The CWRC Ontology
ctb: Constance Crompton
ctb: Members of the Orlando Project
fnd: Social Sciences and Humanities Research Council
pdr: Susan Brown
creator: Abigel Lemak
creator: Alliyya Mo
creator: Colin Faulkner
creator: Deborah Stacey
creator: Gurjap Singh
creator: Jade Penancier
creator: Jasmine Drudge-Willson
creator: Joel Cummings
creator: John Simpson
creator: Kim Martin
creator: Robert Warren
creator: Susan Brown
date: 2019-07-09
description: L'Ontologie CWRC est l'ontologie du Collaboratoire scientifique des écrits du Canada. @fr
description: The CWRC Ontology is the ontology of the Canadian Writing Research Collaboratory.
publisher: The Canadian Writing Research Collaboratory
rights: https://creativecommons.org/licenses/by/3.0/
subject: sh2009007122
subject: sh85013838
subject: sh85019388
subject: sh85043777
subject: sh85077519
title: L'Ontologie CWRC @fr
preferred namespace prefix: cwrc
preferred namespace uri: http://sparql.cwrc.ca/ontologies/cwrc#
in dataset: The CWRC Ontology
type: Vocabulary
type: Ontology
prior version: cwrc-2018-09-30
version info: 0.99.85
term status: Testing

Lesbian Lives: Biographies of Women from the Ladder
issued: 1976
type: Book

Coletta Reid
first name: Coletta
last name: Reid
type: Person

Barbara Grier
first name: Barbara
last name: Grier
type: Person

Diana Press
type: Organization
based near: Baltimore, MD, USA

Big data and its exclusions.
page end: 63
page start: 55
uri: http://www.heinonline.org.subzero.lib.uoguelph.ca/HOL/Page
volume: 66
type: AcademicArticle

Jonas Lerman
first name: Jonas
last name: Lerman
type: Person

Stanford Law Review
issued: September 2013
type: Journal

Rubyfruit Jungle
issued: 1973
type: Book

Rita Mae Brown
first name: Rita Mae
last name: Brown
type: Person

Daughters Inc
type: Organization
based near: Plainfield, VT, USA

Sarah Orne Jewett Manuscript Collection
issued: 1931
type: Book

Houghton Library, Harvard University
type: Organization
based near: Cambridge, MA, USA

Sarah Orne Jewett
first name: Sarah Orne
last name: Jewett
type: Person

The Persistent Desire: A Femme-Butch Reader
issued: 1992
type: Book

Alyson Publications
type: Organization
based near: Boston, MA, USA

Joan Nestle
first name: Joan
last name: Nestle
type: Person

The posts continue: becoming
language: eng
issue: 6
volume: 26
type: Document

Elizabeth St. Pierre
first name: Elizabeth
last name: St. Pierre
type: Person

International Journal of Qualitative Studies in Education
type: Document

Psychopathia Sexualis, with Especial Reference to Contrary Sexual Instinct: A Medico-Legal Study
issued: 1892
type: Book

Gillbert Charles Chaddock
first name: Gillbert Charles
last name: Chaddock
type: Person

F. A. Davis
type: Organization
based near: London, UK

Richard Krafft-Ebing
first name: Richard
last name: Krafft-Ebing
type: Person

The Complete Newgate Calendar
issued: 1926
volume: 2
type: Book

G. T. Crook
first name: G. T.
last name: Crook
type: Person

Navarre Society
type: Organization
based near: London, UK

Mary Hamilton
first name: Mary
last name: Hamilton
type: Person

Working with the Semantic Web
page end: 444
page start: 444
uri: https://books.google.ca/books
type: BookSection

James Smith
last name: James Smith
type: Person

Doing Digital Humanities: Practice, Training, Research
issued: 2013
isbn: 978-1-317-48112-6
type: Book

Constance Crompton
last name: Constance Crompton
type: Person

Richard J Lane
last name: Richard J Lane
type: Person

Routledge
type: Organization

Ray Siemens
last name: Ray Siemens
type: Person

Butch Is a Noun
issued: 2006
type: Book

S. Bear Bergman
first name: S. Bear
last name: Bergman
type: Person

Suspect Thoughts Press
type: Organization
based near: San Francisco, CA, USA

Three Guineas
issued: 1938
type: Book

Hogarth Press
type: Organization

Virginia Woolf
first name: Virginia
last name: Woolf
type: Person

Lesbian Nation: The Feminist Solution
issued: 1973
type: Book

Simon and Schuster
type: Organization

Jill Johnston
first name: Jill
last name: Johnston
type: Person

The Bostonians
issued: 1886
type: Book

Macmillan
type: Organization

Henry James
first name: Henry
last name: James
type: Person

Volatile bodies: toward a corporeal feminism
issued: 1994
isbn: 978-0-253-20862-0
isbn: 978-0-253-32686-7
type: Book

E. A. Grosz
first name: E. A.
last name: Grosz
type: Person

Indiana University Press
type: Organization
based near: Bloomington

Studies in the Psychology of Sex
issued: 1897
type: Book

John Addington Symonds
first name: John Addington
last name: Symonds
type: Person

Havelock Ellis
first name: Havelock
last name: Ellis
type: Person

Wilson & Macmillan
type: Organization
based near: London, UK

Lesbian Lists: A Look at Lesbian Culture, History, and Personalities
issued: 1990
type: Book

Alyson Publications
type: Organization
based near: Boston, MA, USA

Dell Richards
first name: Dell
last name: Richards
type: Person

Why are the Digital Humanities so white? Or thinking the histories of race and computation.
page end: 160
page start: 139
uri: http://dhdebates.gc.cuny.edu/debates/part/4
type: AcademicArticle

Tara McPherson
first name: Tara
last name: McPherson
type: Person

Debates in the digital humanities
issued: 2012
type: Journal

How the Irish Became White
issued: 2008
language: eng
type: Book

Routledge
type: Organization

Noel Ignatiev
first name: Noel
last name: Ignatiev
type: Person

All the Digital Humanists Are White, All the Nerds Are Men, but Some of Us Are Brave
language: eng
uri: http://journalofdigitalhumanities.org/1-1/all-the-digital-humanists-are-white-all-the-nerds-are-men-but-some-of-us-are-brave-by-moya-z-bailey/
type: AcademicArticle

Moya Z. Bailey
first name: Moya Z.
last name: Bailey
type: Person

Journal of Digital Humanities
issued: 2012-03-09
type: Journal

Essentially speaking: Feminism, nature and difference
issued: 2013
type: Book

Diana Fuss
first name: Diana
last name: Fuss
type: Person

Routledge
type: Organization

How We Think: Digital Media and Contemporary Technogenesis
issued: 2012
language: eng
type: Book

The University of Chicago Press
type: Organization

N. Katherine Hayles
first name: N. Katherine
last name: Hayles
type: Person

From XML to RDF in the Orlando Project
doi: CultureComputing.2013.61
page end: 195
page start: 194
uri: http://ieeexplore.ieee.org/document/6680375/
type: Article

John Simpson
first name: John
last name: Simpson
type: Person

Susan Brown
first name: Susan
last name: Brown
type: Person

http://sparql.cwrc.ca/ontologies/cwrc#62208dcb-ed1f-4612-8433-d6e4e5e0b7fc-partof
date: 09/2013
isbn: 978-0-7695-5047-3
type: Proceedings

IEEE
type: Organization

Re-imagining the Latino/a Race
language: eng
type: Chapter

The Latino/a Condition
issued: 1998
type: Document

New York University
type: Organization

The Straight Mind
language: eng
issue: 1
volume: 1
type: Document

Feminist Issues
type: Document

Peirce's Theory of Signs
issued: 2013
language: eng
type: Webpage

Albert Atkin
first name: Albert
last name: Atkin
type: Person

The Stanford Encyclopedia of Philosophy
uri: https://plato.stanford.edu/cgi-bin/encyclopedia/archinfo.cgi
type: Document

DBpedia
issued: 2017
language: eng
uri: https://wiki.dbpedia.org/
type: Document

DBpedia
type: Organization

Feminism and psychoanalysis: a critical dictionary
issued: 1992
isbn: 978-0-631-17312-0
isbn: 978-0-631-18347-1
type: Book

Elizabeth Wright
first name: Elizabeth
last name: Wright
type: Person

Blackwell
type: Organization
based near: Oxford, UK ; Cambridge, Mass., USA

Ladies of Llangollen: Letters and Journals of Lady Eleanor Butler (1739-1829) and Sarah Ponsonby (1755-1831) from the National Library of Wales
issued: 1997
type: Book

Adam Matthew Publications
type: Organization
based near: Marlborough, Wiltshire, England

Sex, privary and ontologies
uri: http://www.dbdump.org/~warren/publications/dean-hall:sexi:2013/dean-hall:sexi:2013.pdf
type: Article

Adriel Dean-Hall
first name: Adriel
last name: Dean-Hall
type: Person

Robert H. Warren
first name: Robert H.
last name: Warren
type: Person

Workshop on Search and Exploration of XRated Information (SEXI 2013)
date: February 2013
type: Proceedings

An Introduction to the Orlando Project
issue: 1
page end: 134
page start: 127
volume: 26
type: AcademicArticle

Patricia Clements
first name: Patricia
last name: Clements
type: Person

Susan Brown
first name: Susan
last name: Brown
type: Person

Jeffrey Antoniuk
first name: Jeffrey
last name: Antoniuk
type: Person

Sharon Balazs
first name: Sharon
last name: Balazs
type: Person

Isobel Grundy
first name: Isobel
last name: Grundy
type: Person

Tulsa Studies in WomenâÂÂs Literature
issued: 2007
issn: 0732-7730
type: Journal

The Story of the Orlando Project: Personal Reflections
issue: 1
page end: 143
page start: 135
volume: 26
type: AcademicArticle

Patricia Clements
first name: Patricia
last name: Clements
type: Person

Susan Brown
first name: Susan
last name: Brown
type: Person

Jeffrey Antoniuk
first name: Jeffrey
last name: Antoniuk
type: Person

Sharon Balazs
first name: Sharon
last name: Balazs
type: Person

Isobel Grundy
first name: Isobel
last name: Grundy
type: Person

Tulsa Studies in WomenâÂÂs Literature
issued: 2007
issn: 0732-7730
type: Journal

Trans Student Educational Resources
issued: 2017
language: eng
type: Document

TSER
uri: http://www.transstudent.org/
type: Document

ENCYCLOPÃÂDIA BRITANNICA
issued: 1911
language: eng
uri: https://www.britannica.com/
type: Document

Cultural (Re-)formations: Structuring a Linked Data Ontology for Intersectional Identities
type: Article

Colin Faulkner
first name: Colin
last name: Faulkner
type: Person

Rob Warren
first name: Rob
last name: Warren
type: Person

Susan Brown
first name: Susan
last name: Brown
type: Person

Abigel Lemak
first name: Abigel
last name: Lemak
type: Person

The Proceedings of the Digital Humanities Conference
date: 2017
type: Proceedings

Persistence: All Ways Butch and Femme
issued: 2011
type: Book

Zena Sharman
first name: Zena
last name: Sharman
type: Person

Ivan E Coyote
first name: Ivan E
last name: Coyote
type: Person

Arsenal Pulp Press
type: Organization
based near: Vancouver, BC, Canada

Debates in the Digital Humanities 2016
issued: 2016
language: en
abstract: If the publication of Debates in the Digital Humanities in 2012 marked the âÂÂdigital humanities moment,âÂÂ this bookâÂÂthe first in a series of annual volumesâÂÂwill chart the possibilities and tensions of the field as it grows.
isbn: 978-0-8166-9954-4
uri: https://www.upress.umn.edu/book-division/books/debates-in-the-digital-humanities-2016
type: Book

Lauren F. Klein
last name: Lauren F. Klein
type: Person

Blood, bread and poetry: The location of the poet.
issued: 1983
language: eng
type: Book

The Massachusetts Review
type: Organization

Gender Trouble
issued: 1990
isbn: 0-415-90043-3
type: Book

Judith Butler
first name: Judith
last name: Butler
type: Person

Routledge
type: Organization

Situated Neuroscience: Exploring Biologies of Diversity
language: eng
type: Chapter

Neurofeminism
isbn: 978-0-230-29673-2
type: Document

Female Masculinity
issued: 1998
type: Book

Jack Halberstam
first name: Jack
last name: Halberstam
type: Person

Duke University Press
type: Organization
based near: Durham, NC, USA

The House That Jill Built: A Lesbian Nation in Formation
issued: 1995
type: Book

Becki Ross
first name: Becki
last name: Ross
type: Person

University of Toronto Press
type: Organization
based near: Toronto, On, Canada

The Paradox of Privacy: Revisiting a Core Library Value in an Age of Big Data and Linked Data
issued: 2016
language: eng
type: Webpage

FIMS Publications
type: Organization

The value of the statistically insignificant
uri: http://er.educause.edu/articles/2014/1/the-value-of-the-statistically-insignificant
type: AcademicArticle

Jutta Treviranus
first name: Jutta
last name: Treviranus
type: Person

Educause
issued: January 2014
type: Journal

Abigel Lemak
type: natural person

abusive name
in dataset: The CWRC Ontology
type: Class
label: nom abusif @fr
subclass of: name type
definition: A name constructed with the intent to abuse, satirize, or slander. For example, Constance Gore-Booth was known in the press by the nickname of "Red Countess" and this nickname had negative connotations.
definition: Un nom inventé dans l'intention d'abuser, de tourner en satire ou de calomnier une personne. Par exemple, Constance Gore-Booth était connue dans la presse sous le surnom de "Red Countess" qui avait une connotation négative. @fr

actor
in dataset: The CWRC Ontology
type: role
type: Concept
definition: A person performing a certain role within an event.
in scheme: role

additional name
in dataset: The CWRC Ontology
type: Class
label: nom additionnel @fr
subclass of: name type
definition: An additional name, "such as a nickname, epithet, or alias." This term is derived from the Text Encoding Initiative P5 schema for the addName element. See TEI element addName (additional name) .
definition: Un nom supplémentaire, "tel qu'un surnom, une épithète ou un alias". Ce terme est dérivé du schéma Text Encoding Initiative P5 pour l'élément addName. Voir l'élément TEI addName TEI element addName (additional name) . @fr

address
in dataset: The CWRC Ontology
type: Class
type: Concept
comment: CWRC address is the equivalent of a schema.org Postal Address and uses the predicates from schema Postal Address.
label: adresse @fr
subclass of: place
definition: A mailing or street address.
definition: Une adresse postale ou de rue. @fr

Alliyya Mo
type: natural person

androgynous
in dataset: The CWRC Ontology
type: gender
type: Concept
label: androgyne @fr
definition: Indicates gender ambiguity or indeterminacy, and the adoption or presentation of a blend of both masculine and feminine gender attributes and behaviour. The term is strongly associated with the nineteenth and twentieth centuries, when it was redefined by Jungian theories and later by Jungian feminist psychologists (Elizabeth Wright, 1992). Androgyny may involve cross-dressing, or appropriation of external attributes usually assigned to the supposedly opposite sex or gender. It may be understood as gender indetermination, gender neutrality, or a fairly balanced mix of male and female attributes. The term also has political significance in some feminist circles. For example, androgyny is an important feature in Virginia Woolf's vision of writing and creative processes (Virginia Woolf, 1929).
definition: Indique l'ambiguïté ou Ã l'indétermination du genre, avec l'adoption ou la présentation d'une combinaison de différents attributs et comportements associés aux genres féminin et masculin. Le terme est fortement associé au 19e et au 20e siècles, lorsqu'il est redéfini par C. G. Jung et plus tard par les féministes jungiennes (Elizabeth Wright, 1992). L'androgynie implique éventuellement le travestissement, ou l'appropriation d'attributs externes traditionnellement associés au sexe opposé. Elle peut être interprétée comme un genre indéterminé, neutre ou un mélange plus ou moins équilibré d'attributs féminins et masculins. Le terme possède également une connotation politique dans certains cercles féministes. Par exemple, le thème de l'androgynie est important pour Virginia Woolf dans sa conception des processus de création et d'écriture. (Virginia Woolf, 1929). @fr
in scheme: gender

authorial name
in dataset: The CWRC Ontology
type: Class
label: nom d'auteur·e @fr
subclass of: name type
definition: A name under which a writer wrote or published.
definition: Un nom sous lequel un·e auteur·e a écrit ou publié. @fr

award
in dataset: The CWRC Ontology
type: Class
definition: An award is something given to a person, a group of people, like a sports team, or an organization in recognition of their excellence in a certain field. An award may be accompanied by a trophy, title, certificate, commemorative plaque, medal, badge, pin, or ribbon. The accompanying item may vary according to purpose.

biographical event
in dataset: The CWRC Ontology
type: Class
type: Concept
subclass of: Event
subclass of: E7 activity
definition: An event related to an biography context.

biography context
in dataset: The CWRC Ontology
type: Class
type: Concept
subclass of: context
definition: Biography Context is a major subclass of context. Annotations typed as Biography Context provide information about and discussions of a person's biography or personal history, through the use of biographical properties and relationships and through subclasses of Biographical Context such as birth context, cultural form context, or occupation context.

birth context
in dataset: The CWRC Ontology
type: Class
type: Concept
label: naissance en contexte @fr
subclass of: biography context
definition: A significant subclass of context. Annotations typed as birth context provide information about and discussions of a person's birth. See About: Birth.
definition: Classe de contexte importante. Les annotations entrées en tant que contexte de naissance fournissent des informations sur la naissance d'une personne. Voir About: Birth @fr

birth event
in dataset: The CWRC Ontology
type: Class
type: Concept
subclass of: biographical event
definition: An event related to an birth context.

birth position
in dataset: The CWRC Ontology
type: Class
type: Concept
label: ordre de naissance @fr
definition: Indicates the birth position of a foaf:person, that is, whether they are the eldest, youngest, or only child in their family. Birth position claims can be made in relation to biological, adopted, or step siblings, and there is not systematic handling of deceased siblings that might affect one's understanding of birth order.
definition: Indique l'ordre de naissance d'une foaf:person, qu'elle soit aînée, cadette ou enfant unique de sa famille. Les déclarations sur l'odre de naissance peuvent être formulées en lien avec les frères et soeurs biologiques, adoptif·ve·s ou par alliance, sans traitement systématique des frères et soeurs décédé·e·s susceptibles de modifier l'ordre de naissance. @fr

birthname
in dataset: The CWRC Ontology
type: Class
label: nom de naissance @fr
subclass of: name type
definition: Indicates the name a person was assigned at birth.
definition: Indique le nom assigné Ã la naissance. @fr

boarding school
in dataset: The CWRC Ontology
type: Class
comment: La description de ce terme est basée sur celle de DBPedia. @fr
comment: The description for this term is indebted to DBpedia.
label: internat @fr
subclass of: educational organization
definition: "A boarding school provides education for pupils who live on the premises, as opposed to a day school. The word "boardingâ is used in the sense of "room and board" i.e., lodging and meals. As they have existed for many centuries, and now extend across many countries, their function and ethos varies greatly." (DBpedia, 2018)
definition: «Un internat est une branche d'un établissement scolaire (école, collège, lycée, école d'enseignement supérieur...) qui offre la possibilité de loger et nourrir les élèves et les étudiants. Ã cette fin, un internat comprend généralement un dortoir ou des chambres, un réfectoire et des salles d'études, douche ou de divertissement.» (DBpedia, 2018) @fr

british women writers literary climate
in dataset: The CWRC Ontology
type: Class
type: Concept
label: climat littéraire des femmes de lettres britanniques @fr
subclass of: literary climate
definition: An event associated with British women writers, including the creation, publication and reception of their works, as well as the material conditions and other aspects of their lives.
definition: Un événement associé aux femmes de lettres britanniques, qui inclue la création, la publication et la réception de leurs Åuvres, ainsi que les conditions matérielles et autres aspects de leur vie. @fr

bursary
in dataset: The CWRC Ontology
type: Class
label: bourse @fr
subclass of: educational award
definition: A bursary is a monetary award made by an institution to individuals or groups of people who cannot afford to pay full fees. In return for the bursary the individual is usually obligated to be employed at the institution for the duration as the bursary.
definition: Une bourse est une compensation monétaire octroyée par une institution Ã des individus ou Ã des groupes de personnes qui ne peuvent pas se permettre de payer l'intégralité des frais d'inscription. En contrepartie de la bourse, le/la boursier·ère doit généralement être employé·e par l'établissement pour toute la durée de la bourse. @fr

certainty
in dataset: The CWRC Ontology
type: Class
comment: The description for this term is indebted to the Text Encoding Initiative's P5: Guidelines for Electronic Text Encoding and Interchange.
label: probabilité @fr
subclass of: Thing
definition: Indicates the degree of certainty associated with some aspect of an assertion, description, identification, or value within a dataset. Equivalent to the "teidata.certainty" range of values of the Text Encoding Initiative.
definition: La probabilité décrit la qualité d'une affirmation dans les données. @fr

change set
in dataset: The CWRC Ontology
type: Class
type: Concept
type: Instant
definition: A change set represents changes or additions made to the ontology by ontology editors or through users where instances were affected. Change sets will also be used to translate and contain Orlando recordInfo instances.
definition: Un change set représente l'ensemble des modifications ou des ajouts apportés Ã l'ontologie par les éditeur·ice·s de l'ontologie ou par les utilisateur·ice·s qui ayant affecté des instances. Les change set seront également utilisés pour traduire et contenir les instances recordInfo d'Orlando. @fr

co-ed school
in dataset: The CWRC Ontology
type: Class
comment: La description de ce terme est basée sur celle de DBPedia. @fr
comment: The description for this term is indebted to DBpedia.
label: éducation mixte @fr
subclass of: educational organization
definition: "Mixed-sex education, also known as mixed-gender education, co-education or coeducation (abbreviated to co-ed or coed), is a system of education where males and females are educated together. Whereas single-sex education was more common up to the 19th century, mixed-sex education has since become standard in many cultures, particularly in Western countries. Single-sex education, however, remains prevalent in many Muslim countries. The relative merits of both systems have been the subject of debate." (DBpedia, 2018)
definition: «La mixité ou, dans son sens ancien, la coéducation1 est l'instruction et l'éducation en commun des garçons et des filles, dans des groupes mixtes.» (DBpedia, 2018) @fr

Colin Faulkner
type: natural person

competency question
in dataset: The CWRC Ontology
type: AnnotationProperty
label: question de compétence @fr
definition: A question that can be asked of the ontology and will be used to specify the high level requirements of the CWRC Ontology allowing decisions about structure and components to be made.
definition: Une question qui peut être posée Ã lâontologie et servira Ã déterminer les exigences ontologiques de haut niveau du CSÃC, permettant ainsi de prendre des décisions sur sa structure et ses composantes. @fr

comprehensive school
in dataset: The CWRC Ontology
type: Class
comment: La description de ce terme est basée sur celle de DBPedia. @fr
comment: The description for this term is indebted to DBpedia.
label: école @fr
subclass of: educational organization
definition: "A comprehensive school is a secondary school or middle school that is a state school and does not select its intake on the basis of academic achievement or aptitude. This is in contrast to the selective school system, where admission is restricted on the basis of selection criteria. The term is commonly used in relation to England and Wales, where comprehensive schools were introduced on an experimental basis in the 1940s and became more widespread from 1965. About 90% of British secondary school pupils now attend comprehensive schools. They correspond broadly to the public high school in the United States and Canada and to the German Gesamtschule." (DBpedia, 2018)
definition: «Après l'école primaire, on a le choix entre deux types d'établissement : grammar school (lycée) et comprehensive state (lycée général). Pour entrer dans une grammar school, il faut passer un examen nommé "11+". Les Grammar schools étant pour les étudiants les plus doués, et les places étant limitées, la grande majorité des enfants fréquentent les state comprehensive.» (DBpedia, 2018) @fr

Constance Crompton
type: natural person

context
in dataset: The CWRC Ontology
type: Class
type: Concept
type: Annotation
label: contexte @fr
definition: La classe Contexte fournit le contexte discursif des assertions de l'ontologie. Lorsque les assertions sont générées Ã partir d'un texte source, le contexte fournit le texte ou un extrait de code provenant d'un texte plus long d'où ces assertations ont été extraites. @fr
definition: The Context class provides the discursive context for assertions in the ontology. Where the assertions have been generated from a source text, Context provides the text, or the relevant snippet of a longer text, from which they have been extracted.

credential
in dataset: The CWRC Ontology
type: Class
type: Concept
label: certificat @fr
definition: Academic or educational qualification, such as a certificate or degree, awarded by an educational institution.
definition: Titre académique ou scolaire, tel qu'un certificat ou un diplôme, délivré par un établissement d'enseignement. @fr

cryptic name
in dataset: The CWRC Ontology
type: Class
label: nom cryptique @fr
subclass of: name type
definition: A name deliberately obscured, as in an anagram. Cryptic names have lexical meaning such as "The Scotch Milkmaid,""A Housewife," or "A Placid Reader."
definition: Un nom qu'on a délibérément chercher Ã cacher, par un exemple dans un anagramme. Les noms cryptiques ont une signification lexicale, par exemple "The Scotch Milkmaid", "A Housewife" ou "A Placid Reader". @fr

cultural form
in dataset: The CWRC Ontology
type: Class
type: Concept
label: forme culturelle @fr
definition: La classe de propriétés Forme Culturelle associe des concepts et des catégories spécifiques Ã la formation identitaire réalisée au travers de processus culturels. De telles associations ont été adoptées par le sujet elle/lui-même ou attribuées par d'autres. Même si les formes culturelles ou les identités sociales s'articulent autour de notions communément partagées comme la caractérisation, les traditions, les croyances ou les origines, certains travaux récents ont ont montré que de telles catégories sont contingentes, provisoire et construites par des discours et des pratiques sociales complexes. Tel que Stuart Hall l'affirme, "Il semble que la question de l'identité réapparaît dans une tentative de remanier la relation entre sujets et pratiques discursives" ("Introduction"). Voir la collection éditée par Stuart Hall et Paul du Goy, Questions of Cultural Identity ((Paul du Goy and Stuart Hall, 1996). Comme ils sont de nature discursive, les concepts et les catégories de Formes Culturelles se recoupent. Un même terme peut donc apparaître sous diverses formes culturelles, reflétant le changement de contextes discursifs dans lesquels il est employé et les diverses situations d'où il provient. Chaque Forme Culturelle est d'une part liée aux autres formes culturelles ou catégories identitaires qui sont appliquées Ã une personne ou Ã d'autres individus, et est d'autre part toujours reliée aux annotations de Formation Culturelle En Contexte, soutenant que les identités sociales sont toujours considérées comme des constructions en progrès. @fr
definition: The Cultural Form class of properties associates specific concepts and categories with the process of identity formation through cultural processes. Such associations may be or have been embraced by the subject herself or himself or attributed by others. Although cultural forms or social identities circulate around the notion of characteristics, traditions, beliefs, or origins that are shared with others, recent work has stressed the contingency, provisionality, and constructedness of such categories through both complex discourses and social practices. As argued by Stuart Hall, "It seems to be in the attempt to rearticulate the relationship between subjects and discursive practices that the question of identity recurs" ("Introduction"). See Stuart Hall and Paul du Goy's edited collection Questions of Cultural Identity (Paul du Goy and Stuart Hall, 1996). Given their highly discursive nature, the concepts and categories classed as cultural forms are understood to overlap with each other conceptually. The same word or label can therefore occur as multiple cultural forms, reflecting the shifting discursive contexts in which it has been used and the diverse situations from which it has emerged. Each specific Cultural Form is understood to interact not only with other cultural forms or identity categories applied to a person, and other instances of the form applied to other people, but also always with Cultural Formation Context annotations, which support the understanding that social identities are always constructions in progress.

cultural form context
in dataset: The CWRC Ontology
type: Class
type: Concept
label: forme culturelle en contexte @fr
subclass of: biography context
definition: Cultural Form Context is a significant subclass of context. Annotations typed as Cultural Form Context provide information about and discussions of a person's social identity or subjectivity through the use of cultural form properties, which when multiple often indicate intersectional identities.
definition: Formation Culturelle En Contexte est une sous-classe de contexte importante. Les annotations entrées en tant Formation Culturelle En Contexte fournissent des renseignements et des discussions sur l'identité sociales ou la subjectivité d'une personne Ã travers l'utilisation des propriétés Formes Culturelles, qui lorsqu'elles sont multiples indiquent souvent des identités intersectionnelles. @fr

cultural form event
in dataset: The CWRC Ontology
type: Class
type: Concept
subclass of: biographical event
definition: An event related to an cultural form context.

cultural formation
is replaced by: cultural form
in dataset: The CWRC Ontology
type: DeprecatedClass
type: Concept
comment: Deprecated in favour of class cultural form.
comment: Désapprouver en faveur de la classe forme culturelle. @fr
label: formation culturelle @fr
equivalent class: cultural form
term status: deprecated
definition: Cultural formation refers to the processes of lived social subjectivities of people and is often combined with predicates indicating the identity positions as they relate to the following discursive constructions of Class, Religion, Ethnicity, Gender, GeographicHeritage, LinguisticAbility, NationalHeritage, NationalIdentity, PoliticalAffiliation, RaceColour, and Sexuality. These categories are not understood as transhistorical or isolated categories. Rather, they facilitate analysis of how such situationally contingent, changing, and negotiated labels are assigned to or adopted by a particular individual. The tensions endemic to practices of classification demand critical engagement and inquiry into the situatedness of particular cultural identities.

dame school
in dataset: The CWRC Ontology
type: Class
comment: La description de ce terme est basée sur celle de DBPedia. @fr
comment: The description for this term is indebted to DBpedia.
subclass of: educational organization
definition: "A dame school was an early form of a private elementary school in English-speaking countries. They were usually taught by women and were often located in the home of the teacher." (DBpedia, 2018)
definition: «On désigne sous le nom de Dame schools les premières écoles primaires privées dans les pays de langue anglaise. C'étaient d'ordinaire des femmes qui enseignaient Ã leur propre domicile. Il y en avait de toutes sortes : certaines étaient de simples garderies tenues par des femmes analphabètes, alors que d'autres donnaient aux élèves des bases solides. Les lacunes de ce système furent mises en évidence en 1838 par une étude de la Statistical Society of London1. Cette étude affirmait que la moitié des élèves des Dame school n'apprenaient que l'alphabet, une proportion négligeable pratiquant les mathématiques et la grammaire. Les Dame schools se firent plus rares en Grande-Bretagne après que l'enseignement eut été rendu obligatoire en 1880 : les écoles où les cours ne couvraient pas le programme fixé par le gouvernement pouvaient être fermées. Dans la première école d'Australie, qui était une Dame school créée en 1789, c'est une détenue, Isabella Rossen, qui enseignait les bases aux enfants.» (DBpedia, 2018) @fr

day school
in dataset: The CWRC Ontology
type: Class
comment: La description de ce terme est basée sur celle de DBPedia. @fr
comment: The description for this term is indebted to DBpedia.
label: école externe @fr
subclass of: educational organization
definition: "A day schoolâas opposed to a boarding schoolâis an institution where children (or high-school age adolescents) are given educational instruction during the day, after which the students return to their homes. The term can also be used to emphasize the length of full-day programs as opposed to after-school programs, as in Jewish day school." (DBpedia, 2018)
definition: «Une école est un établissement où l'on accueille des individus appelés « écoliers » ou élèves afin que des professeurs leur dispensent un enseignement de façon collective. Le mot école vient du latin schola, signifiant « loisir consacré Ã l'étude », lui-même provenant du grec schole (« le loisir »note 1), lequel constituait un idéal souvent exprimé par les philosophes et une catégorie socialement valorisée opposée Ã la sphère des tâches productives.» (DBpedia, 2018) @fr

death context
in dataset: The CWRC Ontology
type: Class
type: Concept
label: décès en contexte @fr
subclass of: biography context
definition: A significant subclass of context. Annotations typed as death context provide information about and discussions of a person's death. See About: Death.
definition: Classe de contexte importante. Les annotations entrées comme contexte de décès fournissent des renseignements et des discussions sur le décès de la personne. Voir About: Death @fr

death event
in dataset: The CWRC Ontology
type: Class
type: Concept
subclass of: biographical event
definition: An event related to an death context.

Deborah Stacey
type: natural person

decade significance
in dataset: The CWRC Ontology
type: Class
type: Concept
label: importance de décennie @fr
subclass of: EventType
definition: Indicates a low level of significance appropriate to a detailed understanding of a decade.
definition: Indique un faible niveau d'importance pour la compréhension détaillée d'une décennie. @fr

distinction
in dataset: The CWRC Ontology
type: Class
label: mention @fr
subclass of: educational award
definition: An educational award indicating that a person has achieved honours or distinction in their studies.
definition: Un prix éducatif indiquant qu'une personne a obtenu des honneurs ou une mention au cours de ses études. @fr

domestic education context
in dataset: The CWRC Ontology
type: Class
label: contexte éducatif domestique @fr
subclass of: education context
definition: Context for education that takes place at home. For example, of a woman writer in the Victorian period taught by her brother or a governess.
definition: L'éducation a lieu Ã domicile. Par exemple, une auteure de la période victorienne qui a reçu son instruction d'un frère ou d'une gouvernante. @fr

domestic education event
in dataset: The CWRC Ontology
type: Class
type: Concept
subclass of: education event
definition: An event related to an domestic education context.

economic context
in dataset: The CWRC Ontology
type: Class
type: Concept
subclass of: biography context
definition: A significant subclass of context. Annotations typed as Economic Context provide information about and discussions of a person's economic standing, including inheritance, property ownership, pensions, and personal financial disasters. See also the occupation context and cultural form context, particularly for social class context.

economic event
in dataset: The CWRC Ontology
type: Class
type: Concept
subclass of: biographical event
definition: An event related to an economic context.

education context
in dataset: The CWRC Ontology
type: Class
label: contexte éducatif @fr
subclass of: biography context
definition: Contexte Ãducatif est une sous-classe de contexte important. Elle contient les sous-classes de contexte contexte éducatif domestique, contexte éducatif institutionnel et contexte éducatif autodidacte. Les annotations entrées en tant que Contexte Ãducatif ou en tant que sous-classe fournissent des informations et des discussions sur l'éducation d'une personne, qu'elle soit formelle ou informelle. @fr
definition: Education Context is a significant subclass of context. It has subclasses for domestic education context, institutional education context, and self taught education context. Annotations typed as Education Context or a subclass provide information about and discussions of a person's education, whether formal or informal.

education event
in dataset: The CWRC Ontology
type: Class
type: Concept
subclass of: biographical event
definition: An event related to an education context.

educational award
in dataset: The CWRC Ontology
type: Class
label: récompense scolaire @fr
subclass of: award
definition: An award, financial, material, or immaterial, associated with a person's education at any level.

educational organization
in dataset: The CWRC Ontology
type: Class
comment: La description de ce terme est basée sur celle de DBPedia. @fr
comment: The description for this term is indebted to DBpedia.
label: établissement éducatif @fr
subclass of: FormalOrganization
definition: An organization such as a school that provides education, usually although not always as its primary function. "A school is an institution designed to provide learning spaces and learning environments for the teaching of students (or "pupils") under the direction of teachers." (DBpedia, 2018)
definition: «Une école est un établissement où l'on accueille des individus appelés « écoliers » afin que des professeurs leur dispensent un enseignement de façon collective.» (DBpedia, 2018) @fr

educational prize
in dataset: The CWRC Ontology
type: Class
label: récompense éducative @fr
subclass of: educational award
definition: A medal or award, monetary or otherwise, presented by either an institution or person of authority to an individual who has excelled in some aspect of their education.
definition: Une médaille ou un prix, monétaire ou autre, remis par une institution ou une personne d'autorité Ã un individu ayant excellé lors de son parcours scolaire. @fr

educational subject
in dataset: The CWRC Ontology
type: Class
label: sujet d'étude @fr
definition: A subject or field of study or practice. Educational subjects are typically designated by Library of Congress Subject Headings (http://id.loc.gov/authorities/subjects.html). However, given the omissions, biases, and US-centricity of this vocabulary, other terms or strings may be used.
definition: Une matière, un domaine d'étude ou de compétence. Les sujets d'étude sont généralement désignés par les en-têtes de sujet de la Bibliothèque du Congrès (http://id.loc.gov/authorities/subjects.html). Cependant, étant donné les omissions, les partis pris et la perspective majoritairement nord-américaine de ce vocabulaire, d'autres termes ou d'autres chaînes peuvent être utilisés. @fr
related: subject

educational text
in dataset: The CWRC Ontology
type: Class

English
is replaced by: eng
in dataset: The CWRC Ontology
type: Concept
comment: Deprecated in favour of foreign instance eng.
comment: Désapprouver en faveur de l'instance eng. @fr
label: Anglais @fr
deprecated: true
term status: deprecated

English
is replaced by: English
in dataset: The CWRC Ontology
type: Concept
comment: Deprecated in favour of instance English.
comment: Désapprouver en faveur de l'instance Anglais. @fr
label: Anglais @fr
deprecated: true
term status: deprecated

English
is replaced by: English
in dataset: The CWRC Ontology
type: Concept
comment: Deprecated in favour of instance ISO 3166-2:GB-ENG.
comment: Désapprouver en faveur de l'instance ISO 3166-2:GB-ENG. @fr
label: Anglais @fr
deprecated: true
term status: deprecated

essay award
in dataset: The CWRC Ontology
type: Class
label: prix (travaux académiques) @fr
subclass of: educational award
definition: An award given in an educational context on the strength of the recipient's essay.
definition: Prix attribué en contexte académique pour récompenser une production académique de qualité. @fr

ethnicity
in dataset: The CWRC Ontology
type: Class
type: ConceptScheme
label: ethnicité @fr
subclass of: cultural form
definition: A subclass of Cultural Form for indicating a person's ethnicity, either as self-reported or as assigned by others, with accompanying context, where present, provided by race or ethnicity context annotations. Ethnicities are groups constructed on the conception of shared national, religious, geographical, racial, or cultural backgrounds or traditions, and particular ethnicities may be denigrated, lauded, or both, depending on the context. Ethnicities are shifting, historically constituted, and interestedly deployed categories whose use must be situated contextually and which are understood here finally as discursive or representational although they have real material impacts. As Angel Oquendo writes, "Despite its long âmaterialist' past in which it was taken to be synonymous with ârace,' the concept of ethnicity as used today does appear to focus on cultural rather than on physiognomic difference." (Angel R. Oquendo, "Re-imagining the Latino/a Race" in The Latino/a Condition: A Critical Reader edited by Richard Delgado, Jean Stefancic 1998. This ontology therefore does not attempt to lay out an exact, fully defined, or mutually exclusive set of ethnic categories: this is an impossibility given their shifting use and the overlap among them and with identity categories for race, geography, and nationality, as demonstrated by Noel Ignatieve in his book How the Irish Became White (Ignatieve, 1995). Those using this class and its instances are encouraged to consult associated race or ethnicity context annotations, if available.
definition: Cette sous-classe de Forme Culturelle indique l'ethnicité d'une personne en parallèle avec le contexte fourni par les annotations de contexte ethnique ou racial lorsqu'il est présent. Une sous-classe de Forme Culturelle, elle indique l'ethnicité d'une personne, que celle-ci soit autodéclarée ou assignée par d'autres. Les ethnies sont des groupes qui se fondent sur une le partage de traditions ou d'héritages nationaux, religieux, géographiques, raciaux ou culturels; en fonction du contexte, certaines ethnies particulières sont dénigrées, glorifiées, ou les deux Ã la fois. Les ethnicités changeantes, historiquement constituées, développées de façon intéressée, et dont l'usage doit être resitué en contexte, sont enfin comprises ici comme discursives et représentationnelles, même si leurs répercussions matérielles sont bien réelles. Angel Oquendo écrit que «En dépit de son long passé âmatérialiste' au cours duquel il était synonyme de ârace', le concept d'ethnicité tel qu'il est employé aujourd'hui semble être centré sur la culture plutôt que sur la différence physionomique.» (Angel R. Oquendo, «Re-imagining the Latino/a Race» in The Latino/a Condition: A Critical Reader édité par Richard Delgado, Jean Stefancic) Cette ontologie ne prétend donc pas offrir un ensemble de catégories ethniques exact, complètement défini, ou mutuellement exclusif; cela est impossible étant donné leur utilisation en changement constant et leur chevauchement mutuel ou avec d'autres catégories identitaires utilisées pour la race, la géographie ou la nationalité. Les personnes qui utilisent cette classe et ses instances sont encouragées Ã consulter les annotations de contexte ethnique ou racial lorsqu'ils sont disponibles. @fr

racial, colour or ethnicity context
is replaced by: race or ethnicity context
subject: ethnicity
subject: race or colour
in dataset: The CWRC Ontology
type: DeprecatedClass
type: Concept
comment: Deprecated in favour of class race or ethnicity context.
comment: Désapprouver en faveur de la classe contexte ethnique ou racial. @fr
label: contexte racial, de couleur de peau ou d'ethnicité @fr
subclass of: cultural form context
equivalent class: race or ethnicity context
term status: deprecated
definition: Ethnicity Context is a significant subclass of context. It is associated with the cultural form subclass Ethnicity, and sometimes other intersecting Cultural Forms. Annotations typed as Ethnicity Context provide information about and discussions of a person's subjectivity or experience with regards to their perceived or self-reported ethnicity. Ethnicity Context provides depth to more granular categorizations of a person indicated by the properties has ethnic identity or has ethnic identity (self-reported).

event
in dataset: The CWRC Ontology
type: Class
type: Concept
label: évènement @fr
subclass of: TemporalEntity
definition: An event that occurs in time.

exhibition (scholarship)
in dataset: The CWRC Ontology
type: Class
label: exposition (bourse) @fr
subclass of: educational award
definition: An exhibition is a type of scholarship award or bursary.
definition: Une exposition est un type de bourse ou de récompense académique. @fr

familiar name
in dataset: The CWRC Ontology
type: Class
label: nom familier @fr
subclass of: name type
definition: A version of a name used by those familiar with a person, such as family, friends, or co-workers.
definition: Variante du nom utilisée par les individus familiers avec une personne, telles que la famille, les ami·e·s ou les collègues. @fr

family context
in dataset: The CWRC Ontology
type: Class
type: Concept
label: contexte familial @fr
subclass of: biography context
definition: Family Context is a significant subclass of context. Annotations typed as Family Context provide information about and discussions of a person's familial relations. Family relationships are social bonds assumed between a group of people affiliated by blood, marriage, co-residence, or other affiliation. For more information, see About: Family.
definition: Le contexte familial est une sous-classe de contexte importante. Les annotations saisies en tant que contexte familial fournissent des informations et des discussions sur les rapports familiaux d'une personne. Les rapports familiaux sont des liens sociaux contractés entre un groupe de personnes liées par le sang, le mariage, la cohabitation ou autre affiliation. Pour plus d'informations, voir About: Family. @fr

family event
in dataset: The CWRC Ontology
type: Class
type: Concept
subclass of: biographical event
definition: An event related to an family context.

fellowship
in dataset: The CWRC Ontology
type: award
type: Class
label: programme de bourse @fr
definition: An award or position usually associated with research or advanced standing in a field, and often associated with a particular group, body, or organization connected to creative, scholarly, or professional practice, sometimes involving a stipend and sometimes labour such as teaching.
definition: Récompense ou position académique généralement reliée Ã la recherche ou Ã un parcours avancé dans un champ disciplinaire, impliquant parfois un emploi d'enseignant·e. @fr
related: fellow

female
in dataset: The CWRC Ontology
type: textual label
comment: Deprecated with no current equivalence.
comment: Désapprouver sans équivalence. @fr
label: femelle @fr
deprecated: true
one of: Woman/Female
one of: Female
term status: deprecated
in scheme: textual label

fictional person
type: Class
label: personne fictive @fr
subclass of: Person
definition: A person, broadly defined, who features in an imaginative work such as a literary work, as a character or in some other way that distinguishes the reference to them from the natural person who is being represented. In other words, there is a distinction between a simple allusion to a natural person, and the fictionalization of that person within a text or other work of art.
definition: Définie de façon large, personne figurant dans une Åuvre créative telle qu'une Åuvre littéraire, dans laquelle elle est un personnage ou représentée d'une façon qui diffère de la personne physique Ã laquelle elle renvoie. Autrement dit, il existe une différence entre la simple allusion Ã une personne physique et la version romancée de cette personne dans un texte ou tout autre oeuvre d'art. @fr

fictional place
in dataset: The CWRC Ontology
type: Class
type: Concept
subclass of: Place
subclass of: place
definition: A place that features in an imaginative work such as a literary work. Such places typically do not not have geospatial coordinates, although they may have a relationship to a [http://sparql.cwrc.ca/ontologies/cwrc#MappedLocation].

forename
in dataset: The CWRC Ontology
type: Class
label: prénom @fr
subclass of: name type
definition: A subject's given or baptismal name. This term is derived from the Text Encoding Initiative P5 schema forename element. See also TEI element forename .
definition: Le nom attribué ou le nom de baptême d'une personne. Ce terme est dérivé de l'élément 'forename' du schéma P5 du Text Encoding Initiative. Voir l'élément TEI forename. @fr

French
is replaced by: fre
in dataset: The CWRC Ontology
type: Concept
comment: Deprecated in favour of foreign instance fre.
comment: Désapprouver en faveur de l'instance fre. @fr
label: Français @fr
deprecated: true
term status: deprecated

friends and associates context
in dataset: The CWRC Ontology
type: Class
type: Concept
label: contexte ami·e·s et relations @fr
subclass of: biography context
definition: Friends and connections context is a significant subclass of context. Annotations typed as friends and connections contexts discuss a broad spectrum of social relations ranging from friendship to enmities and casual associations. Other context annotations treat related aspects of social connections, including leisure context and intimate relationship context.
definition: Le contexte des amis et des connexions est une sous-classe de contexte importante. Les annotations saisies en tant que contexte amis et relations abordent un large éventail de liens sociaux, allant de lâamitié aux conflits en passant par les relations éphémères. D'autres annotations contextuelles traitent des aspects liés aux rapports sociaux, notamment les loisirs et les relations intimes. @fr

friends and associates event
in dataset: The CWRC Ontology
type: Class
type: Concept
subclass of: biographical event
definition: An event related to an friends and associates context.

gender
in dataset: The CWRC Ontology
type: Class
type: ConceptScheme
label: genre @fr
subclass of: cultural form
definition: A subclass of cultural form for indicating a person's gender, whether attributed or self-reported, with accompanying context, where present, provided by gender context annotations. Although in popular culture gender and biological sex are conflated and understood to be binary, the concept of gender stresses the relationality, constructedness, and performativity of gendered identities and gendered behaviour, whose categories are historically contingent and shifting, and the boundaries between them blurry. Simone de Beauvoir (1973) stated "One is not born, but rather becomes, a woman," a belief that has been taken up by many other theorists of gender including Judith Butler (1990). Gender studies to date has investigated the social construction of femininity more than that of masculinity. The multi-layered constructedness of gender is also underlined by Donna Haraway who understands it as a "socially, historically, and semiotically positioned difference" (Donna Haraway, 1988). Gender is understood as fluid, situational, and sometimes plural, and it is related to, though not commensurate with, sexual identity and orientation, just as it is related to but not defined by specific forms of embodiment. Rather than seeing biological sex as a pre-social or natural given, the body is understood as a site of inscription (cf. (Elizabeth Grosz, 1994) which is also socially constructed and indeed epigenetically shaped by environmental factors (N. Katherine Hayles, 2012). As articulated by feminist neurologist Gillian Einstein, (2012)"The world writes on the body." This ontology therefore does not provide separate terms for sex as distinct from gender. Instead, it privileges terms associated with gender, recognizing that they are conventionally but not necessarily associated with sex, and that there is constant slippage between gender and sex in the way that these categories circulate through discourses, actions, and institutions. Far from indicating a universal facet of experienc…
definition: Cette sous-classe de forme culturelle indique le genre d'une personne, qu'il soit attribué par d'autres ou autoproclamé, accompagné du contexte fourni par les annotations de genre en contexte lorsque celui-ci est disponible. Même si dans la culture populaire le genre et le sexe biologique sont confondus et compris comme binaires, le concept de genre souligne la dimension relationnelle, construite et performative des identités et des comportements genrés, dont les catégories sont contingentes et changent au cours de l'Histoire, sans qu'elles soient clairement délimitées. Cf Simone de Beauvoir : «On ne naît pas femme, on le devient,» et d'autres nombreuses théoriciennes du genre, dont Judith Butler en 1990 (Judith Butler, 1990). Ã ce jour, les études de genres se sont davantage intéressées Ã la construction de la féminité qu'à celle de la masculinité. Cette construction du genre Ã plusieurs niveaux est également soulignée par Donna Haraway qui le définit comme une «différence socialement, historiquement et sémiotiquement située» (Donna Haraway,1988). Le genre est interprété comme fluide, situationnel, parfois pluriel ainsi que lié Ã l'identité et l'orientation sexuelles sans leur être proportionnel, tout comme il est relié Ã certaines façons spécifiques de vivre et de présenter son corps, qui ne définissent pas non plus le genre. Plutôt que de voir le sexe biologique comme présocial ou un fait naturel, le corps est compris comme un lieu d'inscriptions (cf. (Elizabeth Grosz, 1994) qui est aussi socialement construit et épigénétiquement modelé par des facteurs environnementaux (N. Katherine Hayles, 2012). Selon la formulation de la neurologiste féministe Gillian Einstein, «Le monde écrit sur le corps» (Gillian Einstein, 2012). Cette ontologie ne fournit donc pas de termes séparés pour le sexe et le genre en tant qu'entités distinctes. Au contraire, elle privilégie les termes associés au genre, en admettant qu'ils sont … @fr

gender context
subject: gender
in dataset: The CWRC Ontology
type: Class
type: Concept
label: genre en contexte @fr
subclass of: cultural form context
definition: Gender Context is a significant subclass of context. It is associated with the cultural form subclass gender, and sometimes other intersecting Cultural Forms. Annotations typed as Gender Context provide information about and discussions of a person's subjectivity or experience with regards to their gender and gender identity. Gender Context provides depth to more granular categorizations of a person indicated through the properties has gender identity or has gender identity (self-reported).
definition: Genre En Contexte est une sous-classe de contexte importante. Elle est associée Ã la sous-classe de Forme Culturelle genre, et se recoupe parfois avec d'autres Formes Culturelles. Les annotations entrées en tant que Genre En Contexte fournissent des renseignements et des discussions sur la subjectivité d'une personne en ce qui concerne son genre et son identité genrée. Genre Contexte explore plus en détails les indications granulaires des propriétés est de genre ou est de genre (autodéclaré). @fr

gender event
in dataset: The CWRC Ontology
type: Class
type: Concept
subclass of: cultural form event
definition: An event related to an gender context.

genderqueer
in dataset: The CWRC Ontology
represented by: queer identity
type: gender
type: Concept
label: queer @fr
definition: Indicates refusal of dominant gender categories and cisnormativity, and identification with both, a combination, or neither of the dominant binary gender roles. The term is strongly associated with the late twentieth and twenty-first centuries. It comes from deconstructionist and post-structuralist theory, and was coined by Teresa de Lauretis at a conference in 1990. Because "queer" identity is recent, its definition is still debated among scholars and activists. Even though it is not rigidly defined, the term is increasingly deployed to refer to a large category of people who are not "straight", in a sense that is not restricted to sexual orientation. Following Judith Butler, queerness is not understood as an essence, but best described as a doing or performance, a way to situate oneself deliberately against traditional notions of gender. See Genderqueer - Wikipedia.
definition: Indique le refus des catégories genrées dominantes et de la cisnormativité, l'identification aux deux, Ã aucun, ou Ã une combinaison des rôles genrés dominants. Le terme est fortement associé associé Ã la fin du 20e siècle et au 21e siècle. Il provient des théories déconstructionnistes et poststructuralistes, et fut formulé pour la première fois par Teresa de Lauretis lors d'une conférence en 1990. Du fait que le terme «queer» est assez récent, il est toujours sujet Ã des discussions parmi les chercheurs et les activistes. Même s'il ne possède pas de définition définitive, le terme est de plus en plus utilisé pour référer Ã une large catégorie de personnes qui ne sont pas «hétérosexuel/les», dans un sens qui va au-delà de l'orientation sexuelle. Selon Judith Butler, l'identité queer ne peut pas être compris comme une essence, mais est plutôt performative et s'actualise Ã travers des actions, au sein d'une posture délibérément Ã contre-courant des acceptions traditionnelles du genre. Voir See Non-binaire â Wikipédia. @fr
in scheme: gender

generational name
in dataset: The CWRC Ontology
type: Class
label: nom générationnel @fr
subclass of: name type
definition: A name component used to distinguish otherwise similar names on the basis of the relative ages or generations of the persons named." This term is derived from the Text Encoding Initiative P5 schema for the genName element. See TEI element genName (generational name component) .
definition: Composant de nom utilisé pour distinguer des noms similaires, en fonction de l'âge ou de la génération relatifs aux personnes portant un nom. "Ce terme est dérivé du schéma P5 du Text Encoding Initiative pour l'élément genName. Voir l'élément TEI genName TEI element genName (generational name component) . @fr

geographic heritage
in dataset: The CWRC Ontology
type: Class
type: ConceptScheme
label: héritage géographique @fr
subclass of: cultural form
definition: A subclass of cultural form, this property indicates a person's geographic heritage, with accompanying context, where present, provided by nationality context annotations. Geographic heritage involves the geographical origins of a person's family, which often contributes to an understanding of their racial and ethnic background. It offers a way to capture individuals identified as "South-Asian," for example, when no more precise national heritage is indicated. See race or ethnicity context for a detailed description of the complexities of this class. It can be multiple and it can be different from a person's national identity or national heritage, current or official citizenship, or the geographical region or territory in which a person resides. Those using this class and its instances are encouraged to consult associated nationality context excerpts or annotations, if available.
definition: Une sous-classe de forme culturelle, Héritage Géographique indique l'héritage géographique d'une personne, accompagné du contexte fourni par contexte national lorsqu'il est disponible. L'héritage géographique inclut les origines géographiques de la famille du sujet, souvent utiles Ã la compréhension de son milieu ethnique et raciale. Cela permet par exemple de saisir l'identité des femmes qui se déclarent «sud-asiatiques», alors que nous n'en savons pas plus sur leur héritage national. Voir contexte ethnique ou racial pour un compte-rendu détaillé de la complexité de cette classe. L'héritage géographique peut être pluriel et peut différer de l'identité ou de l'héritage national, de la citoyenneté actuelle ou officielle, et de la région géographique ou du lieu de résidence. Les personnes qui utilisent cette classe et ses instances sont encouragées Ã consulter les extraits ou les annotations de contexte national lorsqu'ils sont disponibles. @fr
note: Geonames terms are often used for locations and for many instances of geographic heritage.
note: Les termes Geonames sont souvent utilisés pour les lieux et de nombreuses instances héritage géographique. @fr

geographic heritage
is replaced by: geographic heritage
in dataset: The CWRC Ontology
type: DeprecatedClass
type: ConceptScheme
comment: Deprecated in favour of class geographic heritage.
comment: Désapprouver en faveur de la classe héritage géographique. @fr
label: héritage géographique @fr
subclass of: cultural form
equivalent class: geographic heritage
term status: deprecated
definition: A subclass of cultural form, this property indicates a person's geographic heritage, with accompanying context, where present, provided by nationality context annotations. Geographic heritage involves the geographical origins of a person's family, which often contributes to an understanding of their racial and ethnic background. It offers a way to capture individuals identified as "South-Asian," for example, when no more precise national heritage is indicated. See race or ethnicity context for a detailed description of the complexities of this class. It can be multiple and it can be different from a person's national identity or national heritage, current or official citizenship, or the geographical region or territory in which a person resides. Those using this class and its instances are encouraged to consult associated nationality context excerpts or annotations, if available.
definition: Une sous-classe de forme culturelle, Héritage Géographique indique l'héritage géographique d'une personne, accompagné du contexte fourni par contexte national lorsqu'il est disponible. L'héritage géographique inclut les origines géographiques de la famille du sujet, souvent utiles Ã la compréhension de son milieu ethnique et raciale. Cela permet par exemple de saisir l'identité des femmes qui se déclarent «sud-asiatiques», alors que nous n'en savons pas plus sur leur héritage national. Voir contexte ethnique ou racial pour un compte-rendu détaillé de la complexité de cette classe. L'héritage géographique peut être pluriel et peut différer de l'identité ou de l'héritage national, de la citoyenneté actuelle ou officielle, et de la région géographique ou du lieu de résidence. Les personnes qui utilisent cette classe et ses instances sont encouragées Ã consulter les extraits ou les annotations de contexte national lorsqu'ils sont disponibles. @fr

grammar school
in dataset: The CWRC Ontology
type: Class
comment: La description de ce terme est basée sur celle de DBPedia. @fr
comment: The description for this term is indebted to DBpedia.
subclass of: educational organization
definition: "A grammar school is one of several different types of school in the history of education in the United Kingdom and other English-speaking countries, originally a school teaching Latin, but more recently an academically-oriented secondary school, differentiated in recent years from less academic Secondary Modern Schools." (DBpedia, 2018)
definition: «Une grammar school est, dans les pays anglophones, un établissement d'enseignement secondaire ou, plus rarement, d'enseignement primaire. Les origines des grammar schools remontent Ã l'Europe médiévale.» (DBpedia, 2018) @fr

Gurjap Singh
type: natural person

health context
in dataset: The CWRC Ontology
type: Class
type: Concept
label: contexte de santé @fr
subclass of: biography context
definition: A significant subclass of context. Annotations typed as health provide information about and discussions of a person's health, both mental and physical, and associated social, political and historical factors.
definition: Sous-classe importante de contexte. Les annotations entrées comme contexte de santé fournissent des informations sur la santé physique et mentale d'une personne ainsi que sur des facteurs sociaux, politiques et historiques associés. @fr

health event
in dataset: The CWRC Ontology
type: Class
type: Concept
subclass of: biographical event
definition: An event related to an health context.

historic significance
in dataset: The CWRC Ontology
type: Class
type: Concept
label: importance historique @fr
subclass of: EventType
definition: Indicates a very high level of significance appropriate to a historical overview.
definition: Indique un très haut niveau d'importance qui est approprié pour un résumé historique. @fr

honorific name
in dataset: The CWRC Ontology
type: Class
subclass of: name type
definition: A positive name which celebrates or honours a person.

indexed name
in dataset: The CWRC Ontology
type: Class
label: nom indexé @fr
subclass of: name type
definition: Name under which a person's work is indexed by an institution or organization.
definition: Nom sous le travail d'une personne est indexé par une insitution ou une organisation. @fr

individual significance
in dataset: The CWRC Ontology
type: Class
type: Concept
label: importance individuelle @fr
subclass of: EventType
definition: Indicates a level of significance appropriate to an understanding of an individual person or entity.
definition: Indique le niveau d'importance approprié pour la compréhension d'une personne ou d'une entité individuelle. @fr

institutional education context
in dataset: The CWRC Ontology
type: Class
label: contexte éducatif institutionnel @fr
subclass of: education context
definition: Context for education or learning within an institutional setting.
definition: L'instruction ou l'apprentissage a lieu dans un cadre institutionnel. @fr
related: School

institutional education event
in dataset: The CWRC Ontology
type: Class
type: Concept
subclass of: education event
definition: An event related to an institutional education context.

interval time
in dataset: The CWRC Ontology
type: TimeType
label: intervalle @fr
definition: Indicates a span of time, usually represented in the form of a start and end date.
definition: Indique une période de temps, généralement représentée par une date de début et de fin. @fr

intimate relationship context
in dataset: The CWRC Ontology
type: Class
type: Concept
subclass of: biography context
definition: Intimate relationship context is a significant subclass of context. Annotations typed intimate relationships discuss any type of intimacy ranging from emotional through psychological or material to sexual.

intimate relationship event
in dataset: The CWRC Ontology
type: Class
type: Concept
subclass of: biographical event
definition: An event related to an intimate relationship context.

intimate relationships context
is replaced by: intimate relationship context
in dataset: The CWRC Ontology
type: DeprecatedClass
type: Concept
comment: Deprecated in favour of class intimate relationship context.
comment: Désapprouver en faveur de la classe [http://sparql.cwrc.ca/ontologies/cwrc#IntimateRelationshipContext]. @fr
subclass of: biography context
equivalent class: intimate relationship context
term status: deprecated
definition: Intimate relationships context is a significant subclass of context. Annotations typed intimate relationships discuss any type of intimacy ranging from emotional through psychological or material to sexual.

Jade Penancier
type: natural person

Jasmine Drudge-Willson
type: natural person

Jewish
is replaced by: Jewish
in dataset: The CWRC Ontology
represented by: Jewish identity
comment: Deprecated in favour of instance Jewish.
comment: Désapprouver en faveur de l'instance Juif. @fr
label: Juif @fr
deprecated: true
term status: deprecated

Joel Cummings
type: natural person

John Simpson
type: natural person

Kim Martin
type: natural person

language
in dataset: The CWRC Ontology
type: Class
type: Concept
label: langue @fr
subclass of: cultural form
definition: A human language or dialect, whether spoken and/or written.
definition: Une langue ou un dialecte humain, Ã l'oral et/ou Ã l'écrit. @fr
note: Library of Congress Languages codes are typically used for instances of language .
note: Les codes de la Bibliothèque du congrès sont normalement utilisés pour les instances de language. @fr

language context
is replaced by: cultural form context
subject: language
subject: linguistic ability (spoken and/or writen)
in dataset: The CWRC Ontology
type: DeprecatedClass
type: Concept
comment: Deprecated in favour of class cultural form context.
comment: Désapprouver en faveur de la classe forme culturelle en contexte. @fr
label: contexte linguistique @fr
subclass of: cultural form context
equivalent class: cultural form context
term status: deprecated
definition: Language Context is a significant subclass of context. Annotations typed as Cultural Formation Context provide information about and discussions of a person's linguistic ability or abilities. Language Context provides depth to more granular indications of linguistic ability indicated through the property Language.
definition: Langue en Contexte est une sous-classe de contexte importante. Les annotations entrées en tant que Contexte de Formation Culturelle fournissent des informations et des discussions sur la ou les aptitudes linguistiques d'une personne. Langue en Contexte fournit de la profondeur aux indications granulaires sur les aptitudes linguistiques grâce Ã la propriété Langage. @fr

leisure context
in dataset: The CWRC Ontology
type: Class
type: Concept
label: contexte de loisirs @fr
subclass of: biography context
definition: A significant subclass of context. Annotations typed as Leisure Context provide information about and discussions of instances of the leisure and social activities of a person including hobbies, sporting life and cultural activities, for example mountain climbing or hosting a literary salon. Notions of leisure are both gendered and classed, and vary by cultural context. This context is meant to capture a person's social life within their larger community, not simply an elite, fashionable social circle.
definition: Une sous-classe importante de contexte. Les annotations entrées en tant que contexte de loisirs fournissent des informations et des discussions sur les loisirs et les activités sociales d'une personne, notamment ses hobbies, sa vie sportive et ses activités culturelles, par exemple l'escalade ou la tenue d'un salon littéraire. Les notions de loisirs dépendent Ã la fois du genre et de la classe sociale et varient en fonction des cultures. Ce contexte vise Ã rendre compte de la vie sociale dâune personne au sein de sa communauté au sens large, et non seulement de son cercle social d'élite. @fr

leisure event
in dataset: The CWRC Ontology
type: Class
type: Concept
subclass of: biographical event
definition: An event related to an leisure context.

linguistic ability (spoken and/or writen)
in dataset: The CWRC Ontology
type: DeprecatedClass
type: Concept
comment: Deprecated, with no current equivalence.
comment: Désapprouver sans équivalence. @fr
label: aptitude linguistique (écrit ou parlé) @fr
subclass of: cultural form
term status: deprecated
definition: Describes a person's proficiency in a language (speaking, reading, or writing).
definition: Décrit l'aptitude d'une personne pour parler, lire ou écrire une langue. @fr

literary award
in dataset: The CWRC Ontology
type: Class
subclass of: award
definition: A literary award is an award presented in recognition of a particularly lauded literary piece or body of work. It is normally presented to an author.

literary climate
in dataset: The CWRC Ontology
type: Class
type: Concept
label: environnement littéraire @fr
subclass of: EventType
definition: An event associated with the climate for literature and writing, broadly conceived, ranging from publication or performance events to information about print technologies and copyright.
definition: Un évènement associé Ã l'environnement littéraire et Ã l'écriture, allant de la publication ou Ã la représentation d'un texte Ã des informations sur les techniques d'impression et sur les droits d'auteur·e. @fr

literary name
in dataset: The CWRC Ontology
type: Class
label: nom littéraire @fr
subclass of: name type
definition: A name applied to a writer by others, for example in reviews or at readings, which orginate in the person's status as a writer.
definition: Un nom attribué par d'autres Ã un·e auteur·e, par example dans des critiques ou lors de lectures, prenant son origine dans le statut d'écrivain·e de la personne. @fr

local name
in dataset: The CWRC Ontology
type: Class
label: nom local @fr
subclass of: name type
definition: A name with a geographic connotation, for example, "Julian of Norwich."
definition: Nom avec une connotation géographique, par exmple "Julienne de Norwich." @fr

mapped place
in dataset: The CWRC Ontology
type: Class
type: Concept
subclass of: Place
subclass of: place
definition: A place that can be mapped according to some accepted system of graphically representing space.

married name
in dataset: The CWRC Ontology
type: Class
label: nom marital @fr
subclass of: name type
definition: A surname adopted in marriage.
definition: Nom de famille adopté après le mariage. @fr

mental health context
in dataset: The CWRC Ontology
type: Class
type: Concept
label: contexte de santé mentale @fr
subclass of: health context
definition: A subclass of health context. Annotations typed as mental health context describe an aspect of a personâs mental or psychological well-being or illness.
definition: Sous-classe de Contexte de santé. Les annotations entrées en tant que contexte de snaté mentale décrivent un aspect de du bien-être mental d'une personne ou au contraire de ses troubles psychologiques ou mentaux. @fr

name context
in dataset: The CWRC Ontology
type: Class
type: Concept
label: contexte de nom @fr
subclass of: biography context
definition: A significant subclass of context. Annotations typed as name context provide the name or names associated with a person, at times with contextual information.
definition: Sous-classe de contexte importante. Les annotations entrées comme contexte de nom fournissent le ou les noms associés Ã une personne, parfois accompagnés d'informations contextuelles. @fr

name event
in dataset: The CWRC Ontology
type: Class
type: Concept
subclass of: biographical event
definition: An event related to an name context.

name link
in dataset: The CWRC Ontology
type: Class
label: particule de nom @fr
subclass of: name type
definition: "A connecting phrase or link used within a name but not regarded as part of it, such as van der or of." This term is derived from the Text Encoding Initiative P5 schema for the NameLink element. See TEI element nameLink (name link) .
definition: "Une locution ou un lien de connexion utilisé dans un nom mais n'étant pas considéré comme partie intégrante de ce nom, par example van der ou de." Ce terme est dérivé du schéma P5 du Text Encoding Initiative pour l'élément NameLink. Voir l'élément TEI TEI element nameLink (name link) . @fr

name type
in dataset: The CWRC Ontology
type: Class
subclass of: personal name
definition: An aspect of a person's name, including its use, connotations, or significance.

national heritage
in dataset: The CWRC Ontology
type: Class
type: ConceptScheme
label: héritage national @fr
subclass of: cultural form
definition: A subclass of cultural form, this property indicates a person's national heritage, with accompanying context, where present, provided by nationality context annotations. National Heritage is composed of various elements related to national identity, often transmitted from previous generations and influenced by a subject's national historical background or geographic heritage. It can be multiple and can be different from a person's national identity, current or official citizenship, or the geographical region or territory in which a person resides. Those using this class and its instances are encouraged to consult associated nationality context excerpts or annotations, if available.
definition: Une sous-catégorie de forme culturelle, cette propriété indique l'héritage national d'une personne, accompagné du contexte national lorsqu'il est disponible. Héritage National est composé de divers éléments relatifs Ã l'identité nationale, et est souvent transmis par des générations antérieures, influencé par le milieu historique et l'héritage géographique. Il peut être puluriel et peut se distinguer de l'identité nationale, de la citoyenneté actuelle ou officielle, de la région géographique ou du territoire de résidence. Les personnes qui utilisent cette classe et ses instances sont encouragées Ã consulter les extraits ou les annotations de contexte national lorsque ceux-ci sont disponibles. @fr

national identity
in dataset: The CWRC Ontology
type: Class
type: ConceptScheme
label: identité nationale @fr
subclass of: cultural form
definition: A subclass of cultural form, this property indicates a person's national identity, either as self-reported or as assigned by others, with accompanying context, where present, provided by nationality context annotations. It is neither the same as citizenship nor commensurate with the geographical region or territory in which a person resides, although it is usually associated with a current or former country or geographic region. For this reason, the (see ISO 2-digit Codes for the representation of names of countries and their subdivisions â Part 2: Country subdivision codes are used where possible to represent instances of national identities, and only terms for which country codes do not exist appear in this ontology. Like other identity categories, nationality may be plural, fluid, or contingent, and terms used for national identities can intersect with national heritage, geographic heritage, and ethnicity as well as other identity categories. Those using this class and its instances are encouraged to consult associated nationality context annotations, if available.
definition: Une sous-catégorie de forme culturelle, cette propriété indique la nationalité d'une personne, qu'elle soit autodéclarée ou attribuée par d'autres, accompagnée du contexte fourni par les annotations de contexte national lorsqu'il est disponible. Elle diffère de la citoyenneté et n'est pas proportionnelle Ã la zone géographique ou au territoire de la personne, même si elle est généralement liée au pays ou Ã la zone géographique actuelle ou passée. Pour cette raison, (vois les codes de la norme ISO 2 pour la représentation des pays et de leurs subdivisions-Partie 2 : Codes des subdivisions des pays sont utilisés dans la mesure du possible pour représenter les instances de nationalités, et seuls les termes pour lesquels aucun code pays n'existe apparaissent dans l'ontologie. Comme d'autres catégories identitaires, la nationalité peut être plurielle, fluide ou contingente, et recoupe avec héritage national ainsi qu'avec d'autres catégories identitaires. Les personnes qui utilisent cette classe et ses instances sont encouragées Ã consulter les annotations de contexte national lorsqu'elles sont disponibles. @fr

nationality context
subject: geographic heritage
subject: national heritage
subject: national identity
in dataset: The CWRC Ontology
type: Class
type: Concept
label: contexte national @fr
subclass of: cultural form context
definition: Contexte National est une sous-classe de contexte importante. Les annotations entrées en tant que Contexte National fournissent des informations et des discussions sur la formation culturelle d'une personne, en lien avec son identité nationale, son héritage national et son héritage géographique qui ne sont pas toujours équivalents. Contexte National explore plus en détails les indications granulaires sur l'identité nationale Ã travers les propriétés héritage national, identité nationale et héritage géographique. @fr
definition: Nationality Context is a significant subclass of context. Annotations typed as Nationality Context provide information about and discussions of a person's cultural formation in relation to their national identity, national heritage, and geographic heritage -- which are not always aligned. Nationality Context provides depth to more granular indications of national identity through the national heritage, national identity, and geographic heritage properties.

nationality event
in dataset: The CWRC Ontology
type: Class
type: Concept
subclass of: cultural form event
definition: An event related to an nationality context.

natural person
type: Class
label: personne physique @fr
subclass of: Person
definition: Ãtre humain en vie ou ayant vécu Ã un moment donné. Les personnes physiques peuvent être objets de fiction, auquel cas elles sont classées en tant que personne fictive. @fr
definition: A human being who is alive, or was alive at some point in time. Natural persons may be fictionalized, in which case they are also classed as a fictional person.

nickname
in dataset: The CWRC Ontology
type: Class
label: nom honnorifique @fr
subclass of: name type
definition: Indicates familiar, humorous, or abusive name given to a person, applied instead of or in addition to their real name. May have name type, abusive name or honorific name.
definition: Un nom Ã connotation positive qui glorifie ou honnore une personne. @fr

note
type: Class
definition: A note or annotation, such as a footnote, endnote, or hypertext comment, which may be part of an object, contained in metadata describing it (as for a non-textual object), or linked to it, for instance via a Web Annotation.

note (internal)
type: Class
subclass of: note
subclass of: Note
definition: A note or annotation intended for internal purposes having to do with such matters as research, composition, or workflow, and not intended for publication.

note (scholarly)
type: Class
subclass of: note
subclass of: Note
definition: A scholarly note or annotation intended for publication, usually containing ancillary or supplementary content, which may take various forms such as a footnote, endnote, or pop-up note.

occupation
in dataset: The CWRC Ontology
type: Class
type: Concept
definition: A position, activity, job, or profession, whether paid, unpaid, or voluntary, often related to and at times overlapping with a person's social class.

occupation context
in dataset: The CWRC Ontology
type: Class
type: Concept
label: contexte biographique @fr
subclass of: biography context
definition: A significant subclass of context. Annotations typed as occupation provide information about and discussions of positions and activities significant to a person's life, including paid, unpaid, and voluntary work both beyond and within the home. Although writing as a career sometimes overlaps with occupation, literary activities are often described in writing contexts.
definition: Contexte Biographique est une sous-classe majeure de contexte. Les annotations entrées comme contexte biographique fournissent des informations et des discussions sur la biographie ou la vie personnelle d'un individu, grâce aux propriétés, aux relations biographiques et aux sous-classes de contexte biographique, telles que le contexte de naissance, le contexte de forme culturelle ou le contexte professionnel. @fr

occupation event
in dataset: The CWRC Ontology
type: Class
type: Concept
subclass of: biographical event
definition: An event related to an occupation context.

oeuvre
in dataset: The CWRC Ontology
type: Class
definition: Indicates the works of an author or other creative practioner regarded collectively.

organization
in dataset: The CWRC Ontology
type: DeprecatedClass
comment: Deprecated in favour of class org:formalOrganization
comment: Désapprouver en faveur de la classe org:formalOrganization. @fr
term status: deprecated
definition: A social or corporate institution such as a publisher, school, political group, or company.

performance
is replaced by: hasElement
in dataset: The CWRC Ontology
type: DeprecatedClass
type: Concept
comment: Deprecated in favour of class [http://sparql.cwrc.ca/ontologies/cwrc#EventElement].
comment: Désapprouver en faveur de la classe [http://sparql.cwrc.ca/ontologies/cwrc#EventElement]. @fr
label: Leistung @de
label: interprétation @fr
subclass of: EventElement
deprecated: true
equivalent class: EventElement
term status: deprecated
definition: A performance by an agent in an event under a specific context, be it in a role, character or responsibility.

period significance
in dataset: The CWRC Ontology
type: Class
type: Concept
subclass of: EventType
definition: Indicates a moderate level of significance appropriate to an understanding of a historical period.

persona
in dataset: The CWRC Ontology
type: Class
type: Concept
comment: This definition is indebted to the Text Encoding Initiative's definition of the persona element. See TEI element persona .
subclass of: Person
definition: A persona, unlike a role, cannot be adopted by people generally, but is specific to one natural person, or more rarely several natural persons. A persona is an original creation, often bearing meaning regarding the biographical, historical and sociological context to which its/their creator/s is/are attached. Personas as defined here should not be associated with mental illness or multiple personality disorder, since they are not the product of a distorted or uncontrolled perception of reality. At the heart of a persona is an identity that is interacted with by others and that at times can be confused with an actual natural person. It is incarnated and developed by a natural person, and may have a social, literary, artistic or political activity.
definition: Un persona, contrairement Ã un rôle, ne peut être incarné par quiconque, mais est spécifique Ã une personne physique, ou plus rarement Ã plusieurs d'entre elles. Un persona est une création originale, souvent inspiré par le contexte biographique, historique et sociologique auquel son/ses créateur·ice(s) est/sont attaché·e(s). Les personae tels qu'ils sont définis ici ne doivent pas être confondus avecune maladie mentale ou Ã un trouble dissociatif de l'identité, car ils ne relèvent pas d'une perception déformée ou incontrôlée de la réalité. Le persona est avant tout une entité identitaire capable d'interargir avec le monde extérieur et qui peut parfois être confondue avec une personne physique réelle. Il est incarné et développé par une personne physique, et peut avoir une activité sociale, littéraire, artistique ou politique. @fr

personal name
in dataset: The CWRC Ontology
type: Class
subclass of: E41 Appellation
definition: A person's name, containing a proper noun or proper-noun phrase referring to a person. Has subclasses for types of names such as pseudonym and may have name type, and may have associated parts. This term is derived in part from the Text Encoding Initiative P5 schema persname element. See also TEI element persName (personal name) .

physical health context
in dataset: The CWRC Ontology
type: Class
type: Concept
subclass of: health context
definition: A subclass of health context. Annotations typed as physical health context describe aspects of a personâs bodily or physical well-being or illness.

place
in dataset: The CWRC Ontology
type: Class
type: Concept
label: endroit @fr
subclass of: SpatialThing
equivalent class: Place
equivalent class: Feature
definition: A named entity associated with a location in geographical space. It may be real or fictive, populated or unpopulated.
definition: Il peut concerner un endroit peuplé, mais pas nécessairemment. Certains endroits, comme les intersections, n'ont pas de de populations ou d'habitants en soi. Les Geonames classifieront parfois les endroits désormais abandonnés comme «lieux habités». @fr

political affiliation
in dataset: The CWRC Ontology
type: Class
type: ConceptScheme
label: appartenance politique @fr
subclass of: cultural form
definition: Cette sous-classe de forme culturelle indique les appartenances, les connexions et les associations qui font partie de l'engagement politique d'une personne. Elles renvoient aussi bien aux connexions formelles avec un parti ou une organisation qu'aux autres partis pris politiques informels de l'auteur·e. Les appartenances politiques sont définies au sens large et incluent des exemples comme « lutte contre la peine de mort » ou « fervent·e défenseur·se de l'Empire » en plus d'appartenance plus directes telles que « marxiste » ou « conservateur·ice ». Les appartenances politiques peuvent être multiple, parfois contradictoires ou en tension, et peuvent changer au cours du temps. @fr
definition: This subclass of CulturalForm indicates affiliations, connections and associations which designate a person's political involvement. These affiliations can be both formal connections to a party or organisation and informal political positions held by the writer. Political affiliations are defined broadly and include things like "against capital punishment" or "strong supporter of the Empire" in addition to more straightforward affiliations such as "marxist" or "conservative". Political affiliations can be multiple, sometimes contradictory, and may change over time.

political climate
in dataset: The CWRC Ontology
type: Class
type: Concept
subclass of: EventType
definition: An event having political implications within its geopolitical context, often nationally or internationally. Includes the accession of' monarchs, changing governing structures including revolutions, the establishment of major organizations, and other markers of political change.

politics context
subject: political affiliation
in dataset: The CWRC Ontology
type: Class
type: Concept
label: contexte politique @fr
subclass of: cultural form context
definition: Contexte Politique est une sous-classe de contexte importante. Elle est associée Ã appartenance politique, sous-classe de forme culturelle, et recoupe parfois avec d'autres Formes Culturelles. Les annotations entrées en tant que Contexte Politique fournissent des informations et des discussions sur la subjectivité d'une personne en lien avec son activité politique. Contexte Politique explore plus en détails les catégories granulaires d'une personne grâce aux propriétés a une appartenance politique ou a une appartenance politique (autodéclarée)). @fr
definition: Politics Context is a significant subclass of context. It is associated with the cultural form subclass political affiliation, and sometimes other intersecting Cultural Forms. Annotations typed as Politics Context provide information about and discussions of a person's subjectivity or experience with regards to their political identity. Politics Context provides depth to more granular categorizations of a person indicated by the properties has political affiliation and its subproperties.

political organization
in dataset: The CWRC Ontology
type: Class
subclass of: FormalOrganization
definition: An organization whose activities are primarily political or with which a person is affiliated politically.

politics event
in dataset: The CWRC Ontology
type: Class
type: Concept
subclass of: cultural form event
definition: An event related to an politics context.

post-secondary school
in dataset: The CWRC Ontology
type: Class
comment: La description de ce terme est basée sur celle de DBPedia. @fr
comment: The description for this term is indebted to DBpedia.
subclass of: educational organization
definition: "Higher education, post-secondary education, or third level education is an optional final stage of formal learning that occurs after secondary education. Often delivered at universities, academies, colleges, seminaries, and institutes of technology, higher education is also available through certain college-level institutions, including vocational schools, trade schools, and other career colleges that award academic degrees or professional certifications. Tertiary education at non-degree level is sometimes referred to as further education or continuing education as distinct from higher education. The right of access to higher education is mentioned in a number of international human rights instruments. The UN International Covenant on Economic, Social and Cultural Rights of 1966 declares, in Article 13, that "higher education shall be made equally accessible to all, on the basis of capacity, by every appropriate means, and in particular by the progressive introduction of free education". In Europe, Article 2 of the First Protocol to the European Convention on Human Rights, adopted in 1950, obliges all signatory parties to guarantee the right to education" (DBpedia, 2018)
definition: «Le terme d'études supérieures désigne généralement l'éducation dispensée par les universités, les collèges anglo-saxons, avec en France un système plus dual de grandes écoles et d'autres institutions comme les grands établissements décernant des grades universitaires ou autres diplômes de l'enseignement supérieur. Ces études visent Ã acquérir un niveau "supérieur" de compétences, généralement via une inscription ou concours d'entrée, un cursus ponctués par des examens. Historiquement, il s'agissait autrefois d'abord de former les élites recrutées par les Ãtats, les armées et les religions, puis (Ã partir de la révolution industrielle) par les monde économique et industriel et de la culture ou de l'enseignement. Mais d'autres dimensions, socioculturelles et éthiques ou de développement durable sont apparues Ã la fin du XXe siècle, ajoutant une dimension de service public visant Ã permettre aux étudiants, de trouver leur voie ou domaine d'excellence, de se préparer aux métiers futurs tout en faisant progresser le savoir. Ces études se déroulent souvent autour de campus, dans un système public ou privé selon les cas, et souvent catégorisés en « Sciences dures », « sciences de l'ingénieur » et « sciences humaines et sociales ». Les types de diplômes évoluent avec le temps, mais tendent Ã s'homogénéiser aux niveaux européens et internationaux avec les licences, des masters, et des doctorats pour faciliter les systèmes d'équivalence ou de reconnaissance mutuelle de diplômes. Cette formation inclut des cours et des stages, et peut également comporter des participations Ã la recherche scientifique (notamment au niveau du doctorat) et intégrer de la formation continue, mais accepte souvent aussi des « auditeurs libres » qui viennent simplement accroître leur culture générale ou spécialisée.» (DBpedia, 2018) @fr

precision
in dataset: The CWRC Ontology
type: Class
comment: The description for this term is indebted to the Text Encoding Initiative's P5: Guidelines for Electronic Text Encoding and Interchange.
subclass of: Thing
definition: Indicates the numerical accuracy or precision associated with some aspect of a value, measurement, or identification. For example, with respect to a location, it may indicate how precisely a place being referenced is indicated by the latitude and longitude or the place identifier provided.

preferred name
in dataset: The CWRC Ontology
type: Class
subclass of: name type
definition: Indicates the form of name preferred by an authority or institution.

prep school
in dataset: The CWRC Ontology
type: Class
label: école préparatoire @fr
subclass of: educational organization
definition: Dans le contexte nord-américain, les écoles préparatoires sont des établissements d'enseignement privés qui préparent les étudiant·e·s Ã l'université. Dans le contexte britannique, ce sont des écoles privées pour les étudiants; la tranche d'âge des élèves peut varier considérablement en fonction du début de leur scolarisation, mais elle va généralement de sept (parfois trois) Ã treize ans. @fr
definition: Within a North American context, prep schools are private educational institutions that prepare students for college. Within a British context, they are private schools for students -- the age range of the students can vary significantly depending on when they went to school, though typically ranging from ages seven (though sometimes three) to thirteen.

primary school
in dataset: The CWRC Ontology
type: Class
comment: La description de ce terme est basée sur celle de DBPedia. @fr
comment: The description for this term is indebted to DBpedia.
label: école primaire @fr
subclass of: educational organization
definition: «L'enseignement primaire, ou l'école primaire, est, dans plusieurs pays, le premier degré de l'enseignement. Il permet notamment l'apprentissage de la lecture, de l'écriture et des bases des mathématiques. Les enfants débutent leurs études primaires vers l'âge de 6 ans et les achèvent vers l'âge de 11 ans.» (DBpedia, 2018) @fr
definition: "A primary school (or elementary school in American English and often in Canadian English) is a school in which children receive primary or elementary education from the age of about five to twelve, coming after preschool and before secondary school. (In some countries there is an intermediate stage of middle school between primary and secondary education.)" (DBpedia, 2018)

private school
in dataset: The CWRC Ontology
type: Class
comment: La description de ce terme est basée sur celle de DBPedia. @fr
comment: The description for this term is indebted to DBpedia.
label: école privée @fr
subclass of: educational organization
definition: "Private schools, also known as independent schools, non-governmental, or nonstate schools, are not administered by local, state or national governments; thus, they retain the right to select their students and are funded in whole or in part by charging their students tuition, rather than relying on mandatory taxation through public (government) funding; at some private schools students may be able to get a scholarship, which makes the cost cheaper, depending on a talent the student may have (e.g. sport scholarship, art scholarship, academic scholarship), financial need, or tax credit scholarships that might be available." (DBpedia, 2018)
definition: «Les écoles privées sont des écoles qui ne sont pas administrées par leur gouvernement local, étatique ou national et qui conservent donc le droit de sélectionner leurs élèves et sont financées, en tout ou en partie grâce aux frais de scolarité qu'elle demande Ã ses élèves, plutôt qu'entièrement par des fonds gouvernementaux. La plupart des écoles privées offrent des bourses d'étude qui permettent de rendre la fréquentation plus abordable pour des étudiants possédant un talent quelconque, généralement au niveau académique ou sportif. Le terme école privée désigne habituellement une école primaire ou secondaire et n'est que très rarement utilisé pour désigner une université.» (DBpedia, 2018) @fr

professional title
in dataset: The CWRC Ontology
type: Class
subclass of: role name
definition: A person's professional role (e.g. Doctor Jane Smith) or designates membership in a professional society (e.g. John Smith, Esquire).

pseudonym
in dataset: The CWRC Ontology
type: Class
subclass of: name type
definition: Indicates both names and descriptive phrases (e.g. "A Lover of Her Sex" is a pseudonym for Mary Astell) used in publishing to conceal the identity of the author or to represent a persona.

punctive time
in dataset: The CWRC Ontology
type: TimeType
label: temps ponctuel @fr
definition: Indicates a point or location in time. Punctive time can be used to anchor an event that has a duration, such as a wedding or an election. It may be represented by various levels of granularity, for instance a second or a year, or by two dates between which an event was known to occur.
definition: Indique un point ou un emplacement dans le temps. Le temps ponctuel peut être utilisé pour ancrer un événement qui a une durée, comme un mariage ou une élection. Il peut être représenté par différents niveaux de granularité, par exemple une seconde ou une année, ou par deux dates entre lesquelles un événement s'est produit. @fr

race or colour
in dataset: The CWRC Ontology
type: Class
type: ConceptScheme
label: race ou couleur @fr
subclass of: cultural form
definition: A subclass of cultural form, this property indicates a person's race or colour, often as presumed, perceived, or otherwise assigned according to cultural conventions, with accompanying context, where present, provided by race or ethnicity context annotations. Despite the ways in which categories of race or colour frequently serve heinous interests, their ideological and material impacts in the formation of identities requires recognition. These are shifting, historically constituted, and interestedly deployed categories whose use must be situated contextually and which are understood here finally as discursive or representational although they have real material impacts. They are thus as social constructs: "There is nothing more to being, or not being, a given race than the social acceptance and societal ascription of a race to a person" (Damon Sajnani, 2015). This ontology therefore does not attempt to lay out an exact, fully defined, or mutually exclusive set of racial categories: this is an impossibility given their shifting use and the overlap among them and with identity categories for ethnicity, geography, and nationality. Those applying this class and its instances are encouraged not to let privileged identities operate as an unspoken given or to use this class solely in relation to the marginalized. Those concerned about "white" and "black" as homogenizing categories are encouraged to reach for specificity through plural categories and representations of intersectionality, and to consult race or ethnicity context annotations, if available.
definition: Sous-classe de forme culturelle, cette propriété indique l'appartenance raciale ou la couleur d'une personne, souvent telle qu'elle est présupposée, perçue ou autrement assignée selon des conventions culturelles, en parallèle avec le contexte fourni par les annotation de contexte ethnique ou racial lorsqu'il est présent. Même si les catégories de race ou de couleur sont fréquemment manipulées au service d'intérêts déplorables, leurs répercussions idéologiques et matérielles sur la formation identitaire requiert qu'on les prenne en compte. Ces catégories changeantes, historiquement constituées, développées de façon intéressée, et dont l'usage doit être resitué en contexte sont enfin comprises ici comme discursives et représentationnelles, même si leurs répercussions matérielles sont bien réelles. Ce sont donc des constructions sociales: «Le fait d'appartenir ou non Ã une race donnée n'est rien de plus que l'acceptation sociale et l'attribution sociétale d'une race Ã une personne» (Damon Sajnani, 2015). Cette ontologie ne prétend donc pas offrir un ensemble de catégories raciales exact, complètement défini, ou mutuellement exclusif, ce qui est impossible étant donné leur utilisation en changement constant et leur chevauchement mutuel ou avec d'autres catégories identitaires utilisées pour l'ethnicité, la géographie ou la nationalité. Les personnes qui appliquent ces catégories et sous-catégories sont encouragées Ã ne pas faire fonctionner les identités privilégiées comme si elles étaient consensuelles et évidentes, ou Ã utiliser cette classe seulement en relation avec des populations marginalisées. Les personnes préoccupées par le fait que «blanc» et «noir» sont des catégories homogénéisantes sont encouragées Ã atteindre la spécificité Ã travers la pluralité des catégories et les représentations intersectionnelles, ainsi qu'à consulter les annotations associés Ã contexte ethnique ou racial s'ils s… @fr

race or ethnicity
in dataset: The CWRC Ontology
type: DeprecatedClass
type: Concept
comment: Deprecated in favour of class race or colour and ethnicity.
comment: Désapprouver en faveur de la classe race ou couleur et ethnicité. @fr
label: race ou ethnicité @fr
subclass of: cultural form
term status: deprecated

race or ethnicity context
subject: ethnicity
subject: race or colour
in dataset: The CWRC Ontology
type: Class
type: Concept
label: contexte ethnique ou racial @fr
subclass of: cultural form context
definition: Contexte Ethnique ou Racial est une sous-classe importante de Contexte, et est associée aux sous-classes race ou couleur et ethnicité et parfois Ã d'autres formes culturelles. Les annotations entrées en tant que Contexte Ethnique ou Racial fournissent des renseignements de contextualisation et des discussions sur l'identité d'un sujet concernant son appartenance raciale et/ou son ethnicité. Même si les catégories de race et d'ethnicité sont fréquemment manipulées au service d'intérêts déplorables, leurs répercussions idéologiques et matérielles sur la formation identitaire requièrent qu'on les prenne en compte. Ces catégories sont changeantes, historiquement constituées, développées de façon intéressée, et leur usage doit être resitué dans leur contexte; elles sont finalement comprises ici comme discursives et représentationnelles, même si elles ont de réelles répercussions matérielles. Elles sont entendues comme des constructions sociales: «Le fait d'être ou de ne pas être d'une certaine race n'est rien de plus que l'acceptation sociale et l'attribution sociétale d'une race Ã une personne» (Damon Sajnani, 2015) @fr
definition: Race or Ethnicity Context is a subclass of cultural form context, and is associated with the cultural form subclasses race or colour and ethnicity, and sometimes other cultural forms. Annotations typed as Race or Ethnicity Context provide contextualizing information about and discussions related to a person's perceived or self-reported identity with regards to race and/or ethnicity (Race or Colour or ethnicity). Despite the ways in which categories of Race or Colour and ethnicity frequently serve heinous interests, their ideological and material impacts in the formation of identities requires recognition. These are shifting, historically constituted, and interestedly deployed categories whose use must be situated contextually and are understood here finally as discursive or representational although they have real material impacts. They are thus social constructs: "There is nothing more to being, or not being, a given race than the social acceptance and societal ascription of a race to a person" (Damon Sajnani, 2015).

race ethnicity event
in dataset: The CWRC Ontology
type: Class
type: Concept
subclass of: cultural form event
definition: An event related to an race or ethnicity context.

religion
in dataset: The CWRC Ontology
type: Class
type: ConceptScheme
subclass of: cultural form
definition: A subclass of cultural form, this describes a person's religion(s) or belief system(s). Note that while atheism denotes the absence of religion, we use the Religion label for convenience.
definition: Une sous-classe de forme culturelle,décrit la/les religion(s) ou le(s) système(s) de croyance d'une personne. Notez que par commodité nous utilisons l'étiquette Religion pour l'athéisme, même si le terme indique l'absence de religion. @fr

religious context
subject: religion
in dataset: The CWRC Ontology
type: Class
type: Concept
label: contexte religieux @fr
subclass of: cultural form context
definition: Contexte Religieux est une sous-classe de contexte importante. Elle est associée Ã religion, sous-classe de Forme Culturelle, et recoupe parfois avec d'autres Formes Culturelles. Les annotations entrées en tant que Contexte Religieux fournissent des informations et des discussions sur la subjectivité d'une personne en lien avec sa religion. Contexte Religieux explore plus en détails les catégories granulaires d'une personne grâce aux propriétés est de confession Ou religion (autodéclarée). @fr
definition: Religion Context is a significant subclass of context. It is associated with the cultural form subclass religion, and sometimes other intersecting Cultural Forms. Annotations typed as Religion Context provide information about and discussions of a person's subjectivity or experience with regards to their religion. Religion Context provides depth to more granular categorizations of a person indicated by the properties has religious affiliation or has religious affiliation (self-reported).

religion event
in dataset: The CWRC Ontology
type: Class
type: Concept
subclass of: cultural form event
definition: An event related to an religious context.

religious organization
in dataset: The CWRC Ontology
type: Class
subclass of: FormalOrganization
definition: An organization whose activities are primarily religious.

religious school
in dataset: The CWRC Ontology
type: Class
label: école non laïque @fr
subclass of: educational organization
definition: A school associated formally in some way with a religion, ranging from parochial schools to faith-based schools.
definition: Ãtablissement éducatif officiellement associé de quelque façon avec une religion, allant des écoles paroissiales aux écoles confessionnelles. @fr

religious name
in dataset: The CWRC Ontology
type: Class
subclass of: name type
definition: A name acquired through a religious role or practice.

reproductive history
in dataset: The CWRC Ontology
type: Class
type: Concept

Robert Warren
type: natural person

role
in dataset: The CWRC Ontology
type: Class
label: Rôle @fr
definition: A role of a Person or Actor in some Event, CreativeWork, or Organisation.
definition: Le rôle d'une Personne ou d'un·e Acteur·ice au sein d'un Ãvènement, d'une Åuvre Créative ou une Organisation. @fr

role name
in dataset: The CWRC Ontology
type: Class
subclass of: name type
definition: A name which "indicates that a person has a particular role or position in society, such as an official title or rank." This term is derived from the Text Encoding Initiative P5 schema for the roleName element. See TEI element roleName .

romance name
in dataset: The CWRC Ontology
type: Class
subclass of: name type
definition: Indicates cases where the person has a name associated with writing romances, or with romantic writing, for example, Swift's Stella.

royal name
in dataset: The CWRC Ontology
type: Class
subclass of: role name
definition: A name based on royal status.

scholarship
in dataset: The CWRC Ontology
type: Class
subclass of: educational award
definition: A scholarship is an award of financial aid for a student to further their education. Scholarships are awarded based upon various criteria, which usually reflect the values and purposes of the donor or founder of the award. Scholarship money is not required to be repaid.

secondary modern school
in dataset: The CWRC Ontology
type: Class
comment: La description de ce terme est basée sur celle de DBPedia. @fr
comment: The description for this term is indebted to DBpedia.
label: école secondaire moderne @fr
subclass of: educational organization
definition: "A secondary modern school is a type of secondary school that once existed throughout England, Wales and Northern Ireland, from 1944 until the 1970s under the Tripartite System and still persist in Northern Ireland, where they are usually referred to simply as Secondary schools, and in areas of England, such as Buckinghamshire (where they are referred to as community schools), Lincolnshire, Wirral Medway and Kent where they are called high schools. " (DBpedia, 2018)
definition: «Les écoles secondaires modernes, ou Secondary Technical Schools (en), avaient pour objectif une professionnalisation rapide de leur élèves.» (DBpedia, 2018) @fr

secondary school
in dataset: The CWRC Ontology
type: Class
comment: La description de ce terme est basée sur celle de DBPedia. @fr
comment: The description for this term is indebted to DBpedia.
label: collège @fr
subclass of: educational organization
definition: "A secondary school is both an organization that provides secondary education and the building where this takes place. Some secondary schools can provide both lower secondary education and upper secondary education (levels 2 and 3 of the ISCED scale), but these can also be provided in separate schools, as in the American middle school- high school system. Secondary schools typically follow on from primary schools and lead into vocational and tertiary education. Attendance is compulsory in most countries for students between the ages of 11 and 16. The organisations, buildings, and terminology are more or less unique in each country." (DBpedia, 2018)
definition: «En France, le collège est un établissement d'enseignement â public ou privé â qui se situe entre l'école primaire et le lycée et assure le premier niveau de l'enseignement secondaire (de la 6e Ã la 3e) en principe de 11 Ã 14 / 15 ans environ (l'âge obligatoire minimum de sortie scolaire est de 16 ans en France).» (DBpedia, 2018) @fr

secular school
in dataset: The CWRC Ontology
type: Class
label: école laïque @fr
subclass of: educational organization
definition: A school that is not formally associated with a religious organization and/or one that is avowedly secular in its educational principles, often but not always publicly-funded institutions that are funded by countries with a separation between religion and the state.
definition: Ãcole qui n'est pas formellement associée Ã quelque organisation religieuse et/ou officiellement laïque dans ses principes éducatifs, souvent (mais pas toujours) financée publiquement dans les pays où la religion est séparée de l'Ãtat. @fr

self constructed name
in dataset: The CWRC Ontology
type: Class
subclass of: additional name
definition: A self-chosen name used in everyday life rather than only on title-pages as is the case for a pseudonym.

self taught education context
in dataset: The CWRC Ontology
type: Class
label: contexte éducatif autodidacte @fr
subclass of: education context
definition: Contexte éducatif lié Ã l'apprentissage mené de façon autonome. @fr
definition: Education context related to learning conducted independently.
related: Autodidacticism

self taught education event
in dataset: The CWRC Ontology
type: Class
type: Concept
subclass of: education event
definition: An event related to an self taught education context.

sex identity
is replaced by: gender
in dataset: The CWRC Ontology
type: DeprecatedClass
type: Concept
comment: Deprecated in favour of class gender.
comment: Désapprouver en faveur de la classe genre. @fr
label: identité sexe @fr
subclass of: cultural form
equivalent class: gender
term status: deprecated

Sexual Identity
is replaced by: sexuality
in dataset: The CWRC Ontology
type: DeprecatedClass
type: Concept
comment: Deprecated in favour of sexuality term.
comment: Deprecated in favour of class sexuality.
comment: Désapprouver en faveur de la classe sexualité. @fr
label: Identité Sexuelle @fr
subclass of: cultural form
equivalent class: sexuality
term status: deprecated

sexuality
in dataset: The CWRC Ontology
type: Class
type: ConceptScheme
label: sexualité @fr
subclass of: cultural form
definition: A subclass of cultural form and linked to sexuality context, Sexuality properties indicate in a word or phrase identifications or aspects of sexuality (i.e., "lesbian," "monogamous," "heterosexual" but also "promiscuous") not as a means of shutting down but advancing investigation and critical analysis of these identifications. The association assumes that sexual identity does not function in an essentialist manner but can be plural and fluid, so multiple designations can be applied to a single person can be associated with multiple terms. Sexual identity may come from the subject her/himself or be ascribed by others. Terms may be in tension or mutually exclusive, they may reflect different life stages, and they may or may not reflect actual sexual practices. Linking a person to the term lesbianism as a sexual identity, for instance, does not necessarily signify that the subject was in any definitive sense a lesbian; such identifications are often impossible for reasons of historical gaps and silences. As far as living persons are concerned, our practice is to draw only on widely circulated public sources or disclosures from the subject her/himself in order to avoid inadvertently outing someone. See Campbell and Cowan, 2016
definition: Une sous-classe de forme culturelle liée Ã sexualité en contexte, les propriétés de Sexualité indiquent en un mot ou en une phrase les identifications ou les aspects de la sexualité (par exemple «lesbienne», «monogame», «hétérosexuelle», mais aussi «promiscuité»), non pas pour clore la discussion mais pour développer l'étude et l'analyse critique de ces catégories. Comme l'identité sexuelle peut être plurielle et fluide, une même personne est susceptible d'être associée Ã plusieurs termes. L'identité sexuelle peut être formulée par la personne elle-même ou être assignée par d'autres individus. Les termes utilisés peuvent se trouver en tension ou se montrer incompatibles, et reflètent différentes périodes de l'existence. Par exemple, lier une personne au terme «lesbienne» comme classe de sexualité ne signifie pas nécessairement que cette dernière était définitivement lesbienne, car une telle identification est souvent impossible Ã cause de lacunes et de silences historiques. En ce qui concerne les personnes toujours en vie, nous ne nous appuyons que sur des sources ou des déclarations publiques faites par le sujet elle/lui-même afin de ne pas dévoiler par inadvertance des informations privées sur sa sexualité. Voir Campbell and Cowan 2016 @fr

sexuality context
subject: gender
subject: sexuality
in dataset: The CWRC Ontology
type: Class
type: Concept
label: sexualité en contexte @fr
subclass of: cultural form context
definition: Sexuality Context is a significant subclass of cultural form context. Annotations typed as Sexuality Context provide information about and discussions of a person's subjectivity or experience with regards to their sexuality and sexual identity. Sexuality Context provides depth to more granular categorizations of a person through the sexuality or sexuality self-reported properties. It does not provide context for individual sexual experiences and relationships (for which see intimate relationship context), although specific relationships may be invoked to indicate the impact on a subject's life and understanding of their own sexuality. Contextualizations allow recognition of the complicated politics of sexuality, for example, considerations regarding outing, the historical specificity of some categories such as "congenital invert," the appropriation of derogatory terms, and the multiplicity of constructions. There are important politics of privacy with respect to the disclosure of a subject's sexuality, sexual orientation, and sexual identity. As far as living persons are concerned, recommended practice is to draw only on widely circulated public sources or disclosures from the subject her/himself in order to avoid inadvertently outing someone. See Campbell and Cowan, 2016
definition: Sexualité En Contexte est une sous-classe de contexte importante. Les annotations de Sexualité En Contexte fournissent des renseignements et des discussions sur la sexualité et l'identité sexuelle d'une personne grâce Ã Sexualité ou Sexualité Autodéclarée. Elle n'est pas vouée Ã répertorier les expériences sexuelles et les relations intimes, même si certaines d'entre elles peuvent être évoquées pour indiquer leurs conséquences sur la vie du sujet ou la connaissance qu'elle a de sa propre sexualité. Ces efforts de contextualisation permettent de reconnaître l'existence de questions complexes qui entourent la sexualité, comme par exemple les politiques de délation, la spécificité historique de certaines catégories comme "inversion sexuelle", la réappropriation de termes dénigrants ou les mutliples constructions discursives. Il existe d'importantes politiques de confidentialité qui protègent les personnes contre la divulgation d'informations privées sur leur sexualité, leur orientation sexuelle et leur identité sexuelle. Pour les personnes toujours en vie, notre pratique est donc de ne nous appuyer que sur des sources ou des déclarations publiques venant des sujets eux-mêmes, afin de ne pas dévoiler par inadvertance des informations privées sur leur sexualité. Voir (Campbell and Cowan, 2016) @fr

sexuality event
in dataset: The CWRC Ontology
type: Class
type: Concept
subclass of: cultural form event
definition: An event related to an sexuality context.

single-sex school
in dataset: The CWRC Ontology
type: Class
comment: The description for this term is indebted to DBpedia.
label: éducation non mixte @fr
subclass of: educational organization
definition: "Single-sex education, also known as single-gender education, is the practice of conducting education where male and female students attend separate classes or in separate buildings or schools. The practice was common before the twentieth century, particularly in secondary education and higher education. Single-sex education in many cultures is advocated on the basis of tradition as well as religion, and is practiced in many parts of the world. Recently, there has been a surge of interest and establishment of single-sex schools due to educational research. Single sex education is practiced in many Muslim majority countries; while in the West it is most popular in Belgium, Chile, Singapore, the United Kingdom, Hong Kong, Israel, New Zealand, Australia, South Korea. Motivations for such education range from religious ideas of sex segregation to beliefs that the sexes learn and behave differently, and, as such, they thrive in a single sex environment. In the 19th century, in Western countries, single sex girls' finishing schools, and women's colleges offered women a chance to education at a time when they were denied access to mainstream educational institutions. The former were especially common in Switzerland, the latter in the US and the UK, which were pioneers in women's education." (DBpedia, 2018)
definition: L'éducation non mixte, également connue sous le nom d'éducation unisexe, désigne un type d'éducation qui implique la séparation des élèves en fonction de leur sexe de naissance, qui sont réparti·e·s dans des classes, des bâtiments ou des écoles séparés. @fr

social class
in dataset: The CWRC Ontology
type: Class
type: ConceptScheme
label: classe sociale @fr
subclass of: cultural form
definition: A subclass of cultural form, socialClass terms associate subjects with a specific social group, recognizing that such categories and their application to individuals are contested and can change over time. The association may be or have been embraced by the subject her/himself or attributed by others. Unlike Notes typed as social class context, which contain detailed discussion of a subject's class position, socialClass links to a word or phrase signifying a particular construction of class, with particular reference to earlier historical periods in the British Isles. Social class has been variously constructed and theorized, sometimes overlaps with occupation, and for women is further complicated by the fact that women were understood to take their social status from fathers and/or husbands. The terminology used here reflects quite basic social groupings that intersect with other factors such as wealth.
definition: Une sous-catégorie de culturalForm, les termes de socialClass associent les sujets Ã des groupes sociaux spécifiques, en prenant en compte le fait que ces catégories et leur application aux individus sont contestables et peuvent changer au fil du temps. L'association Ã une classe sociale peut ou a pu être assumée par le sujet elle/lui-même ou attribuée par d'autres. Contrairement aux notes comme contexte social, qui contiennent les détails des discussions autour de le statut social du sujet, socialClass relie un mot ou une phrase référant Ã une classe spécifique qui renvoie Ã des périodes historiques antérieures spécifiques des Ãles Britanniques. La notion de classe sociale a été construite et théorisée de diverses manières, et est d'autant plus complexe pour les femmes puisqu'elles étaient censées adopter le statut social de leur père et/ou de leur mari. La terminologie ici utilisée réfère Ã des groupes sociaux élémentaires qui se recoupent avec d'autres facteurs comme la richesse. @fr

social class context
subject: social class
in dataset: The CWRC Ontology
type: Class
type: Concept
label: contexte social @fr
subclass of: cultural form context
definition: Contexte Social est une sous-classe de contexte importante. Les annotations de Contexte Social fournissent des informations et des discussions relatives Ã la classe sociale et parfois Ã d'autres Formes Culturelles d'une personne. Contexte Social explore plus en détails les indications granulaires sur la classe sociale Ã travers les propriétés de Classe Sociale.(Orlando, 2006) @fr
definition: Social Class Context is a significant subclass of context. Annotations typed as Social Class Context provide information about and discussions of a person's cultural formation in relation to social class identities and sometimes other intersecting Cultural Forms. Social Class Context provides depth to more granular indications of social class through the Social Class property(Orlando, 2006).

social class event
in dataset: The CWRC Ontology
type: Class
type: Concept
subclass of: cultural form event
definition: An event related to an social class context.

social class identity
is replaced by: social class
in dataset: The CWRC Ontology
type: DeprecatedClass
type: Concept
comment: Deprecated in favour of class social class.
comment: Désapprouver en faveur de la classe classe sociale. @fr
label: identité classe sociale @fr
subclass of: cultural form
equivalent class: social class
term status: deprecated
definition: A subclass of culturalForms, socialClassIdentity terms associate subjects with a specific social group, recognizing that such categories and their application to individuals are contested and can change over time. The association may be or have been embraced by the subject her/himself or attributed by others. Unlike Notes typed as socialClassContext, which contain detailed discussions of a subject's class position, socialClassIdentity links to a word or phrase signifying a particular construction of class, with particular reference to earlier historical periods in the British Isles. Social class has been variously constructed and theorized, and for women is further complicated by the fact that women were understood to take their social status from fathers and/or husbands. The terminology used here reflects quite basic social groupings that intersect with other factors such as wealth.
definition: Une sous-catégorie de culturalForms, les termes de socialClassIdentity associent les sujets Ã des groupes sociaux spécifiques, en prenant en compte le fait que ces catégories et leur application aux individus sont contestables et peuvent changer au fil du temps. L'association Ã une classe sociale peut ou a pu être assumée par le sujet elle/lui-même ou attribuée par d'autres. Contrairement aux notes comme socialClassContext, qui contiennent les détails des discussions autour de le statut social du sujet, socialClassIdentity relie un mot ou une phrase référant Ã une classe spécifique qui renvoie Ã des périodes historiques antérieures spécifiques des Ãles Britanniques. La notion de classe sociale a été construite et théorisée de diverses manières, et est d'autant plus complexe pour les femmes puisqu'elles étaient censées adopter le statut social de leur père et/ou de leur mari. La terminologie ici utilisée réfère Ã des groupes sociaux élémentaires qui se recoupent avec d'autres facteurs comme la richesse. @fr

social climate
in dataset: The CWRC Ontology
type: Class
type: Concept
subclass of: EventType
definition: Events, including indications of larger trends, with social implications, such as shifts in technology, science, medicine, law, or education, domestic conditions such as housing, clothes, or food and food supply, or the changing positions and civic involvements of marginalized groups.

spatial context
in dataset: The CWRC Ontology
type: Class
type: Concept
subclass of: context
definition: A significant subclass of context. Annotations typed as spatial context provide information about and discussions of aspects of a person's connections to geospatial locations. Spatial information is also associated in a range of ways with other properties and events such as a person's geographic heritage, a place of publication, or the setting of literary texts.

spatial event
in dataset: The CWRC Ontology
type: Class
type: Concept
subclass of: Event
subclass of: E7 activity
definition: An event related to an spatial context.

spatial movement event
in dataset: The CWRC Ontology
type: Class
type: Concept
subclass of: biographical event
subclass of: spatial event
definition: An event related to an spatial context. Particularly in relation to travelled to, moved to, emigrated from, immigrated to, visits

state school
in dataset: The CWRC Ontology
type: Class
comment: The description for this term is indebted to DBpedia.
subclass of: educational organization
definition: "State schools (also known as public schools outside of England and Wales) generally refer to primary or secondary schools mandated for or offered to all children without charge, funded in whole or in part by taxation. The term may also refer to public institutions of post-secondary education." (DBpedia, 2018)
definition: State school est un terme utilisé en Australie, en Nouvelle-Zélande et au Royaume-Uni pour distinguer les écoles gérées par le gouvernement des écoles privées. @fr

studentship
in dataset: The CWRC Ontology
type: Class
subclass of: educational award
definition: A Studentship is a type of academic scholarship.

styled name
in dataset: The CWRC Ontology
type: Class
subclass of: role name
definition: A courtesy title associated with the British or other peerage.

surname
in dataset: The CWRC Ontology
type: Class
subclass of: name type
equivalent class: 8581.html
definition: A subject's last name at birth, often a family (inherited) name, as opposed to a forename or nickname." This term is derived from the Text Encoding Initiative P5 schema surname element. See also TEI element surname .

Susan Brown
type: natural person

system name
in dataset: The CWRC Ontology
type: Class
subclass of: personal name
subclass of: accountName
definition: A name by which a person holds an account for a platform or service.

textual label
in dataset: The CWRC Ontology
type: Class
type: ConceptScheme
label: étiquettes textuelles @fr
definition: Collection of ambiguous or overloaded labels associated with contested concepts.
definition: Ensemble des étiquettes ambigues au sein du jeu d'étiquettes d'Orlando. @fr
related: Label

titled name
in dataset: The CWRC Ontology
type: Class
subclass of: role name
definition: A formal title in the British and other peerages, including of a life peer. Peeresses may be described as titled, although in strict terms, unless one holds a title "in her own right", these are styled names or courtesy titles.

trade school
in dataset: The CWRC Ontology
type: Class
comment: La description de ce terme est basée sur celle de DBPedia. @fr
comment: The description for this term is indebted to DBpedia.
label: lycée professionnel @fr
subclass of: educational organization
definition: "A vocational school, sometimes called a trade school or vocational college, is a post-secondary educational institution designed to provide vocational education, or technical skills required to perform the tasks of a particular and specific job. Vocational schools are traditionally distinguished from four-year colleges by their focus on job-specific training to students who are typically bound for one of the skilled trades, rather than providing academic training for students pursuing careers in a professional discipline. While many schools have largely adhered to this convention, the purely vocational focus of other trade schools began to shift in the 1990s "toward a broader preparation that develops the academic" as well as technical skills of their students." (DBpedia, 2018)
definition: «En France, le lycée professionnel (LP) est un établissement d'enseignement professionnel qui offre un enseignement professionnel en relation avec les métiers des entreprises, afin d'acquérir des compétences, des connaissances et des savoir-faire dans un domaine professionnel. Son but est l'insertion socioprofessionnelle.» (DBpedia, 2018) @fr

violence context
in dataset: The CWRC Ontology
type: Class
type: Concept
subclass of: biography context
definition: A significant subclass of context. Annotations typed as Violence Context provide information about and discussions of instances of physical, sexual, and undue emotional abuse, whether the person was subject to the violence or perpetrated it. Broadly conceived to include the effect of exposure to violence of which the person was neither perpetrator nor survivor.

violence event
in dataset: The CWRC Ontology
type: Class
type: Concept
subclass of: biographical event
definition: An event related to an violence context.

wealth context
is replaced by: economic context
in dataset: The CWRC Ontology
type: DeprecatedClass
type: Concept
comment: Deprecated in favour of class economic context.
comment: Désapprouver en faveur de la classe . @fr
subclass of: biography context
equivalent class: economic context
term status: deprecated
definition: A significant subclass of context. Annotations typed as Wealth Context provide information about and discussions of a person's economic standing, including inheritance, property ownership, pensions, and personal financial disasters. See also the occupation context and cultural form context, particularly for social class context.

women's health context
in dataset: The CWRC Ontology
type: Class
type: Concept
subclass of: health context
definition: A subclass of health context. Annotations typed as women 's health context describe an aspect of a person's health related to being a woman. Often closely connected to or overlapping with reproductive history. See Women's health - Wikipedia.

When owl:sameAs IsnâÂÂt the Same: An Analysis of Identity in Linked Data
doi: 978-3-642-17746-0 20
volume: 6496
type: Article

Henry S. Thompson
first name: Henry S.
last name: Thompson
type: Person

Patrick J. Hayes
first name: Patrick J.
last name: Hayes
type: Person

Harry Halpin
first name: Harry
last name: Halpin
type: Person

James P. McCusker
first name: James P.
last name: McCusker
type: Person

Deborah L. McGuinness
first name: Deborah L.
last name: McGuinness
type: Person

International Semantic Web Conference
date: 2010
type: Proceedings

Springer
type: Organization

Key Concepts in Post-colonial Studies
issued: 1998
language: eng
type: Book

Gareth Griffiths
first name: Gareth
last name: Griffiths
type: Person

Bill Ashcroft
first name: Bill
last name: Ashcroft
type: Person

Helen Tiffin
first name: Helen
last name: Tiffin
type: Person

Literary Criticism
type: Organization

Encyclopedia of Postcolonial Studies
language: eng
uri: https://gpreview.kingborn.net/812000/1f12b226026b4455b93414506a261df1.pdf
type: Document

John Charles Hawley
first name: John Charles
last name: Hawley
type: Person

Greenwood Publishing Group,
type: Organization

The curious identity of Michael Field and its implications for humanities research with the semantic web.
type: Article

John Simpson
first name: John
last name: Simpson
type: Person

Susan Brown
first name: Susan
last name: Brown
type: Person

2013 IEEE International Conference on Big Data
date: 2013
type: Proceedings

abolitionism
in dataset: The CWRC Ontology
contrary to: pro-slavery
type: political affiliation
type: Concept
comment: La description de ce terme est basée sur celle de DBPedia. @fr
comment: The description for this term is indebted to DBpedia.
label: Abolitionnisme @fr
alternative label: abolition
alternative label: abolitionist
alternative label: anti-slavery
alternative label: integrationism
alternative label: sugar boycotter
broader transitive: civil rights movement
broader transitive: human rights
broader transitive: racial equality
definition: "Abolitionism is a movement to end slavery, whether formal or informal. In Western Europe and the Americas, abolitionism is a historical movement to end the African and Indian slave trade and set slaves free. King Charles I of Spain, usually known as Emperor Charles V, following the example of the Swedish monarch, passed a law which would have abolished colonial slavery in 1542, although this law was not passed in the largest colonial states, and so was not enforced. In the late 17th century, the Roman Catholic Church, taking up a plea by Lourenco da Silva de Mendouca, officially condemned the slave trade, which was affirmed vehemently by Pope Gregory XVI in 1839. An abolitionist movement only started in the late 18th century, however, when English and American Quakers began to question the morality of slavery. James Oglethorpe was among the first to articulate the Enlightenment case against slavery, banning it in the Province of Georgia on humanist grounds, arguing against it in Parliament, and eventually encouraging his friends Granville Sharp and Hannah More to vigorously pursue the cause. Soon after his death in 1785, they joined with William Wilberforce and others in forming the Clapham Sect. The Somersett Case in 1772, which emancipated a slave in England, helped launch the British movement to abolish slavery. Though anti-slavery sentiments were widespread by the late 18th century, the colonies and emerging nations that used slave labour continued to do so: French, English and Portuguese territories in the West Indies; South America; and the Southern United States. After the American Revolution established the United States, northern states, beginning with Pennsylvania in 1780, passed legislation during the next two decades abolishing slavery, sometimes by gradual emancipation. Massachusetts ratified a constitution that declared all men equal; freedom suits challenging slavery based on this principle brought an end to slavery in the state. Vermont, which exist…
definition: «L'abolitionnisme est un courant de pensée qui émerge dans le dernier tiers du XVIIIe siècle dans le monde occidental (notamment en Grande-Bretagne) et vise la suppression de l'esclavage. Par extension, on utilise le terme pour tous les mouvements qui cherchent la suppression d'une tradition, d'une institution ou d'une loi : abolition de la peine de mort, de la torture, du travail, des privilèges, des prisons, de la prostitution, du spécisme, etc.» (DBpedia, 2017) @fr
in scheme: political affiliation

abolitionist
in dataset: The CWRC Ontology
type: occupation
type: Concept
alternative label: abolitionist activist
alternative label: abolitionist worker
broader transitive: activist
in scheme: occupation

abortion
in dataset: The CWRC Ontology
type: reproductive history
type: Concept
alternative label: aborted
definition: Related to an abortion of a pregnancy.
in scheme: reproductive history

Abrahamic religions
in dataset: The CWRC Ontology
type: religion
type: Concept
comment: La description de ce terme est basée sur celle de DBPedia. @fr
comment: The description for this term is indebted to DBpedia.
label: Religions abrahamiques @fr
definition: "Abrahamic religions, emphasising and tracing their common origin to the tribal patriarch Abraham or recognizing a spiritual tradition identified with him, comprising one of the major divisions in comparative religion, along with Indian, Iranian, and East Asian religions. Judaism, Christianity and Islam are the largest Abrahamic religions.The largest Abrahamic religions in chronological order of founding are Judaism (2nd millennium BCE), Christianity (1st century CE) and Islam (7th century CE)." (DBpedia, 2017)
definition: «L'expression religion abrahamique désigne principalement le judaïsme, le christianisme dont les Saintes Ãcritures, respectivement le Tanakh, la Bible évoquent la figure d'Abraham et l'islam avec le Coran, celle d'Ibrahim.En français, cette expression est apparue vers 1950 dans des études d'islamologie pour désigner, d'une part, la religion d'Abraham telle qu'elle se conçoit dans l'islam et d'autre part les trois religions que sont le judaïsme, le christianisme et l'islam.» (DBpedia, 2017) @fr
in scheme: religion

academic
in dataset: The CWRC Ontology
type: occupation
type: Concept
alternative label: academician
alternative label: humanist scholar
alternative label: scholar
broader transitive: education
hidden label: academic and social critic
hidden label: first woman in scotland to earn a university certificate
hidden label: greek and hebrew examiner
hidden label: oxford don
in scheme: occupation

accountant
in dataset: The CWRC Ontology
type: occupation
type: Concept
alternative label: agent and accountant
alternative label: book keeper
alternative label: household accountant
alternative label: keeping accounts
alternative label: management accountant
hidden label: family budgeting
hidden label: family financial manager
in scheme: occupation
related: finance

activist
in dataset: The CWRC Ontology
type: occupation
type: Concept
alternative label: activist against slavery
alternative label: activist for dissent
alternative label: activist for the disabled
alternative label: anti poverty activist
alternative label: anti slavery activist
alternative label: anti vivisectionist
alternative label: child labour activist
alternative label: christian social activist
alternative label: civil rights activist
alternative label: continuing education activist
alternative label: educational activist
alternative label: housing activist
alternative label: human rights activist
alternative label: labour activist
alternative label: library activist
alternative label: media activist
alternative label: medical mission activist
alternative label: peace activist
alternative label: political activist
alternative label: poverty activist
alternative label: protest organiser
alternative label: resistance activist
alternative label: social activist
alternative label: temperance activist
alternative label: workhouse activist
in scheme: occupation

activist involvement in
in dataset: The CWRC Ontology
range includes: political affiliation
range includes: political organization
range includes: religion
subject-centric predicate: has activist involvement in
type: ObjectProperty
domain: Person
sub property of: political membership in

actor manager
in dataset: The CWRC Ontology
type: occupation
type: Concept
broader transitive: theatre work
in scheme: occupation

adjudicator
in dataset: The CWRC Ontology
type: occupation
type: Concept
alternative label: awards judge
alternative label: contest judge
hidden label: selector for the poetry book society
in scheme: occupation

administrator
in dataset: The CWRC Ontology
type: occupation
type: Concept
alternative label: administration
alternative label: administrative officer
alternative label: hospital administrator
hidden label: principal of institute
in scheme: occupation

adoption
in dataset: The CWRC Ontology
type: reproductive history
type: Concept
definition: Related to adoption.
in scheme: reproductive history

Adventism
in dataset: The CWRC Ontology
type: religion
type: Concept
comment: La description de ce terme est basée sur celle de DBPedia. @fr
comment: The description for this term is indebted to DBpedia.
label: Adventisme @fr
alternative label: Second Adventist
broader transitive: Protestantism
definition: "Adventism is a branch of Protestantism with origins in the 19th century American Protestant revival known as the Second Great Awakening. The name refers to belief in the imminent Second Coming (or "Second Advent") of Jesus Christ. William Miller started the Adventist movement in the 1830s. His followers became known as Millerites. Although the Adventist churches hold much in common, their theologies differ on whether the intermediate state is unconscious sleep or consciousness, whether the ultimate punishment of the wicked is annihilation or eternal torment, the nature of immortality, whether or not the wicked are resurrected after the millennium, and whether the sanctuary of Daniel 8 refers to the one in heaven or one on earth. The movement has encouraged the examination of the whole Bible, leading Seventh-day Adventists and some smaller Adventist groups to observe the Sabbath. The General Conference of Seventh-day Adventists has compiled that church's core beliefs in the 28 Fundamental Beliefs (1980 and 2005), which use Biblical references as justification. In 2010, Adventism claimed some 22 million believers scattered in various independent churches. The largest church within the movement â the Seventh-day Adventist Church â is one of the largest Christian churches in the world, with more than 18 million baptized members." (DBpedia, 2018)
definition: «L'adventisme est un mouvement chrétien lancé au XIXe siècle dans le contexte du Second grand réveil aux Ãtats-Unis. L'expression se réfère Ã la doctrine de la deuxième venue de Jésus-Christ, aussi appelée « le retour du Christ ». Ceux qui adhérèrent Ã l'enseignement du prédicateur baptiste William Miller furent appelés les millerites. Le mot « adventisme » ou « adventisme du septième jour » désigne aussi ce qui touche Ã l'histoire, les croyances, la mission, l'organisation et la sociologie de l'Ãglise adventiste du septième jour, la plus grande dénomination adventiste. Le terme n'est nullement restreint aux dénominations adventistes. Une personne qui attend le retour du Christ est dans les faits un « adventiste ». L'Ãglise primitive des rois mages annonça et attendit le retour des apôtres. Des ordres catholiques y accordèrent leur attention. L'histoire et l'identité spirituelle du mouvement adventiste prennent leurs sources différentes dans la réforme luthérienne, le baptisme, le piétisme, le méthodisme et les réveils. Un intérêt pour l'étude des textes prophétiques de la Bible abordant la question de la venue en gloire du Christ est très attesté tout au long de l'histoire protestante. Ã partir du XVIIIe siècle en Europe cet intérêt devint plus profond et inspira la prédication revivaliste, ainsi que celle de William Miller. Ellen G. White proposa sa version de l'adventisme dans son livre "La tragédie des siècles" (1911).» (DBpedia, 2018) @fr
in scheme: religion

advertising
in dataset: The CWRC Ontology
type: occupation
type: Concept
alternative label: advertising manager
alternative label: assistant press officer
alternative label: literary publicist
alternative label: music publicity
alternative label: political publicist
alternative label: press assistant
alternative label: press officer
alternative label: public relations
alternative label: public relations specialist
alternative label: publicist
alternative label: publicity
alternative label: publicity agent
alternative label: publicity assistant
alternative label: publicity manager
alternative label: publicity officer
alternative label: religious publicist
hidden label: junior press officer
hidden label: publisher's advertising manager
hidden label: quaker publicist
in scheme: occupation

advocate
in dataset: The CWRC Ontology
type: occupation
type: Concept
alternative label: advocate for the poor
alternative label: animal rights advocate
alternative label: anti poverty
alternative label: campaigner against capital punishment
alternative label: campaigner for child welfare
alternative label: civil rights
alternative label: emigration promoter
alternative label: free speech advocate
alternative label: maternity advocate
alternative label: prisoners' advocate
alternative label: promote temperance
alternative label: promotion of women's work
alternative label: sunday school promoter
broader transitive: politics
hidden label: continued to encourage women to enter politics through various efforts
in scheme: occupation

Rachel/Racial Theory: Reverse Passing in the Curious Case of Rachel Dolezal
language: eng
uri: http://hutchinscenter.fas.harvard.edu/news/hutchins/rachelracial-theory-reverse-passing-curious-case-rachel-dolezal
type: AcademicArticle

Damon Sajnani
first name: Damon
last name: Sajnani
type: Person

Transition Magazine, Hutchins Center
type: Journal

affected entity
in dataset: The CWRC Ontology
type: ObjectProperty
domain: change set
definition: Affected entities link to the Object or Class that was modified within a change set, this can be any rdf:resource. A change set may have 0 to many affected entities.

African-American
in dataset: The CWRC Ontology
represented by: black identity
type: ethnicity
type: Concept
comment: La description de ce terme est basée sur celle de DBPedia. @fr
comment: The description for this term is indebted to DBpedia.
label: Afro-américain @fr
definition: "African Americans (also referred to as Black Americans or Afro-Americans) are an ethnic group of Americans (citizens or residents of the United States) with total or partial ancestry from any of the Black racial groups of Africa. The term may also be used to include only those individuals who are descended from enslaved Africans. As a compound adjective the term is usually hyphenated as African-American." (DBpedia, 2017)
definition: «Les Afro-Américains, également appelés Noirs américains ou, plus rarement, Africains-Américains, sont les citoyens des Ãtats-Unis ayant des ancêtres originaires d'Afrique noire. La grande majorité des Afro-Américains est descendante des esclaves déportés entre le début du xviie et le début du xixe siècle. Longtemps victimes de l'esclavage, de la ségrégation raciale et de la discrimination (en), la reconstruction après la guerre de Sécession, la déségrégation et le Mouvement des droits civiques constituent autant d'étapes vers la reconnaissance des droits des Afro-Américains. L'accession de Barack Obama Ã la tête des Ãtats-Unis en 2009 constitue bien d'un certain point de vue la fin de ce long cheminement mais n'empêche pas que les classes sociales afro-Américaines les plus démunies soient toujours confrontées au racisme et Ã la discrimination, notamment par certains membres des forces de police américaine.»(DBpedia, 2017) @fr
in scheme: ethnicity
related: African

African
in dataset: The CWRC Ontology
represented by: black identity
type: ethnicity
type: Concept
comment: La description de ce terme est basée sur celle de DBPedia. @fr
comment: The description for this term is indebted to DBpedia.
label: Africain @fr
alternative label: black African descent
definition: "The ethnic groups of Africa number in the thousands, each generally having its own language (or dialect of a language) and culture. The ethnolinguistic groups include various Afro-Asiatic, Khoisan, Niger-Congo and Nilo-Saharan populations." (DBpedia, 2017)
definition: «Cet article propose une liste des groupes ethniques d'Afrique, non exhaustive (on peut en dénombrer près de 2 000 sur le continent africain et Ã Madagascar) et en cours d'élaboration. Comme il s'agit de sociétés vivantes, ces distinctions et divisions sont toujours discutées et en évolution, il n'en existe donc pas de représentation unique. La notion d'ethnie est controversée au sein de l'anthropologie contemporaine, notamment francophone. En particulier, il n'existe pas d'accord sur des critères permettant de délimiter tous les groupes (langue, culture, territoire, sentiment d'appartenanceâ¦) Ce répertoire alphabétique a donc surtout une finalité pratique. Il appartient Ã chaque article d'apporter précisions et mise en perspective historique.»(DBpedia, 2017) @fr
in scheme: ethnicity

African
in dataset: The CWRC Ontology
type: national heritage
type: Concept
comment: La description de ce terme est basée sur celle de DBPedia. @fr
comment: The description for this term is indebted to DBpedia.
label: Africain @fr
definition: "The African diaspora refers to the communities throughout the world that have resulted by descent from the movement in historic times of peoples from Africa, predominantly to the Americas, Europe, the Middle East, Asia, and among other areas around the globe. The term has been historically applied in particular to the descendants of the West and Central Africans who were enslaved and shipped to the Americas in the Atlantic slave trade between the 16th and 19th centuries, with their largest populations in Brazil (see Afro-Brazilian), the United States, and others. Some scholars identify "four circulatory phases" of migration out of Africa." (DBpedia, 2018)
definition: «La diaspora africaine est une population qui résulte de la déportation d'Africains Ã l'époque de la traite esclavagiste du XVIe au XIXe siècle et de leurs descendants Ã travers le monde d'une part, et du phénomène d'émigration d'autre part. Ils habitent plus particulièrement sur le continent américain dans les Caraïbes, aux Guyanes (Guyane, Guyana et Suriname), aux Ãtats-Unis, au Canada, en Amérique centrale et en Amérique du Sud (dans tous les pays sauf au Chili et Argentine). Ils sont minoritaires partout sauf aux Antilles, où la population résulte du métissage entre Européens et Africains.» (DBpedia, 2018) @fr
in scheme: national heritage

African
in dataset: The CWRC Ontology
type: national identity
type: Concept
label: Africain @fr
definition: Indicates a subject's identification with or labelling as African as a national identity.
definition: Indique qu'un sujet s'identifie Ã ou s'est vu assigner une identité nationale africaine. @fr
in scheme: national identity

Afro-Caribbean
in dataset: The CWRC Ontology
type: race or colour
type: Concept
comment: La description de ce terme est basée sur celle de DBPedia. @fr
comment: The description for this term is indebted to DBpedia.
label: Afro-Caribéens @fr
definition: "African-Caribbeans are Caribbean people who trace their heritage to Africa in the period since Christopher Columbus's arrival in the region in 1492. Other names for the group include African-Caribbean (especially in the UK branch of the diaspora), Afro-Antillean or Afro-West Indian. Between the 16th and 19th centuries, European-led triangular trade brought African people to work as slaves in the Caribbean on various plantations. Many Afro-Caribbeans also have non-African ancestry, such as European, South Asian, East Asian, Middle Eastern and Native American, as there has been intermarriage over the centuries." (DBpedia, 2018)
definition: «Les Afro-Caribéens (Afro-Caribbeans) sont des habitants de la Caraïbe d'origine africaine, dont l'arrivée est postérieure Ã la découverte du continent américain par Christophe Colomb en 1492. Ils sont parfois nommés Africains-Caribéens (notamment dans la diaspora au Royaume-Uni), Afro-antillais ou Afro-Indiens de l'Ouest.» (DBpedia, 2018) @fr
in scheme: race or colour

agent
in dataset: The CWRC Ontology
type: occupation
type: Concept
hidden label: chief agent
in scheme: occupation

agnosticism
in dataset: The CWRC Ontology
type: religion
type: Concept
comment: La description de ce terme est basée sur celle de DBPedia. @fr
comment: The description for this term is indebted to DBpedia.
label: agnosticisme @fr
definition: "Agnosticism is the view that the truth values of certain claims â especially metaphysical and religious claims such as whether God, the divine or the supernatural exist â are unknown and perhaps unknowable. According to the philosopher William L. Rowe: "In the popular sense of the term, an agnostic is someone who neither believes nor disbelieves in God, whereas an atheist disbelieves in God." Agnosticism is a doctrine or set of tenets rather than a religion as such. Thomas Henry Huxley, an English biologist, coined the word "agnostic" in 1869. Earlier thinkers, however, had written works that promoted agnostic points of view, such as Sanjaya Belatthaputta, a 5th-century BCE Indian philosopher who expressed agnosticism about any afterlife; and Protagoras, a 5th-century BCE Greek philosopher who expressed agnosticism about "the gods". The Nasadiya Sukta in the Rigveda is agnostic about the origin of the universe." (DBpedia, 2017)
definition: «L'agnosticisme ou pensée de l'interrogation est une attitude de pensée considérant la vérité de certaines propositions concernant notamment l'existence de Dieu ou des dieux comme inconnaissable : Ã la différence des croyants, considérant probable ou certaine l'existence de telles divinités, ou des athées l'estimant improbable ou impossible, les agnostiques refusent de trancher. Si le degré de scepticisme varie selon les individus, les agnostiques s'accordent pour dire qu'il n'existe pas de preuve définitive en faveur de l'existence ou de l'inexistence du divin, et affirment l'impossibilité de se prononcer. Si les agnostiques refusent de se prononcer quant Ã l'existence d'une intelligence supérieure, ils n'accordent, en revanche, ou du moins tendent Ã n'accorder, aucune transcendance et aucune valeur sacrée aux religions (prophète, messie, textes sacrés...) et Ã leurs institutions (clergé, rituels et prescriptions diverses...). Ceux-ci voient en effet les religions comme de pures constructions sociales et culturelles qui auraient surtout pour fonction historique d'assurer la cohésion et l'ordre dans les sociétés humaines traditionnelles via par exemple la menace de l'enfer, la promesse du paradis ou encore la notion de péché ou par le mécanisme du bouc émissaire. En d'autres termes, les religions, aux yeux d'un agnostique, seraient bien trop «humaines» de par leurs modes de fonctionnement et de par les dynamiques anthropologiques sur lesquelles elles se basent (soutien psychologique face Ã la mort, analogie très anthropocentrique d'un Dieu bâtisseur de l'univers...) pour qu'elles aient un quelconque lien direct avec toute forme d'intelligence supérieure, tout en n'excluant pas non plus pour certains le fait que ce soit malgré tout possible. D'où cette interrogation constante propre Ã l'agnostique.» (DBpedia, 2017) @fr
in scheme: religion

AIDS activism
in dataset: The CWRC Ontology
type: political affiliation
type: Concept
comment: The description for this term is indebted to DBpedia.
label: lutte contre le sida @fr
alternative label: aids activist
broader transitive: social reform
definition: Activism related to HIV/AIDS, ranging from addressing attitudes to changing government policies related to treatment and medication. See: Category:AIDS activism - Wikipedia
definition: Militantisme lié au sida/VIH, allant du changement des comportements aux politiques gouvernementales sur les traitements et les médicaments. Voir Mouvements des malades â Wikipédia @fr
in scheme: political affiliation

airForce
in dataset: The CWRC Ontology
type: occupation
type: Concept
alternative label: airforce officer
in scheme: occupation

air raid warden
in dataset: The CWRC Ontology
type: occupation
type: Concept
broader transitive: war work
in scheme: occupation

aircraft industry
in dataset: The CWRC Ontology
type: occupation
type: Concept
alternative label: aeroplane manufacturer
in scheme: occupation

airman
in dataset: The CWRC Ontology
type: occupation
type: Concept
alternative label: flyer
broader transitive: military
broader transitive: pilot
in scheme: occupation

altered by
in dataset: The CWRC Ontology
type: ObjectProperty
domain: change set
range: natural person
definition: Links a natural person to a change set entry.

alternative medicine
in dataset: The CWRC Ontology
type: occupation
type: Concept
alternative label: herbalist
in scheme: occupation

ambulance worker
in dataset: The CWRC Ontology
type: occupation
type: Concept
alternative label: ambulance assistant
alternative label: ambulance driver
alternative label: drove an ambulance
hidden label: ambulance brigade organizer
hidden label: ambulance brigade president
in scheme: occupation

American nationalism
in dataset: The CWRC Ontology
type: political affiliation
type: Concept
label: nationalisme américain @fr
alternative label: (us) nationalist
alternative label: american nationalist
alternative label: us nationalist
alternative label: us patriotism
broader transitive: nationalism
definition: American nationalism emphasizes the distinctiveness of American language, culture, and history, and calls for a celebration of "Americanness," which might include white nationalist pride and anti-immigration.
definition: Le nationalisme américain souligne la spécificité de la langue, de la culture et de l'histoire américaine et revendique la célébration de l'"américanité", pouvant inclure le nationalisme blanc et la lutte contre l'immigration. @fr
in scheme: political affiliation

anarchism
in dataset: The CWRC Ontology
contrary to: nationalism
type: political affiliation
type: Concept
comment: La description de ce terme est basée sur celle de DBPedia. @fr
comment: The description for this term is indebted to DBpedia.
label: Anarchisme @fr
alternative label: anarchist
definition: "Anarchism is a political philosophy that advocates self-governed societies based on voluntary institutions. These are often described as stateless societies, although several authors have defined them more specifically as institutions based on non-hierarchical free associations. Anarchism holds the state to be undesirable, unnecessary, and harmful. While anti-statism is central, anarchism entails opposing authority or hierarchical organisation in the conduct of all human relations, including, but not limited to, the state system. Anarchism does not offer a fixed body of doctrine from a single particular world view, instead fluxing and flowing as a philosophy. Many types and traditions of anarchism exist, not all of which are mutually exclusive. Anarchist schools of thought can differ fundamentally, supporting anything from extreme individualism to complete collectivism. Strains of anarchism have often been divided into the categories of social and individualist anarchism or similar dual classifications. Anarchism is usually considered a radical left-wing ideology, and much of anarchist economics and anarchist legal philosophy reflect anti-authoritarian interpretations of communism, collectivism, syndicalism, mutualism, or participatory economics." (DBpedia, 2017)
definition: L'anarchisme est un courant de philosophie politique développé depuis le XIXe siècle sur un ensemble de théories et de pratiques anti-autoritaires d'égalité sociale. Le terme libertaire, souvent utilisé comme synonyme d'anarchisme, est un néologisme créé en 1857 par Joseph Déjacque pour renforcer le caractère égalitaire. Fondé sur la négation du principe d'autorité dans l'organisation sociale et le refus de toute contrainte découlant des institutions basées sur ce principe, l'anarchisme a pour but de développer une société sans domination et sans exploitation, où les individus-producteurs coopèrent librement dans une dynamique d'autogestion et de fédéralisme. Contre l'oppression, l'anarchisme propose une société basée sur la solidarité comme solution aux antagonismes, la complémentarité de la liberté de chacun et celle de la collectivité, l'égalité des conditions de vie et la propriété commune autogérée. Il s'agit donc d'un mode politique qui cherche non pas Ã résoudre les différences opposant les membres constituants de la société mais Ã associer des forces autonomes et contradictoires. Le terme «anarchisme» et ses dérivés sont employés tantôt péjorativement, comme synonymes de désordre social dans le sens commun ou courant et qui se rapproche de l'anomie, tantôt comme un but pratique, car l'anarchisme défend l'idée que l'absence d'une structure de pouvoir n'est pas synonyme de désorganisation sociale. Les anarchistes rejettent en général la conception courante de l'anarchie (utilisée par les médias et les pouvoirs politiques). Pour eux, l'ordre naît de la liberté, tandis que les pouvoirs engendrent le désordre. Certains anarchistes useront du terme «acratie» (du grec «kratos», le pouvoir), donc littéralement «absence de pouvoir», plutôt que du terme «anarchie» qui leur semble devenu ambigu. De même, certains anarchistes auront plutôt tendance Ã utiliser le terme de «libertaires». Pour ses … @fr
in scheme: political affiliation
related: anti-monarchism

ancestor
in dataset: The CWRC Ontology
subject-centric predicate: has ancestor
type: ObjectProperty
range: Person
sub property of: relative
alternative label: forebear

ancestor of
in dataset: The CWRC Ontology
type: ObjectProperty
domain: Person
label: ancestor de @fr
range: Person
sub property of: relative of
inverse of: has ancestor

Anglicanism
in dataset: The CWRC Ontology
type: religion
type: Concept
type: Organization
comment: La description de ce terme est basée sur celle de DBPedia. @fr
comment: The description for this term is indebted to the Getty Art & Architecture Thesaurus.
label: Anglicaans (kerk van Engeland) @nl
label: Anglicanismo @es
label: Iglesia de Inglaterra @es
label: ying guo sheng gong hui @zh-latn
label: ying kuo sheng kung hui @zh-latn
label: yīng guó shèng gÅng huì @zh-latn
label: Ãglise d'Angleterre @fr
label: è±åèå ¬æ (è±ååæ) @zh-hant
alternative label: Anglican Church
alternative label: Anglo-Catholic
alternative label: Church of England
alternative label: Church of Ireland
alternative label: Episcopalian
alternative label: High Anglican
alternative label: High Church
alternative label: Low Church
alternative label: Low-Church
broader transitive: Christianity
definition: "A Christian denomination having both Protestant and Catholic aspects that originated with Henry VIII's break with the Roman Catholic Church (ca. 1532-34). As the official state Church of England, the monarch of England is still formally considered its head. While at first it remained mainly Catholic in character, reforms came under Edward IV and Elizabeth I who introduced doctrine that was more Protestant in nature, namely new editions of the Book of Common Prayer and the Thirty-nine Articles. Although an overall attitude of toleration exists in the modern Anglican Church, tension remains between its Protestant and Catholic inclinations as well as with newer liberal and evangelical influences. Anglicanism is based on episcopal authority and parish structure is fundamental to the organisation of the church. The term is used with regard to the Church of England; with regard to the Episcopal Church in America, use "Episcopal."" (Getty, 2017)
definition: "Te gebruiken om te verwijzen naar de anglicaanse kerk (Church of England); gebruik 'episcopaal' om te verwijzen naar de episcopale kerk in Amerika. De term verwijst naar een christelijke geloofsrichting met zowel protestantse als katholieke elementen die ontstond na de breuk tussen de Engelse koning Hendrik VIII en de rooms-katholieke kerk (circa 1532-34). Het anglicanisme is de officiële Britse staatsgodsdienst, en de Britse soevereine vorst is nog altijd het officiële hoofd van de anglicaanse kerk. Aanvankelijk droeg de kerk nog een overwegend katholiek karakter, maar onder Edward IV en Elizabeth I werden er hervormingen doorgevoerd en werd een meer protestants georiënteerde geloofsleer geïntroduceerd, met een nieuwe versie van het Book of Common Prayer en de Negenendertig Artikelen. Hoewel de huidige anglicaanse kerk in het algemeen wordt gekenmerkt door een tolerante houding, zijn de spanningen tussen protestants en katholiek gezinde stromingen binnen de kerk nooit verdwenen en heerst er weerstand tegen nieuwe vrijzinnige en evangelische invloeden. Het anglicanisme berust op episcopaal gezag en op een structuur van parochies, welke van fundamenteel belang is voor de kerkelijke organisatie." (Getty, 2017) @nl
definition: "Ãsese con referencia a la Iglesia de Inglaterra y también con referencia a la Iglesia Episcopal de Estados Unidos (úsese Iglesia Episcopal). Este término s erefiere a a una denominación cristiana que contiene elementos católicos y protestantes en varios aspectos y que se originó con el rey Enrique VIII quien rompió con la Iglesia Católica Romana (ca. 1532-1534) Es la iglesia oficial de Inglaterra, la Monarquía Inglesa es aún formalmente considerada su cabeza.Mientras en sus comienzos conservaba su carácter católico, con las reformas realizadas bajo Eduardo IV e Isabel I quienes introdujeron una doctrina que está más cerca del protestantismo y que se encuentra contenida en nuevas ediciones del Libro de Oraciones Comunes y en los Treinta y nueve Artículos. Aunque el anglicanismo tiene actualmente una actitud de total tolerancia, aún persisten tensiones con las iglesias protestantes y católicas así como de últimas influencias liberales y evangélicas.El Anglicanismo está basado en la autoridad episcopal y se sustenta en una estructura de parroquias que resulta fundamental para la organización de la Iglesia." (Getty, 2017) @es
definition: "è±çäº¨å©å «ä¸èç¾ é¦¬å¤©ä¸»æææ(è¥¿å 1532-34å¹´)åè£æåµçåºç£ææ´¾å¥ï¼åæå«ææ°æèå¤©ä¸»æå ç´ ãä½çºå®æ¹è±ååæï¼å ¶æ­£å¼ææé¦è ¦ä»çºè±ååçãèµ·åè¼å ·å¤©ä¸»æç¹è²ï¼å¨æå¾·è¯åä¸èä¼èèç½ä¸ä¸ææ¹é©ï¼å å ¥è¼å ·æ°ææ¬è³ªçææ¢ï¼å³ï¼æ°ççå ¬ç¦±æ¸(Book of Common Prayer)åä¸åä¹æ¢ä¿¡ç¶±(Thirty-nine Articles)ãéç¶ç¾ä»£çè±åèå ¬æå¤§é«ä¸æ åº¦å·²è¶é¡¯å¯¬å®¹ï¼ä½ææå §çæ°ææ´¾ç³»èå¤©ä¸»ææ´¾ç³»éä¿ä»ç·ç¹ï¼ä¹ä»ä¸æ¨æ¼æ¥åè¼æ°çèªç±èç¦é³æ´¾å½±é¿ãè±åèå ¬æå¥ åºæ¼ä¸»æçæ¬å¨ä¸ï¼ç§å¸«æåççµæ§å°ææçµç¹ååéè¦ãæ­¤è©å½ç¨æ¼æç¨±è±ååæï¼ç¾ååçä¸»ææ´¾ææï¼åç¨±çºãç¾åèå ¬æ(Episcopal)ãã" (Getty, 2017) @zh-hant
definition: «L'anglicanisme est une confession chrétienne présente principalement dans les pays qui ont pu être imprégnés par la culture anglaise incluant notamment, outre l'Angleterre, les anciennes colonies britanniques en Amérique et en Afrique. On retrouve tout de même plusieurs communauté anglicanes dans le monde, notamment en France. L'origine de cette confession remonte Ã la période antique de l'Ãglise d'Angleterre, lorsque celle-ci était unie canoniquement et juridiquement Ã l'évêque de Rome. Puis, au XVIe siècle, lorsque le roi d'Angleterre Henri VIII rompit avec le pape de Rome pour causes politiques et théologiques. Ainsi, Henri VIII ne créa rien de nouveau : il extirpa l'autorité du pape de son royaume, sans pour autant modifier ou jeter de nouvelles bases théologiques pour l'Ãglise, et remplaça l'autorité papale par la sienne propre. Depuis la reine Elizabeth Ire, le monarque a le titre de «gouverneur suprême», mais n'a qu'un rôle de maintien de l'ordre et du bon déroulement de la vie ecclésiale, mais aucune réelle autorité décisionnelle comme celle d'un évêque ou d'un synode. L'Archevêque de Canterbury porte le titre de «primat de toute l'Angleterre» et l'archevêque d'York porte quant Ã lui le titre de «primat de l'Angleterre». L'Ãglise anglicane, tout comme l'Ãglise orthodoxe, est une communion d'églises autocéphales, mais néanmoins interdépendantes. Bien que plusieurs églises anglicanes existent Ã travers le monde, comme c'est le cas pour l'Ãglise catholique romaine (présente en France, en Espagne, etc.), ou encore pour l'Ãglise orthodoxe (présente en Russie, en Serbie, etc.), il ne s'agit que d'une seule Ãglise. Elles sont rassemblées dans la Communion anglicane , au sein de laquelle l'Ãglise d'Angleterre et son primat, l'archevêque de Canterbury, ne jouissent que d'une primauté d'honneur. Ces églises sont en pleine communion (doctrinale, spirituelle, épiscopale, sacramentelle) les unes avec les autres et représ… @fr
in scheme: religion

Anglo-Indian
in dataset: The CWRC Ontology
type: national identity
type: Concept
label: Anglo-Indienne @fr
definition: Indicates a subject's identification with or labelling as Anglo-Indian as a national identity.
definition: Indique qu'un sujet s'identifie Ã ou s'est vu assigner une identité nationale anglo-indienne. @fr
in scheme: national identity

Anglo-Irish
in dataset: The CWRC Ontology
type: ethnicity
type: Concept
comment: La description de ce terme est basée sur celle de DBPedia. @fr
comment: The description for this term is indebted to DBpedia.
label: Anglo-irlandais @fr
broader transitive: European
definition: "Anglo-Irish (Irish: Angla-Ãireannach) was a term used primarily in the 19th and early 20th centuries to identify a privileged social class in Ireland, whose members were mostly the descendants and successors of the Protestant Ascendancy. They mostly belonged to the Anglican Church of Ireland, which was the established church of Ireland until 1871, or to a lesser extent one of the English dissenting churches, such as the Methodist church. Its members tended to follow English practices in matters of culture, science, law, agriculture and politics. Many became eminent as administrators in the British Empire and as senior army and naval officers." (DBpedia, 2018)
definition: «"Les Anglo-irlandais sont une population relativement privilégiée d'Irlande, du XIXe siècle et du début du XXe, descendant de colons protestants. Le terme s'applique également pour décrire les relations bilatérales entre la République d'Irlande et le Royaume-Uni comme pour le traité anglo-irlandais ou le Anglo-Irish Agreement. * Portail de lâIrlande Portail de lâIrlande * Portail du Royaume-Uni Portail du Royaume-Uni"» (DBpedia, 2018) @fr
in scheme: ethnicity

Anglo-Irish
in dataset: The CWRC Ontology
type: national heritage
type: Concept
comment: La description de ce terme est basée sur celle de DBPedia. @fr
comment: The description for this term is indebted to DBpedia.
label: Anglo-irlandais @fr
definition: "Anglo-Irish (Irish: Angla-Ãireannach) was a term used primarily in the 19th and early 20th centuries to identify a privileged social class in Ireland, whose members were mostly the descendants and successors of the Protestant Ascendancy. They mostly belonged to the Anglican Church of Ireland, which was the established church of Ireland until 1871, or to a lesser extent one of the English dissenting churches, such as the Methodist church. Its members tended to follow English practices in matters of culture, science, law, agriculture and politics. Many became eminent as administrators in the British Empire and as senior army and naval officers." (DBpedia, 2018)
definition: «Les Anglo-irlandais sont une population relativement privilégiée d'Irlande, du XIXe siècle et du début du XXe, descendant de colons protestants. Le terme s'applique également pour décrire les relations bilatérales entre la République d'Irlande et le Royaume-Uni comme pour le traité anglo-irlandais ou le Anglo-Irish Agreement. * Portail de lâIrlande Portail de lâIrlande * Portail du Royaume-Uni Portail du Royaume-Uni» (DBpedia, 2018) @fr
in scheme: national heritage

Anglo-Irish
in dataset: The CWRC Ontology
type: national identity
type: Concept
label: Anglo-Irlandaise @fr
definition: Indicates a subject's identification with or labelling as Anglo-Irish as a national identity.
definition: Indique qu'un sujet s'identifie Ã ou s'est vu assigner une identité nationale anglo-irlandaise. @fr
in scheme: national identity

Anglo-Irish
in dataset: The CWRC Ontology
type: race or colour
type: Concept
comment: La description de ce terme est basée sur celle de DBPedia. @fr
comment: The description for this term is indebted to DBpedia.
label: Anglo-irlandais @fr
definition: "Anglo-Irish (Irish: Angla-Ãireannach) was a term used primarily in the 19th and early 20th centuries to identify a privileged social class in Ireland, whose members were mostly the descendants and successors of the Protestant Ascendancy. They mostly belonged to the Anglican Church of Ireland, which was the established church of Ireland until 1871, or to a lesser extent one of the English dissenting churches, such as the Methodist church. Its members tended to follow English practices in matters of culture, science, law, agriculture and politics. Many became eminent as administrators in the British Empire and as senior army and naval officers." (DBpedia, 2018)
definition: «"Les Anglo-irlandais sont une population relativement privilégiée d'Irlande, du XIXe siècle et du début du XXe, descendant de colons protestants. Le terme s'applique également pour décrire les relations bilatérales entre la République d'Irlande et le Royaume-Uni comme pour le traité anglo-irlandais ou le Anglo-Irish Agreement. * Portail de lâIrlande Portail de lâIrlande * Portail du Royaume-Uni Portail du Royaume-Uni"» (DBpedia, 2018) @fr
in scheme: race or colour

Anglo-Norman
in dataset: The CWRC Ontology
type: ethnicity
type: Concept
comment: La description de ce terme est basée sur celle de DBPedia. @fr
comment: The description for this term is indebted to DBpedia.
label: Baronnage anglo-normand @fr
broader transitive: European
definition: "The Anglo-Normans were the medieval ruling class in England, composed mainly of a combination of ethnic Angles and Normans, following the Norman conquest. A small number of Normans had earlier befriended future Anglo-Saxon King of England, Edward the Confessor, during his exile in his mother's homeland of Normandy. When he returned to England some of them went with him, and so there were Normans already settled in England prior to the conquest. Following the death of Edward, the powerful Anglo-Saxon noble, Harold Godwinson, acceded to the English throne until his defeat by William, Duke of Normandy at the Battle of Hastings." (DBpedia, 2018)
definition: «Le baronnage anglo-normand (« baronage » en anglais) correspond principalement Ã la noblesse du duché de Normandie qui a reçu des terres en Angleterre Ã partir du temps de Guillaume le Conquérant après la bataille de Hastings d'octobre 1066. Comme les Varègues dans la Russie kiévienne des IXe au XIe siècles, il s'agit dâune noblesse dâorigine étrangère vis-Ã -vis dâune population autochtone largement majoritaire, anglo-saxonne et danoise notamment en ce qui concerne lâAngleterre.» (DBpedia, 2018) @fr
in scheme: ethnicity

animal welfare advocacy
in dataset: The CWRC Ontology
type: political affiliation
type: Concept
comment: The description for this term is indebted to DBpedia.
label: défense du bien-être animal @fr
alternative label: animal activist
alternative label: animal rights
alternative label: animal rights activist
alternative label: animal rights advocate
alternative label: animal welfare
alternative label: animal welfare activist
alternative label: anti-blood-sports
alternative label: anti-cruelty
alternative label: anti-cruelty to animals
alternative label: anti-hunting
broader transitive: social reform
definition: Advocacy, often in the form of activism, for the welfare of animals. See: Animal welfare - Wikipedia
definition: Défense pour le bien-être des animaux, souvent sous forme de miliitantisme. Voir Bien-être animal â Wikipédia @fr
in scheme: political affiliation
related: feminism

anti-American politics
in dataset: The CWRC Ontology
contrary to: American nationalism
contrary to: pro-American
type: political affiliation
type: Concept
comment: The description for this term is indebted to DBpedia.
label: anti-américanisme @fr
alternative label: anti-American
definition: Opposed to the policies or influence of the United States of America, often with reference to specific government actions. See: Anti-Americanism - Wikipedia
definition: Opposition aux politiques ou Ã l'influence des Ãtats-Unis, souvent en référence Ã des actions gouvernementales spécifiques. Voir: Antiaméricanisme â Wikipédia @fr
in scheme: political affiliation

anti-antisemitism
in dataset: The CWRC Ontology
contrary to: antisemitism
type: political affiliation
type: Concept
comment: The description for this term is indebted to DBpedia.
label: anti-antisémitisme @fr
alternative label: anti-anti-semitism
alternative label: anti-antisemitic
alternative label: anti-antisemitist
broader transitive: racial equality
definition: Opposed to anti-semitic attitudes and practices. See Antisemitism - Wikipedia
definition: Opposition aux attitude et aux pratiques antisémitistes. Voir Antisémitisme â Wikipédia @fr
in scheme: political affiliation
related: anti-fascism

anti-apartheid
in dataset: The CWRC Ontology
type: political affiliation
type: Concept
comment: The description for this term is indebted to DBpedia.
alternative label: the struggle to end Apartheid
broader transitive: human rights
broader transitive: racial equality
broader transitive: social reform
definition: "The Anti-Apartheid Movement (AAM), originally known as the Boycott Movement, was a British organisation that was at the centre of the international movement opposing South Africa's system of apartheid and supporting South Africa's non-whites." (DBpedia, 2017)
in scheme: political affiliation

anti-Boer politics
in dataset: The CWRC Ontology
contrary to: pro-Boer War
type: political affiliation
type: Concept
comment: The description for this term is indebted to DBpedia.
label: anti-boer @fr
alternative label: anti-Boer
definition: "Opposition to the Second Boer War in Britain was modest when the war began on 11 October 1899 and was always less widespread than support for it, let alone prevailing indifference. However, influential groups formed immediately and ineffectually against the war, including the South African Conciliation Committee and W. T. Stead's Stop the War Committee." (DBpedia, 2017)
in scheme: political affiliation
related: anti-war movement

anti-Bolshevism
in dataset: The CWRC Ontology
contrary to: Bolshevism
type: political affiliation
type: Concept
comment: La description de ce terme est basée sur celle de DBPedia. @fr
comment: The description for this term is indebted to DBpedia.
label: Anticommunisme @fr
alternative label: anti-bolshevik
definition: "Anti-communism is opposition to communism. Organized anti-communism developed in reaction to the rise of communism, especially after the 1917 October Revolution in Russia. It reached global dimensions during the Cold War, when America and the Soviet Union engaged in an intense rivalry. Most modern anti-communists reject the concept of historical materialism, which is a central idea in Marxism. Anti-communists reject the Marxist belief that capitalism will be followed by socialism and communism, just as feudalism was followed by capitalism. Anti-communists question the validity of the Marxist claim that the socialist state will "wither away" when it becomes unnecessary in a true communist society. Anti-communists also accuse communists of having caused several famines that occurred in 20th-century communist states, such as the Russian Famine of 1921 and the much more severe famine in China during the Great Leap Forward. Some anti-communists refer to both communism and fascism as totalitarianism, seeing similarity between the actions of communist and fascist governments. Opponents argue that communist parties that have come to power have tended to be rigidly intolerant of political opposition. Communist governments have also been accused of creating a new ruling class (a Nomenklatura), with powers and privileges greater than those previously enjoyed by the upper classes in the non-communist regimes." (DBpedia, 2017)
definition: «Le terme d'anticommunisme englobe, au sens large, l'ensemble des attitudes d'opposition ou d'hostilité envers les aspects théoriques ou pratiques du communisme : l'anticommunisme peut se traduire sous forme de simple prise de position, de discours politique structuré, d'action ou de propagande. Son sens est cependant changeant en fonction de celui du «communisme», mot qui recouvre lui-même un ensemble de réalités très différentes les unes des autres en fonction des contextes sociaux, culturels et politiques. Les facteurs distinguant les différents types d'anticommunisme sont notamment la forme de communisme explicitement visée et les motivations qui poussent Ã s'opposer au communisme ; le terme «anticommunisme» est employé, selon les époques et les contextes, pour qualifier l'opposition aux théories marxistes ou communistes elles-mêmes, ou aux mouvances et partis politiques s'en réclamant, ou bien Ã la pratique politique des régimes communistes. Le terme d'«anticommunisme» a pu ainsi être utilisé pour qualifier les opposants au stalinisme, que ces derniers aient été ou non anticommunistes au sens strict. Apparu au XIXe siècle en tant que concept, l'anticommunisme s'est largement développé au cours du XXe siècle, Ã la suite de la prise du pouvoir par les bolcheviks en Russie en octobre 1917, puis Ã la création de l'URSS : il s'est alors identifié, pour l'essentiel, Ã l'opposition aux régimes communistes et aux partis communistes d'inspiration léniniste et stalinienne. Après la Seconde Guerre mondiale, l'anticommunisme devient un élément majeur de la politique étrangère et intérieure des Ãtats-Unis, opposés Ã l'URSS dans le contexte de la guerre froide.» (DBpedia, 2017) @fr
in scheme: political affiliation
related: anti-communism

anti-Bonapartism
in dataset: The CWRC Ontology
contrary to: Bonapartism
type: political affiliation
type: Concept
comment: The description for this term is indebted to DBpedia.
label: anti-bonapartisme @fr
alternative label: anti-bonapartist
definition: Opposed to the political ideology of Napolean Bonaparte and his followers. See Bonapartism - Wikipedia
definition: Opposition Ã la politique et aux idées de Napoléon Bonaparte et ses parisans. Voir Bonapartisme â Wikipédia @fr
in scheme: political affiliation

anti-British politics
in dataset: The CWRC Ontology
type: political affiliation
type: Concept
comment: The description for this term is indebted to DBpedia.
label: anglophobie @fr
alternative label: anti-British
definition: Opposed to the policies or influence of the United Kingdom, often with reference to specific government actions. See: Anti-British sentiment - Wikipedia
definition: Opposition aux politiques ou Ã l'influence du Royaume-Uni, souvent en référence Ã des actions gouvernementales spécifiques. Voir Anglophobie â Wikipédia @fr
in scheme: political affiliation

anti-capital punishment
in dataset: The CWRC Ontology
type: political affiliation
type: Concept
comment: La description de ce terme est basée sur celle de DBPedia. @fr
comment: The description for this term is indebted to DBpedia.
label: Peine de mort @fr
alternative label: against capital punishment
alternative label: anti-capital-punishment
alternative label: opponent of capital punishment
alternative label: opposition to capital punishment
broader transitive: social reform
definition: "Capital punishment, also known as the death penalty, is a government sanctioned practice whereby a person is put to death by the state as a punishment for a crime. The sentence that someone be punished in such a manner is referred to as a death sentence, whereas the act of carrying out the sentence is known as an execution. Crimes that can result in a death penalty are known as capital crimes or capital offences. The term capital is derived from the Latin capitalis ("of the head", referring to execution by beheading). Fifty-eight countries retain capital punishment, 102 countries have completely abolished it de jure for all crimes, six have abolished it for ordinary crimes (while maintaining it for special circumstances such as war crimes), and 32 are abolitionist in practice. Capital punishment is a matter of active controversy in various countries and states, and positions can vary within a single political ideology or cultural region. In the European Union, Article 2 of the Charter of Fundamental Rights of the European Union prohibits the use of capital punishment. Also, the Council of Europe, which has 47 member states, prohibits the use of the death penalty by its members. The United Nations General Assembly has adopted, in 2007, 2008, 2010, 2012, and 2014 non-binding resolutions calling for a global moratorium on executions, with a view to eventual abolition. Although most nations have abolished capital punishment, over 60% of the world's population live in countries where executions take place, such as China, India, the United States, and Indonesia." (DBpedia, 2017)
definition: «La peine de mort, ou peine capitale, est une peine prévue par la loi consistant Ã exécuter une personne ayant été reconnue coupable d'une faute qualifiée de «crime capital». La sentence est prononcée par l'institution judiciaire Ã l'issue d'un procès. En l'absence d'un procès, ou dans les cas où celui-ci n'est pas réalisé par une institution reconnue, on parle d'exécution sommaire, d'acte de vengeance ou de justice privée. La peine de mort est diversement considérée selon les époques et les régions géographiques. Elle est prévue dans les textes de loi de 93 pays, mais seuls 22 des 192 pays du globe ont procédé Ã des exécutions en 2014. Elle est une sanction reconnue bien que réprouvée par les institutions internationales comme l'Organisation des Nations unies (ONU). Les Ãtats abolitionnistes sont aujourd'hui majoritaires, mais ils ne représentent encore qu'une minorité de la population mondiale. Parmi les démocraties industrialisées, seules deux la pratiquent : les Ãtats-Unis et le Japon. Au plan international, le 18 décembre 2007, l'Assemblée générale de l'ONU a adopté la résolution 62/149 appelant Ã un moratoire sur les exécutions dans le monde. Cette résolution (comme les autres résolutions de l'ONU) n'a pas de valeur contraignante mais peut être vue comme le signe que la majorité des états souhaite remettre en cause la peine de mort. Cependant huit des dix pays les plus peuplés ont voté contre la résolution. Elle a été renouvelée en 2014.» (DBpedia, 2017) @fr
in scheme: political affiliation

anti-capitalism
in dataset: The CWRC Ontology
type: political affiliation
type: Concept
comment: La description de ce terme est basée sur celle de DBPedia. @fr
comment: The description for this term is indebted to DBpedia.
label: Anticapitalisme @fr
alternative label: anti-capitalist
alternative label: anti-property
definition: "Anti-capitalism encompasses a wide variety of movements, ideas and attitudes that oppose capitalism. Anti-capitalists, in the strict sense of the word, are those who wish to replace capitalism with another type of economic system." (DBpedia, 2017)
definition: «L'anticapitalisme regroupe un ensemble de mouvements qui s'opposent au capitalisme. Les aspects visés diffèrent selon les conceptions et peuvent notamment concerner, sans y être limités, le profit et l'importance de l'argent, la spéculation, le salariat, la concurrence économique, les effets considérés comme des effets néfastes du capitalisme sur la société (comme sa supposée «immoralité», ou les inégalités économiques qu'il est censé entraîner), l'environnement, ou les formes sociales de base du capitalisme. Un spectre politique large et très divers s'est réclamé ou se réclame de l'anticapitalisme.» (DBpedia, 2017) @fr
in scheme: political affiliation
related: communism

anti-caste movement
in dataset: The CWRC Ontology
type: political affiliation
type: Concept
comment: The description for this term is indebted to DBpedia.
label: mouvement contre le système de castes @fr
alternative label: worked against the caste system
broader transitive: civil rights movement
broader transitive: social reform
definition: Advocacy or activism opposing the caste system in India. See Caste system in India - Wikipedia; Caste politics - Wikipedia; Dalit - Wikipedia
definition: Militantisme ou activisme en opposition au système de castes en Inde. Voir Castes en Inde â Wikipédia; Intouchables (Inde) â Wikipédia @fr
in scheme: political affiliation
related: feminism

anti-catholicism
in dataset: The CWRC Ontology
contrary to: pro-Catholicism
type: political affiliation
type: Concept
comment: La description de ce terme est basée sur celle de DBPedia. @fr
comment: The description for this term is indebted to DBpedia.
label: Anticatholicisme @fr
alternative label: anti-catholic
alternative label: anti-catholic-emancipation
definition: "Anti-Catholicism is hostility towards or opposition to the Catholic Church, its clergy and adherents. After the Reformation and until at least the late 20th Century, majority Protestant states (especially England, Germany, the United States, and Canada) made anti-Catholicism and opposition to the Pope and Catholic rituals major political themes, with anti-Catholic sentiment at times leading to violence and religious discrimination against Catholic individuals (often derogatorily referred to in Anglophone Protestant countries as "papists" or "Romanists"). Historically, Catholics in Protestant countries were frequently (and almost always baselessly) suspected of conspiring against the state in furtherance of papal interests or to establish a political hegemony under the "Papacy", with Protestants sometimes questioning Catholic individuals' loyalty to the state and suspecting Catholics of ultimately maintaining loyalty to the Vatican rather than their domiciled country. In majority Protestant countries with large scale immigration, such as the United States, Canada, and Australia, suspicion or discrimination of Catholic immigrants often overlapped or conflated with nativism, xenophobia, and ethnocentric or racist sentiments (i.e. anti-Italianism, anti-Irish sentiment, hispanophobia, Anti-Quebec sentiment). In the Early modern period, in the face of rising secular powers in Europe, the Catholic Church struggled to maintain its traditional religious and political role in primarily Catholic nations. As a result of these struggles, there arose in some majority Catholic countries (especially among those individuals with certain secular political views) a hostile attitude towards the considerable political, social, spiritual, and religious power of the Pope and the clergy in the form of anti-clericalism." (DBpedia, 2017)
definition: «L'anticatholicisme désigne la méfiance, la discrimination, la répression, ou la persécution du catholicisme et des catholiques.» (DBpedia, 2017) @fr
in scheme: political affiliation

anti-censorship movement
in dataset: The CWRC Ontology
type: political affiliation
type: Concept
comment: The description for this term is indebted to DBpedia.
label: lutte contre la censure @fr
alternative label: Freedom of Speech
alternative label: anti-censorship
alternative label: free speech advocate
alternative label: intellectual property activist
alternative label: pro free speech
alternative label: pro-free speech
broader transitive: social reform
definition: Opposition to censorship. See Freedom of speech - Wikipedia
definition: Opposition Ã la censure. Voir Liberté d'expression â Wikipédia @fr
in scheme: political affiliation
related: anti-monarchism

anti-communism
in dataset: The CWRC Ontology
contrary to: communism
type: political affiliation
type: Concept
comment: La description de ce terme est basée sur celle de DBPedia. @fr
comment: The description for this term is indebted to DBpedia.
label: Anticommunisme @fr
alternative label: anti-communist
definition: "Anti-communism is opposition to communism. Organized anti-communism developed in reaction to the rise of communism, especially after the 1917 October Revolution in Russia. It reached global dimensions during the Cold War, when America and the Soviet Union engaged in an intense rivalry. Most modern anti-communists reject the concept of historical materialism, which is a central idea in Marxism. Anti-communists reject the Marxist belief that capitalism will be followed by socialism and communism, just as feudalism was followed by capitalism. Anti-communists question the validity of the Marxist claim that the socialist state will "wither away" when it becomes unnecessary in a true communist society. Anti-communists also accuse communists of having caused several famines that occurred in 20th-century communist states, such as the Russian Famine of 1921 and the much more severe famine in China during the Great Leap Forward. Some anti-communists refer to both communism and fascism as totalitarianism, seeing similarity between the actions of communist and fascist governments. Opponents argue that communist parties that have come to power have tended to be rigidly intolerant of political opposition. Communist governments have also been accused of creating a new ruling class (a Nomenklatura), with powers and privileges greater than those previously enjoyed by the upper classes in the non-communist regimes." (DBpedia, 2017)
definition: «Le terme d'anticommunisme englobe, au sens large, l'ensemble des attitudes d'opposition ou d'hostilité envers les aspects théoriques ou pratiques du communisme : l'anticommunisme peut se traduire sous forme de simple prise de position, de discours politique structuré, d'action ou de propagande. Son sens est cependant changeant en fonction de celui du «communisme», mot qui recouvre lui-même un ensemble de réalités très différentes les unes des autres en fonction des contextes sociaux, culturels et politiques. Les facteurs distinguant les différents types d'anticommunisme sont notamment la forme de communisme explicitement visée et les motivations qui poussent Ã s'opposer au communisme ; le terme «anticommunisme» est employé, selon les époques et les contextes, pour qualifier l'opposition aux théories marxistes ou communistes elles-mêmes, ou aux mouvances et partis politiques s'en réclamant, ou bien Ã la pratique politique des régimes communistes. Le terme d'«anticommunisme» a pu ainsi être utilisé pour qualifier les opposants au stalinisme, que ces derniers aient été ou non anticommunistes au sens strict. Apparu au XIXe siècle en tant que concept, l'anticommunisme s'est largement développé au cours du XXe siècle, Ã la suite de la prise du pouvoir par les bolcheviks en Russie en octobre 1917, puis Ã la création de l'URSS : il s'est alors identifié, pour l'essentiel, Ã l'opposition aux régimes communistes et aux partis communistes d'inspiration léniniste et stalinienne. Après la Seconde Guerre mondiale, l'anticommunisme devient un élément majeur de la politique étrangère et intérieure des Ãtats-Unis, opposés Ã l'URSS dans le contexte de la guerre froide.» (DBpedia, 2017) @fr
in scheme: political affiliation

anti-conscriptionism
in dataset: The CWRC Ontology
contrary to: communism
type: political affiliation
type: Concept
comment: The description for this term is indebted to DBpedia.
label: lutte contre la conscription militaire @fr
alternative label: anti-conscriptionist
definition: Opposition to compulsory enlistment of people in either war or peacetime into a national service, usually military service.
definition: Opposition Ã la conscription militaire obligatoire pour le service nationale en temps de guerre ou de paix, généralement Ã travers le service militaire. Voir Antimilitarisme â Wikipédia @fr
in scheme: political affiliation
related: anti-war movement

anti-Contagious Diseases Act
in dataset: The CWRC Ontology
type: political affiliation
type: Concept
comment: The description for this term is indebted to DBpedia.
label: anti-Contagious Diseases Acte @fr
alternative label: against the Contagious Diseases Acts
alternative label: anti-contagious diseases act activist
alternative label: anti-contagious diseases acts
broader transitive: feminism
broader transitive: social reform
definition: Opposition to government regulation of prostitution including the forced physical examination of suspected prostitutes for venereal disease. See: Contagious Diseases Acts - Wikipedia
definition: Opposition Ã la régulation gouvernementale de la prostitution, incluant les examens médicaux forcés conduits sur les prostituées suspectées de véhiculer des maladies vénériennes. Voir Contagious Diseases Acts â Wikipédia; Abolitionnisme (prostitution) â Wikipédia @fr
in scheme: political affiliation

anti-corporal punishment
in dataset: The CWRC Ontology
type: political affiliation
type: Concept
comment: The description for this term is indebted to DBpedia.
label: lutte contre les châtiments corporels @fr
broader transitive: social reform
definition: "Campaigns against corporal punishment aim to reduce or eliminate corporal punishment of minors by instigating legal and cultural changes in the areas where such punishments are practiced. Such campaigns date mostly from the late 20th century, although occasional voices in opposition to corporal punishment existed from ancient times through to the modern era. The UN Committee on the Rights of the Child defines "corporal punishment" as: any punishment in which physical force is used and intended to cause some degree of pain or discomfort, however light. Most involves hitting ("smacking", "slapping", "spanking") children, with the hand or with an implement â whip, stick, belt, shoe, wooden spoon, etc. But it can also involve, for example, kicking, shaking or throwing children, scratching, pinching, biting, pulling hair or boxing ears, forcing children to stay in uncomfortable positions, burning, scalding, or forced ingestion." (DBpedia, 2017)
in scheme: political affiliation

anti-Dreyfusard
in dataset: The CWRC Ontology
contrary to: Dreyfusard
type: political affiliation
type: Concept
comment: The description for this term is indebted to DBpedia.
label: antidreyfusard @fr
broader transitive: human rights
definition: Défenseurs de l'Armée lors de le procès du capitaine Alfred Dreyfus. Voir Affaire Dreyfus â Wikipédia @fr
definition: Supporters of the French military during the prosecution of Captain Alfred Dreyfus. See: Dreyfus affair - Wikipedia
in scheme: political affiliation

anti-European politics
in dataset: The CWRC Ontology
contrary to: pro-European
type: political affiliation
type: Concept
comment: The description for this term is indebted to DBpedia.
label: Euroscepticisme @fr
alternative label: anti-European
definition: Opposed to the existence, policies, or influence of the European Union. On Euroskepticism, see Euroscepticism - Wikipedia
definition: Opposition Ã l'existence, aux politiques, ou Ã l'influence de l'Union Européenne. Sur l'euroscepticisme, voir Euroscepticisme â Wikipédia @fr
in scheme: political affiliation

anti-fascism
in dataset: The CWRC Ontology
contrary to: fascism
type: political affiliation
type: Concept
comment: La description de ce terme est basée sur celle de DBPedia. @fr
comment: The description for this term is indebted to DBpedia.
label: Antifascisme @fr
alternative label: anti-fascist
alternative label: anti-nazi
alternative label: strongly opposed Fascism
definition: "Anti-fascism is opposition to fascist ideologies, groups and individuals. The anti-fascist movement began in a few European countries in the 1920s and eventually spread to other countries around the world." (DBpedia, 2017)
definition: «L'antifascisme est l'opposition organisée au fascisme et, plus largement, Ã l'extrême droite. Il prend forme dans les années 1920 et se développe conséquemment Ã la montée du fascisme en Europe. Il a connu un très fort développement au cours des années 1930, étant Ã l'origine de la formation des Fronts populaires , puis pendant la Seconde Guerre mondiale au sein des résistances contre les dictatures fascistes et nazies ainsi que les régimes de collaboration. L'antifascisme peut désigner dans une acception plus large une idéologie tendant Ã s'opposer également Ã la droite dite «dure». Certains historiens reprochent Ã l'antifascisme d'avoir été instrumentalisé par le mouvement communiste.» (DBpedia, 2017) @fr
in scheme: political affiliation
related: anti-antisemitism

Anti-Federalism
in dataset: The CWRC Ontology
type: political affiliation
type: Concept
comment: La description de ce terme est basée sur celle de DBPedia. @fr
comment: The description for this term is indebted to DBpedia.
label: Antifédéralisme @fr
alternative label: anti-federalist
definition: "Anti-Federalism refers to a movement that opposed the creation of a stronger U.S. federal government and which later opposed the ratification of the 1787 Constitution. The previous constitution, called the Articles of Confederation, gave state governments more authority. Led by Patrick Henry of Virginia, Anti-Federalists worried, among other things, that the position of president, then a novelty, might evolve into a monarchy." (DBpedia, 2017)
definition: Antifédéralisme fut le nom donné Ã deux mouvements politiques distincts Ã la fin du XVIIIe siècle aux Ãtats-Unis: * Le premier mouvement antifédéraliste des années 1780, s'opposa Ã la création d'un gouvernement national plus fort, tel que le permettait la Constitution et chercha Ã le conserver tel qu'il était institué dans les Articles de la Confédération de 1777. * Le second mouvement antifédéraliste se" constitua en réaction aux lois fiscales d'Alexander Hamilton lors du premier mandat de George Washington. Ce mouvement est parfois nommé l'Anti-Administration Party qui deviendra plus tard le Parti républicain-démocrate de Thomas Jefferson et James Madison." (DBpedia, 2017) @fr
in scheme: political affiliation

anti-feminism
in dataset: The CWRC Ontology
contrary to: feminism
contrary to: suffrage movement
type: political affiliation
type: Concept
comment: La description de ce terme est basée sur celle de DBPedia. @fr
comment: The description for this term is indebted to DBpedia.
label: Antiféminisme @fr
alternative label: anti-feminist
alternative label: anti-women's liberation
alternative label: antifeminist
alternative label: gender conservative
alternative label: misogynist
alternative label: non-feminist
definition: "Antifeminism is criticism of some or all feminist ideology, arguing that modern feminism is not practiced in ways that promote true gender equality. This opposition has taken various forms across time and cultures. For example, antifeminists in the late 1800s and early 1900s resisted women's suffrage, while antifeminists in the late 20th century opposed the Equal Rights Amendment. Antifeminism may be motivated by the belief that feminist theories of patriarchy and disadvantages suffered by women in modern society are mischaracterized or exaggerated; that feminism as a movement encourages misandry and results in harm or oppression of men; or driven by general opposition towards women's rights." (DBpedia, 2017)
definition: «L'antiféminisme est un néologisme qualifiant des critiques ou une opposition aux mouvements ou aux thèses féministes, pour des raisons politiques, philosophiques, religieuses, sociologiques ou culturelles. Il s'applique soit Ã la lutte contre l'émancipation féminine, soit au refus des thèses d'un ou plusieurs mouvements se disant «féministes».» (DBpedia, 2017) @fr
in scheme: political affiliation

anti-globalism
in dataset: The CWRC Ontology
type: political affiliation
type: Concept
comment: La description de ce terme est basée sur celle de DBPedia. @fr
comment: The description for this term is indebted to DBpedia.
label: Mouvement antimondialisation @fr
alternative label: anti-globalist
alternative label: anti-globalization
definition: "The anti-globalization movement, or counter-globalization movement, is a social movement critical of the globalization of corporate capitalism. The movement is also commonly referred to as the global justice movement, alter-globalization movement, anti-globalist movement, anti-corporate globalization movement, or movement against neoliberal globalization. Participants base their criticisms on a number of related ideas. What is shared is that participants oppose what they see as large, multi-national corporations having unregulated political power, exercised through trade agreements and deregulated financial markets. Specifically, corporations are accused of seeking to maximize profit at the expense of work safety conditions and standards, labor hiring and compensation standards, environmental conservation principles, and the integrity of national legislative authority, independence and sovereignty. As of January 2012, some commentators have characterized the unprecedented changes in the global economy as "turbo-capitalism" (Edward Luttwak), "market fundamentalism" (George Soros), "casino capitalism" (Susan Strange), and as "McWorld" (Benjamin Barber). Many anti-globalization activists call for forms of global integration that better provide democratic representation, advancement of human rights, fair trade and sustainable development and therefore feel the term "anti-globalization" is misleading." (DBpedia, 2017)
definition: «Le mouvement antimondialisation désigne le mouvement d'opposition Ã la mondialisation.» (DBpedia, 2017) @fr
in scheme: political affiliation

Anti-imperialism
in dataset: The CWRC Ontology
contrary to: imperialism
type: political affiliation
type: Concept
comment: La description de ce terme est basée sur celle de DBPedia. @fr
comment: The description for this term is indebted to DBpedia.
label: Anti-impérialisme @fr
alternative label: Zulu resistance to colonial rule
alternative label: anti-colonial
alternative label: anti-colonialism
alternative label: anti-colonialist
alternative label: anti-imperial
alternative label: anti-imperialist
broader transitive: human rights
definition: ""Anti-imperialism" in political science and international relations is a term used in a variety of contexts, usually by nationalist movements, who want to secede from a larger polity (usually in the form of an empire, but also in a multi-ethnic sovereign state) or as a specific theory opposed to capitalism in MarxistâLeninist discourse, derived from Vladimir Lenin's work Imperialism, the Highest Stage of Capitalism. A less common usage is by isolationists who oppose an interventionist foreign policy. People who categorise themselves as anti-imperialists, often state that they are opposed to colonialism, colonial empire, hegemony, imperialism, and territorial expansion of a country beyond its established borders. The phrase gained a wide currency after the Second World War and at the onset of the Cold War as political movements in colonies of European powers promoted national sovereignty. Some "anti-imperialist" groups who opposed the United States supported the power of the Soviet Union, such as in Guevarism, while in Maoism, this was criticized as "social imperialism". In the Arab and Muslim world, the term is often used in the context of Anti-Zionist nationalist and religious movements." (DBpedia, 2017)
definition: «L'anti-impérialisme est une idéologie d'opposition Ã l'impérialisme, c'est-Ã -dire la doctrine d'un Ãtat ou un groupe d'Ãtats Ã mettre un autre Ãtat ou un groupe d'Ãtats plus faible sous sa dépendance politique, économique et culturelle par la conquête militaire ou toute autre forme de coercition. Cette idéologie est corollaire au processus de décolonisation, aux mouvements de libération nationale et, dans une certaine mesure, au nationalisme. Bien que le terme impérialisme est utilisé la langue française au cours XIXe siècle pour désigner l'appui au régime napoléonien et le «système de gouvernement et de domination de l'Empire romain», l'anti-impérialisme prend son origine durant la seconde moitié de XIXe siècle de l'anglais imperialism qui désigne d'abord la politique d'extension coloniale de l'Empire britannique sous le premier ministre britannique Benjamin Disraeli au cours des années 1870. Le concept sera approfondi par John Atkinson Hobson en 1902 dans son livre Imperialism: A Study. L'anti-impérialisme est aussi une notions cruciale du marxisme-léninisme. Le concept, qui diffère de l'usage commun, est approfondi dans le livre de 1917 L'Impérialisme, stade suprême du capitalisme de Lénine entre autres. Dans la théorie marxiste, l'impérialisme est un stade du capitalisme au cours duquel le capital financier supplante toutes les autres formes du capital. L'anti-impérialisme a été l'un des principales politique de l'URSS, de la République populaire de Chine, de Cuba et des autres pays communistes depuis la seconde moitié du XXe siècle. La fin du XXe siècle sous l'hégémonie des Ãtats-Unis voit la naissance d'un nouvel impérialisme . L'anti-impérialisme, dans ces circonstances, est une part intégrante du mouvement altermondialiste qui s'oppose Ã la mondialisation libérale et aux grands accords de libre-échange et du mouvement pacifiste qui s'oppose aux invasions militaires.» (DBpedia, 2017) @fr
in scheme: political affiliation
related: anti-British politics

anti-Jacobin
in dataset: The CWRC Ontology
type: political affiliation
type: Concept
comment: The description for this term is indebted to DBpedia.
alternative label: anti-revolutionary
definition: Opposed to Jacobinism. See Jacobin - Wikipedia
definition: Opposition au jacobinisme. Voir Jacobinisme â Wikipédia @fr
in scheme: political affiliation

anti-Jacobite
in dataset: The CWRC Ontology
contrary to: Jacobitism
type: political affiliation
type: Concept
comment: The description for this term is indebted to DBpedia.
definition: Opposed to Jacobitism. See Jacobitism - Wikipedia
definition: Opposition au jacobitisme. Voir Jacobitisme â Wikipédia @fr
in scheme: political affiliation

Anti-Irish National Land League
in dataset: The CWRC Ontology
type: political affiliation
type: Concept
comment: The description for this term is indebted to DBpedia.
alternative label: anti-Irish Home Rule
alternative label: anti-Land League
definition: Opposed to the Irish Land League movement. See Irish National Land League - Wikipedia
definition: Opposition au mouvement de la Irish Land Lead. @fr
in scheme: political affiliation
related: Irish unionism

anti-monarchism
in dataset: The CWRC Ontology
contrary to: monarchism
type: political affiliation
type: Concept
comment: The description for this term is indebted to DBpedia.
label: antimonarchisme @fr
alternative label: anti-monarchist
alternative label: anti-royalist
definition: "The abolition of monarchy has occurred throughout history, either through revolutions, coups d'état, wars, or legislative reforms (such as abdications). The founding of the Roman Republic is a noteworthy example and became part of the nation's traditions including as justification for the assassination of Julius Caesar. The twentieth century saw a major acceleration of this process, with many monarchies violently overthrown by revolution or war, or else abolished as part of the process of decolonisation. By contrast, the restoration of monarchies is rare in modern times, with only two major examples, Spain and Cambodia." (DBpedia, 2017)
in scheme: political affiliation

anti-nuclear movement
in dataset: The CWRC Ontology
type: political affiliation
type: Concept
comment: La description de ce terme est basée sur celle de DBPedia. @fr
comment: The description for this term is indebted to DBpedia.
label: mouvement antinucléaire @fr
alternative label: Campaign for Nuclear Disarmament
alternative label: anti-atomic
alternative label: anti-nuclear
alternative label: anti-nuclear activist
alternative label: anti-nuclear war
alternative label: anti-nuclear weapons
alternative label: nuclear disarmament
alternative label: nuclear disarmament campaigner
alternative label: pro nuclear disarmament
broader transitive: environmentalism
definition: "The anti-nuclear movement is a social movement that opposes various nuclear technologies. Some direct action groups, environmental groups, and professional organisations have identified themselves with the movement at the local, national, and international level. Major anti-nuclear groups include Campaign for Nuclear Disarmament, Friends of the Earth, Greenpeace, International Physicians for the Prevention of Nuclear War, and the Nuclear Information and Resource Service. The initial objective of the movement was nuclear disarmament, though since the late 1960s opposition has included the use of nuclear power. Many anti-nuclear groups oppose both nuclear power and nuclear weapons. The formation of green parties in the 1970s and 1980s was often a direct result of anti-nuclear politics. Scientists and diplomats have debated nuclear weapons policy since before the atomic bombings of Hiroshima and Nagasaki in 1945. The public became concerned about nuclear weapons testing from about 1954, following extensive nuclear testing in the Pacific. In 1963, many countries ratified the Partial Test Ban Treaty which prohibited atmospheric nuclear testing. Some local opposition to nuclear power emerged in the early 1960s, and in the late 1960s some members of the scientific community began to express their concerns. In the early 1970s, there were large protests about a proposed nuclear power plant in Wyhl, West Germany. The project was cancelled in 1975 and anti-nuclear success at Wyhl inspired opposition to nuclear power in other parts of Europe and North America. Nuclear power became an issue of major public protest in the 1970s. A protest against nuclear power occurred in July 1977 in Bilbao, Spain, with up to 200,000 people in attendance. Following the Three Mile Island accident in 1979, an anti-nuclear protest was held in New York City, involving 200,000 people. In 1981, Germany's largest anti-nuclear power demonstration took place to protest against the Brokdorf Nuclear Power…
definition: «Le mouvement antinucléaire désigne l'ensemble des personnes et organisations (associations, syndicats, partis politiques) qui s'opposent de façon générale Ã l'utilisation de l'énergie nucléaire. Cette opposition peut s'étendre de la bombe atomique aux armes utilisant l'uranium appauvri, jusqu'à la production d'électricité d'origine nucléaire, l'irradiation des aliments et l'utilisation de la radioactivité. Les opposants au nucléaire soutiennent qu'il existe des solutions alternatives, telles que les économies d'énergie ou les énergies renouvelables et que l'uranium est, de même que les énergies fossiles, une source d'énergie dont l'épuisement est attendu dans quelques décennies. Il existe aussi une opposition spécifique Ã l'arme nucléaire, que l'on peut qualifier de «mouvement antinucléaire militaire». Les opposants au nucléaire soutiennent notamment qu'il existe des liens étroits entre le nucléaire civil et militaire, et que le nucléaire civil a une responsabilité lourde dans la prolifération nucléaire.» (DBpedia, 2017) @fr
in scheme: political affiliation

anti-pacifism
in dataset: The CWRC Ontology
contrary to: pacifism
type: political affiliation
type: Concept
comment: The description for this term is indebted to DBpedia.
label: antipacifisme @fr
alternative label: anti-appeasement
alternative label: conscriptionist
alternative label: non-pacifist
alternative label: war supporter
definition: Opposed to pacifism. See Pacifism - Wikipedia
definition: Opposition au pacifisme. Voir Pacifisme â Wikipédia @fr
in scheme: political affiliation

anti-poverty movement
in dataset: The CWRC Ontology
type: political affiliation
type: Concept
comment: The description for this term is indebted to DBpedia.
label: mouvement de lutte contre la pauvreté @fr
alternative label: anti-poverty activist
alternative label: poverty activist
definition: Advocacy or activism to reduce poverty. See Poverty reduction - Wikipedia
definition: Militantisme pour réduire la pauvreté. Voir Pauvreté â Wikipédia @fr
in scheme: political affiliation

anti-racism
in dataset: The CWRC Ontology
contrary to: racism
type: political affiliation
type: Concept
comment: La description de ce terme est basée sur celle de DBPedia. @fr
comment: The description for this term is indebted to DBpedia.
label: antiracisme @fr
alternative label: anti-racist
broader transitive: civil rights movement
definition: "Anti-racism includes beliefs, actions, movements, and policies adopted or developed to oppose racism. In general, anti-racism is intended to promote an egalitarian society in which people do not face discrimination on the basis of their race, however defined. By its nature, anti-racism tends to promote the view that racism in a particular society is both pernicious and socially pervasive, and that particular changes in political, economic, and/or social life are required to eliminate it." (DBpedia, 2017)
definition: «L'antiracisme inclut les opinions, actions, mouvements et les politiques adoptées ou développée pour s'opposer au racisme. En général l'antiracisme promeut une société dans laquelle les individus ne subissent pas de discrimination sur la base de leur ethnie dont la définition peut varier. De par sa nature, l'antiracisme avance la vision que le racisme dans une société est Ã la fois pernicieux et socialement pénalisant et que des changements politiques, économiques et/ou sociaux sont nécessaires pour l'éradiquer. La notion d'antiracisme, tout comme les acteurs de la lutte dite antiraciste, ont été critiqués par certains intellectuels notamment pour sa faiblesse conceptuelle, ses utilisations politiques, voire paradoxalement par la réintroduction de la notion de race au sein du débat national.» (DBpedia, 2017) @fr
in scheme: political affiliation
related: black anti-oppression movement

anti-socialism
in dataset: The CWRC Ontology
contrary to: socialism
type: political affiliation
type: Concept
comment: La description de ce terme est basée sur celle de DBPedia. @fr
comment: The description for this term is indebted to DBpedia.
label: Critiques du socialisme @fr
alternative label: anti-socialist
definition: "Criticism of socialism refers to any critique of socialist models of economic organisation and their feasibility; as well as the political and social implications of adopting such a system. Some criticisms are not directed towards socialism as a system, but are directed towards the socialist movement, socialist political parties or existing socialist states. Some critics consider socialism to be a purely theoretical concept that should be criticized on theoretical grounds (such as in the Socialist calculation debate); others hold that certain historical examples exist and that they can be criticized on practical grounds. Economic liberals and right libertarians view private ownership of the means of production and the market exchange as natural entities or moral rights which are central to their conceptions of freedom and liberty, and view the economic dynamics of capitalism as immutable and absolute. Therefore, they perceive public ownership of the means of production, cooperatives and economic planning as infringements upon liberty. According to the Austrian school economist Ludwig von Mises, an economic system that does not utilize money, financial calculation and market pricing will be unable to effectively value capital goods and coordinate production, and therefore socialism is impossible because it lacks the necessary information to perform economic calculation in the first place. Another central argument leveled against socialist systems based on economic planning is based on the use of dispersed knowledge. Socialism is unfeasible in this view because information cannot be aggregated by a central body and effectively used to formulate a plan for an entire economy, because doing so would result in distorted or absent price signals. Many economic criticisms of socialism focus on the experiences of Soviet-type planned economies. It is argued that a lack of budget constraints in enterprises operating in a planned economy reduces incentives for enterprises to ac…
definition: «Les critiques du socialisme se réfèrent aux critiques des modèles socialistes d'organisation économique, de leurs efficacités et de leurs faisabilités, ainsi que des implications politiques et sociales de tels systèmes. Certaines critiques ne sont pas dirigées vers le socialisme en tant que système, mais sont dirigés vers des mouvements socialistes, des partis politiques socialistes ou des états socialistes existants. Certaines critiques considèrent le socialisme comme un concept purement théorique qui doit être critiqué pour des raisons théoriques, d'autres soutiennent que les expériences socialistes peuvent être critiquées sur les faits. Certains encore veulent englober plusieurs exemples historiques d'Ãtats communistes dans une forme de socialisme.Le socialisme est donc une notion large, certaines critiques présentées dans cet article ne s'appliqueront qu'a un modèle spécifique du socialisme qui peuvent différer considérablement des autres types de socialisme. Les libéraux économiques, libertariens, pro-capitalistes et quelques libéraux classiques considèrent l'entreprise privée, la propriété privée des moyens de production et l'échange sur le marché comme des phénomènes naturels ou moraux[pas clair], au centre de leurs conceptions de la liberté. Et par opposition, les membres de ces trois groupes peuvent percevoir la propriété publique des moyens de production, des coopératives et de la planification économique parrainé par l'Ãtat comme des atteintes Ã la liberté[pas clair]. Les membres de l'école néoclassique d'économie critiquent les théories socialistes qui favorisent la participation de l'Ãtat ou de la centralisation du capital sur les motifs du manque de motivation au sein des institutions de l'Ãtat d'agir sur l'information aussi efficacement que les gestionnaires dans les entreprises capitalistes parce qu'ils n'ont pas de forte contrainte (profit et mécanisme de perte), ce qui réduit le bien-être économ… @fr
in scheme: political affiliation

anti-suffrage
in dataset: The CWRC Ontology
contrary to: suffrage movement
type: occupation
type: political affiliation
type: Concept
comment: The description for this term is indebted to DBpedia.
label: opposition au suffrage universel @fr
alternative label: anti-sufffragist
alternative label: anti-suffrage movement
alternative label: anti-suffragist
alternative label: anti-suffragist movement
alternative label: non-suffragist
broader transitive: politics
definition: "Anti-suffragism was a political movement composed mainly of women, begun in the late 19th century in order to campaign against women's suffrage in Great Britain and the United States. It was closely associated with "domestic feminism", the belief that women had the right to complete freedom within the home." (DBpedia, 2017)
in scheme: political affiliation

anti-trade-unionism
in dataset: The CWRC Ontology
contrary to: labour movement
type: political affiliation
type: Concept
comment: The description for this term is indebted to DBpedia.
label: opposition au syndicalisme @fr
alternative label: anti-Union
alternative label: anti-trade-unionist
definition: Opposed to trade unions or the trade union movement. See Trade union - Wikipedia
definition: Opposition aux syndicats ou au mouvement syndical. Voir Répression antisyndicale â Wikipédia @fr
in scheme: political affiliation

anti-urbanism
in dataset: The CWRC Ontology
type: political affiliation
type: Concept
comment: The description for this term is indebted to DBpedia.
label: antiurbain @fr
alternative label: pro-countryside
definition: "Anti-urbanism is hostility towards the city as opposed to the country, a simple rejection of the city, or a wish to destroy the city." (DBpedia, 2017)
definition: «L'antiurbain est l'hostilité Ã l'égard de la ville par opposition Ã la campagne, un rejet pur et simple, une volonté de détruire la ville. » (DBpedia, 2017) @fr
in scheme: political affiliation

anti-vaccination movement
in dataset: The CWRC Ontology
type: political affiliation
type: Concept
comment: The description for this term is indebted to DBpedia.
label: mouvement contre la vaccination @fr
alternative label: movement against compulsory vaccination
definition: Opposition to vaccination, usually compulsory vaccination. See Vaccine hesitancy - Wikipedia Also see: Category:Vaccine controversies - Wikipedia
definition: Opposition Ã la vaccination, généralement lorsqu'elle est obligatoire. Voir Controverse sur la vaccination â Wikipédia @fr
in scheme: political affiliation

anti-vivisection
in dataset: The CWRC Ontology
type: political affiliation
type: Concept
comment: The description for this term is indebted to DBpedia.
label: antivivisection @fr
alternative label: anti-vivisection movement
alternative label: anti-vivisectionist
definition: Opposition to experimentation and testing on live animals. See Category:Anti-vivisection movement - Wikipedia Also see Vivisection - Wikipedia
definition: Opposition Ã l'expérimentation et aux tests conduits sur des animaux vivants. Voir Ligue française contre la vivisection â Wikipédia. Voir aussi Vivisection â Wikipédia @fr
in scheme: political affiliation
related: feminism

anti-war movement
in dataset: The CWRC Ontology
contrary to: pro-Boer War
type: political affiliation
type: Concept
comment: La description de ce terme est basée sur celle de DBPedia. @fr
comment: The description for this term is indebted to DBpedia.
label: Antiguerre @fr
alternative label: anti Vietnam war
alternative label: anti-Vietnam-War demonstrations
alternative label: anti-militarism
alternative label: anti-militaristic
alternative label: anti-war
alternative label: anti-war activism
alternative label: vietnam war protester
broader transitive: pacifism
definition: "An anti-war movement (also antiwar) is a social movement, usually in opposition to a particular nation's decision to start or carry on an armed conflict, unconditional of a maybe-existing just cause. The term can also refer to pacifism, which is the opposition to all use of military force during conflicts. Many activists distinguish between anti-war movements and peace movements. Anti-war activists work through protest and other grassroots means to attempt to pressure a government (or governments) to put an end to a particular war or conflict." (DBpedia, 2017)
definition: «Le mouvement antiguerre est un mouvement social[réf. nécessaire] s'opposant aux conflits armés.» (DBpedia, 2017) @fr
in scheme: political affiliation

anti-Zionism
in dataset: The CWRC Ontology
contrary to: Zionism
type: political affiliation
type: Concept
comment: La description de ce terme est basée sur celle de DBPedia. @fr
comment: The description for this term is indebted to DBpedia.
label: Antisionisme @fr
alternative label: anti-Israeli
alternative label: anti-israel
alternative label: anti-zionist
definition: "Anti-Zionism is opposition to Zionism, broadly defined in the modern era as the opposition to the ethnonationalist and political movement of Jews and Jewish culture that supports the establishment of a Jewish state as a Jewish homeland in the territory defined as the historic Land of Israel (also referred to as Palestine, Canaan or the Holy Land) or to the modern State of Israel as defined as A Jewish and Democratic State. The term is used to describe various religious, moral, and political points of view, but their diversity of motivation and expression is sufficiently different that "anti-Zionism" cannot be seen as having a single ideology or source. According to many notable Jewish and non-Jewish sources, anti-Zionism has become a cover for modern-day antisemitism, a position that critics have challenged as a tactic to silence criticism of Israeli policies." (DBpedia, 2017)
definition: «L'antisionisme (ou anti-sionisme) désigne historiquement l'opposition au projet sioniste d'établissement d'un foyer national juif en Palestine. Il apparaît d'une part parmi les dirigeants traditionalistes juifs pour des raisons religieuses ou par crainte des Juifs assimiliationistes et d'autre part parmi les dirigeants arabes de Palestine et certains officiers britanniques quand la Grande-Bretagne obtient de la société des Nations un mandat pour administrer le pays. Outre l'opposition politique, l'antisionisme arabe palestinien de l'époque se manifeste lors de la Grande Révolte arabe de 1936-1939 et puis par la Guerre israélo-arabe de 1948. L'antisionisme juif est moins important et d'origine religieuse. Il se réduit fortement Ã partir de 1921 avec la nomination au grand rabbinat d'Eretz Israel du rabbin Abraham Isaac Kook pour disparaître presque totalement après la Shoah, la Résolution 181 de l'ONU du 30 novembre 1947 qui prévoit le Plan de partage de la Palestine et l'établissement d'un Ãtat juif, l'Ãtat d'Israël, que les Arabes tentèrent vainement d'empêcher lors de la guerre de 1948 et qui est l'aboutissement du projet sioniste originel. Après la guerre de 1967 et les conquêtes territoriales israéliennes, et en parallèle avec la médiatisation de la cause palestinienne et du problème des réfugiés palestiniens, la notion d'antisionisme évolue et devient plus ambiguë. Le terme peut caractériser des prises de positions aussi éloignées que le simple rejet de la politique israélienne Ã la revendication de son anéantissement. Ainsi, l'antisionisme est parfois invoqué comme une échappatoire pour voiler une nouvelle forme d'antisémitisme et cette accusation est elle-même dénoncée comme une manipulation visant Ã empêcher toute critique d'Israël et du sionisme. En Israël même, la situation a engendré les mouvements néosioniste et postsioniste, tous deux en opposition avec le «sionisme séculaire» des «pères fondateurs» ma… @fr
in scheme: political affiliation

anti-masonry
in dataset: The CWRC Ontology
type: political affiliation
type: Concept
comment: La description de ce terme est basée sur celle de DBPedia. @fr
comment: The description for this term is indebted to DBpedia.
label: antimaçonnisme @fr
alternative label: anti-masonic
definition: "Anti-Masonry (alternatively called Anti-Freemasonry) is defined as "avowed opposition to Freemasonry". However, there is no homogeneous anti-Masonic movement. Anti-Masonry consists of radically differing criticisms from sometimes incompatible groups who are hostile to Freemasonry in some form." (DBpedia, 2018)
definition: «L'antimaçonnisme (ou antimaçonnerie) désigne la critique, l'opposition et l'hostilité manifestées Ã lâencontre de la franc-maçonnerie et de ses membres. Souvent liées Ã lâÃglise catholique, qui condamna Ã plusieurs reprises la franc-maçonnerie en tant que telle depuis la bulle pontificale In eminenti apostolatus specula en 1738, les condamnations au sujet de la société initiatique se sont exprimées sous des natures et formes diverses. L'acceptation globale de l'idéologie démontre que la distribution des préjugés fut variables au sein des classes sociales et selon les appartenances religieuses. En tant que phénomène sociétal, l'antimaçonnisme constitue une réalité historique et sociale qui puise sa source dans plusieurs strates de l'histoire. La chronologie du phénomène rapporte un ensemble de faits concentrés géographiquement en occident. Les politiques et publications antimaçonniques décrient généralement des intentions et des actions de conspiration liées Ã un secret, telles les théories du complot maçonnique. Les hostilités furent nourries de tout temps par de multiples interprétations spéculatives telles que lâimmixtion dans le pouvoir politique et judiciaire, les hauts grades, l'influence déterminante et lâinsertion de symboles dans la vie civile qui en résultent. Dans une optique plus rationnelle, l'antimaçonnisme découle d'une opposition aux idées progressistes et libérales issues du siècle des Lumières époque où certains philosophes de renom ont adhéré Ã l'école de pensée. Ã la suite notamment des ouvrages de lâabbé Barruel, qui défend la thèse que la Révolution française résulterait dâun complot maçonnique, lâantimaçonnisme devient progressivement une doctrine qui se développe dans les milieux catholiques ultramontains et chez les penseurs de la contre-révolution. Au XXe siècle, si la franc-maçonnerie est jugée « contre-révolutionnaire » par l'Internationale communiste qui l'interdit Ã ses p… @fr
in scheme: political affiliation

anti-clericalism
in dataset: The CWRC Ontology
type: political affiliation
type: religion
type: Concept
comment: La description de ce terme est basée sur celle de DBPedia. @fr
comment: The description for this term is indebted to DBpedia.
label: anticléricalisme @fr
broader transitive: Methodism
definition: "Anti-clericalism refers to historical movements that oppose the clergy for reasons including their actual or alleged power and influence in all aspects of public and political life and their involvement in the everyday life of the citizen, their privileges, or their enforcement of orthodoxy. Not all anti-clericals are irreligious or anti-religious, some have been religious and have opposed clergy on the basis of institutional issues and/or disagreements in religious interpretation, such as during the Protestant Reformation." (DBpedia, 2018)
definition: «L'anticléricalisme est un système opposé aux tendances du clergé. D'après Françoise Marcard, l'anticléricalisme s'oppose au cléricalisme, « sachant qu'il y a présomption de cléricalisme chaque fois que le fait religieux transgresse les frontières du terrain dit temporel ». L'anticléricalisme insiste sur la nécessaire séparation du religieux et du profane. Il postule la liberté de conscience individuelle. Autour de ce noyau dur de convictions, l'anticléricalisme évolue en relation étroite avec le cléricalisme qu'il combat, et d'une façon plus large avec les religions. Selon l'historien et politologue René Rémond : « L'anticléricalisme comporte un élément irréductible et qui est une défiance, peut-être une aversion insurmontable pour toute Ãglise. Si peu clérical que le fait religieux puisse devenir, il gardera toujours de quoi irriter, inquiéter ou susciter l'anticléricalisme. Il y a donc lieu de considérer que l'anticléricalisme constitue un facteur durable du champ des idéologies. » Lâanticléricalisme, composante essentielle de la tradition du Siècle des Lumières, reste une position extrêmement minoritaire sur la planète : les croyances et les pratiques religieuses continuent de réguler plus ou moins profondément la vie quotidienne de la plus grande partie de sa population.» (DBpedia, 2018) @fr
in scheme: religion

antidisestablishmentarianism
in dataset: The CWRC Ontology
contrary to: disestablishmentarianism
type: political affiliation
type: Concept
comment: The description for this term is indebted to DBpedia.
label: opposition Ã l'Establismhment @fr
alternative label: antidisestablishmentarian
definition: "Antidisestablishmentarianism (/Ëæn.ti.dÉªs.Éªs.tæb.lÉªÊ.mÉnËtÉÉ.rÉªÉ.nÉª.záµm/, /Ëæn.taÉªËdÉªs.ÉsËtæb.lÉªÊ.mÉntËÉ.ri.ÉnËÉª.zm/) is a political position that developed in 19th-century Britain in opposition to Liberal proposals for the disestablishment of the Church of Englandâmeaning the removal of the Anglican Church's status as the state church of England, Ireland, and Wales. The establishment was maintained in England, but in Ireland the Church of Ireland (Anglican) was disestablished in 1871. In Wales, four Church of England dioceses were disestablished in 1920 and became the Church in Wales. Antidisestablishmentarianism is also one of the longest non-scientific words. The word has also come by analogy to refer to any opposition to those who oppose the establishment, whether the government, in whole or part, or the established society." (DBpedia, 2017)
in scheme: political affiliation

antisemitism
in dataset: The CWRC Ontology
type: political affiliation
type: Concept
comment: La description de ce terme est basée sur celle de DBPedia. @fr
comment: The description for this term is indebted to DBpedia.
label: Antisémitisme @fr
alternative label: anti-semitism
alternative label: antisemitic
broader transitive: racism
definition: "Antisemitism (also spelled anti-Semitism or anti-semitism) is hostility, prejudice, or discrimination against Jews. A person who holds such positions is called an antisemite. Antisemitism is widely considered to be a form of racism. The root word Semite gives the false impression that antisemitism is directed against all Semitic people. However, the compound word antisemite was popularized in Germany in 1879 as a scientific-sounding term for Judenhass ("Jew-hatred") ,and that has been its common use since then. Antisemitism may be manifested in many ways, ranging from expressions of hatred of or discrimination against individual Jews to organized pogroms by mobs, state police, or even military attacks on entire Jewish communities. Although the term did not come into common usage until the 19th century, it is now also applied to historic anti-Jewish incidents. Notable instances of persecution include the Rhineland massacres preceding the First Crusade in 1096, the Edict of Expulsion from England in 1290, the massacres of Spanish Jews in 1391, the persecutions of the Spanish Inquisition, the expulsion from Spain in 1492, the Cossack massacres in Ukraine from 1648 to 1657, various anti-Jewish pogroms in the Russian Empire between 1821 and 1906, the 1894â1906 Dreyfus affair in France, the Holocaust in German-occupied Europe, official Soviet anti-Jewish policies, and Arab and Muslim involvement in the Jewish exodus from Arab and Muslim countries." (DBpedia, 2017)
definition: «L'antisémitisme (originellement : anti-sémitisme) est le nom donné de nos jours Ã la discrimination et Ã l'hostilité manifestées Ã l'encontre des Juifs en tant que groupe ethnique, religieux ou racial. Il s'agit, dans son acception originelle telle que formulée vers la fin du XIXe siècle, d'une forme de racisme dirigée nominalement contre les peuples sémites, regroupés en tant que tels sur base de critères linguistiques, mais ne visant en réalité que les Juifs. Bien que certains historiens comme Jules Isaac insistent pour distinguer antijudaïsme et antisémitisme, le second terme est cependant le plus souvent utilisé aujourd'hui pour qualifier tous les actes d'hostilité anti-juive au cours de l'Histoire, que leurs fondements soient raciaux ou non. Les motifs et mises en pratique de l'antisémitisme incluent divers préjugés, des allégations, des mesures discriminatoires ou d'exclusion socio-économique, des expulsions, voire des massacres d'individus ou de communautés entières.» (DBpedia, 2017) @fr
in scheme: political affiliation

appeasement
in dataset: The CWRC Ontology
type: political affiliation
type: Concept
comment: La description de ce terme est basée sur celle de DBPedia. @fr
comment: The description for this term is indebted to DBpedia.
label: politique d'apaisement @fr
definition: "Appeasement in a political context is a diplomatic policy of making political or material concessions to an enemy power in order to avoid conflict. The term is most often applied to the foreign policy of the British Prime Ministers Ramsay Macdonald, Stanley Baldwin and Neville Chamberlain towards Nazi Germany and Fascist Italy between 1935 and 1939. Their policies have been the subject of intense debate for more than seventy years among academics, politicians and diplomats. The historians' assessments have ranged from condemnation for allowing Adolf Hitler's Germany to grow too strong, to the judgment that they had no alternative and acted in their country's best interests. At the time, these concessions were widely seen as positive, and the Munich Pact concluded on 30 September 1938 among Germany, Britain, France, and Italy prompted Chamberlain to announce that he had secured "peace for our time."" (DBpedia, 2018)
definition: «La politique d'apaisement dans les relations internationales vise Ã éviter la guerre en faisant des concessions Ã l'ennemi.» (DBpedia, 2018) @fr
in scheme: political affiliation

appraiser
in dataset: The CWRC Ontology
type: occupation
type: Concept
alternative label: project appraiser
in scheme: occupation

Arab
in dataset: The CWRC Ontology
type: ethnicity
type: Concept
comment: La description de ce terme est basée sur celle de DBPedia. @fr
comment: The description for this term is indebted to DBpedia.
label: Arabe @fr
definition: "Arabs (Arabic: Ø¹Ø±Ø¨ââ, âarab) are a panethnicity of peoples whose native language is a variety of Arabic. They primarily inhabit Western Asia, North Africa, and parts of the Horn of Africa and East Africa. Before the spread of Islam, Arab referred to any of the largely nomadic Semitic people from the northern and central Arabian Peninsula. In modern usage Arab refers to a heterogeneous collection of Arabic-speaking peoples in Western Asia and North Africa. The ties that bind Arabs are linguistic, cultural, political, and ethnic, with Arabized Arabs displaying genetic contributions, in varying proportions, from both indigenous elements and the Arabian peninsula. As such, Arab identity is based on one or more of genealogical, linguistic or cultural grounds, although with competing identities often taking a more prominent role, based on considerations including regional, national, clan, kin, sect, and tribe affiliations and relationships. Not all people who could be considered Arab identify as such. If the Arab pan-ethnicity is regarded as a single population, then it constitutes the world's second largest group of people after the Han Chinese. The Arabian Peninsula itself was not entirely Arab linguistically or culturally before the spread of Islam. Arabization occurred in the southern and eastern regions of the peninsula. For example, the language shift to Arabic displaced the distinct Old South Arabian languages from what is now modern-day Yemen and southern Oman. These were the languages spoken in the civilizations of Sheba, Magan, and Dilmun." (DBpedia, 2018)
definition: «Les Arabes sont des individus anthropologiquement différents les uns des autres mais qui sâidentifient par des liens linguistiques et/ou culturels. Ils sont répartis sur une vaste zone qui sâétend dâOman Ã la Mauritanie. Cela comprend les descendants d'habitants de la péninsule arabique qui ont migré au nord et Ã l'ouest et qui parlent des variantes de l'arabe, une langue sémitique. Ainsi définis, ils sont estimés Ã environ 450 millions dans le monde. Ils sont principalement présents en Asie occidentale, en Afrique et en Europe occidentale.» (DBpedia, 2018) @fr
in scheme: ethnicity

archaeologist
in dataset: The CWRC Ontology
type: occupation
type: Concept
alternative label: palaeontologist
alternative label: paleontologist
hidden label: director of archaeology in the department of antiquities
in scheme: occupation

architecture
in dataset: The CWRC Ontology
type: occupation
type: Concept
alternative label: architect
alternative label: architectural draftsman
alternative label: architectural restoration
alternative label: draftsman
alternative label: draughter
alternative label: draughtsman
alternative label: royal architect
in scheme: occupation

archivist
in dataset: The CWRC Ontology
type: occupation
type: Concept
in scheme: occupation
related: librarian

aristocrat
in dataset: The CWRC Ontology
type: occupation
type: Concept
alternative label: baron
alternative label: baronet
in scheme: occupation

army
in dataset: The CWRC Ontology
type: occupation
type: Concept
alternative label: army colonel
alternative label: army commander
alternative label: army doctor
alternative label: army officer
alternative label: army paymaster
alternative label: army surgeon
alternative label: billetting officer
alternative label: cavalry officer
alternative label: cavalry soldier
hidden label: inspector of army education
in scheme: occupation

arts manager
in dataset: The CWRC Ontology
type: occupation
type: Concept
alternative label: art acquisitions officer
alternative label: arts administrator
alternative label: arts centre director
alternative label: arts festival director
alternative label: musical manager
broader transitive: manager
hidden label: director of the national gallery
hidden label: joint chairman of the writers' guild of great britain
in scheme: occupation

arts advocacy
in dataset: The CWRC Ontology
type: political affiliation
type: Concept
comment: The description for this term is indebted to DBpedia.
label: défense des arts @fr
alternative label: advocate for the arts
alternative label: artists' advocate
definition: Action pour les beaux arts, les arts du spectale ou les humanités. @fr
definition: Advocacy for the fine, performing, or liberal arts.
in scheme: political affiliation

literature advocate
in dataset: The CWRC Ontology
type: occupation
type: Concept
broader transitive: advocate
in scheme: occupation

asceticism
in dataset: The CWRC Ontology
type: religion
type: Concept
comment: La description de ce terme est basée sur celle de DBPedia. @fr
comment: The description for this term is indebted to DBpedia.
label: ascèse @fr
definition: "Asceticism (/ÉËsÉtÉªsÉªzÉm/; from the Greek: á¼ÏÎºÎ·ÏÎ¹Ï áskesis, "exercise" or "training") is a lifestyle characterized by abstinence from worldly pleasures, often for the purpose of pursuing spiritual goals. Ascetics may withdraw from the world for their practices or continue to be part of their society, but typically adopt a frugal lifestyle, characterised by the renunciation of material possessions and physical pleasures, and time spent fasting while concentrating on the practice of religion or reflection upon spiritual matters. Asceticism is classified into two types. "Natural asceticism" consists of a lifestyle where material aspects of life are reduced to utmost simplicity and a minimum but without maiming the body or harsher austerities that make the body suffer, while "unnatural asceticism" is defined as a practice that involves body mortification and self infliction of pain such as by sleeping on a bed of nails. Asceticism has been historically observed in many religious traditions, including Christianity, Judaism, Hinduism, Buddhism, and Jainism. Mainstream Islam has lacked asceticism, except for its minority Sufi sect whose long tradition has included strict asceticism. The practitioners of these religions eschewed worldly pleasures and led an abstinent lifestyle, in the pursuit of redemption, salvation or spirituality. Asceticism is seen in the ancient theologies as a journey towards spiritual transformation, where the simple is sufficient, the bliss is within, the frugal is plenty." (DBpedia, 2018)
definition: «L'ascèse ou ascétisme est une discipline volontaire du corps et de l'esprit cherchant Ã tendre vers une perfection, par une forme de renoncement ou d'abnégation.» (DBpedia, 2018) @fr
in scheme: religion

asexuality
in dataset: The CWRC Ontology
type: sexuality
type: Concept
label: asexualité @fr
alternative label: asexual
definition: Indicates a lack of interest in sex or sexual attraction to other subjects and is not to be confused with celibacy
in scheme: sexuality

Ashkenazi Jewish
in dataset: The CWRC Ontology
represented by: Jewish identity
type: ethnicity
type: Concept
comment: La description de ce terme est basée sur celle de DBPedia. @fr
comment: The description for this term is indebted to DBpedia.
label: Juif ashkénaze @fr
alternative label: Ashkenazim
alternative label: Ashkenazim, or German Jewish
broader transitive: Jewish
definition: "Ashkenazi Jews, also known as Ashkenazic Jews or simply Ashkenazim (Hebrew: ×Ö·×©Ö°××Ö°Ö¼× Ö·×Ö´Ö¼××, Ashkenazi Hebrew pronunciation: [ËaÊkÉËnazim], singular: [ËaÊkÉËnazi], Modern Hebrew: [aÊkenaËzim, aÊkenaËzi]; also ×Ö°××Ö¼×Öµ× ×Ö·×©Ö°××Ö²Ö¼× Ö·× Y'hudey Ashkenaz), are a Jewish diaspora population who coalesced as a distinct community of Jews in the Holy Roman Empire around the end of the 1st millennium. The traditional diaspora language of Ashkenazi Jews consisted of various dialects of Yiddish." (DBpedia, 2017)
definition: «L'appellation Ashkénaze, Ashkenaze ou Achkenaze désigne 'les Juifs de l'Europe occidentale, centrale et orientale qui sont d'origine et de langue germaniques par opposition Ã ceux qui sont originaires d'Espagne et sont dits séfarades (sefardim)' et aux Juifs descendant des communautés juives des régions proche et moyen-orientales dits Mizrahim. Leur nom vient du patriarche biblique Ashkenaz. Les communautés ashkénazes se sont principalement concentrées en Allemagne, en Pologne, en Russie, dans l'ancien Empire austro-hongrois et, de façon plus clairsemée, dans le reste de l'Europe centrale et orientale. Les Ashkénazes sont caractérisés par des coutumes, un héritage culturel et des traditions religieuses particulières. Ã la différence des communautés séfarades ou mizrahim, la langue vernaculaire des Ashkénazes est le yiddish5, variété de moyen-haut allemand enrichie d'emprunts Ã l'hébreu, au polonais et au russe6). Certaines sources attestent de leur présence dans toute l'Europe du nord-ouest au début du Moyen ge. Les Ashkénazes constituent aujourd'hui la catégorie la plus nombreuse du judaïsme mondial.» (DBpedia, 2017) @fr
in scheme: ethnicity

Asian
in dataset: The CWRC Ontology
type: race or colour
type: Concept
comment: La description de ce terme est basée sur celle de DBPedia. @fr
comment: The description for this term is indebted to DBpedia.
label: Asiatique @fr
definition: "Asian people or Asiatic people are people who descend from a portion of Asia's population. There are varieties of definition and geographical data presented by organisations and individuals for classifying the ethnic groups in Asia."(DBpedia, 2017)
definition: «Le terme asiatique désigne une personne originaire d'Asie, et présentant des caractéristiques physiques d'Asie de l'Est, d'Asie du Sud-Est et de certaines régions d'Asie centrale. En français, l'adjectif asiatique désigne, au sens large, tout ce qui se rapporte Ã l'Asie : dans le langage courant, quand il se rapporte Ã des personnes, il est cependant essentiellement utilisé pour désigner les populations originaires de ces régions asiatiques. Les personnes originaires d'autres régions d'Asie comme le Moyen-Orient ou le sous-continent indien ne sont que rarement appelées Asiatiques, bien qu'elles le soient également au sens géographique.» @fr
in scheme: race or colour

assistant
in dataset: The CWRC Ontology
type: occupation
type: Concept
alternative label: administrative assistant
alternative label: personal assistant
hidden label: full time programme assistant
in scheme: occupation

associated by violence with
in dataset: The CWRC Ontology
range includes: Work
range includes: AdminPlaceConcept
range includes: Feature
range includes: FormalOrganization
range includes: Person
type: ObjectProperty
type: SymmetricProperty
domain: Person
sub property of: has biographical relation to
definition: A connection between persons and other persons or entities related to instances of physical, sexual, and undue emotional violence, whether the subject was the victim or the perpetrator. Broadly conceived to include the effect of exposure to violence of which the person was neither perpetrator nor survivor.

associated via health with
in dataset: The CWRC Ontology
range includes: Work
range includes: AdminPlaceConcept
range includes: Feature
range includes: FormalOrganization
range includes: Person
type: ObjectProperty
type: SymmetricProperty
domain: Person
sub property of: has biographical relation to

association involvement
in dataset: The CWRC Ontology
type: occupation
type: Concept
alternative label: club leader
alternative label: club president
alternative label: clubman
alternative label: clubperson
alternative label: clubwoman
alternative label: freemason
alternative label: president of professional association
alternative label: president of society
alternative label: president of the society of authors
alternative label: secretary of literary society
alternative label: society director
alternative label: society member
alternative label: society president
alternative label: society secretary
alternative label: society vice president
alternative label: vice president of society
hidden label: president of the british club for belgian soldiers
hidden label: president of the herdwick association
hidden label: president of the literary ladies club
hidden label: president of the society of women journalists
in scheme: occupation

astronomer
in dataset: The CWRC Ontology
type: occupation
type: Concept
alternative label: amateur astronomer
alternative label: assistant astronomer
broader transitive: scientist
in scheme: occupation

atheism
in dataset: The CWRC Ontology
type: religion
type: Concept
comment: La description de ce terme est basée sur celle de DBPedia. @fr
comment: The description for this term is indebted to DBpedia.
label: athéisme @fr
definition: "Atheism is, in a broad sense, the rejection of belief in the existence of deities. In a narrower sense, atheism is specifically the position that there are no deities. Most inclusively, atheism is the absence of belief that any deities exist. Atheism is contrasted with theism, which, in its most general form, is the belief that at least one deity exists. The term "atheism" originated from the Greek á¼Î¸ÎµÎ¿Ï (atheos), meaning "without god(s)", used as a pejorative term applied to those thought to reject the gods worshiped by the larger society. With the spread of freethought, skeptical inquiry, and subsequent increase in criticism of religion, application of the term narrowed in scope. The first individuals to identify themselves using the word "atheist" lived in the 18th century during the Age of Enlightenment. The French Revolution, noted for its "unprecedented atheism," witnessed the first major political movement in history to advocate for the supremacy of human reason. Arguments for atheism range from the philosophical to social and historical approaches. Rationales for not believing in deities include arguments that there is a lack of empirical evidence; the problem of evil; the argument from inconsistent revelations; the rejection of concepts that cannot be falsified; and the argument from nonbelief. Although some atheists have adopted secular philosophies (eg. humanism and skepticism), there is no one ideology or set of behaviors to which all atheists adhere. Many atheists hold that atheism is a more parsimonious worldview than theism and therefore that the burden of proof lies not on the atheist to disprove the existence of God but on the theist to provide a rationale for theism. Since conceptions of atheism vary, accurate estimations of current numbers of atheists are difficult. Several comprehensive global polls on the subject have been conducted by Gallup International: their 2015 poll featured over 64,000 respondents and indicated that 11% were "convin…
definition: «L'athéisme est une attitude ou une doctrine qui nie l'existence de quelque dieu ou divinité que ce soit, contrairement, par exemple, au déisme et au théisme qui soutiennent ces existences, ou Ã l'agnosticisme qui considère que personne ne peut répondre Ã ces questions. C'est une position philosophique qui peut être formulée ainsi : il n'existe rien qui ressemble de près ou de loin Ã ce que les croyants appellent un «dieu», ou «Dieu».» (DBpedia, 2017) @fr
in scheme: religion

attends
in dataset: The CWRC Ontology
type: ObjectProperty
domain: Person
label: scolarisation @fr
range: educational organization
sub property of: relates by education to
inverse of: has student
definition: Indique que le sujet fréquente ou a fréquenté un établissement éducatif en particulier ou a reçu une forme d'enseignement spécifique @fr
definition: Indicates attending or having attended for education either a particular school or a particular type of schooling.

attends post-secondary school
in dataset: The CWRC Ontology
type: ObjectProperty
sub property of: attends
definition: Indicates attending or having attended for education a post-secondary school.

attends primary school
in dataset: The CWRC Ontology
type: ObjectProperty
sub property of: attends
definition: Indicates attending or having attended for education a primary school.

attends secondary school
in dataset: The CWRC Ontology
type: ObjectProperty
sub property of: attends
definition: Indicates attending or having attended for education a secondary school.

attorney general
in dataset: The CWRC Ontology
type: occupation
type: Concept
broader transitive: government official
hidden label: attorney general of ireland
in scheme: occupation

auctioneer
in dataset: The CWRC Ontology
type: occupation
type: Concept
in scheme: occupation

aunt
in dataset: The CWRC Ontology
subject-centric predicate: has aunt
type: ObjectProperty
range: Person
sub property of: relative

aunt of
in dataset: The CWRC Ontology
type: ObjectProperty
domain: Person
label: tante de @fr
range: Person
sub property of: relative of
inverse of: has aunt
broader: relatedTo

automobileIndustry
in dataset: The CWRC Ontology
type: occupation
type: Concept
alternative label: car industry
alternative label: car part manufacturer
broader transitive: transportation work
in scheme: occupation

award
in dataset: The CWRC Ontology
subject-centric predicate: has award
type: ObjectProperty
label: une récompense @fr
sub property of: education relationship

awarded to
in dataset: The CWRC Ontology
type: ObjectProperty

Lesbian/Woman
issued: 1972
type: Book

Phyllis Lyon
first name: Phyllis
last name: Lyon
type: Person

Glide P
type: Organization
based near: San Francisco, CA, USA

Del Martin
first name: Del
last name: Martin
type: Person

Sisters in exile: The Lesbian Nation
issue: 19
volume: 3
type: AcademicArticle

S. Munt
first name: S.
last name: Munt
type: Person

New frontiers of space, bodies and gender
issued: 1998
type: Journal

Gender Outlaws: The Next Generation.
issued: 2010
type: Book

Seal P
type: Organization
based near: Berkeley, CA, USA

S. Bear Bergman
first name: S. Bear
last name: Bergman
type: Person

Kate Bornstein
first name: Kate
last name: Bornstein
type: Person

Demarginalizing the Intersection of Race and Sex: A Black Feminist Critique of Antidiscrimination Doctrine,Feminist Theory and Antiracist Politics
page end: 167
page start: 139
type: AcademicArticle

Kimberle Crenshaw
first name: Kimberle
last name: Crenshaw
type: Person

University of Chicago Legal Forum
issued: 1989
type: Journal

B.A.
in dataset: The CWRC Ontology
type: credential
type: Concept
comment: La description de ce terme est basée sur celle de DBPedia. @fr
comment: The description for this term is indebted to DBpedia.
label: Baccalauréat universitaire ès lettres @fr
alternative label: 2:2 BA
alternative label: AB degree
alternative label: BA
alternative label: BA (Honours)
alternative label: BA (Hons) in English Language and Literature
alternative label: BA (Second Class Honours)
alternative label: BA Honours degree
alternative label: BA Honours degree in English was a third class
alternative label: BA Honours in English
alternative label: BA Pass Degree
alternative label: BA degee
alternative label: BA degree
alternative label: BA first-class Honours in English
alternative label: BA honours in History
alternative label: BA honours, second class
alternative label: BA honours, third class
alternative label: BA in Arts
alternative label: BA in Classics, Class II
alternative label: BA in Drama and Theatre Arts
alternative label: BA in English
alternative label: BA in English Language and Literature
alternative label: BA in English Literature
alternative label: BA in English and History
alternative label: BA in English with First Class Honours
alternative label: BA in PPE
alternative label: BA in cultural anthropology
alternative label: BA in history
alternative label: BA in modern history
alternative label: BA, Second Class, in English Language and Literature
alternative label: Bachelor of Arts
alternative label: Bachelor of Arts degree (at pass level only)
alternative label: Bachelor of Arts with honours in English
alternative label: Cambridge BA
alternative label: Class Three BA
alternative label: Honours BA
alternative label: Honours BA degree
alternative label: Honours BA in Classics, First Class
alternative label: Honours BA in English
alternative label: Honours BA in French
alternative label: Honours BA in Greats
alternative label: Honours BA, Second Class,
alternative label: Second Class Honours BA
alternative label: Second Class degree
alternative label: Second Class honours degree
alternative label: degree with first-class honours
alternative label: double first Honours BA
alternative label: first class honours
alternative label: first in her BA
alternative label: first-class BA
alternative label: first-class BA in English
alternative label: first-class degree
alternative label: first-class honours BA
alternative label: second-class honours
alternative label: third-class degree (in history)
alternative label: third-class honours
broader transitive: undergraduate degree
definition: "A Bachelor of Arts (BA, B.A., AB or A.B. from the Latin artium baccalaureus or baccalaureus artium) is a bachelor's degree awarded for an undergraduate course or program in either the liberal arts, the sciences, or both. Bachelor of Arts degree programs generally take three to four years depending on the country, academic institution, and specific specializations, majors or minors. The word baccalaureus or baccalarium (from the Latin bacca, a berry, and laureus, "of the bay laurel") should not be confused with baccalaureatus (translatable as "gold-plated scepter" by using the Latina bacum and aureatus), which refers to the one- to two-year postgraduate Bachelor of Arts with Honours degree (Baccalaureatus in Artibus Cum Honore) in some countries. Diplomas generally give the name of the institution, signatures of officials of the institution (generally the president or rector of the university as well as the secretary or dean of the component college), the type of degree conferred, the conferring authority and the location at which the degree is conferred. Degree diplomas generally are printed on high quality paper or parchment; individual institutions set the preferred abbreviation for their degrees. The Bachelor of Arts degree is usually attained in four years in Afghanistan, Lebanon, Armenia, Greece, Bangladesh, Azerbaijan, Egypt, Iran, Japan, Nigeria, Serbia, Spain, Pakistan, the Philippines, Thailand, Russia, Ireland, South Korea, Iraq, Kuwait, Turkey, the United States of America and most of the Americas. They generally last three years in nearly all of the European Union, and in Albania, Australia, Bosnia and Herzegovina, Canada, India, Israel, New Zealand, Iceland, Norway, Singapore, the Caribbean, South Africa, and Switzerland." (DBpedia, 2018)
definition: «Le baccalauréat universitaire en lettres ou baccalauréat en arts est un grade universitaire délivré généralement après des études dans le domaine des lettres, des beaux-arts ou des sciences sociales ou humaines. Ce terme est parfois abrégé en BA (ou plus rarement AB de l'expression latine Artium Baccalaureus).» (DBpedia, 2018) @fr
in scheme: credential

B.Sc.
in dataset: The CWRC Ontology
type: credential
type: Concept
comment: La description de ce terme est basée sur celle de DBPedia. @fr
comment: The description for this term is indebted to DBpedia.
label: Baccalauréat universitaire en sciences @fr
alternative label: B.Sc. (with honours)
alternative label: BSc
alternative label: BSc in Physics
broader transitive: undergraduate degree
definition: "A Bachelor of Science (Latin Baccalaureus Scientiae, B.S., BS, B.Sc., or BSc; or, less commonly, S.B., SB, or Sc.B., from the equivalent Latin Scientiae Baccalaureus) is an undergraduate academic degree awarded for completed courses that generally last three to five years. Whether a student of a particular subject is awarded a Bachelor of Science degree or a Bachelor of Arts degree can vary between universities. For one example, an economics degree may be given as a Bachelor of Arts (B.A.) by one university but as a B.Sc. by another, and some universities offer the choice of either. Some liberal arts colleges in the United States offer only the BA, even in the natural sciences, while some universities offer only the BS even in non-science fields. Georgetown University's School of Foreign Service awards Bachelor of Science in Foreign Service degrees to all of its undergraduates, although many major in humanities-oriented fields such as international history and culture and politics. The London School of Economics offers B.Sc. degrees in practically all subject areas, even those normally associated with arts degrees, while the Oxbridge universities almost exclusively award arts qualifications. In both instances, there are historical and traditional reasons. Northwestern University's School of Communication grants B.Sc. degrees in all of its programs of study, including theater, dance, and radio/television/film. University of California, Berkeley grants B.S. degree in Environmental Economics and Policy in College of Natural Resources (CNR), and B.A. degree in Environmental Economics and Policy in College of Letters and Science (L&S). The first university to admit a student to the degree of Bachelor of Science was the University of London in 1860. Prior to this, science subjects were included in the B.A. bracket, notably in the cases of mathematics, physics, physiology and botany." (DBpedia, 2018)
definition: «Le baccalauréat universitaire en sciences (BSc) est un grade universitaire existant dans de nombreux pays, notamment dans les pays de tradition universitaire anglo-saxonne. Il existait en France au XIXe siècle.» (DBpedia, 2018) @fr
in scheme: credential

baker
in dataset: The CWRC Ontology
type: occupation
type: Concept
alternative label: pastrycook
broader transitive: skilled trade
in scheme: occupation

bankrupt
in dataset: The CWRC Ontology
type: occupation
type: Concept
hidden label: grande scale bankrupt
in scheme: occupation

Baptist Christianity
in dataset: The CWRC Ontology
type: religion
type: Concept
comment: La description de ce terme est basée sur celle de DBPedia. @fr
comment: The description for this term is indebted to the Getty Art & Architecture Thesaurus.
label: Baptisme @fr
label: Baptismo @es
label: Baptistas @es
label: chin li tsung @zh-latn
label: jin li zong @zh-latn
label: jìn lÇ zÅng @zh-latn
label: æµ¸ä¿¡æ @zh-hant
label: æµ¸ç¦®å® @zh-hant
label: 浸禮派 @zh-hant
alternative label: Baptist
alternative label: Baptist Church
alternative label: Particular Baptist
broader transitive: Dissent (Protestant)
definition: "Refers to a Protestant denomination centered around the belief that the sacrament of baptism should only be administered to adult members after a personal profession of belief in Jesus Christ. Baptism in this faith is usually done by full immersion. Emphasis is placed on biblical scripture and preaching. The Baptist denomination is primarily derived from early 17th-century England and Wales where it quickly spread although there are some links with the Anabaptists of the 16th century. Baptist churches very rapidly increased in the late 19th century in the United States." (Getty, 2017)
definition: "Se refiere a la religión protestante centrada en torno a la creencia que el sacramento del bautismo debería ser administrado sólo a miembros adultos tras una manifestación personal de creencia en Jesucristo. El bautismo en esta fe es usualmente hecho por inmersión total. El énfasis es puesto en las Escrituras Bíblicas y la oración. La denominación baptista deriva principalmente de la Inglaterra y Gales del siglo XVII en donde rápidamente se difundió a pesar que hay algunas conexiones con los Anabaptistas del siglo XVI. La iglesia baptista creció rápidamente en el siglo XIX en los Estados Unidos." (Getty, 2017) @es
definition: "Verwijst naar een protestantse gezindte waarbij het geloof centraal staat dat het sacrament van de doop alleen moet worden toegediend aan volwassen leden na een persoonlijke belijdenis van geloof in Jezus Christus. De doop vindt bij deze gezindte doorgaans plaats door volledige onderdompeling. De nadruk ligt op Bijbelse geschriften en preken. Het baptisme is in hoofdzaak ontstaan in de vroege 17de eeuw in Engeland en Wales waar het zich snel verspreidde, hoewel er enige verbanden zijn met de anabaptisten van de 16de eeuw. In de late 19de eeuw nam het aantal baptistische kerken in de Verenigde Staten snel toe." (Getty, 2017) @nl
definition: "ä¸æ¯æ°ææ´¾å¥ï¼ç¸ä¿¡åªæè¦ªèªè²æä¿¡ä»°åºç£çæäººæå¯åæ´ãæ­¤æçæ´ç¦®éå¸¸éå ¨èº«æµ¸æ´ãéè¦èç¶ç¶æèä½éãæµ¸ä¿¡æèåå ­ä¸ç´çéæµ¸æ´¾æäºæ·µæºï¼ä½ä¸»è¦æºæ¼åä¸ä¸ç´åçè±æ ¼è­èå¨ç¾æ¯ï¼å¨éå ©èå¿«éå»£å³ãå ¶æææ¼åä¹ä¸ç´æ«å¨ç¾åæ¥éå¢å ã" (Getty, 2017) @zh-hant
definition: «Le baptisme est un courant chrétien évangélique issu d'un réveil démarré par les pasteurs anglais John Smyth en Hollande en 1609, puis Thomas Helwys en Angleterre en 1612. Ce mouvement se caractérise par l'importance donnée Ã la Bible, Ã la nouvelle naissance, au baptême adulte en tant que témoignage volontaire, un esprit missionnaire, un engagement moral de vie ainsi que par l'autonomie locale des églises, la séparation de l'Ãglise et de l'Ãtat, et finalement l'autorité de la congrégation (congrégationalisme). Selon les chiffres du Pew Research Center, en 2011, le mouvement recense 72 millions de croyants.» (DBpedia, 2017) @fr
in scheme: religion

Baptist
is replaced by: Baptist Christianity
in dataset: The CWRC Ontology
type: Concept
comment: Deprecated in favour of instance Baptist Christianity.
comment: Désapprouver en faveur de l'instance Baptisme. @fr
comment: La description de ce terme est basée sur celle de DBPedia. @fr
comment: The description for this term is indebted to the Getty Art & Architecture Thesaurus.
label: Baptisme @fr
label: Baptismo @es
label: Baptistas @es
label: chin li tsung @zh-latn
label: jin li zong @zh-latn
label: jìn lÇ zÅng @zh-latn
label: æµ¸ä¿¡æ @zh-hant
label: æµ¸ç¦®å® @zh-hant
label: 浸禮派 @zh-hant
deprecated: true
term status: deprecated
broader transitive: Christianity
definition: "Refers to a Protestant denomination centered around the belief that the sacrament of baptism should only be administered to adult members after a personal profession of belief in Jesus Christ. Baptism in this faith is usually done by full immersion. Emphasis is placed on biblical scripture and preaching. The Baptist denomination is primarily derived from early 17th-century England and Wales where it quickly spread although there are some links with the Anabaptists of the 16th century. Baptist churches very rapidly increased in the late 19th century in the United States." (Getty, 2017)
definition: "Se refiere a la religión protestante centrada en torno a la creencia que el sacramento del bautismo debería ser administrado sólo a miembros adultos tras una manifestación personal de creencia en Jesucristo. El bautismo en esta fe es usualmente hecho por inmersión total. El énfasis es puesto en las Escrituras Bíblicas y la oración. La denominación baptista deriva principalmente de la Inglaterra y Gales del siglo XVII en donde rápidamente se difundió a pesar que hay algunas conexiones con los Anabaptistas del siglo XVI. La iglesia baptista creció rápidamente en el siglo XIX en los Estados Unidos." (Getty, 2017) @es
definition: "Verwijst naar een protestantse gezindte waarbij het geloof centraal staat dat het sacrament van de doop alleen moet worden toegediend aan volwassen leden na een persoonlijke belijdenis van geloof in Jezus Christus. De doop vindt bij deze gezindte doorgaans plaats door volledige onderdompeling. De nadruk ligt op Bijbelse geschriften en preken. Het baptisme is in hoofdzaak ontstaan in de vroege 17de eeuw in Engeland en Wales waar het zich snel verspreidde, hoewel er enige verbanden zijn met de anabaptisten van de 16de eeuw. In de late 19de eeuw nam het aantal baptistische kerken in de Verenigde Staten snel toe." (Getty, 2017) @nl
definition: "ä¸æ¯æ°ææ´¾å¥ï¼ç¸ä¿¡åªæè¦ªèªè²æä¿¡ä»°åºç£çæäººæå¯åæ´ãæ­¤æçæ´ç¦®éå¸¸éå ¨èº«æµ¸æ´ãéè¦èç¶ç¶æèä½éãæµ¸ä¿¡æèåå ­ä¸ç´çéæµ¸æ´¾æäºæ·µæºï¼ä½ä¸»è¦æºæ¼åä¸ä¸ç´åçè±æ ¼è­èå¨ç¾æ¯ï¼å¨éå ©èå¿«éå»£å³ãå ¶æææ¼åä¹ä¸ç´æ«å¨ç¾åæ¥éå¢å ã" (Getty, 2017) @zh-hant
definition: «Le baptisme est un courant chrétien évangélique issu d'un réveil démarré par les pasteurs anglais John Smyth en Hollande en 1609, puis Thomas Helwys en Angleterre en 1612. Ce mouvement se caractérise par l'importance donnée Ã la Bible, Ã la nouvelle naissance, au baptême adulte en tant que témoignage volontaire, un esprit missionnaire, un engagement moral de vie ainsi que par l'autonomie locale des églises, la séparation de l'Ãglise et de l'Ãtat, et finalement l'autorité de la congrégation (congrégationalisme). Selon les chiffres du Pew Research Center, en 2011, le mouvement recense 72 millions de croyants.» (DBpedia, 2017) @fr
in scheme: religion

The second sex
issued: 2011
language: eng
abstract: Newly translated and unabridged in English for the first time, Simone de Beauvoir's masterwork is a powerful analysis of the Western notion of "woman," and a groundbreaking exploration of inequality and otherness. This long-awaited new edition reinstates significant portions of the original French text that were cut in the first English translation. Vital and groundbreaking, Beauvoir's pioneering and impressive text remains as pertinent today as it was sixty years ago, and will continue to provoke and inspire generations of men and women to come. Overview: Newly translated and unabridged in English for the first time, Simone de Beauvoir's masterwork is a powerful analysis of the Western notion of "woman," and a groundbreaking exploration of inequality and otherness. This long-awaited new edition reinstates significant portions of the original French text that were cut in the first English translation. Vital and groundbreaking, Beauvoir's pioneering and impressive text remains as pertinent today as it was sixty years ago, and will continue to provoke and inspire generations of men and women to come.
isbn: 978-0-307-27778-7
type: Book

Sheila Malovany-Chevallier
first name: Sheila
last name: Malovany-Chevallier
type: Person

Vintage
type: Organization
based near: New York

Constance Borde
first name: Constance
last name: Borde
type: Person

Simone de Beauvoir
first name: Simone de
last name: Beauvoir
type: Person

Art & architecture thesaurus
issued: 1990
language: eng
abstract: First edition of the Art and Architecture Thesaurus, a project, started in 1979, of the Getty Art History Information Program. The work presents, in a faceted hierarchical structure, a standard vocabulary for the field of art and architecture. Two displays are provided: the hierarchical, which includes seven facets (associated concepts, physical attributes, styles and periods, agents, activities, materials, objects), and the alphabetical display including all terms.
isbn: 978-0-19-506403-2
uri: http://www.bcin.ca/Interface/openbcin.cgi
type: Book

Oxford University Press
type: Organization

Toni Petersen
first name: Toni
last name: Petersen
type: Person

beautician
in dataset: The CWRC Ontology
type: occupation
type: Concept
alternative label: barber
alternative label: cosmetician
alternative label: hairdresser
in scheme: occupation

beauty
in dataset: The CWRC Ontology
type: occupation
type: Concept
hidden label: pre raphaelite muse
in scheme: occupation

beggar
in dataset: The CWRC Ontology
type: occupation
type: Concept
in scheme: occupation
related: indigent

Behemenism
in dataset: The CWRC Ontology
type: religion
type: Concept
comment: The description for this term is indebted to DBpedia.
alternative label: Behmenist
definition: "Behmenism, also Behemenism and similar, is the English-language designation for a 17th-century European Christian movement based on the teachings of German mystic and theosopher Jakob Böhme (1575-1624). The term was not usually applied by followers of Böhme's theosophy to themselves, but rather was used by some opponents of Böhme's thought as a polemical term. The origins of the term date back to the German literature of the 1620s, when opponents of Böhme's thought, such as the Thuringian antinomian Esajas Stiefel, the Lutheran theologian Peter Widmann and others denounced the writings of Böhme and the Böhmisten. When his writings began to appear in England in the 1640s, Böhme's surname was irretrievably corrupted to the form "Behmen" or "Behemen", whence the term "Behmenism" developed. A follower of Böhme's theosophy is a "Behmenist"." (DBpedia, 2018)
in scheme: religion

Benedictine Order
in dataset: The CWRC Ontology
type: religion
type: Concept
comment: La description de ce terme est basée sur celle de DBPedia. @fr
comment: The description for this term is indebted to DBpedia.
label: Ordre de Saint-Benoît @fr
alternative label: Benedictine
broader transitive: Roman Catholicism
definition: "The Order of Saint Benedict (OSB; Latin: Ordo Sancti Benedicti), also known â in reference to the color of its members' habits â as the Black Monks, is a Catholic religious order of independent monastic communities that observe the Rule of Saint Benedict. Each community (monastery, priory or abbey) within the order maintains its own autonomy, while the order itself represents their mutual interests. The terms "Order of Saint Benedict" and "Benedictine Order" are, however, also used to refer to all Benedictine communities collectively, sometimes giving the incorrect impression that there exists a generalate or motherhouse with jurisdiction over them. Internationally, the order is governed by the Benedictine Confederation, a body, established in 1883 by Pope Leo XIII's Brief Summum semper, whose head is known as the Abbot Primate. Individuals whose communities are members of the order generally add the initials "OSB" after their names." (DBpedia, 2018)
definition: «Lâordre de Saint-Benoît [OSB], plus connu sous le nom dâordre des Bénédictins, est une fédération de monastères ayant, au cours de leur histoire, adopté la règle de saint Benoît. Ainsi saint Benoît de Nursie (480-547) en est-il considéré comme le fondateur (en 529). Ce n'est pas le plus ancien Ordre de l'Occident chrétien (cf. la Règle des moines de Saint-Augustin, la fondation de Ligugé par Saint Martin et de Saint-Victor de Marseille par Jean Cassien, et la laus perennis en 515 Ã lâabbaye de Saint-Maurice d'Agaune), mais c'est celui qui a connu le plus large succès ; ses membres suivent la règle de saint Benoît et appartiennent Ã la confédération bénédictine.» (DBpedia, 2018) @fr
in scheme: religion

Bengali
in dataset: The CWRC Ontology
type: ethnicity
type: Concept
comment: La description de ce terme est basée sur celle de DBPedia. @fr
comment: The description for this term is indebted to DBpedia.
label: bengali @fr
definition: "The Bengalis (à¦¬à¦¾à¦à¦¾à¦²à¦¿ Bangali), also spelled as the Bangalees, are a major Indo-Aryan ethnic group. They are native to the region of Bengal in South Asia, which is presently-divided between Bangladesh and the Indian state of West Bengal. They speak the Bengali language, the most easterly branch of the Indo-European language family. Bengalis are the third largest ethnic group in the world after the Han Chinese and the Arabs. They have four major religious subgroups, including Bengali Muslims, Bengali Hindus, Bengali Christians and Bengali Buddhists." (DBpedia, 2017)
definition: «Les Bengalis (Bengali: à¦¬à¦¾à¦à¦¾à¦²à¦¿ Bangali) sont le principal groupe ethnique de la région du Bengale partagée entre le Bangladesh et l'Inde. Les langues Bengalis sont les principales langues maternelles des Bengalis. Ils sont majoritaires au Bangladesh et dans les Ãtats du Bengale-Occidental et de Tripura d'Inde. Ils représentent quelque 150 millions d'individus au Bangladesh, 70 millions en Inde, 3 millions au Pakistan et forment d'importantes minorités d'Arabie Saoudite et des Ãmirats arabes unis. Environ 65 % des Bengalis sont Musulmans, 34 % Hindous, et moins de 1% sont de diverses confessions (dont Chrétiens). Les Bengalis Musulmans vivent principalement au Bangladesh, ou ils constituent plus de 80 % des croyants. Le reste des Bengalis, Hindous, vivent en Inde, surtout au Bengale-occidental. Au Bangladesh, entre 11 et 15% de la population Bengalie est Hindoue.» (DBpedia, 2017) @fr
in scheme: ethnicity

bengali
in dataset: The CWRC Ontology
type: national heritage
type: Concept
comment: La description de ce terme est basée sur celle de DBPedia. @fr
comment: The description for this term is indebted to DBpedia.
label: Bengale @fr
definition: "Bengal (bÉÅgÉl; Bengali: à¦¬à¦¾à¦à¦²à¦¾ and à¦¬à¦à§à¦) is a region in Asia which is located in the eastern part of the Indian subcontinent at the apex of the Bay of Bengal. Geographically, it is made up by the Ganges-Brahmaputra delta system, the largest such formation in the world; along with mountains in its north (bordering the Himalayan states) and east (bordering Northeast India and Burma). Politically, Bengal is divided between the sovereign republic of Bangladesh, which covers two-thirds of the region, and West Bengal, which is a part of the Republic of India, in the western part of the region. In 2011, the population of Bengal was estimated to be 250 million, making it the most densely populated region in South Asia. An estimated 160 million people live in Bangladesh, while 91.3 million people live in West Bengal. The predominant ethno-linguistic group are the Bengali people, who speak the Indo-Aryan Bengali language. Bengali Muslims are the majority in Bangladesh. Bengali Hindus are the majority in West Bengal. Outside Bengal proper, the Indian territories of Tripura, the Barak Valley of Assam and the Andaman and Nicobar Islands; as well as Myanmar's Rakhine State; are also home to significant communities with Bengali heritage. Dense woodlands, including hilly rainforests, cover Bengal's northern and eastern areas; while an elevated forested plateau covers its central area. In the littoral southwest are the Sunderbans, the world's largest mangrove forest and home of the Bengal tiger. In the coastal southeast lies Cox's Bazaar, the longest beach in the world at 125 km (78 mi). The Bengali calendar divides the region's climate into six seasons. Bengal has played a major role in the history of Asia. In antiquity, its kingdoms were known as seafaring nations. At times an independent regional empire, or a bastion of larger empires, the historical region was a leading power of the Indian subcontinent and the Islamic East. It had extensive trade networks. Bengali…
definition: «Le Bengale désigne aujourd'hui une zone géographique de l'est du sous-continent indien aujourd'hui partagée entre l'Inde et le Bangladesh. Le nom de Bengale n'a pas recouvert exactement la même zone au fil des siècles. Cette zone recoupe également plus ou moins l'aire de distribution de la langue bengali.» (DBpedia, 2018) @fr
in scheme: national heritage

The CWRC ontology bibliography
in dataset: The CWRC Ontology
type: Collection
label: La bibliographie de l'ontologie CWRC @fr

bibliophile
in dataset: The CWRC Ontology
type: occupation
type: Concept
in scheme: occupation

bill collector
in dataset: The CWRC Ontology
type: occupation
type: Concept
in scheme: occupation

biographical relationship
in dataset: The CWRC Ontology
range includes: Work
range includes: AdminPlaceConcept
range includes: Feature
range includes: FormalOrganization
range includes: Person
subject-centric predicate: has biographical relation to
type: ObjectProperty
sub property of: hasBody

biologist
in dataset: The CWRC Ontology
type: occupation
type: Concept
alternative label: conchologist
alternative label: entomologist
broader transitive: life scientist
in scheme: occupation

birth control
in dataset: The CWRC Ontology
type: reproductive history
type: Concept
alternative label: contraception
alternative label: family planning
definition: Related to birth control.
in scheme: reproductive history

birth control activism
in dataset: The CWRC Ontology
type: political affiliation
type: Concept
comment: The description for this term is indebted to DBpedia.
label: défense du contrôle des naissances @fr
alternative label: birth control campaigner
alternative label: birth control movement
alternative label: birth-control activist
alternative label: contraceptionist
alternative label: pro-birth control
alternative label: pro-contraception
alternative label: supporter of contraception
broader transitive: social reform
definition: Promotion of birth control awareness, practices, and resources. See: Birth control movement in the United States - Wikipedia. Also see:Category:Birth control - Wikipedia
definition: Sensibilisation sur le contrôle des naissances, Ã travers les savoirs, les pratiques et les ressources qui y sont liées. Voir Contrôle des naissances â Wikipédia @fr
in scheme: political affiliation
related: feminism
related: pro-choice
related: sexual reform

birth date
in dataset: The CWRC Ontology
subject-centric predicate: has birth date
type: ObjectProperty
domain: Person
sub property of: birth relationship

birth date of
in dataset: The CWRC Ontology
type: ObjectProperty
range: Person
inverse of: has birth date

birth place
in dataset: The CWRC Ontology
range includes: AdminPlaceConcept
range includes: Feature
subject-centric predicate: has birth place
type: ObjectProperty
domain: Person
sub property of: birth relationship
sub property of: spatial relationship

birth place of
in dataset: The CWRC Ontology
type: ObjectProperty
range: Person
inverse of: has birth place

birth position
in dataset: The CWRC Ontology
subject-centric predicate: has birth position
type: ObjectProperty
domain: Person
range: birth position
sub property of: birth relationship

birth position of
in dataset: The CWRC Ontology
type: ObjectProperty
domain: birth position
range: Person
inverse of: has birth position

birth relationship
in dataset: The CWRC Ontology
range includes: Work
range includes: AdminPlaceConcept
range includes: Feature
range includes: FormalOrganization
range includes: Person
subject-centric predicate: relates by birth to
type: ObjectProperty
sub property of: biographical relationship

bisexuality
in dataset: The CWRC Ontology
type: sexuality
type: Concept
label: bisexualité @fr
alternative label: bisexual
definition: Bisexuality indicates sexual attraction to both genders. In terms of binary understandings of sex or gender, bisexuality is often defined as being sexually attracted to "both sexes".
definition: La bisexualité réfère Ã l'attraction sexuelle pour les deux genres. En terme d'acceptation binaire du sexe ou du genre, la bisexualité est souvent définie comme attraction sexuelle pour les «deux sexes». @fr
in scheme: sexuality

black (race)
is replaced by: black
in dataset: The CWRC Ontology
comment: Deprecated in favour of instance black.
comment: Désapprouver en faveur de l'instance noir. @fr
label: noir (race) @fr
deprecated: true
term status: deprecated
alternative label: blackwoman

black anti-oppression movement
in dataset: The CWRC Ontology
type: political affiliation
type: Concept
comment: The description for this term is indebted to DBpedia.
label: mouvement contre l'oppression des Noirs @fr
alternative label: anti-segregationist
alternative label: black activist
alternative label: black liberation
alternative label: black liberationist
alternative label: black power
alternative label: black pride
broader transitive: civil rights movement
broader transitive: racial equality
definition: Opposition to the social, institutional, and political oppression of people defined as black, which varies historically and geographically. See Racism in the United Kingdom - Wikipedia and Civil rights movement - Wikipedia
definition: Opposition Ã l'oppression sociale, institutionnelle et politique des personnes identifiées comme noires, qui diffère selon le contexte historique et géographique. Voir Racisme en France â Wikipédia et Mouvement afro-américain des droits civiques â Wikipédia @fr
in scheme: political affiliation
related: abolitionism

black
in dataset: The CWRC Ontology
represented by: black identity
type: ethnicity
type: Concept
comment: La description de ce terme est basée sur celle de DBPedia. @fr
comment: The description for this term is indebted to DBpedia.
label: noir @fr
definition: "Black people (seen both capitalized and with lowercase 'b') is a term used in certain countries, often in socially based systems of racial classification or of ethnicity, to describe persons who are perceived to be dark-skinned compared to other given populations. As such, the meaning of the expression varies widely both between and within societies, and depends significantly on context. For many other individuals, communities and countries, "black" is also perceived as a derogatory, outdated, reductive or otherwise unrepresentative label, and as a result is neither used nor defined. Different societies apply differing criteria regarding who is classified as "black", and these social constructs have also changed over time. In a number of countries, societal variables affect classification as much as skin color, and the social criteria for "blackness" vary. For example, in North America the term black people is not necessarily an indicator of skin color or ethnic origin, but is instead a socially based racial classification related to being African American, with a family history associated with institutionalized slavery. In South Africa and Latin America, mixed-race people are generally not classified as "black". In other regions such as Australasia, settlers applied the term "black" or it was used by local populations with different histories and ancestral backgrounds." (DBpedia, 2017)
definition: «La catégorie Noir(e) est généralement employée en français pour distinguer un être humain ayant la peau foncée. S'il désigne souvent des êtres humains originaires d'Afrique subsaharienne, ce terme peut être utilisé pour qualifier des personnes asiatiques (Papous...) ou océaniennes (Aborigènesâ¦). Les études scientifiques, fondées depuis le milieu du xxe siècle sur la génétique, ont affirmé que le concept de race n'est pas pertinent pour caractériser les différents sous-groupes géographiques de l'espèce humaine car la variabilité génétique entre individus d'un même sous-groupe est plus importante que la variabilité génétique moyenne entre sous-groupes géographiques. Le consensus scientifique actuel rejette en tout état de cause la présence d'arguments biologiques pour légitimer la notion de race, reléguée Ã une représentation arbitraire selon des critères morphologiques, ethnico-sociaux, culturels ou politiques, comme les identités. D'un point de vue biologique la peau foncée est un épiderme qui comporte un fort taux de mélanine, c'est donc une adaptation génétique issue de la sélection naturelle permettant une protection face aux radiations UV dans les milieux fortement ensoleillés. Ces milieux sont moins soumis au risque de carence en vitamine D Ã l'inverse des pays faiblement ensoleillés dans lesquels les individus ont la peau claire.» (DBpedia, 2017) @fr
in scheme: ethnicity
related: African-American
related: African

black identity
in dataset: The CWRC Ontology
represents: black
type: textual label
type: Concept
label: identité noir @fr
definition: A subclass of textual label, this discursive label reflects the ambiguity of blackness associated with different cultural forms. It provides a means of aggregating and searching multiple instances of "Black" (e.g. black, black) cultural identities.
definition: Une sous-classe d'étiquettes textuelles, cette étiquette discursive reflète l'ambiguité de la noirceur de peau en tant que charactérique physique associée Ã diverses formes culturelles. Elle permet de compiler et de rechercher les multiples instances d'identités culturelles «noires» (par exemple noir, noir). @fr
in scheme: textual label

Black nationalism
in dataset: The CWRC Ontology
type: political affiliation
type: Concept
comment: La description de ce terme est basée sur celle de DBPedia. @fr
comment: The description for this term is indebted to DBpedia.
label: nationalisme Noir @fr
definition: "Black nationalism (BN) advocates a racial definition (or redefinition) of national identity. There are different indigenous nationalist philosophies but the principles of all Black nationalist ideologies are unity and self-determinationâthat is, separation, or independence, from European society." (DBpedia, 2018)
definition: «Le nationalisme noir, souvent désigné sous le terme anglais Black nationalism, est un terme générique regroupant une série d'idéologies affirmant l'unité fondamentale des populations africaines ou d'origine africaine. Le « nationalisme noir » ne doit pas être confondu avec des idéologies ou attitudes nationalistes spécifiques Ã certains groupe de population, qui affirment au contraire leur spécificité par rapport Ã l'ensemble des autres populations noires. Il a trouvé ses expressions dominantes en Afrique et dans les deux Amériques, et notamment aux Ãtats-Unis, où son histoire se confond avec celle de l'UNIA de Marcus Garvey et du Black Panther Party. Dans les années 1970, le Black feminism qui mêlait revendications féministes et Black nationalism a fait son apparition, bouleversant la scène du féminisme américain. En Afrique du Sud, il regroupe des mouvements proches du Black Consciousness Movement, tel que l'AZAPO, un parti politique fondé en 1978. Le nationalisme noir est né du sentiment d'un destin commun difficile, ici du fait de l'esclavage des noirs et de la colonisation européenne. Il se distingue largement des formes classiques de nationalisme qui militent pour la création ou la défense d'un Ãtat-nation : le nationalisme noir, mouvement hétérogène, peut prôner par exemple le séparatisme (ainsi le Black Panther Party aux Ãtats-Unis) ou, au contraire, le panafricanisme, c'est-Ã -dire l'union des Africains dans un même ensemble politique, projet plus proche du panaméricanisme.» (DBpedia, 2018) @fr
in scheme: political affiliation

black
in dataset: The CWRC Ontology
represented by: black identity
type: race or colour
type: Concept
comment: La description de ce terme est basée sur celle de DBPedia. @fr
comment: The description for this term is indebted to DBpedia.
label: noir @fr
alternative label: blackwoman
definition: "Black people (seen both capitalized and with lowercase 'b') is a term used in certain countries, often in socially based systems of racial classification or of ethnicity, to describe persons who are perceived to be dark-skinned compared to other given populations. As such, the meaning of the expression varies widely both between and within societies, and depends significantly on context. For many other individuals, communities and countries, 'black' is also perceived as a derogatory, outdated, reductive or otherwise unrepresentative label, and as a result is neither used nor defined. Different societies apply different criteria regarding who is classified as 'black', and these social constructs have also changed over time. In a number of countries, societal variables affect classification as much as skin color, and the social criteria for 'blackness' vary. For example, in North America the term black people is not necessarily an indicator of skin color or ethnic origin, but is instead a socially based racial classification related to being African American, with a family history associated with institutionalized slavery. In South Africa and Latin America, mixed-race people are generally not classified as 'black'. In other regions such as Australasia, settlers applied the term 'black' or it was used by local populations with different histories and ancestral backgrounds." (DBpedia, 2017)
definition: «La catégorie Noir(e) est généralement employée en français pour distinguer un être humain ayant la peau foncée. S'il désigne souvent des êtres humains originaires d'Afrique subsaharienne, ce terme peut être utilisé pour qualifier des personnes asiatiques (Papous...) ou océaniennes (Aborigènes...). Les études scientifiques, fondées depuis le milieu du xxe siècle sur la génétique, ont affirmé que le concept de race n'est pas pertinent pour caractériser les différents sous-groupes géographiques de l'espèce humaine car la variabilité génétique entre individus d'un même sous-groupe est plus importante que la variabilité génétique moyenne entre sous-groupes géographiques. Le consensus scientifique actuel rejette en tout état de cause la présence d'arguments biologiques pour légitimer la notion de race, reléguée Ã une représentation arbitraire selon des critères morphologiques, ethnico-sociaux, culturels ou politiques, comme les identités. D'un point de vue biologique la peau foncée est un épiderme qui comporte un fort taux de mélanine, c'est donc une adaptation génétique issue de la sélection naturelle permettant une protection face aux radiations UV dans les milieux fortement ensoleillés. Ces milieux sont moins soumis au risque de carence en vitamine D Ã l'inverse des pays faiblement ensoleillés dans lesquels les individus ont la peau claire.» (DBpedia, 2017) @fr
in scheme: race or colour

blackwoman
in dataset: The CWRC Ontology
type: gender
type: race or colour
type: Concept
label: femme noire @fr
definition: An intersectional identity that co-occurs with but is not reducible to the combination of "has gender identity woman" and "has race or colour identity black". See Black women - Wikipedia and (Kimberlé Crenshaw, 1989).
definition: Une identité intersectionnelle qui résulte de la combinaison de "a le genre femme" et de "a une identité de race ou de couleur noire". Voir Afroféminisme â Wikipédia et (Kimberlé Crenshaw, 1989). @fr
in scheme: race or colour

blacksmith
in dataset: The CWRC Ontology
type: occupation
type: Concept
broader transitive: skilled trade
in scheme: occupation

blood relative of
in dataset: The CWRC Ontology
type: DeprecatedProperty
comment: Deprecated, with no current equivalence, in favour of definition of family relationships as more fluid and expansive than blood relations.
comment: Désapprouver sans équivalence. @fr
label: liens de sang @fr
sub property of: relative of
deprecated: true
term status: deprecated

board member
in dataset: The CWRC Ontology
type: occupation
type: Concept
in scheme: occupation

boarding house keeper
in dataset: The CWRC Ontology
type: occupation
type: Concept
alternative label: boarding house manager
broader transitive: housekeeper
hidden label: established boarding houses
in scheme: occupation

Bohemianism
in dataset: The CWRC Ontology
type: social class
type: Concept
label: Bohème @fr
alternative label: alternative society of young artists, dropouts, and nonconformists
alternative label: bohemian with upper-class connections
alternative label: classlessness
definition: "Bohemianism is the practice of an unconventional lifestyle, often in the company of like-minded people, with few permanent ties, involving musical, artistic, or literary pursuits. In this context, Bohemians may be wanderers, adventurers, or vagabonds. This use of the word bohemian first appeared in the English language in the nineteenth century to describe the non-traditional lifestyles of marginalized and impoverished artists, writers, journalists, musicians, and actors in major European cities." (DBpedia, 2018)
definition: «La bohème est une façon de vivre au jour le jour dans la pauvreté mais aussi dans lâinsouciance. Elle correspond Ã un mouvement littéraire et artistique du XIXe siècle, en marge du mouvement romantique plus « aristocratique ». Câest Ã la fois un style de vie qui rejette la domination bourgeoise et sa rationalité dans le cadre de la société industrielle, et la recherche dâun idéal artistique. Si lâexpression avait connu un certain déclin Ã partir des Trente Glorieuses et des années 1960, période de la normalisation technocratique de Paris, lâexpression « bourgeois bohème », ou « bobo », lui donne un certain regain. Le concept sâappuie évidemment sur la métaphore des « peuples bohémiens » ou des tziganes, qui étaient associés, au XIXe siècle, au mouvement romantique.» (DBpedia, 2018) @fr
in scheme: social class

Bolshevism
in dataset: The CWRC Ontology
type: political affiliation
type: Concept
comment: La description de ce terme est basée sur celle de DBPedia. @fr
comment: The description for this term is indebted to DBpedia.
label: Bolcheviks @fr
alternative label: Bolshevist
alternative label: pro-bolshevik
definition: "The Bolsheviks, originally also Bolshevists or Bolsheviki (Russian: Ð±Ð¾Ð»ÑÑÐµÐ²Ð¸ÐºÐ¸, Ð±Ð¾Ð»ÑÑÐµÐ²Ð¸Ðº (singular); IPA: [bÉlÊ²ÊÉ¨ËvÊ²ik]; derived from Ð±Ð¾Ð»ÑÑÐ¸Ð½ÑÑÐ²Ð¾ bol'shinstvo, "majority", literally meaning "one of the majority") were a faction of the Marxist Russian Social Democratic Labour Party (RSDLP) which split apart from the Menshevik faction at the Second Party Congress in 1903. The RSDLP was a revolutionary socialist political party formed in 1898 in Minsk to unite the various revolutionary organisations of the Russian Empire into one party. In the Second Party Congress vote, the Bolsheviks won on the majority of important issues, hence their name. They ultimately became the Communist Party of the Soviet Union. The Bolsheviks or Reds came to power in Russia during the October Revolution phase of the Russian Revolution of 1917, and founded the Russian Soviet Federative Socialist Republic (RSFSR). With the Reds defeating the Whites, and others during the Russian Civil War of 1917â1922, the RSFSR became the chief constituent of the Soviet Union in December 1922. The Bolsheviks, founded by Vladimir Lenin and Alexander Bogdanov, were by 1905 a major organisation consisting primarily of workers under a democratic internal hierarchy governed by the principle of democratic centralism, who considered themselves the leaders of the revolutionary working class of Russia. Their beliefs and practices were often referred to as Bolshevism." (DBpedia, 2017)
definition: «Les bolcheviks, bolcheviques ou bolchéviques sont les membres d'une fraction du Parti ouvrier social-démocrate de Russie, créée en 1903 sous la direction de Lénine, devenue un parti indépendant en 1912. Après la révolution russe de février 1917, les bolcheviks prennent le pouvoir au nom des soviets en octobre 1917 dans le cadre de la République socialiste fédérative soviétique de Russie. En 1918, le Parti bolchévique est renommé Parti communiste. Après la mise en place de l'URSS (1922), il devient le Parti communiste de l'Union soviétique (PCUS), ajoutant jusqu'en 1952 Ã ce nom l'adjectif bolchevik (placé entre parenthèses).» (DBpedia, 2017) @fr
in scheme: political affiliation
related: communism

Bonapartism
in dataset: The CWRC Ontology
type: political affiliation
type: Concept
comment: La description de ce terme est basée sur celle de DBPedia. @fr
comment: The description for this term is indebted to DBpedia.
label: Bonapartisme @fr
alternative label: pro-bonapartist
definition: "Bonapartism is the political ideology of Napoleon Bonaparte and his followers and successors. It was later used to refer to persons who hoped to restore the House of Bonaparte and its style of government. After Napoleon, the term was applied to the French politicians who seized power in the coup of 18 Brumaire, ruling in the French Consulate and subsequently in the First and Second French Empires under the House of Bonaparte (the family of Bonaparte and his nephew Louis). The term was used more generally for a political movement that advocated a dictatorship or authoritarian centralized state, with a strongman charismatic leader based on anti-elitist rhetoric, army support, and conservatism. Marxism and Leninism developed a vocabulary of political terms that included Bonapartism, derived from their analysis of the career of Napoleon Bonaparte. Karl Marx was a student of Jacobinism and the French Revolution, and was a contemporary critic of the Second Republic and Second Empire. He used "Bonapartism" to refer to a situation in which counter-revolutionary military officers seize power from revolutionaries, and use selective reforms to co-opt the radicalism of the popular classes. Marx argued that in the process, Bonapartists preserve and mask the power of a narrower ruling class. According to his essay "The Eighteenth Brumaire of Louis Napoleon" (1852), Marx believed that both Bonaparte and his nephew Napoleon III had corrupted revolutions in France in this way. In this document, he drew attention to what he calls the phenomenon's repetitive history by saying: "History repeats itself, first as tragedy, then as farce." More generally, "Bonapartism" may be used to describe the replacement of civilian leadership by military leadership within revolutionary movements or governments. Many modern-day Trotskyists and other leftists use the phrase "left Bonapartist" to describe those, such as Stalin and Mao, who controlled 20th-century bureaucratic socialist regimes. In addit…
definition: Le bonapartisme est une famille de pensée politique française, qui s'inspire de l'action de l'empereur Napoléon Ier. Le terme a deux acceptions : * au sens strict, le bonapartisme vise Ã établir un régime républicain impérial en France Ã la tête duquel serait placé un membre de la famille de Napoléon Bonaparte ; * au sens large, le" bonapartisme vise Ã établir un Ãtat national Ã exécutif fort et centralisé mais d'essence républicaine et assis sur la consultation régulière du peuple par le biais de plébiscites. Le bonapartisme n'implique donc pas forcément l'adhésion Ã un système d'organisation politique héréditaire mais peut au contraire s'accommoder d'une forme républicaine de gouvernement. Il repose sur la fusion des élites et l'adhésion populaire. Ces deux facettes peuvent être distinctes ou confondues, selon les personnes et périodes." (DBpedia, 2017) @fr
in scheme: political affiliation

book production
in dataset: The CWRC Ontology
type: occupation
type: Concept
broader transitive: publishing
in scheme: occupation

bookbinder
in dataset: The CWRC Ontology
type: occupation
type: Concept
alternative label: book binder
alternative label: bookbinding
broader transitive: book production
in scheme: occupation

bookclub participation
in dataset: The CWRC Ontology
type: occupation
type: Concept
alternative label: book club founder
alternative label: book club organizer
alternative label: book society member
alternative label: bookclub president
broader transitive: literary group participant
hidden label: member of the new english art club
in scheme: occupation

botanist
in dataset: The CWRC Ontology
type: occupation
type: Concept
alternative label: assistant botanist
alternative label: botany
alternative label: botany enthusiast
broader transitive: biologist
in scheme: occupation

boulangism
in dataset: The CWRC Ontology
type: political affiliation
type: Concept
comment: The description for this term is indebted to DBpedia.
label: Boulangisme @fr
alternative label: boulangist
definition: Followed the three principles of "revenge on Germany", "revision of the constitution", and "the return to monarchy" in frustration with French conservatism. Based on the politics of Georges Ernest Boulanger. See: Georges Ernest Boulanger - Wikipedia
definition: Mouvement politique suivant trois principes qui sont la revenge contre l'Allemagne, la révision de la constitution et le retour Ã la monarchie, en réponse Ã la frustration provoquée par le régime conservateur français. S'appuie sur les idées politiques du général Georges Ernest Boulanger. Voir Boulangisme â Wikipédia @fr
in scheme: political affiliation

Brahmin
in dataset: The CWRC Ontology
type: social class
type: Concept
label: Brahmane @fr
definition: "Brahmin is a varna (class) in Hinduism specialising as priests, teachers (acharya) and protectors of sacred learning across generations. Brahmins were traditionally responsible for religious rituals in temples, as intermediaries between temple deities and devotees, as well as rite of passage rituals such as solemnising a wedding with hymns and prayers. However, Indian texts suggest that Brahmins were often agriculturalists and warriors in ancient and medieval India." (DBpedia, 2018)
definition: «Un brahmane (sanskrit : brÄhmaá¹a ; devanagari : à¤¬à¥à¤°à¤¾à¤¹à¥à¤®à¤£ ; lié au sacré) est un membre d'une des quatre castes en Inde (vará¹a), regroupant notamment les prêtres, les sacrificateurs, les professeurs et les hommes de loi â ou plus largement les enseignants du Brahman comme l'indique clairement le titre de « brâhmane ». Le brahmane a pour devoir principal d'incarner le dharma, de le défendre, et de le faire respecter par les autres castes sacrées, afin de maintenir le bon ordre cosmique. La caste des brahmanes représente environ 6 % de la population de l'Inde. La vie du brahmane se divise en quatre stades (ashrama). Lors de son enfance, il reçoit une initiation (upanayana) qui représente une deuxième naissance, il devient alors dvija, « deux fois né ». Il n'y a jamais eu de tentation politique pour les brahmanes . Plus généralement, un brahmane est un homme de lettres disposant de connaissances importantes sur le monde ; il peut ainsi être appelé Pandit, qui est le titre le plus glorieux que peut avoir un brahmane du fait de sa large connaissance philosophique, scientifique ou artistique.» (DBpedia, 2018) @fr
in scheme: social class

brewer
in dataset: The CWRC Ontology
type: occupation
type: Concept
alternative label: brewers
broader transitive: skilled trade
in scheme: occupation

British
in dataset: The CWRC Ontology
type: national identity
type: Concept
label: Brittaniques @fr
definition: Indicates a subject's identification with or labelling as British as a national identity. See British people - Wikipedia.
definition: «Les Britanniques, également appelés en anglais les Britons (en français, les Bretons insulaires), familièrement les Brits, et de manière archaïque les Britishers, se définissent comme les citoyens ou les natifs du Royaume-Uni, des dépendances de la Couronne et des territoires britanniques dâOutre-mer, ainsi que leurs descendants». Britanniques â Wikipédia(DBpedia, 2018) @fr
in scheme: national identity

British nationalism
in dataset: The CWRC Ontology
type: political affiliation
type: Concept
comment: The description for this term is indebted to DBpedia.
label: nationalisme anglais @fr
alternative label: british nationalist
alternative label: pro-British
broader transitive: nationalism
definition: "British nationalism asserts that the British are a nation and promotes the cultural unity of the British, in a definition of Britishness that may include people of English, Scottish, Welsh, Ulster, Scots and Irish descent. British nationalism is closely associated with British unionism, which seeks to uphold the political union that is the United Kingdom, or strengthen the links between the countries of the United Kingdom. British nationalism's unifying identity descends from the ancient Britons who dwelt on the island of Great Britain. British nationalism grew to include people outside Great Britain, in Ireland, because of the 1542 Crown of Ireland Act, which declared that the crown of Ireland was to be held by the ruling monarch of England as well as Anglo-Irish calls for unity with Britain. It is characterised as a "powerful but ambivalent force in British politics". In its moderate form, British nationalism has been a civic nationalism, emphasising both cohesion and diversity of the people of the United Kingdom, its dependencies, and its former colonies. Recently however, nativist nationalism has arisen based on fear of Britain being swamped by immigrants; this anti-immigrant nativist nationalism has manifested politically in the British National Party and other nativist nationalist movements. Politicians, such as British Prime Minister David Cameron of the Conservative Party and his direct predecessor Gordon Brown of the Labour Party, have sought to promote British nationalism as a progressive cause." (DBpedia, 2017)
in scheme: political affiliation

broadcaster
in dataset: The CWRC Ontology
type: occupation
type: Concept
alternative label: broadcasting
in scheme: occupation

brother
in dataset: The CWRC Ontology
subject-centric predicate: has brother
type: ObjectProperty
range: Person
sub property of: sibling

brother of
in dataset: The CWRC Ontology
type: ObjectProperty
domain: Person
label: frère de @fr
range: Person
sub property of: sibling of
inverse of: has brother
broader: sibling

Buddhism
in dataset: The CWRC Ontology
type: religion
type: Concept
comment: La description de ce terme est basée sur celle de DBPedia. @fr
comment: The description for this term is indebted to the Getty Art & Architecture Thesaurus.
label: Boeddhisme @nl
label: Bouddhisme @fr
label: Budismo @es
label: fo chiao @zh-latn
label: fo jiao @zh-latn
label: fó jià o @zh-latn
label: ä½æ @zh-hant
alternative label: Buddhist
definition: "Refers to the philosophy and religion based on the enlightenment and teachings of the Buddha Gautama in the early sixth century BCE in the northeastern region of modern India. Playing dominant roles in the art and culture of Southeast Asia and East Asia, this religion is based on the transcendence of human suffering and pain through the acceptance of the limitations of individuality, the surrender of worldly desires and cravings that cause disappointment and sorrow, and the deliverance from the impermanence of living and individual ego based on wealth, social position, or family through the process of enlightenment (nirvana). The religion also centers around 'anatman', or no-self, the idea that the self is in a state of action or a series of changing manifestations rather than in a state of fixed, metaphysical substance. The structure of the religion is based on the Triratna ("Three Jewels" of Buddha), a tripartite schematic for living based on three elements: Buddha (the teacher), dharma (the teaching), and sangha (community)." (Getty, 2017)
definition: "Se refiere a la filosofía y religión basada en la iluminación y enseñanza del Buddha Gautama en el siglo VI a.C temprano en la región nordeste de la India Moderna. Jugando un rol dominante en el arte y la cultura del Asia Sudeste y Asia Oriental, esta religión está basada en la trascendencia del sufrimiento y dolor humano a través de la aceptación de las limitaciones de individualidad, la rendición de deseos mundanos y anhelos que causan desilusión y aflicción y la liberación desde la transitoriedad of living and individual ego based on wealth, social position, or family through the process of enlightenment (nirvana). The religion also centers around anatman, or no-self, the idea that the self is in a state of action or a series of changing manifestations rather than in a state of fixed, metaphysical substance. The structure of the religion is based on the Triratna ("Three Jewels" of Buddha), a tripartite schematic for living based on three elements: Buddha (the teacher), dharma (the teaching), and sangha (community)." (Getty, 2017) @es
definition: "Verwijst naar de filosofie en religie die zijn gebaseerd op de verlichting en leer van Boeddha Gautama in de vroege 6de eeuw v. Chr. in het Noord-Oosten van het moderne India. Deze religie, die een dominante rol speelt in de kunst en cultuur van Zuidoost-Azië en Oost-Azië, is gebaseerd op het overstijgen van menselijk lijden en pijn door het accepteren van de grenzen van de individualiteit, het opgeven van wereldse verlangens en wensen die voor teleurstellingen en verdriet zorgen en het loslaten van het niet-permanente van het leven en het afzonderlijke ego met de bijbehorende welvaart, sociale positie of familierelaties, allemaal door het proces van de verlichting (nirvana). Bij deze religie staat ook 'anatman' centraal, het idee dat 'het zelf' altijd in ontwikkeling is of deel uitmaakt van een reeks veranderende verschijningsvormen in plaats van een vaste, metafysische substantie. De structuur van de religie is gebaseerd op de Triratna ('drie juwelen' van boeddha), een drieledige structuur voor het leven gebaseerd op drie elementen: boeddha (de leraar), dharma (de leer) en sangha (de gemeenschap)." (Getty, 2017) @nl
definition: "æ ¹æéè¿¦çå°¼ä½ä¹éæèæèª¨çå²å­¸åå®æï¼å¨è¥¿å åå ­ä¸ç´åèµ·æºæ¼ç¾ä»å°åº¦æ±åé¨ãä½ææ¼æ±åäºåæ±äºçèè¡èæåå±¤é¢æ®æ¼ä¸»è¦è§è²ï¼ç¸ä¿¡ééæ¥åèªèº«çå±éï¼ä»¥åæ¾æ£æå¼èµ·å¤±æèæ²å·çä¸ä¿æ¬²æ±åæ¸´æï¼è½å¤ ä½¿äººé¡çè¦çå¾ä»¥æè¯ï¼èå¨éæï¼æ¶ ç¤ï¼éç¨ä¸­å¾ä»¥å¾ç­æ«ççå½ä»¥åå»ºç¯å¨è²¡å¯ãç¤¾æå°ä½èå®¶åº­ä¸çåäººèªå°ä¸­ç²å¾è§£è«ãæ­¤å®æçä¸­å¿ææ³çºãç¡æãï¼èªçºèªææ¯èæ¼æ´»åçæ ææ¯ä¸é£ä¸²çå½¢å¼æ¹è®ï¼èéåºå®çå½¢ä¸å¯¦é«çæ ãä½æçæ¶æ§å¥ åºæ¼ãä¸å¯¶ãï¼å³çå½ä¸å ç´ ï¼ä½(èå¸«)ãæ³(è¦ç¯)ãå§(ç¾)ã" (Getty, 2017) @zh-hant
definition: «Le bouddhisme est, selon les points de vue en Occident, une religion (notamment une religion d'Ãtat) ou une philosophie, voire les deux, dont les origines remontent en Inde au Ve siècleav. J.-C. Ã la suite de l'éveil de Siddhartha Gautama et de son enseignement. Le bouddhisme comptait en 2005 entre 230 millions et 500 millions d'adeptes, ce qui en fait la quatrième religion mondiale, derrière (dans l'ordre décroissant) le christianisme, l'islam, et l'hindouisme. Le bouddhisme présente un ensemble ramifié de pratiques méditatives, de pratiques éthiques, de théories psychologiques, philosophiques, cosmogoniques et cosmologiques, abordées dans la perspective de la bodhi, «l'éveil». Ã l'instar du jaïnisme, le bouddhisme est Ã l'origine une tradition shramana, et non brahmanique comme l'est l'hindouisme. Les notions de dieu et de divinité dans le bouddhisme sont particulières : bien que le bouddhisme soit souvent perçu comme une religion sans dieu créateur, la notion étant absente de la plupart des formes du bouddhisme, la vénération et le culte du Bouddha historique Siddhartha Gautama en tant que bhagavat joue un rôle important dans le TheravÄda et également dans le MahÄyÄna, dans lesquels il est un être éveillé ayant trois aspects ou manifestations (trikÄya).» (DBpedia, 2017) @fr
in scheme: religion

bullion carrier
in dataset: The CWRC Ontology
type: occupation
type: Concept
in scheme: occupation

burial place
in dataset: The CWRC Ontology
range includes: AdminPlaceConcept
range includes: Feature
subject-centric predicate: has burial place
type: ObjectProperty
sub property of: death relationship
sub property of: spatial relationship

burial place of
in dataset: The CWRC Ontology
type: ObjectProperty
range: Person
inverse of: has burial place

bursar
in dataset: The CWRC Ontology
type: occupation
type: Concept
in scheme: occupation

Bushido
in dataset: The CWRC Ontology
type: religion
type: Concept
comment: La description de ce terme est basée sur celle de DBPedia. @fr
comment: The description for this term is indebted to DBpedia.
definition: "Bushido (æ­¦å£«é, "the way of the warrior") is a Japanese term for the samurai way of life, loosely analogous to the concept of chivalry in Europe. Just like the knights of Europe, the samurai had a code to live by that was also based in a moral way of life. The "way" itself originates from the samurai moral values, most commonly stressing some combination of frugality, loyalty, martial arts mastery, and honor until death. Born from Neo-Confucianism during times of peace in Tokugawa Japan and following Confucian texts, Bushido was also influenced by Shinto and Zen Buddhism, allowing the violent existence of the samurai to be tempered by wisdom and serenity. BushidÅ developed between the 16th and 20th centuries, debated by pundits who believed they were building on a legacy dating back to the 10th century, although some scholars have noted that the term bushidÅ itself is "rarely attested in premodern literature". Under the Tokugawa Shogunate, some aspects of warrior values became formalized into Japanese feudal law. The word was first used in Japan during the 17th century in KÅyÅ Gunkan. It came into common usage in Japan and the West after the 1899 publication of Nitobe InazÅ's Bushido: The Soul of Japan. In Bushido (1899), Nitobe wrote: [â¦] BushidÅ, then, is the code of moral principles which the samurai were required or instructed to observe [â¦] More frequently it is a code unuttered and unwritten [â¦] It was an organic growth of decades and centuries of military career. In order to become a samurai this code has to be mastered. Nitobe was not the first to document Japanese chivalry in this way. In Feudal and Modern Japan (1896), historian Arthur May Knapp wrote: "The samurai of thirty years ago had behind him a thousand years of training in the law of honor, obedience, duty, and self-sacrifice.... It was not needed to create or establish them. As a child he had but to be instructed, as indeed he was from his earliest years, in the etiquette of self-immolation.…
definition: «Le bushido est le code des principes moraux que les samouraïs japonais étaient tenus d'observer.» (DBpedia, 2018) @fr
in scheme: religion

business
in dataset: The CWRC Ontology
type: occupation
type: Concept
alternative label: business agent
alternative label: business assistant
alternative label: business entrepreneur
alternative label: business manager
alternative label: businessman
alternative label: businesswoman
alternative label: company president
alternative label: entrepeneur
alternative label: entrepreneur
alternative label: family business
alternative label: industrialist
alternative label: industrialists
alternative label: market research
alternative label: marketing
alternative label: small businessman
hidden label: industrialist/manager
hidden label: market researcher
hidden label: small entrepreneur
in scheme: occupation

business owner
in dataset: The CWRC Ontology
type: occupation
type: Concept
alternative label: bar owner
alternative label: barbershop owner
alternative label: coffee shop owner
alternative label: colliery owner
alternative label: factory owner
alternative label: magazine proprietor
alternative label: mill owner
alternative label: mine owner
alternative label: music shop owner
alternative label: newspaper magnate
alternative label: newspaper proprietor
alternative label: owner of food outlet
alternative label: proprietor
alternative label: sex shop owner
alternative label: shop owner
alternative label: store owner
broader transitive: business
hidden label: mail order business
hidden label: news agency proprietor
hidden label: pottery magnate
in scheme: occupation

butcher
in dataset: The CWRC Ontology
type: occupation
type: Concept
alternative label: slaughterman
hidden label: shochet or ritual butcher
in scheme: occupation

DBpedia
language: eng
uri: http://sparql.cwrc.ca/ontologies/dbpedia.org
type: Document

Representing race and ethnicity in american fiction, 1789- 1964.
type: Article

http://sparql.cwrc.ca/ontologies/cwrc#c3a52178-f054-494c-9afd-7421ddcb384a-partof
date: October 2016
type: Proceedings

DBpedia
issued: 2018
language: eng
uri: https://wiki.dbpedia.org/
type: Document

The Second Sex
issued: 1973
language: eng
type: Book

Vintage Books
type: Organization
based near: New York

Frigidity
language: eng
type: Chapter

Sex and Society, Volume 1
issued: 2010
type: Document

Marshall Cavendish
type: Organization

The Intermediate Sex: A Study of Some Transitional Types of Men and Women
issued: 1908
type: Book

Swan Sonnenschein and Company
type: Organization
based near: London, UK

Edward Carpenter
first name: Edward
last name: Carpenter
type: Person

calligraphy
in dataset: The CWRC Ontology
type: occupation
type: Concept
alternative label: calligrapher
alternative label: calligraphist
in scheme: occupation

Calvinism
in dataset: The CWRC Ontology
type: religion
type: Concept
comment: La description de ce terme est basée sur celle de DBPedia. @fr
comment: The description for this term is indebted to DBpedia.
label: calvinisme @fr
alternative label: Reformed
definition: "Calvinism (also called the Reformed tradition, Reformed Christianity, Reformed Protestantism or the Reformed faith) is a major branch of Protestantism that follows the theological tradition and forms of Christian practice of John Calvin and other Reformation-era theologians. Calvinists broke with the Roman Catholic Church but differed from Lutherans on the real presence of Christ in the Eucharist, theories of worship, and the use of God's law for believers, among other things. The term Calvinism can be misleading, because the religious tradition it denotes is and has always been diverse, with a wide range of influences rather than a single founder. The movement was first called Calvinism by Lutherans who opposed it, and many within the tradition would prefer to use the word Reformed. Early influential Reformed theologians include Ulrich Zwingli, John Calvin, Martin Bucer, William Farel, Heinrich Bullinger, Peter Martyr Vermigli, Theodore Beza, and John Knox. In the twentieth century Abraham Kuyper, Herman Bavinck, B. B. Warfield, Karl Barth, Martyn Lloyd-Jones, Cornelius Van Til, and Gordon Clark were influential, while contemporary Reformed theologians include J. I. Packer, R. C. Sproul, Timothy J. Keller, John Piper, and Michael Horton. Reformed churches may exercise several forms of ecclesiastical polity, but most are presbyterian or congregationalist with some being episcopalian. Calvinism is largely represented by Continental Reformed, Presbyterian, and Congregationalist traditions. The biggest Reformed association is the World Communion of Reformed Churches with more than 80 million members in 211 member denominations around the world. There are more conservative Reformed federations like the World Reformed Fellowship and the International Conference of Reformed Churches, as well as independent churches." (DBpedia, 2018)
definition: «Le calvinisme (nommé ainsi d'après Jean Calvin et aussi appelé la tradition réformée, la foi réformée ou la théologie réformée) est une doctrine théologique protestante et une approche de la vie chrétienne qui reposent sur le principe de la souveraineté de Dieu en toutes choses. Bien quâelle fût développée par plusieurs théologiens tels que Martin Bucer, Heinrich Bullinger, Pierre Martyr Vermigli, Ulrich Zwingli et Théodore de Bèze, elle porte le nom du réformateur français Jean Calvin en raison de lâinfluence dominante quâil eut sur elle et du rôle déterminant quâil exerça dans les débats confessionnels et ecclésiastiques du XVIe siècle. Aujourdâhui ce terme fait référence aux doctrines et aux pratiques des Ãglises réformées. Plus rarement, il désigne lâenseignement de Calvin lui-même. Le calvinisme est aussi connu pour les doctrines de la prédestination et de la corruption totale.» (DBpedia, 2018) @fr
in scheme: religion

Camisards
in dataset: The CWRC Ontology
type: religion
type: Concept
comment: La description de ce terme est basée sur celle de DBPedia. @fr
comment: The description for this term is indebted to DBpedia.
label: Camisard @fr
alternative label: French Prophets
broader transitive: Huguenot
definition: "Camisards were Huguenots (French Protestants) of the rugged and isolated Cévennes region, and the Vaunage in southern France. They raised an insurrection against the persecutions which followed the Revocation of the Edict of Nantes in 1685, which had made being Protestant illegal. The Camisards operated throughout the mainly protestant Cévennes region which in the eighteenth century also included the Vaunage and the parts of the Camargue around Aigues Mortes. The revolt by the Camisards broke out in 1702, with the worst of the fighting continuing until 1704, then scattered fighting until 1710 and a final peace by 1715. The Edict of Tolerance was not finally signed until 1787." (DBpedia, 2018)
definition: «Les Camisards étaient des protestants français (huguenots) de la région des Cévennes, en France, qui ont mené une insurrection contre les persécutions qui ont suivi la Révocation de l'Ãdit de Nantes en 1685. De 1685 Ã 1700, le petit peuple protestant est lentement passé de la résignation Ã la révolte, et tous ses pasteurs ayant été exécutés ou mis en fuite, il se retrouve sans leaders. La place des pasteurs est alors prise par des "inspirés", prophètes sans formation qui appellent parfois ouvertement Ã la révolte violente. La Guerre des Cévennes éclate en 1702, avec les affrontements de plus en plus importants jusqu'en 1704, puis une lutte moindre jusqu'en 1710 avant une paix définitive en 1715.» (DBpedia, 2018) @fr
in scheme: religion

capitalism
in dataset: The CWRC Ontology
type: political affiliation
type: Concept
comment: La description de ce terme est basée sur celle de DBPedia. @fr
comment: The description for this term is indebted to DBpedia.
label: capitalisme @fr
alternative label: capitalist
alternative label: free market capitalism
definition: Capitalism is an economic system based on private ownership of the means of production and their operation for profit. Characteristics central to capitalism include private property, capital accumulation, wage labor, voluntary exchange, a price system, and competitive markets. In a capitalist market economy, decision-making and investment is determined by the owners of the factors of production in financial and capital markets, and prices and the distribution of goods are mainly determined by competition in the market. Economists, political economists, and historians have adopted different perspectives in their analyses of capitalism and have recognized various forms of it in practice. These include laissez-faire or free market capitalism, welfare capitalism, and state capitalism. Different forms of capitalism feature varying degrees of free markets, public ownership, obstacles to free competition, and state-sanctioned social policies. The degree of competition in markets, the role of intervention and regulation, and the scope of state ownership vary across different models of capitalism;the extent to which different markets are free, as well as the rules defining private property, are matters of politics and of policy. Most existing capitalist economies are mixed economies, which combine elements of free markets with state intervention, and in some cases, with economic planning. Capitalism has existed under many forms of government, in many different times, places, and cultures. Following the decline of mercantilism, mixed capitalist systems became dominant in the Western world and continue to spread See: Capitalism - Wikipedia
definition: Le capitalisme est un concept Ã la fois économique, sociologique et politique qui caractérise un système s'appuyant sur la propriété privée des moyens de production. Sa définition donne lieu Ã des variations dans l'espace et dans le temps, et en fonction des sensibilités politiques des personnes qui emploient le terme. On considère généralement que ses fondements sont l'accumulation du capital productif et la réalisation du profit. Voir Capitalisme â Wikipédia @fr
in scheme: political affiliation

captain
in dataset: The CWRC Ontology
type: occupation
type: Concept
in scheme: occupation

care giver
in dataset: The CWRC Ontology
type: occupation
type: Concept
alternative label: caregiver
alternative label: elder care
alternative label: family carer
alternative label: home care giver
alternative label: home carer
hidden label: attendant to the blind
hidden label: devoting herself to the care of her elderly father
in scheme: occupation

Cartesianism
in dataset: The CWRC Ontology
type: religion
type: Concept
comment: La description de ce terme est basée sur celle de DBPedia. @fr
comment: The description for this term is indebted to DBpedia.
label: Cartésianisme @fr
alternative label: Cartesian
broader transitive: rationalism
definition: "Cartesianism is the name given to the philosophical and scientific system of René Descartes and its subsequent development by other seventeenth century thinkers, most notably Nicolas Malebranche and Baruch Spinoza. Descartes is often regarded as the first thinker to emphasize the use of reason to develop the natural sciences. For him, the philosophy was a thinking system that embodied all knowledge, and expressed it in this way: Cartesians view the mind as being wholly separate from the corporeal body. Sensation and the perception of reality are thought to be the source of untruth and illusions, with the only reliable truths to be had in the existence of a metaphysical mind. Such a mind can perhaps interact with a physical body, but it does not exist in the body, nor even in the same physical plane as the body. The question of how mind and body interact would be a persistent difficulty for Descartes and his followers, with different Cartesians providing different answers." (DBpedia, 2018)
definition: «Le cartésianisme désigne un courant philosophique qui se réclame des principes et des thèses de la pensée de René Descartes (1596-1650). Le cartésianisme s'est particulièrement manifesté Ã travers le premier ouvrage philosophique publié en langue française, le célèbre Discours de la méthode (1637), sous-titré « pour bien conduire sa raison et chercher la vérité dans les sciences ». Le cartésianisme est une philosophie rationaliste et métaphysique.» (DBpedia, 2018) @fr
in scheme: religion

cartoonist
in dataset: The CWRC Ontology
type: occupation
type: Concept
alternative label: caricaturist
alternative label: political cartoonist
in scheme: occupation

catering
in dataset: The CWRC Ontology
type: occupation
type: Concept
alternative label: caterer
alternative label: catering assistant
alternative label: catering manager
broader transitive: cooking
in scheme: occupation

Roman Catholic
is replaced by: Roman Catholicism
in dataset: The CWRC Ontology
type: Concept
comment: Deprecated in favour of instance Roman Catholicism.
comment: Désapprouver en faveur de l'instance Catholicisme. @fr
comment: La description de ce terme est basée sur celle de DBPedia. @fr
comment: The description for this term is indebted to the Getty Art & Architecture Thesaurus.
label: Catholicisme @fr
label: Catolicismo @es
label: Catolicismo Romano @es
label: Katholicisme @nl
label: Katholiek @nl
label: Rooms-Katholicisme @nl
deprecated: true
term status: deprecated
broader transitive: Christianity
definition: "Refers to the branch of Christianity characterized by a uniform, highly developed ritual canon and organisational structure with doctrinal roots based in the teachings of the Apostles of Jesus Christ in the first century, in the Alexandrian school of theology, and in Augustinian thought. In this religious branch, faith is considered an acceptance of revelation; revelation appears as doctrine. In juridical terms, it refers to the branch of Christianity distinguished as a unified, monolithic sacramental system under the governance of papal authority. Throughout much of its history, the seat of the Pope has been in Rome, thus "Roman Catholicism" is often used to distinguish this concept from the Orthodox Catholic church." (Getty, 2017)
definition: "Se refiere a la rama del cristianismo caracterizada por un canon ritual uniforme y altamente desarrollado y una estructura organizacional con raíces doctrinales basadas en las enseñanzas de los Apostoles de Jesucristo en la primera centuria, en la Escuela Alejandrina de teología, y en el pensamiento agustiniano. En esta rama de la religión, la fe es considerada como una aceptación de revelación; la revelación aparece como doctrina. Se refiere a la rama del cristianismo caracterizada por un canon ritual uniforme y altamente desarrollado y una estructura organizacional con raíces doctrinales basadas en las enseñanzas de los Apóstoles de Jesucristo en el primer siglo, en la Escuela Alejandrina de teología, y en el pensamiento agustiniano. En esta rama de la religión, la fe es considerada como una aceptación de revelación; la revelación aparece como doctrina. En términos jurídicos, se refiere a la rama del Cristianismo distinguido como sistema sacramental unificado, monolítico bajo gobierno de la autoridad papal. A través de la mayor parte de su historia, "la silla del papal" ha estado en Roma, mediante este concepto el Catolicismo Romano se distingue de la Iglesia Católica Ortodoxa." (Getty, 2017) @es
definition: "Verwijst naar de richting van het christendom die zich kenmerkt door een uniforme, hoogontwikkelde rituele canon en organisatiestructuur met een doctrine die wortelt in de leer van de apostelen van Jezus Christus in de 1ste eeuw, in de theologie van de Alexandrijnse school en in het augustijner gedachtegoed. In deze godsdienstige richting wordt het geloof beschouwd als een aanvaarding van de openbaring; de openbaring heeft de vorm van een doctrine. In juridische zin verwijst de term naar de richting van het christendom die zich onderscheidt als een verenigd, monolithisch sacramenteel systeem onder het bestuur van het pauselijk gezag. Gedurende het grootste deel van de geschiedenis van dit systeem was de paus gevestigd in Rome en daarom wordt 'rooms-katholicisme' vaak gebruikt om dit begrip te onderscheiden van de orthodoxe katholieke kerk." (Getty, 2017) @nl
definition: «L'Ãglise catholique, ou Ãglise catholique, apostolique et romaine, est la plus grande Ãglise chrétienne avec plus d'un milliard de fidèles. Elle réunit l'ensemble des chrétiens en communion avec le pape et les évêques qui sont considérés par les catholiques comme étant les successeurs des apôtres de Jésus-Christ. L'Ãglise catholique est l'une des plus vieilles institutions religieuses au monde et a joué un rôle important dans l'histoire, surtout du monde occidental. La foi de l'Ãglise catholique est résumée par le symbole de Nicée et elle se caractérise par la célébration des sept sacrements dont le plus important est l'Eucharistie célébré liturgiquement durant la messe. Selon son propre catéchisme, l'Ãglise catholique est composée de trois parties qui ne forment qu'une seule Ãglise placée sous Jésus-Christ : l'Ãglise militante, l'Ãglise triomphante et l'Ãglise souffrante correspondant respectivement Ã l'ensemble des fidèles sur terre, l'ensemble des saints qui sont au ciel et l'ensemble des âmes qui sont au purgatoire. L'Ãglise catholique sur terre se conçoit comme une communion d'Ãglises locales ou particulières, c'est-Ã -dire ayant chacune un territoire et un évêque Ã sa tête. Celles-ci sont chacune pleinement l'Ãglise catholique dans la mesure où elles sont en communion avec le pape, qui est l'évêque de Rome et considéré comme étant le successeur de saint Pierre, et en communion les unes avec les autres. L'Ãglise catholique se définit comme une institution Ã la fois humaine et divine : «société parfaite en dépit de l'imperfection de ses membres». En plus d'être l'ensemble des baptisés, elle est aussi une institution et un clergé organisés de façon hiérarchique. Une très grande majorité des catholiques (au moins 98 %) sont de l'Ãglise latine, mais il existe aussi des catholiques de différentes Ãglises catholiques orientales.» (DBpedia, 2017) @fr
in scheme: religion

Catholic emancipation
in dataset: The CWRC Ontology
type: political affiliation
type: Concept
comment: La description de ce terme est basée sur celle de DBPedia. @fr
comment: The description for this term is indebted to DBpedia.
label: émancipation des catholiques @fr
definition: "Catholic emancipation or Catholic relief was a process in the Kingdom of Great Britain and Ireland in the late 18th century and early 19th century that involved reducing and removing many of the restrictions on Roman Catholics introduced by the Act of Uniformity, the Test Acts and the penal laws. Requirements to abjure (renounce) the temporal and spiritual authority of the Pope and transubstantiation placed major burdens on Roman Catholics. From the death on 14 January 1766 of James Francis Edward Stuart, the son of the deposed James II of England and Ireland (also James VII of Scotland) and pretender to the English, Scottish and Irish thrones since 1701, the papacy recognised the Hanoverian dynasty as lawful rulers of England, Scotland and Ireland, 52 years after it had taken power, and thereafter the penal laws started to be dismantled. The most significant measure was the Roman Catholic Relief Act 1829, which removed the most substantial restrictions on Roman Catholicism in the United Kingdom." (DBpedia, 2018)
definition: «L'émancipation des catholiques (irlandais : Fuascailt na gCaitliceach), fut un processus qui se déroula en Grande-Bretagne et en Irlande Ã la fin du XVIIIe siècle et au début du XIXe siècle. Il consista Ã réduire ou Ã supprimer de nombreuses restrictions, frappant les catholiques, introduites par l'Act of Uniformity, le Test Act, et les Lois pénales. La nécessité d'abjurer l'autorité spirituelle et temporelle du pape, ainsi que la transsubstantiation, avait accablé lourdement les catholiques. Après la mort de Jacques François Stuart en janvier 1766, et après un silence de soixante-dix ans, le Saint-Siège reconnut la Maison de Hanovre comme la dynastie régnante légitime en Angleterre, en Ãcosse et en Irlande. Peu après, les Lois pénales commencèrent Ã être démantelées.» (DBpedia, 2018) @fr
in scheme: political affiliation

Roman Catholicism
in dataset: The CWRC Ontology
type: religion
type: Concept
comment: La description de ce terme est basée sur celle de DBPedia. @fr
comment: The description for this term is indebted to the Getty Art & Architecture Thesaurus.
label: Catholicisme @fr
label: Catolicismo @es
label: Catolicismo Romano @es
label: Katholicisme @nl
label: Katholiek @nl
label: Rooms-Katholicisme @nl
alternative label: Catholic Church
alternative label: Catholicism
alternative label: Roman Catholic Church
broader transitive: Christianity
definition: "Refers to the branch of Christianity characterized by a uniform, highly developed ritual canon and organisational structure with doctrinal roots based in the teachings of the Apostles of Jesus Christ in the first century, in the Alexandrian school of theology, and in Augustinian thought. In this religious branch, faith is considered an acceptance of revelation; revelation appears as doctrine. In juridical terms, it refers to the branch of Christianity distinguished as a unified, monolithic sacramental system under the governance of papal authority. Throughout much of its history, the seat of the Pope has been in Rome, thus "Roman Catholicism" is often used to distinguish this concept from the Orthodox Catholic church." (Getty, 2017)
definition: "Se refiere a la rama del cristianismo caracterizada por un canon ritual uniforme y altamente desarrollado y una estructura organizacional con raíces doctrinales basadas en las enseñanzas de los Apostoles de Jesucristo en la primera centuria, en la Escuela Alejandrina de teología, y en el pensamiento agustiniano. En esta rama de la religión, la fe es considerada como una aceptación de revelación; la revelación aparece como doctrina. Se refiere a la rama del cristianismo caracterizada por un canon ritual uniforme y altamente desarrollado y una estructura organizacional con raíces doctrinales basadas en las enseñanzas de los Apóstoles de Jesucristo en el primer siglo, en la Escuela Alejandrina de teología, y en el pensamiento agustiniano. En esta rama de la religión, la fe es considerada como una aceptación de revelación; la revelación aparece como doctrina. En términos jurídicos, se refiere a la rama del Cristianismo distinguido como sistema sacramental unificado, monolítico bajo gobierno de la autoridad papal. A través de la mayor parte de su historia, "la silla del papal" ha estado en Roma, mediante este concepto el Catolicismo Romano se distingue de la Iglesia Católica Ortodoxa." (Getty, 2017) @es
definition: "Verwijst naar de richting van het christendom die zich kenmerkt door een uniforme, hoogontwikkelde rituele canon en organisatiestructuur met een doctrine die wortelt in de leer van de apostelen van Jezus Christus in de 1ste eeuw, in de theologie van de Alexandrijnse school en in het augustijner gedachtegoed. In deze godsdienstige richting wordt het geloof beschouwd als een aanvaarding van de openbaring; de openbaring heeft de vorm van een doctrine. In juridische zin verwijst de term naar de richting van het christendom die zich onderscheidt als een verenigd, monolithisch sacramenteel systeem onder het bestuur van het pauselijk gezag. Gedurende het grootste deel van de geschiedenis van dit systeem was de paus gevestigd in Rome en daarom wordt 'rooms-katholicisme' vaak gebruikt om dit begrip te onderscheiden van de orthodoxe katholieke kerk." (Getty, 2017) @nl
definition: «L'Ãglise catholique, ou Ãglise catholique, apostolique et romaine, est la plus grande Ãglise chrétienne avec plus d'un milliard de fidèles. Elle réunit l'ensemble des chrétiens en communion avec le pape et les évêques qui sont considérés par les catholiques comme étant les successeurs des apôtres de Jésus-Christ. L'Ãglise catholique est l'une des plus vieilles institutions religieuses au monde et a joué un rôle important dans l'histoire, surtout du monde occidental. La foi de l'Ãglise catholique est résumée par le symbole de Nicée et elle se caractérise par la célébration des sept sacrements dont le plus important est l'Eucharistie célébré liturgiquement durant la messe. Selon son propre catéchisme, l'Ãglise catholique est composée de trois parties qui ne forment qu'une seule Ãglise placée sous Jésus-Christ : l'Ãglise militante, l'Ãglise triomphante et l'Ãglise souffrante correspondant respectivement Ã l'ensemble des fidèles sur terre, l'ensemble des saints qui sont au ciel et l'ensemble des âmes qui sont au purgatoire. L'Ãglise catholique sur terre se conçoit comme une communion d'Ãglises locales ou particulières, c'est-Ã -dire ayant chacune un territoire et un évêque Ã sa tête. Celles-ci sont chacune pleinement l'Ãglise catholique dans la mesure où elles sont en communion avec le pape, qui est l'évêque de Rome et considéré comme étant le successeur de saint Pierre, et en communion les unes avec les autres. L'Ãglise catholique se définit comme une institution Ã la fois humaine et divine : «société parfaite en dépit de l'imperfection de ses membres». En plus d'être l'ensemble des baptisés, elle est aussi une institution et un clergé organisés de façon hiérarchique. Une très grande majorité des catholiques (au moins 98 %) sont de l'Ãglise latine, mais il existe aussi des catholiques de différentes Ãglises catholiques orientales.» (DBpedia, 2017) @fr
in scheme: religion

cause of death
in dataset: The CWRC Ontology
subject-centric predicate: has cause of death
type: ObjectProperty
range: IllnessInjury
sub property of: death relationship

celibacy
in dataset: The CWRC Ontology
type: sexuality
type: Concept
label: célibat @fr
alternative label: celibate
definition: Celibacy indicates abstention from sex, and can stem from personal choice, religious prescriptions, or with religious occupations such as being a nun or priest. Celibacy is not the be confused with asexuality, which describes a lack of interest in sex or sexual attraction to other subjects.
definition: Le célibat indique l'abstinence sexuelle, et peut être dû Ã un choix personnel, Ã des impératifs religieux ou des professions cléricales comme religieuse ou prêtre. Le célibat ne doit pas être confondu avec l'asexualité, qui décrit une absence d'intérêt pour les pratiques sexuelles ou d'attirance sexuelle pour d'autres personnes. @fr
in scheme: sexuality

Celtic
in dataset: The CWRC Ontology
type: ethnicity
type: Concept
comment: La description de ce terme est basée sur celle de DBPedia. @fr
comment: The description for this term is indebted to DBpedia.
label: Celte @fr
alternative label: Highland
alternative label: Highland (that is Celtic)
broader transitive: European
definition: "A modern Celtic identity emerged in Western Europe following the identification of the native peoples of the Atlantic fringe as Celts by Edward Lhuyd in the 18th century. Lhuyd and others equated the Celts described by Greco-Roman writers with the pre-Roman peoples of France, Great Britain and Ireland. The Irish and ancient British languages were thus Celtic languages. The descendants of these languages were the Brittonic (Breton, Cornish and Welsh variants) and Gaelic (Irish, Manx and Scottish variants) languages. These peoples were therefore modern Celts. Attempts were made to link their distinctive cultures to those of the Ancient Celtic people." (DBpedia, 2017)
definition: «Les Celtes constituent une civilisation protohistorique qui se définit par l'usage de langues celtiques et par certains particularismes culturels. Ils ont jadis été présents sur une grande partie du continent européen et en Asie mineure. L'apogée de l'expansion celte se situe entre le viiie siècle av. J.-C. et le iiie siècle, marqué notamment par la civilisation laténienne au ve siècle av. J.-C. Une succession de conquêtes et de migrations les mènent jusqu'en Galatie, en Asie mineure. Ainsi, leur domination s'étendait dans l'Europe actuelle de Galice jusqu'à GalaÈi.» (DBpedia, 2017) @fr
in scheme: ethnicity

censor
in dataset: The CWRC Ontology
type: occupation
type: Concept
alternative label: bowdlerizer
in scheme: occupation

certainty of
in dataset: The CWRC Ontology
type: InverseFunctionalProperty
type: ObjectProperty
domain: certainty
inverse of: has certainty
definition: Links a level of certainty to an assertion, description, identification, or value. Related to the certainty element of the Text Encoding Initiative.

certificate
in dataset: The CWRC Ontology
type: credential
type: Concept
alternative label: Cambridge Certificate
alternative label: Certificat d'Ãtudes Françaises, 1er Degré
alternative label: Higher Cambridge Certificate
alternative label: Higher National Certificate
alternative label: Postgraduate Certificate
alternative label: Postgraduate Certificate in Education, English as a Second Language
alternative label: University Certificate
alternative label: certificate in social science
alternative label: certificate in the exam for women
definition: Educational certificate, including those awarded to women in lieu of degrees in the early years of their admission to universities.
in scheme: credential

chairperson
in dataset: The CWRC Ontology
type: occupation
type: Concept
alternative label: chair
alternative label: chair of prize panel
alternative label: chair of social anthropology
alternative label: chair of society
alternative label: chair of the greater london arts literature panel
alternative label: chair of women's organization
alternative label: chairman
alternative label: chairwoman
alternative label: committee chair
alternative label: committee chairman
alternative label: deputy chairman
alternative label: society chair
alternative label: vice chairman
hidden label: chair of academy
hidden label: chair of international organization
hidden label: chairman of the authors' lending and copyright society or alcs
hidden label: chairman of the photographic society
hidden label: vice chair of the british copyright council
hidden label: vice chairman of the copyright licensing agency
in scheme: occupation

chaperone
in dataset: The CWRC Ontology
type: occupation
type: Concept
in scheme: occupation

charity worker
in dataset: The CWRC Ontology
type: occupation
type: Concept
alternative label: charitable causes
alternative label: charitable donation
alternative label: charitable giving
alternative label: charitable worker
alternative label: charity
alternative label: charity administrator
alternative label: charity agent
alternative label: charity board member
alternative label: charity campaigner
alternative label: charity co ordinator
alternative label: charity management
alternative label: charity organiser
alternative label: charity organizer
alternative label: charity performer
alternative label: charity representative
alternative label: charity school supporter
alternative label: charity speaker
alternative label: charity work
alternative label: church and community work
alternative label: director of charity
alternative label: president of charity
alternative label: raise funds for a variety of wartime charities
alternative label: vice president of charity
hidden label: charititable activity
hidden label: charity organiser
hidden label: charity organization society
hidden label: childbirth charity organiser
hidden label: established a soup kitchen for starving peasants during the great famine
hidden label: running church or charity bazaars
hidden label: shelter provision
hidden label: text distributor
hidden label: work with women and the poor
in scheme: occupation
related: philanthropist

Chartist
in dataset: The CWRC Ontology
type: political affiliation
type: Concept
comment: The description for this term is indebted to DBpedia.
definition: Chartism was a working-class movement for political reform in Britain which existed from 1838 to 1858. It took its name from the People's Charter of 1838 and was a national protest movement, with particular strongholds of support in Northern England, the East Midlands, the Staffordshire Potteries, the Black Country, and the South Wales Valleys. Support for the movement was at its highest in 1839, 1842, and 1848, when petitions signed by millions of working people were presented to the House of Commons. The strategy employed was to use the scale of support which these petitions and the accompanying mass meetings demonstrated to put pressure on politicians to concede manhood suffrage.
in scheme: political affiliation

chemist
in dataset: The CWRC Ontology
type: occupation
type: Concept
alternative label: industrial chemist
broader transitive: scientist
hidden label: chemist and immunologist
hidden label: research chemist
in scheme: occupation

chess
in dataset: The CWRC Ontology
type: occupation
type: Concept
hidden label: international chess master
in scheme: occupation

child
in dataset: The CWRC Ontology
subject-centric predicate: has child
type: ObjectProperty
range: Person
sub property of: relative

child of
in dataset: The CWRC Ontology
type: ObjectProperty
domain: Person
label: enfant de @fr
range: Person
sub property of: relative of
inverse of: has child

childcare
in dataset: The CWRC Ontology
type: occupation
type: Concept
alternative label: au pair
alternative label: child care
alternative label: child carer
alternative label: child minding
alternative label: child rearing
alternative label: child recreation manager
alternative label: childcare provider
alternative label: childcare worker
alternative label: children's home manager
alternative label: nursemaid
alternative label: nursery manager
hidden label: child recreation manager
hidden label: childcare guru
hidden label: worker for children
hidden label: worker with children
in scheme: occupation

childcare work
in dataset: The CWRC Ontology
type: occupation
type: Concept
alternative label: child recreation manager
alternative label: children's home manager
alternative label: nursery manager
in scheme: occupation

childlessness
in dataset: The CWRC Ontology
type: reproductive history
type: Concept
alternative label: childless
alternative label: no children
alternative label: no surviving children
definition: Related to voluntary or involuntary childlessness.
in scheme: reproductive history

children
in dataset: The CWRC Ontology
subject-centric predicate: has children
type: ObjectProperty
range: nonNegativeInteger
sub property of: relative
related: has reproductive history

children's welfare
in dataset: The CWRC Ontology
type: political affiliation
type: Concept
comment: The description for this term is indebted to DBpedia.
label: défense des droits des enfants @fr
alternative label: campaigner against child prostitution
alternative label: children's rights
alternative label: children's rights activist
alternative label: children's rights advocate
broader transitive: human rights
definition: Advocacy or activism for the rights or welfare of children. See: Category:Child welfare - Wikipedia
definition: Militantisme et activisme pour les droits et le bien-être des enfants. Voir Droits de l'enfant â Wikipédia @fr
in scheme: political affiliation

Chinese
in dataset: The CWRC Ontology
type: ethnicity
type: Concept
comment: La description de ce terme est basée sur celle de DBPedia. @fr
comment: The description for this term is indebted to DBpedia.
label: Chinois @fr
definition: "Chinese people are the various individuals or groups of people associated with China (or Greater China), either by reason of ancestry, heredity, ethnicity, nationality, citizenship, place of residence, or other affiliation." (DBpedia, 2018)
definition: «Les Chinois sont les différents individus ou groupes de personnes associés Ã la Chine (ou Ã la Grande Chine), en raison de leur ascendance, leur hérédité, leur ethnie, leur nationalité, leur citoyenneté, leur lieu de résidence ou d'autre affiliation.» (DBpedia, 2018) @fr
in scheme: ethnicity

Christian pacifism
in dataset: The CWRC Ontology
type: political affiliation
type: Concept
comment: La description de ce terme est basée sur celle de DBPedia. @fr
comment: The description for this term is indebted to DBpedia.
label: Pacifisme chrétien @fr
alternative label: christian pacifist
broader transitive: pacifism
definition: "Christian pacifism is the theological and ethical position that any form of violence is incompatible with the Christian faith. Christian pacifists state that Jesus himself was a pacifist who taught and practiced pacifism and that his followers must do likewise. Notable Christian pacifists include Martin Luther King, Jr., Leo Tolstoy, and Ammon Hennacy. Hennacy believed that adherence to Christianity required not just pacifism but, because governments inevitably threatened or used force to resolve conflicts, anarchism. However, most Christian pacifists, including the peace churches, Christian Peacemaker Teams, and individuals such as John Howard Yoder, make no claim to be anarchists." (DBpedia, 2017)
definition: «Le pacifisme chrétien est un courant de pensée et d'action Ã l'intérieur du christianisme. Il désigne, a minima, le refus de la participation Ã la mise Ã mort d'un être humain Ã la guerre pour motif de conscience, et plus largement, le refus d'utiliser des moyens violents pour se défendre, parvenir Ã ses fins ou opposer une résistance. Bien qu'étant la position d'origine des premiers chrétiens , le pacifisme est considéré comme la position minoritaire au sein des Ãglises chrétiennes, la position dominante dans l'histoire de l'Ãglise étant la doctrine de la guerre juste. Ce refus d'attenter Ã la vie de la personne humaine se fonde sur l'un ou plusieurs les aspects bibliques-théologiques suivants : l'être humain comme créature et image de Dieu Ã ne pas tuer (Ge 1.27 ; Ge 9.5-6)la parole du Décalogue (Ex 20,13) : «Tu ne tueras point», et l'extension de son champ d'applicationl'enseignement du Christ («Ne vous opposez pas [violemment] au mal» (Mt 5.39) ; «Aimez vos ennemis» (Mt 5.44)l'exemple de la vie du Christ (1 Pi 2.21-23)la mort du Christ interprétée comme don de soi et comme manière de répondre au mal (Rm 5.6-10)la résurrection du Christ vue comme la justification par Dieu de la manière de vivre du Messie (Phil 2.6-11)l'enseignement des apôtres («Soyez en paix avec tous» (Rm 12.18) ; «Sois vainqueur du mal par le bien» (Rm 12.21) Le pacifisme chrétien rejoint aujourd'hui l'ensemble de ce qui peut se désigner par le vocable de non-violence et qui se décline en dialogue, résolution de conflits, médiation, protestation non-violence, justice restaurative, etc. Le pacifisme chrétien et la non-violence sont notamment connu en milieu catholique Ã travers les efforts de pacification de la communauté de Sant'Egidio et les nombreuses missions diplomatiques de Jean-Paul II[réf. nécessaire]. Au sein du protestantisme, la résistance spirituelle au nazisme suscitée par le pasteur André Trocmé autour du Chambon-sur-Lignon, le comb… @fr
in scheme: political affiliation

Christian Science
in dataset: The CWRC Ontology
type: religion
type: Concept
comment: La description de ce terme est basée sur celle de DBPedia. @fr
comment: The description for this term is indebted to the Getty Art & Architecture Thesaurus.
label: Christenwetenschap @nl
label: Ciencia Cristiana @es
label: Science Chrétienne @fr
alternative label: Christian Scientist
alternative label: Church of Christ Scientist
broader transitive: Christianity
definition: "Refers to a Christian denomination and movement founded by Mary Baker Eddy (1821-1910) that seeks to reinstate the Christian message of salvation from all evil, including sickness and disease as well as sin. Eddy, a semi-invalid who was interested in cures not involving medicine, claimed a recovery from a bad injury without medical assistance in 1866. Afterwards, she devoted herself to restoring the healing emphasis of early Christianity. In 1875 she finished writing the first edition of the 'Science and Health with Key to the Scriptures.' This work and the Bible are the principal texts of the movement and importance has been laid on establishing reading rooms where these works can make their own appeal to readers. The 'Christian Science Monitor' is also published by the denomination. Christian Science believes that ignorance is at the root of human unease and thus 'dis-ease.' Instead of seeking medical treatment, special Christian Science healers are to be consulted for spiritual healing. Health, happiness, and holiness can be restored by applying to all aspects of life practices and attitudes in keeping with the principal of divine harmony. The first Church of Christ, Scientist was founded in 1879 in Boston and its headquarters remain there." (Getty, 2017)
definition: "Se refiere a una secta y movimiento cristiano fundado por Mary Baker Eddy (1821-1910) que busca reincorporar el mensaje cristiano de salvación de todo mal, incluso la enfermedad y padecimiento así como el pecado. Eddy, un semi-inválido que estaba interesado en curas que no involucraran medicina, afirmó que se había recuperado de una lesión grave sin la ayuda médica en 1866. Después, se consagró a restaurar el énfasis curativo de la primera cristiandad. En 1875 ella terminó escribiendo la primera edición del "la Ciencia y Salud con Llave a las Escrituras". Este trabajo y la Biblia son los textos principales del movimiento y importancia se ha puesto en establecer salas de lectura donde estos trabajos pueden hacer su propia apelación a los lectores. El "Instructivo de ciencia cristiano" también fue publicado por la secta. La Ciencia Cristiana cree que la ignorancia es la raíz de los padecimientos humanos y por lo tanto de la enfermedad. En lugar de buscar tratamiento médico, los sanadores de la Ciencia Cristiana especiales serán consultados para la curación espiritual. La salud, felicidad, y santidad pueden ser restauradas aplicando a todos los aspectos de la vida prácticas y actitudes en concordancia con la armonía divina. La primera Iglesia Científica de Cristo, se fundó en 1879 en Boston y su centro principal permanece allí." (Getty, 2017) @es
definition: "Verwijst naar een christelijke gezindte en beweging die is gesticht door Mary Baker Eddy (1821-1910) en die streeft naar herbevestiging van de christelijke boodschap van verlossing van al het kwaad, met inbegrip van ziekte en zonde. Eddy, die half invalide was en geïnteresseerd in genezing zonder medicijnen, beweerde dat zij in 1866 zonder medische hulp was hersteld van zwaar letsel. Daarna wijdde zij zich aan het herstel van de nadruk op gebedsgenezing die het vroege christendom had gekenmerkt. In 1875 voltooide zij de eerste editie van haar boek 'Science and Health with Key to the Scriptures'. Dit werk en de Bijbel zijn de voornaamste geschriften van de beweging, die veel belang hecht aan de inrichting van leesruimten waar deze boeken een eigen beroep op de lezers kunnen doen. Ook de 'Christian Science Monitor' wordt door het kerkgenootschap uitgegeven. Volgens de leer van Christian Science is onwetendheid de wortel van het menselijk ongemak, de menselijke ziekte. In plaats van medische behandeling te zoeken moet men gebedsgenezers van Christian Science raadplegen voor spirituele genezing. Gezondheid, geluk en heiligheid kunnen worden hersteld door alle aspecten van de levenspraktijk en -houding aan te spreken in overeenstemming met het beginsel van goddelijke harmonie. De eerste Church of Christ, Scientist werd in 1879 in Boston gesticht en het hoofdkwartier van de beweging is daar nog altijd gevestigd." (Getty, 2017) @nl
definition: «La Science chrétienne (ou Christian Science en anglais) se définit elle-même comme la «Science du Christ». Sa fondatrice, la théologienne américaine Mary Baker Eddy, estime avoir redécouvert en 1866 les lois appliquées par Jésus dans la guérison des malades et la résolution des aléas de la vie, lois toujours démontrables aujourd'hui. Son observation des guérisons et résolutions diverses obtenues sur la base de sa théorie en prouve, selon elle, la validité. Ainsi, la Science chrétienne est «chrétienne» en ce sens qu'elle repose sur les enseignements de Jésus de Nazareth, tels qu'exposés dans le Nouveau Testament. La Science chrétienne se veut une religion pratique permettant l'application de lois divines démontrables. Afin d'assurer la diffusion de cette science, Mary Baker Eddy fonde en 1879 une Ãglise sans credo, appelée «Ãglise du Christ, Scientiste» (en anglais The First Church of Christ, Scientist), rassemblant de nos jours 1 800 églises dans 82 pays et quelques centaines de milliers de pratiquants, principalement aux Ãtats-Unis. Reconnue comme association cultuelle dans de nombreux pays, notamment aux Ãtats-Unis, la Science chrétienne précise que, malgré la confusion possible entre les deux noms, elle n'a rien de commun avec l'Ãglise de Scientologie; de plus, bien qu'elle partage nombre de concepts métaphysiques avec les églises de la Nouvelle Pensée comme Unité, la Science divine et la Science religieuse, ce qui amène certains historiens et sociologues Ã les aborder ensemble dans leurs travaux, la Science chrétienne et ces églises ne se reconnaissent pas mutuellement comme faisant partie de la même mouvance. La principale critique de la Science chrétienne est qu'elle a un caractère alternatif et non complémentaire au traitement médical. Ainsi, les guérisons alléguées sont obtenues en dehors de tout contrôle médical. Ses guérisons de maladies fonctionnelles ou organiques sont considérées comme relevant de l… @fr
in scheme: religion

Christian socialism
in dataset: The CWRC Ontology
type: political affiliation
type: Concept
comment: The description for this term is indebted to DBpedia.
label: socialisme chrétien @fr
alternative label: christian socialist
broader transitive: socialism
definition: "Christian socialism is a form of religious socialism based on the teachings of Jesus of Nazareth. Many Christian socialists believe capitalism to be idolatrous and rooted in greed, which some Christian denominations consider a mortal sin. Christian socialists identify the cause of inequality to be the greed that they associate with capitalism. Christian socialism became a major movement in the United Kingdom beginning in the 1960s through the Christian Socialist Movement, since 2013 known as Christians on the Left. Other earlier figures are also viewed as Christian socialists, such as the nineteenth century writers Frederick Denison Maurice (The Kingdom of Christ, 1838), John Ruskin (Unto This Last, 1862), Charles Kingsley (The Water-Babies, 1863), Thomas Hughes (Tom Brown's Schooldays, 1857), Frederick James Furnivall (co-creator of the Oxford English Dictionary), Adin Ballou (Practical Christian Socialism, 1854), and Francis Bellamy (a Baptist minister and the author of the United States' Pledge of Allegiance)." (DBpedia, 2017)
in scheme: political affiliation

Christianity
in dataset: The CWRC Ontology
type: religion
type: Concept
comment: La description de ce terme est basée sur celle de DBPedia. @fr
comment: The description for this term is indebted to the Getty Art & Architecture Thesaurus.
label: Christelijk @nl
label: Christendom @nl
label: Christianisme @fr
label: Cristianismo @es
label: chi tu chiao @zh-latn
label: ji du jiao @zh-latn
label: jī dū jiÄo @zh-latn
label: åºç£æ @zh-hant
alternative label: Christian
broader transitive: Abrahamic religions
definition: "Refers to the world religion and culture that developed in the first century CE, driven by the teachings of Jesus Christ of Nazareth. Its roots are in the Judaic tradition and the Old Testament. The tenets include a belief in the death and redemptive resurrection of Jesus. The religion incorporates a tradition of faith, ritual, and a form of church authority or leadership." (Getty, 2017)
definition: "Se refiere a la religión y cultura que se desarrolló en la primera centuria, guiado por la creencia y reverencia por la vida, enseñanza, muerte y resurrección redentiva de Jesucristo de Nazaret. La religión incorpora una tradición de fe, ritual y una forma de iglesia de autoridad y liderazgo." (Getty, 2017) @es
definition: "Verwijst naar de wereldreligie en -cultuur die in de eerste eeuw n. Chr. tot ontwikkeling kwam op basis van de leer van Jezus Christus van Nazareth. De wortels van deze religie liggen in de joodse traditie en het Oude Testament. Een van de kenmerkende grondbeginselen is het geloof in de dood en wederopstanding van Jezus. De religie omvat een traditie van geloof, rituelen en een vorm van kerkelijke autoriteit of leiderschap." (Getty, 2017) @nl
definition: "ç¼å±æ¼è¥¿å ä¸ä¸ç´çä¸çå®æèæåï¼è·é¨æ¿è©å(Nazareth)è¶ç©åºç£çæèª¨ãæºæ¼ç¶å¤ªå³çµ±åèç´èç¶ãæç¾©å æ¬ç¸ä¿¡è¶ç©ä¹æ­»èæè´å¾©æ´»ãæ­¤æèåä¿¡ä»°å³çµ±ãåå¼ï¼åæç¨®å½¢å¼çæææ¬å¨æé å°ã" (Getty, 2017) @zh-hant
definition: «Le christianisme est une religion abrahamique fondée sur l'enseignement, la personne et la vie de Jésus de Nazareth tels qu'ils sont interprétés par la tradition chrétienne Ã partir du Nouveau Testament de la Bible. Il s'agit d'une religion du salut considérant Jésus-Christ comme le Messie annoncé par les prophètes dans l'Ancien Testament qui vient sauver l'humanité du Mal et la faire participer Ã la vie de Dieu. La foi en la résurrection de Jésus est au cÅur du christianisme car elle signifie le début d'une humanité nouvelle libérée du Mal. Les premières communautés chrétiennes naissent au Ier siècle en Judée et dans les grandes villes de la diaspora juive telles que Rome, Ãphèse, Antioche et Alexandrie. Le christianisme se développe dès le IIe siècle dans l'Empire romain, dont il devient la religion officielle au IVe siècle, mais aussi en Perse, en Inde et en Ãthiopie. Au Moyen-Ãge, le christianisme devint majoritaire en Europe, tandis qu'il s'amenuise face Ã l'islam dans les régions où il est né. Depuis le XVIe siècle, il est devenu la religion la plus importante de la planète par son expansion en Amérique et, plus tard, en Afrique. Il est actuellement présent dans tous les pays du monde. Les Ãglises chrétiennes sont classiquement regroupées en trois principales branches : le catholicisme, le christianisme orthodoxe et le protestantisme représentant respectivement 50%, 12% et 37% du total des chrétiens en 2010. Ã la mi-2015, le nombre total de chrétiens dans le monde est évalué Ã 2,419 milliards, ce qui en fait la religion comptant le plus grand nombre de fidèles au monde devant l'islam qui en compte environ 1,6 milliard.» (DBpedia, 2017) @fr
in scheme: religion
narrower transitive: Buddhism

Christian Science
is replaced by: Christian Science
in dataset: The CWRC Ontology
type: Concept
comment: Deprecated in favour of instance Christian Science.
comment: Désapprouver en faveur de l'instance Science Chrétienne. @fr
comment: La description de ce terme est basée sur celle de DBPedia. @fr
comment: The description for this term is indebted to the Getty Art & Architecture Thesaurus.
label: Christenwetenschap @nl
label: Ciencia Cristiana @es
label: Science CHRÃTIENNE @fr
deprecated: true
term status: deprecated
broader transitive: Christianity
definition: "Refers to a Christian denomination and movement founded by Mary Baker Eddy (1821-1910) that seeks to reinstate the Christian message of salvation from all evil, including sickness and disease as well as sin. Eddy, a semi-invalid who was interested in cures not involving medicine, claimed a recovery from a bad injury without medical assistance in 1866. Afterwards, she devoted herself to restoring the healing emphasis of early Christianity. In 1875 she finished writing the first edition of the "Science and Health with Key to the Scriptures." This work and the Bible are the principal texts of the movement and importance has been laid on establishing reading rooms where these works can make their own appeal to readers. The "Christian Science Monitor" is also published by the denomination. Christian Science believes that ignorance is at the root of human unease and thus "dis-ease." Instead of seeking medical treatment, special Christian Science healers are to be consulted for spiritual healing. Health, happiness, and holiness can be restored by applying to all aspects of life practices and attitudes in keeping with the principal of divine harmony. The first Church of Christ, Scientist was founded in 1879 in Boston and its headquarters remain there." (Getty, 2017)
definition: "Se refiere a una secta y movimiento cristiano fundado por Mary Baker Eddy (1821-1910) que busca reincorporar el mensaje cristiano de salvación de todo mal, incluso la enfermedad y padecimiento así como el pecado. Eddy, un semi-inválido que estaba interesado en curas que no involucraran medicina, afirmó que se había recuperado de una lesión grave sin la ayuda médica en 1866. Después, se consagró a restaurar el énfasis curativo de la primera cristiandad. En 1875 ella terminó escribiendo la primera edición del "la Ciencia y Salud con Llave a las Escrituras". Este trabajo y la Biblia son los textos principales del movimiento y importancia se ha puesto en establecer salas de lectura donde estos trabajos pueden hacer su propia apelación a los lectores. El "Instructivo de ciencia cristiano" también fue publicado por la secta. La Ciencia Cristiana cree que la ignorancia es la raíz de los padecimientos humanos y por lo tanto de la enfermedad. En lugar de buscar tratamiento médico, los sanadores de la Ciencia Cristiana especiales serán consultados para la curación espiritual. La salud, felicidad, y santidad pueden ser restauradas aplicando a todos los aspectos de la vida prácticas y actitudes en concordancia con la armonía divina. La primera Iglesia Científica de Cristo, se fundó en 1879 en Boston y su centro principal permanece allí." (Getty, 2017) @es
definition: "Verwijst naar een christelijke gezindte en beweging die is gesticht door Mary Baker Eddy (1821-1910) en die streeft naar herbevestiging van de christelijke boodschap van verlossing van al het kwaad, met inbegrip van ziekte en zonde. Eddy, die half invalide was en geïnteresseerd in genezing zonder medicijnen, beweerde dat zij in 1866 zonder medische hulp was hersteld van zwaar letsel. Daarna wijdde zij zich aan het herstel van de nadruk op gebedsgenezing die het vroege christendom had gekenmerkt. In 1875 voltooide zij de eerste editie van haar boek 'Science and Health with Key to the Scriptures'. Dit werk en de Bijbel zijn de voornaamste geschriften van de beweging, die veel belang hecht aan de inrichting van leesruimten waar deze boeken een eigen beroep op de lezers kunnen doen. Ook de 'Christian Science Monitor' wordt door het kerkgenootschap uitgegeven. Volgens de leer van Christian Science is onwetendheid de wortel van het menselijk ongemak, de menselijke ziekte. In plaats van medische behandeling te zoeken moet men gebedsgenezers van Christian Science raadplegen voor spirituele genezing. Gezondheid, geluk en heiligheid kunnen worden hersteld door alle aspecten van de levenspraktijk en -houding aan te spreken in overeenstemming met het beginsel van goddelijke harmonie. De eerste Church of Christ, Scientist werd in 1879 in Boston gesticht en het hoofdkwartier van de beweging is daar nog altijd gevestigd." (Getty, 2017) @nl
definition: «La Science chrétienne (ou Christian Science en anglais) se définit elle-même comme la «Science du Christ». Sa fondatrice, la théologienne américaine Mary Baker Eddy, estime avoir redécouvert en 1866 les lois appliquées par Jésus dans la guérison des malades et la résolution des aléas de la vie, lois toujours démontrables aujourd'hui. Son observation des guérisons et résolutions diverses obtenues sur la base de sa théorie en prouve, selon elle, la validité. Ainsi, la Science chrétienne est «chrétienne» en ce sens qu'elle repose sur les enseignements de Jésus de Nazareth, tels qu'exposés dans le Nouveau Testament. La Science chrétienne se veut une religion pratique permettant l'application de lois divines démontrables. Afin d'assurer la diffusion de cette science, Mary Baker Eddy fonde en 1879 une Ãglise sans credo, appelée «Ãglise du Christ, Scientiste» (en anglais The First Church of Christ, Scientist), rassemblant de nos jours 1 800 églises dans 82 pays et quelques centaines de milliers de pratiquants, principalement aux Ãtats-Unis. Reconnue comme association cultuelle dans de nombreux pays, notamment aux Ãtats-Unis, la Science chrétienne précise que, malgré la confusion possible entre les deux noms, elle n'a rien de commun avec l'Ãglise de Scientologie; de plus, bien qu'elle partage nombre de concepts métaphysiques avec les églises de la Nouvelle Pensée comme Unité, la Science divine et la Science religieuse, ce qui amène certains historiens et sociologues Ã les aborder ensemble dans leurs travaux, la Science chrétienne et ces églises ne se reconnaissent pas mutuellement comme faisant partie de la même mouvance. La principale critique de la Science chrétienne est qu'elle a un caractère alternatif et non complémentaire au traitement médical. Ainsi, les guérisons alléguées sont obtenues en dehors de tout contrôle médical. Ses guérisons de maladies fonctionnelles ou organiques sont considérées comme relevant de l… @fr
in scheme: religion

Church of England
is replaced by: Anglicanism
in dataset: The CWRC Ontology
type: Concept
type: Organization
comment: Deprecated in favour of instance Anglicanism.
comment: Désapprouver en faveur de l'instance Ãglise d'Angleterre. @fr
deprecated: true
term status: deprecated
broader transitive: Christianity
in scheme: religion

Church of Ireland
is replaced by: Anglicanism
in dataset: The CWRC Ontology
type: Concept
type: Organization
comment: Deprecated in favour of instance Anglicanism.
comment: Désapprouver en faveur de l'instance Ãglise d'Angleterre. @fr
comment: La description de ce terme est basée sur celle de DBPedia. @fr
comment: The description for this term is indebted to DBpedia.
label: Ãglise d'Irlande @fr
deprecated: true
term status: deprecated
definition: "The Church of Ireland (Irish: Eaglais na hÃireann Scots: Kirk o Airlann) is a Christian church in Ireland and an autonomous province of the Anglican Communion. It is organised on an all-Ireland basis and is the second-largest Christian church on the island after the Catholic Church. Like other Anglican churches, it has retained elements of pre-Reformation practice, notably its episcopal polity, while rejecting the primacy of the Bishop of Rome. Nevertheless, in theological and liturgical matters, it incorporates many principles of the Reformation, particularly those espoused during the English Reformation. The church self identifies as being both Catholic and Reformed. Within the church, differences exist between those members who are more Catholic-leaning (high church) and those who are more Protestant-leaning (low church or evangelical). For historical and cultural reasons, the Church of Ireland is generally identified as a Protestant church. The Church of Ireland is the second-largest in the Republic of Ireland, with around 130,000 members, and the third-largest in Northern Ireland, with around 260,000 members." (DBpedia, 2017)
definition: «L'Ãglise d'Irlande (irlandais : Eaglais na hÃireann, anglais : Church of Ireland) est une communauté religieuse autonome de la communion anglicane, dont le rayon d'action touche la République d'Irlande et l'Irlande du Nord. Comme d'autres Ãglises anglicanes, elle s'affirme «catholique» et «réformée». Quand l'Ãglise d'Angleterre rompt avec le Pape et l'Ãglise catholique romaine, l'Ãglise d'Irlande évolue également vers la Réforme, gardant son statut juridique et ses possessions, si sa doctrine change. Ainsi, de nos jours, l'Ãglise, dans ses cathédrales et ses églises, conserve largement l'héritage des constructions médiévales de l'île. La nouvelle Ãglise indépendante n'est cependant pas suivie par la majorité de la population ; l'Ãglise catholique romaine conserve le soutien de la plus grande partie des habitants, et ce jusqu'à aujourd'hui. En dépit de son caractère minoritaire, cependant, l'Ãglise d'Irlande conserve le statut de religion d'Ãtat jusqu'au désétablissement de 1869, quand Gladstone abolit l'Acte d'établissement. Le nombre d'églises est tombé brusquement au cours du XXe siècle, particulièrement en République d'Irlande, après l'indépendance ; le dernier recensement de la République montre un exemple rare de résistance Ã la crise de la foi. Aujourd'hui, l'Ãglise d'Irlande est, après l'Ãglise catholique, la deuxième plus importante Ãglise de l'île d'Irlande. C'est également la plus importante Ãglise protestante de la République d'Irlande et le deuxième plus importante d'Irlande du Nord, après l'Ãglise presbytérienne d'Irlande. Elle est gouvernée par un synode général du clergé et des laïcs et organisée en douze diocèses. Elle a Ã sa tête l'archevêque d'Armagh, qui porte le titre de «Primat de toute l'Irlande». L'archevêque actuel est Richard Clarke qui a succédé le Ã Alan Harper ; l'autre archevêque est celui de Dublin John Neill.» (DBpedia, 2017) @fr
in scheme: religion

cisgender
in dataset: The CWRC Ontology
type: gender
type: Concept
label: cisgenre @fr
definition: Indicates alignment between a person's gender identity and their sex as understood or assigned at birth. As per the Trans Student Educational Resources (TSER), "the term is not indicative of gender expression, sexual orientation, hormonal makeup, physical anatomy, or how one is perceived in daily life" (TSER, 2017).
definition: Indique l'alignement entre le genre et le sexe d'une personne, tel que celui-ci a été compris ou assigné Ã sa naissance. Selon le Trans Student Educational Resources (TSER), «le terme n'est pas révélateur de l'expression du genre, de l'orientation sexuelle, de la constitution hormonale, de l'anatomie, ou de la façon dont une personne est perçue au quotidien» (TSER, 2017). @fr
in scheme: gender

cis man/cis male
in dataset: The CWRC Ontology
represented by: man
type: gender
type: Concept
label: homme cisgenre @fr
definition: Indicates a cisgendered man.
definition: Indique un homme cisgenre. @fr
in scheme: gender

cis woman/cis female
in dataset: The CWRC Ontology
represented by: woman
type: gender
type: Concept
label: femme cisgenre @fr
definition: Indicates a cisgendered woman.
definition: Indique une femme cisgenre. @fr
in scheme: gender

citing
type: Motivation
broader: commenting
definition: A motivation for W3C Web Annotations for when the user is identifying a citation within a Target. The Body of the Annotation will typically be the item being cited. Citation involves "creating a link between a concept, procedure, or kind of data, and a document or documents," often through the invocation of one or more authors of a publication (Small 1978, 337).

civil libertarianism
in dataset: The CWRC Ontology
type: political affiliation
type: Concept
comment: The description for this term is indebted to DBpedia.
label: mouvement libertaire @fr
alternative label: civil libertarian
broader transitive: Libertarianism
definition: "Civil libertarianism is a strain of political thought that supports civil liberties, or which emphasises the supremacy of individual rights and personal freedoms over and against any kind of authority (such as a state, a corporation, social norms imposed through peer pressure, etc.). Civil libertarianism is not a complete ideology; rather, it is a collection of views on the specific issues of civil liberties and civil rights." (DBpedia, 2017)
in scheme: political affiliation

civil rights movement
in dataset: The CWRC Ontology
type: political affiliation
type: Concept
comment: La description de ce terme est basée sur celle de DBPedia. @fr
comment: The description for this term is indebted to DBpedia.
label: droits civiques @fr
alternative label: civil rights
alternative label: civil rights activist
alternative label: personal rights advocate
alternative label: pro civil rights
definition: "Civil and political rights are a class of rights that protect individuals' freedom from infringement by governments, social organisations, and private individuals. They ensure one's ability to participate in the civil and political life of the society and state without discrimination or repression. Civil rights include the ensuring of people's physical and mental integrity, life, and safety; protection from discrimination on grounds such as race, gender, national origin, colour, age, political affiliation, ethnicity, religion, or disability; and individual rights such as privacy and the freedoms of thought, speech, religion, press, assembly, and movement. Political rights include natural justice (procedural fairness) in law, such as the rights of the accused, including the right to a fair trial; the right to due process; the right to seek redress or a legal remedy; and rights of participation in civil society and politics such as freedom of association, the right to assemble, the right to petition, the right of self-defense, and the right to vote. Civil and political rights form the original and main part of international human rights. They comprise the first portion of the 1948 Universal Declaration of Human Rights (with economic, social, and cultural rights comprising the second portion). The theory of three generations of human rights considers this group of rights to be "first-generation rights", and the theory of negative and positive rights considers them to be generally negative rights." (DBpedia, 2017)
definition: «Les droits civiques désignent les protections et privilèges des libertés fondamentales accordés Ã tous les citoyens par la loi contre toutes les discriminations.» (DBpedia, 2017) @fr
in scheme: political affiliation

classicist
in dataset: The CWRC Ontology
type: occupation
type: Concept
alternative label: amateur classicist
alternative label: classical scholar
in scheme: occupation

cleaner
in dataset: The CWRC Ontology
type: occupation
type: Concept
alternative label: cleaning lady
alternative label: domestic cleaner
in scheme: occupation

clerical work
in dataset: The CWRC Ontology
type: occupation
type: Concept
alternative label: association secretary
alternative label: clerical
alternative label: clerical officer
alternative label: clerk
alternative label: club secretary
alternative label: college secretary
alternative label: executive secretary
alternative label: factory secretary
alternative label: legal secretary
alternative label: pay clerk
alternative label: private secretary
alternative label: receptionist
alternative label: scrivener
alternative label: secretarial work
alternative label: secretary
alternative label: shorthand typist
alternative label: stenographer
alternative label: town clerk
alternative label: typist
alternative label: warehouse clerk
hidden label: secretary and registrar
in scheme: occupation

clothing production
in dataset: The CWRC Ontology
type: occupation
type: Concept
alternative label: cotton manufacturer
alternative label: glove manufacturer
alternative label: hosier
alternative label: linen manufacturer
alternative label: weaving manufacturer
alternative label: woollen manufacturer
in scheme: occupation

clothworker
in dataset: The CWRC Ontology
type: occupation
type: Concept
broader transitive: clothing production
in scheme: occupation

co-operative movement
in dataset: The CWRC Ontology
type: political affiliation
type: Concept
comment: The description for this term is indebted to DBpedia.
label: mouvement pour l'économie sociale @fr
definition: Défense de l'économie sociale, voir Histoire de l'économie sociale â Wikipédia @fr
definition: Supporter of the co-operative movement. History of the cooperative movement - Wikipedia
in scheme: political affiliation
related: social reform

coach
in dataset: The CWRC Ontology
type: occupation
type: Concept
broader transitive: sports
hidden label: coach of the cambridge rowing crew
in scheme: occupation

coastguard
in dataset: The CWRC Ontology
type: occupation
type: Concept
alternative label: coast guard
broader transitive: law enforcement
broader transitive: military
in scheme: occupation

cobbler
in dataset: The CWRC Ontology
type: occupation
type: Concept
alternative label: apprentice shoemaker
alternative label: shoemaker
alternative label: shoemaker's assistant
broader transitive: clothing production
in scheme: occupation

cohabitant
in dataset: The CWRC Ontology
subject-centric predicate: has cohabitant
type: ObjectProperty
range: Person
sub property of: intimate relationship

collector
in dataset: The CWRC Ontology
type: occupation
type: Concept
alternative label: anthropological collector
alternative label: antiquarian
alternative label: antiquary
alternative label: art collector
alternative label: book collector
alternative label: coin collector
alternative label: zoological collector
hidden label: collect irish folklore
hidden label: collecting
hidden label: collector of china and paintings
in scheme: occupation

colonial official
in dataset: The CWRC Ontology
type: occupation
type: Concept
alternative label: colonial administrator
alternative label: colonial civil servant
alternative label: colonial magistrate
alternative label: colonial manager
alternative label: colonial officer
alternative label: colonial organizer
alternative label: colonial prime minister
alternative label: lieutenantGovernor
broader transitive: government
hidden label: chairman of the east india company
hidden label: india agent
hidden label: lord deputy of ireland
hidden label: registrar of the naval prize court in bermuda
hidden label: upper canada's first vice chancellor
hidden label: viceroy of india
hidden label: viceroy of ireland
in scheme: occupation

commissioner
in dataset: The CWRC Ontology
type: occupation
type: Concept
alternative label: bankruptcy commissioner
alternative label: commissioner of bankruptcy
alternative label: commissioner of customs
alternative label: commissioner of inland revenue
alternative label: commissioner of the dockyards
alternative label: customs commissioner
alternative label: excise commissioner
alternative label: parliamentary commissioner
broader transitive: government official
in scheme: occupation

committee member
in dataset: The CWRC Ontology
type: occupation
type: Concept
alternative label: committee man
alternative label: committee president
alternative label: committee woman
alternative label: school board member
in scheme: occupation

communalism
in dataset: The CWRC Ontology
type: political affiliation
type: Concept
comment: The description for this term is indebted to DBpedia.
label: municipalisme libertaire @fr
alternative label: communalist
definition: "Communalism usually refers to a system that integrates communal ownership and federations of highly localised independent communities. A prominent libertarian socialist, Murray Bookchin, defines communalism as "a theory of government or a system of government in which independent communes participate in a federation", as well as "the principles and practice of communal ownership". This usage of communalism appears to have emerged during the late 20th century to distinguish commune-based systems from other political movements and/or governments espousing (if not actually practicing) similar ideas. In particular, earlier communities and movements advocating such practices that were often described as "anarchist", "socialist" and/or "communist". Many historical communities practicing utopian socialism or anarchist communism did implement internal rules of communalist property ownership in the context of federated communalism. It is at least theoretically possible for a federation of communes to include communes which do not practice communalist rules of property, which is to say, that the overall national government may be a federation of communes, but that private property rather than communalist property is the order within each such commune. Karl Marx, often viewed as the founder of modern communism, criticized older forms, including primitive communism and/or utopian socialism, as poorly conceived and/or prone to disintegration in practise. Communalism in the form described above is distinct from the predominant usage in South Asian forms of English: allegiance to a particular ethnic and/or religious group rather than to a broader society. As such, this usage is synonymous with sectarianism and associated with communal violence." (DBpedia, 2017)
in scheme: political affiliation

commune organizer
in dataset: The CWRC Ontology
type: occupation
type: Concept
broader transitive: politics
in scheme: occupation

communism
in dataset: The CWRC Ontology
contrary to: anti-communism
contrary to: liberalism
type: occupation
type: political affiliation
type: Concept
comment: La description de ce terme est basée sur celle de DBPedia. @fr
comment: The description for this term is indebted to DBpedia.
label: communisme @fr
alternative label: christian communist
alternative label: communist
broader transitive: politics
definition: "In political and social sciences, communism (from Latin communis, "common, universal") is a social, political, and economic ideology and movement whose ultimate goal is the establishment of the communist society, which is a socioeconomic order structured upon the common ownership of the means of production and the absence of social classes, money, and the state. Communism includes a variety of schools of thought, which broadly include Marxism, anarchism (anarchist communism), and the political ideologies grouped around both. All these hold in common the analysis that the current order of society stems from its economic system, capitalism, that in this system, there are two major social classes: the working class â who must work to survive, and who make up a majority of society â and the capitalist class â a minority who derive profit from employing the proletariat, through private ownership of the means of production (the physical and institutional means with which commodities are produced and distributed), and that political, social and economic conflict between these two classes will trigger a fundamental change in the economic system, and by extension a wide-ranging transformation of society. The primary element which will enable this transformation, according to this analysis, is the social ownership of the means of production." (DBpedia, 2017)
definition: «Le communisme (du latin communis â commun, universel) est un ensemble de doctrines politiques issues du socialisme et, pour la plupart, du marxisme, opposées au capitalisme et visant Ã l'instauration d'une société sans classes sociales. Plus largement, ce terme est associé au mouvement communiste international né après la Première Guerre mondiale, fruit d'une scission de la IIe Internationale provoquée par les bolcheviks. Il renvoie également, dans le contexte de la guerre froide, Ã une alliance géopolitique (bloc communiste) dominée par l'Union soviétique, ainsi qu'au régime politique Ã parti unique, dictatorial ou totalitaire, en vigueur dans les pays du bloc communiste. Dans son sens d'origine, le communisme est une forme d'organisation sociale sans classes, sans Ãtat et sans monnaie, où les biens matériels seraient partagés. Au XIXe siècle, le mot «communisme» entre dans le vocabulaire du socialisme. Il se rattache en particulier Ã l'Åuvre de Karl Marx et Friedrich Engels - qui le reprennent Ã leur compte en 1848 dans le Manifeste du Parti communiste - et, par extension, Ã l'école de pensée marxiste. En 1917, les bolcheviks, dirigés par Lénine, prennent le pouvoir en Russie lors de la Révolution d'Octobre. Cet évènement change radicalement le sens du mot communisme : il désigne désormais un mouvement politique international, né d'une scission du socialisme, et qui se reconnaît dans le courant révolutionnaire incarné par les bolcheviks comme dans l'interprétation du marxisme par Lénine. Le communisme se présente désormais comme la véritable expression politique du mouvement ouvrier, au détriment de la social-démocratie dont il est issu. Selon cette acception, le communisme constitue l'un des phénomènes les plus importants du XXe siècle, qui a pu être qualifié de «siècle du communisme» tant cette idéologie y a tenu un rôle moteur. Lénine et ses partisans créent en 1919 l'Internationale communiste (dite Troisièm… @fr
in scheme: political affiliation
related: Maoism
related: Marxism

companion
in dataset: The CWRC Ontology
subject-centric predicate: has companion
type: occupation
type: ObjectProperty
type: Concept
label: un·e camarade @fr
range: Person
sub property of: education relationship
sub property of: social relationship
alternative label: humble companion
alternative label: paid companion
in scheme: occupation

composer
in dataset: The CWRC Ontology
type: occupation
type: Concept
alternative label: composed
alternative label: composer of church music
broader transitive: music
in scheme: occupation

computer scientist
in dataset: The CWRC Ontology
type: occupation
type: Concept
broader transitive: scientist
in scheme: occupation

computer work
in dataset: The CWRC Ontology
type: occupation
type: Concept
alternative label: computer programmer
alternative label: database manager
in scheme: occupation
related: data processing

confectioner
in dataset: The CWRC Ontology
type: occupation
type: Concept
hidden label: confectionery production and sale
in scheme: occupation

Congregational Church
is replaced by: Congregationalism
in dataset: The CWRC Ontology
type: Concept
comment: Deprecated in favour of instance Congregationalism.
comment: Désapprouver en faveur de l'instance Ãglises congrégationalistes. @fr
comment: La description de ce terme est basée sur celle de DBPedia. @fr
label: Ãglises congrégationalistes @fr
deprecated: true
term status: deprecated
broader transitive: Christianity
definition: "Congregational churches are Protestant Christian churches practicing congregationalist church governance, in which each congregation independently and autonomously runs its own affairs. Congregationalism is often considered to be a part of the wider Reformed tradition. Many Congregational churches claim their descent from Protestant denominations formed on a theory of union published by the theologian Robert Browne in 1582. These arose from the ideas of nonconforming Protestants during the Puritan Reformation of the Church of England. In Great Britain, the early Congregationalists were called Separatists or Independents to distinguish them from the similarly Calvinistic Presbyterians. Congregational churches were widely established in the Plymouth Colony and the Massachusetts Bay Colony (later New England), and together wrote the Cambridge Platform of 1648 which described the autonomy of the church and its association with others. Within the United States, the model of Congregational churches was carried by migrating settlers from New England into New York, then into the Old North West, and further. With their insistence on independent local bodies, they became important in many social reform movements, including abolitionism, temperance, and women's suffrage. Modern Congregationalism in the United States is largely split into three bodies: the United Church of Christ, the National Association of Congregational Christian Churches and the Conservative Congregational Christian Conference, which is the most theologically conservative. Congregationalism, as defined by the Pew Research Center, is estimated to represent 0.5% of the worldwide Protestant population." (DBpedia, 2017)
definition: «Les Ãglises congrégationalistes sont des églises protestantes de tradition réformée, pratiquant une forme d'organisation d'église où chaque paroisse se gère de manière entièrement autonome et indépendante. Le congrégationalisme se caractérise plus comme un mouvement que comme une dénomination chrétienne en raison de sa conviction fondamentale en faveur de l'autonomie complète de chaque paroisse. Malgré la forte diversité théologique inhérente Ã leur forme d'organisation, la plupart des congrégationalistes se considèrent d'abord comme des réformés, soit traditionnels soit néo-orthodoxes (barthiens). Les congrégationalistes, selon la définition du centre de recherche indépendant Pew Research Center, représentent environ 0,5% de la population protestante mondiale, soit 4 millions de chrétiens répartis essentiellement dans les grands pays anglophones (Royaume-Uni, Ãtats-Unis, Canada, Australie, Afrique du sud, Irlande) et dans quelques «terres de mission» (Argentine, Bulgarie, Ãles Samoa). Leur rôle historique et leur influence, notamment aux Ãtats-Unis, excèdent largement ces chiffres.» (DBpedia, 2017) @fr
in scheme: religion

Congregationalism
in dataset: The CWRC Ontology
type: religion
type: Concept
comment: La description de ce terme est basée sur celle de DBPedia. @fr
comment: The description for this term is indebted to DBpedia.
label: Ãglises congrégationalistes @fr
alternative label: Independent
alternative label: Independent Church
alternative label: Separatist
broader transitive: Dissent (Protestant)
definition: "Congregational churches are Protestant Christian churches practicing congregationalist church governance, in which each congregation independently and autonomously runs its own affairs. Congregationalism is often considered to be a part of the wider Reformed tradition. Many Congregational churches claim their descent from Protestant denominations formed on a theory of union published by the theologian Robert Browne in 1582. These arose from the ideas of nonconforming Protestants during the Puritan Reformation of the Church of England. In Great Britain, the early Congregationalists were called Separatists or Independents to distinguish them from the similarly Calvinistic Presbyterians. Congregational churches were widely established in the Plymouth Colony and the Massachusetts Bay Colony (later New England), and together wrote the Cambridge Platform of 1648 which described the autonomy of the church and its association with others. Within the United States, the model of Congregational churches was carried by migrating settlers from New England into New York, then into the Old North West, and further. With their insistence on independent local bodies, they became important in many social reform movements, including abolitionism, temperance, and women's suffrage. Modern Congregationalism in the United States is largely split into three bodies: the United Church of Christ, the National Association of Congregational Christian Churches and the Conservative Congregational Christian Conference, which is the most theologically conservative. Congregationalism, as defined by the Pew Research Center, is estimated to represent 0.5% of the worldwide Protestant population." (DBpedia, 2017)
definition: «Les Ãglises congrégationalistes sont des églises protestantes de tradition réformée, pratiquant une forme d'organisation d'église où chaque paroisse se gère de manière entièrement autonome et indépendante. Le congrégationalisme se caractérise plus comme un mouvement que comme une dénomination chrétienne en raison de sa conviction fondamentale en faveur de l'autonomie complète de chaque paroisse. Malgré la forte diversité théologique inhérente Ã leur forme d'organisation, la plupart des congrégationalistes se considèrent d'abord comme des réformés, soit traditionnels soit néo-orthodoxes (barthiens). Les congrégationalistes, selon la définition du centre de recherche indépendant Pew Research Center, représentent environ 0,5% de la population protestante mondiale, soit 4 millions de chrétiens répartis essentiellement dans les grands pays anglophones (Royaume-Uni, Ãtats-Unis, Canada, Australie, Afrique du sud, Irlande) et dans quelques «terres de mission» (Argentine, Bulgarie, Ãles Samoa). Leur rôle historique et leur influence, notamment aux Ãtats-Unis, excèdent largement ces chiffres.» (DBpedia, 2017) @fr
in scheme: religion

connoisseur
in dataset: The CWRC Ontology
type: occupation
type: Concept
alternative label: art connoisseur
in scheme: occupation

conscientious objection
in dataset: The CWRC Ontology
type: political affiliation
type: Concept
comment: The description for this term is indebted to DBpedia.
label: objection de conscience @fr
broader transitive: pacifism
definition: "A conscientious objector is an "individual who has claimed the right to refuse to perform military service" on the grounds of freedom of thought, conscience, disability, or religion. In general, conscientious objector status is considered only in the context of military conscription and is not applicable to volunteer military forces. In some countries, conscientious objectors are assigned to an alternative civilian service as a substitute for conscription or military service. Some conscientious objectors consider themselves pacifist, non-interventionist, non-resistant, non-aggressionist, or antimilitarist. On March 8, 1995 the United Nations Commission on Human Rights resolution 1995/83 stated that "persons performing military service should not be excluded from the right to have conscientious objections to military service." This was re-affirmed in 1998, when resolution 1998/77 recognized that "persons [already] performing military service may develop conscientious objections." A number of organisations around the world celebrate the principle on May 15 as International Conscientious Objectors Day. The term has also been extended to objecting to working for the military-industrial complex due to a crisis of conscience." (DBpedia, 2017)
in scheme: political affiliation

conservationist
in dataset: The CWRC Ontology
type: occupation
type: Concept
in scheme: occupation

conservatism
in dataset: The CWRC Ontology
type: occupation
type: political affiliation
type: Concept
comment: La description de ce terme est basée sur celle de DBPedia. @fr
comment: The description for this term is indebted to DBpedia.
label: conservatisme @fr
alternative label: conservative
broader transitive: politics
definition: "Conservatism as a political and social philosophy promotes retaining traditional social institutions in the context of culture and civilization. Some conservatives seek to preserve things as they are, emphasising stability and continuity, while others, called reactionaries, oppose modernism and seek a return to "the way things were". The first established use of the term in a political context originated with François-René de Chateaubriand in 1818, during the period of Bourbon restoration that sought to roll back the policies of the French Revolution. The term, historically associated with right-wing politics, has since been used to describe a wide range of views. There is no single set of policies that are universally regarded as conservative, because the meaning of conservatism depends on what is considered traditional in a given place and time. Thus conservatives from different parts of the worldâeach upholding their respective traditionsâmay disagree on a wide range of issues. Edmund Burke, an 18th-century politician who opposed the French Revolution but supported the American Revolution, is credited as one of the main theorists of conservatism in Britain in the 1790s. According to Quintin Hogg, the chairman of the British Conservative Party in 1959, "Conservatism is not so much a philosophy as an attitude, a constant force, performing a timeless function in the development of a free society, and corresponding to a deep and permanent requirement of human nature itself."" (DBpedia, 2017)
definition: «Le conservatisme est une philosophie politique qui est en faveur des valeurs traditionnelles et qui s'oppose au progressisme. Les cultures ayant chacune des valeurs différentes, les conservateurs selon leur culture ont des buts différents. Mais tous les conservateurs promeuvent la défense (statu quo) ou le retour Ã des valeurs établies (statu quo ante). Pour Michael Freeden, le conservatisme croit seulement en un changement limité de ce qui est naturel ou organique ; aussi, pour lui, l'ordre social est indépendant de la volonté humaine. Le terme vient de «conserver» ; du latin conservare, «maintenir, observer (une loi, une coutume)» composé de servare «préserver, garder». Bien que ce ne soit pas une idéologie en soi, le conservatisme est une philosophie politique dont les idées sont en grande partie liées Ã leur contexte d'existence. Il est défini en partie par l'accent mis sur la tradition comme source de sagesse, bien au-delà de ce qui peut être démontré ou explicitement établi. Il se fonde sur la conservation d'un ordre préétabli, selon les conventions, chacun Ã sa place.» (DBpedia, 2017) @fr
in scheme: political affiliation
related: neo-conservatism

conservative feminism
in dataset: The CWRC Ontology
type: political affiliation
type: Concept
comment: The description for this term is indebted to DBpedia.
label: féminisme conservateur @fr
broader transitive: feminism
definition: Feminism that tends towards social conservativism. See Feminism - Wikipedia
definition: Féminisme qui tend vers le conservatisme social. Voir Féminisme â Wikipédia @fr
in scheme: political affiliation
related: conservatism

Conservative Party (UK)
in dataset: The CWRC Ontology
type: political affiliation
type: Concept
comment: The description for this term is indebted to DBpedia.
label: Parti Conservateur (Royaume-Uni) @fr
alternative label: Tory Party
alternative label: Tory Party (Britain)
alternative label: Tory radical
alternative label: conservative party
alternative label: disaffected Tories
alternative label: tory
broader transitive: conservatism
definition: "The Tories were members of two political parties which existed, sequentially, in the Kingdom of England, the Kingdom of Great Britain, and later the United Kingdom of Great Britain and Ireland from the 17th to the early 19th centuries. The first Tories emerged in 1678 in England, when they opposed the Whig-supported Exclusion Bill which set out to disinherit the heir presumptive James, Duke of York (who eventually became James II of England and VII of Scotland). This party ceased to exist as an organised political entity in the early 1760s, although it was used as a term of self-description by some political writers. A few decades later, a new Tory party would rise to establish a hold on government between 1783 and 1830, with William Pitt the Younger followed by Robert Jenkinson, 2nd Earl of Liverpool. The Earl of Liverpool was succeeded by fellow Tory Arthur Wellesley, 1st Duke of Wellington, whose term included the Catholic Emancipation, which occurred mostly due to the election of Daniel O'Connell as a Catholic MP from Ireland. When the Whigs subsequently regained control, the Representation of the People Act 1832 removed the rotten boroughs, many of which were controlled by Tories. In the following general election, the Tory ranks were reduced to 180 MPs. Under the leadership of Robert Peel, the Tamworth Manifesto was issued, which began to transform the Tories into the Conservative Party. However, Peel lost many of his supporters by repealing the Corn Laws, causing the party to break apart. One faction, led by the Earl of Derby and Benjamin Disraeli, survived to become the modern Conservative Party, whose members are commonly still referred to as Tories." (DBpedia, 2017)
in scheme: political affiliation

constitutionalism
in dataset: The CWRC Ontology
type: political affiliation
type: Concept
comment: La description de ce terme est basée sur celle de DBPedia. @fr
comment: The description for this term is indebted to DBpedia.
label: Constitutionnalisme @fr
alternative label: constitutional feminist
alternative label: constitutionalist
definition: "Constitutionalism is "a complex of ideas, attitudes, and patterns of behavior elaborating the principle that the authority of government derives from and is limited by a body of fundamental law". Political organisations are constitutional to the extent that they "contain institutionalized mechanisms of power control for the protection of the interests and liberties of the citizenry, including those that may be in the minority". As described by political scientist and constitutional scholar David Fellman: Constitutionalism is descriptive of a complicated concept, deeply embedded in historical experience, which subjects the officials who exercise governmental powers to the limitations of a higher law. Constitutionalism proclaims the desirability of the rule of law as opposed to rule by the arbitrary judgment or mere fiat of public officialsâ¦. Throughout the literature dealing with modern public law and the foundations of statecraft the central element of the concept of constitutionalism is that in political society government officials are not free to do anything they please in any manner they choose; they are bound to observe both the limitations on power and the procedures which are set out in the supreme, constitutional law of the community. It may therefore be said that the touchstone of constitutionalism is the concept of limited government under a higher law." (DBpedia, 2017)
definition: «Le constitutionnalisme est une théorie du droit qui insiste sur le rôle et la fonction de la Constitution dans la hiérarchie des normes par rapport Ã la loi, ainsi que sur le contrôle de constitutionnalité des lois. On l'oppose parfois au légicentrisme, qui défend la suprématie de la loi, émanation de la souveraineté populaire. En droit international, le constitutionnalisme est une conception qui tend Ã s'opposer au pluralisme juridique.» (DBpedia, 2017) @fr
in scheme: political affiliation

construction
in dataset: The CWRC Ontology
type: occupation
type: Concept
alternative label: builder
alternative label: building
alternative label: building improver
alternative label: carpenter
alternative label: construction supervisor
alternative label: gothic builder bricklayer
alternative label: house builder
alternative label: renovator
alternative label: road construction supervisor
alternative label: shipwright
hidden label: builder, architect
hidden label: clerk of the king's works
hidden label: clerk of the works
in scheme: occupation

consultant
in dataset: The CWRC Ontology
type: occupation
type: Concept
alternative label: management consultant
hidden label: drug adviser and consultant
in scheme: occupation

nonconformant behaviour
in dataset: The CWRC Ontology
subject-centric predicate: has nonconformant behaviour
type: ObjectProperty
label: comportement contesté @fr
sub property of: education relationship

context focus
type: ObjectProperty
range: context
sub property of: hasBody
definition: Indicates the focus or primary subject of a Context annotation. Note: The object of this property, the Context focus, becomes the subject of the subject-centric properties that can be derived from Context predicates via SPARQL CONSTRUCT queries.

contractor
in dataset: The CWRC Ontology
type: occupation
type: Concept
in scheme: occupation

contrary to
in dataset: The CWRC Ontology
type: ObjectProperty
type: SymmetricProperty
label: contraire Ã @fr

cooking
in dataset: The CWRC Ontology
type: occupation
type: Concept
alternative label: cook
in scheme: occupation

co-op organizer
in dataset: The CWRC Ontology
type: occupation
type: Concept
alternative label: co op organizer
broader transitive: politics
in scheme: occupation

cooper
in dataset: The CWRC Ontology
type: occupation
type: Concept
in scheme: occupation

copyist
in dataset: The CWRC Ontology
type: occupation
type: Concept
alternative label: copyist of illuminated manuscripts
alternative label: legal copyist
alternative label: music copyist
alternative label: scientific copyist
hidden label: copyists of illuminated manuscripts
in scheme: occupation
related: transcriber

Cornish
in dataset: The CWRC Ontology
type: national heritage
type: Concept
comment: La description de ce terme est basée sur celle de DBPedia. @fr
comment: The description for this term is indebted to DBpedia.
label: Corniques @fr
definition: "Cornish people or Cornish (Cornish: Kernowyon) are an ethnic group associated with Cornwall, in the south west of Great Britain, administered as part of England, and a recognised national minority in the United Kingdom. The Cornish thus represent a distinct ethnic group within the UK, which can trace its roots to the ancient Britons who inhabited southern and central Great Britain before the Roman conquest, and some in the county today continue to assert a distinct identity, separately or in addition to English or British identities. Cornish identity has been adopted by migrants into Cornwall, as well as by emigrant and descendant communities from Cornwall, the latter sometimes referred to as the Cornish diaspora. Although not included as an explicit option in the UK census, the numbers of" (DBpedia, 2018)
definition: «Les Corniques sont un groupe ethnique originaire des Cornouailles, en Angleterre (Ã ne pas confondre avec les Cornouaillais qui sont les habitants de la Cornouaille â sans « s » â, région de Bretagne). C'est un peuple celtique qui parlait la langue cornique jusqu'au XVIIIe siècle et qui s'est mis Ã la cultiver de nouveau depuis le XXe siècle, bien que de manière minoritaire. Selon une enquête de 2004, 35 % des habitants des Cornouailles se considèrent corniques (environ 181 000 personnes).» (DBpedia, 2018) @fr
in scheme: national heritage

corporate or organizational director
in dataset: The CWRC Ontology
type: occupation
type: Concept
alternative label: company director
alternative label: deputy director
alternative label: honorary director
alternative label: managing director
hidden label: chairman of railway company
hidden label: president of the baby and foundling hospital
in scheme: occupation

counsellor
in dataset: The CWRC Ontology
type: occupation
type: Concept
alternative label: advisor
alternative label: careers advisor
alternative label: counseling
hidden label: counselled hundreds of women
in scheme: occupation

courtier
in dataset: The CWRC Ontology
type: occupation
type: Concept
alternative label: bed chamber woman
alternative label: groom of the chamber
alternative label: keeper of the robes
alternative label: lady in waiting
alternative label: lady of the bedchamber
hidden label: chamberlain to the king of bavaria
in scheme: occupation
related: aristocrat

cousin
in dataset: The CWRC Ontology
subject-centric predicate: has cousin
type: ObjectProperty
range: Person
sub property of: relative

cousin of
in dataset: The CWRC Ontology
type: ObjectProperty
domain: Person
label: cousin de @fr
range: Person
sub property of: relative of
inverse of: has cousin
broader: relatedTo

Covenanters
in dataset: The CWRC Ontology
type: political affiliation
type: Concept
comment: La description de ce terme est basée sur celle de DBPedia. @fr
comment: The description for this term is indebted to DBpedia.
label: Covenantaire @fr
alternative label: Covenanting
definition: "The Covenanters were a Scottish Presbyterian movement that played an important part in the history of Scotland, and to a lesser extent that of England and Ireland, during the 17th century. Presbyterian denominations tracing their history to the Covenanters and often incorporating the name continue the ideas and traditions in Scotland and internationally. They derive their name from the term covenant after the Covenant between God and the Israelites in the Old Testament. There were two important covenants in Scottish history, the National Covenant and the Solemn League and Covenant." (DBpedia, 2017)
definition: «Les Covenantaires formèrent un important mouvement religieux et politique en Ãcosse au XVIIe siècle. Du point de vue religieux, ce mouvement s'attacha surtout Ã promouvoir et Ã développer le presbytérianisme, et Ã en faire une forme de gouvernement souhaitée par le peuple, en opposition avec l'Ãpiscopalisme, qui avait les faveurs de la couronne. Du point de vue politique, ce mouvement vit d'importantes évolutions du caractère et du fonctionnement du Parlement écossais, qui commença Ã se démarquer progressivement de ses origines médiévales. Dans son ensemble, ce mouvement était essentiellement conservateur dans le ton, mais il amorça une révolution qui embrasa l'Ãcosse, l'Angleterre et l'Irlande, et qui fut appelée les guerres des Trois Royaumes. Le nom Covenantaire provient de «covenant», qui est un mot de l'ancien français, passé dans le moyen anglais, qui signifiait Ã l'origine convention, chose convenue, et qui désigna, dans la loi anglaise, un accord formel, une promesse solennelle. En Ãcosse, le terme prit le sens biblique d'«Alliance» ou de «Promesse». Le premier engagement de ce genre fut signé par les Ãcossais de toutes les classes, en 1588, lorsque Philippe II menaçait l'Angleterre et la Réforme par sa fameuse Invincible Armada. Il contenait une profession de foi protestante, une réprobation de l'Ãglise romaine et un serment de défense mutuelle et d'union. La destruction de la flotte espagnole rendit cette confédération sans objet. Au siècle suivant, le «National Covenant» de 1638, qui prit comme base des documents précédents du même genre, était surtout intéressé Ã préserver la Réforme de toute innovation issue de la couronne britannique. Son document jumeau de 1643, «Solemn League and Covenant», se préoccupait également de religion, même s'il s'agissait principalement d'un traité d'alliance entre les covenantaires d'Ãcosse et le Parlement d'Angleterre, soucieux de se soutenir lors de la guerre civile de p… @fr
in scheme: political affiliation

craftsperson
in dataset: The CWRC Ontology
type: occupation
type: Concept
alternative label: arts and crafts
alternative label: craft work
alternative label: craftswoman
alternative label: furniture restorer
alternative label: handicraft
alternative label: handicrafts
alternative label: shellwork
hidden label: decorator of reproduction furniture
in scheme: occupation

credential
in dataset: The CWRC Ontology
subject-centric predicate: has credential
type: ObjectProperty
range: credential
sub property of: education relationship

credential held by
is replaced by: credential of
in dataset: The CWRC Ontology
type: DeprecatedProperty
comment: Deprecated in favour of instance credential of.
comment: Désapprouver en faveur de l'instance . @fr
domain: credential
range: Person
deprecated: true
inverse of: has credential in
term status: deprecated

credential of
in dataset: The CWRC Ontology
type: ObjectProperty
domain: credential
range: Person
inverse of: has credential

credential subject
in dataset: The CWRC Ontology
subject-centric predicate: has credential subject
type: ObjectProperty
range: educational subject
sub property of: education relationship

credential subject of
in dataset: The CWRC Ontology
type: ObjectProperty
domain: educational subject
range: Person
inverse of: has credential subject

Creole
in dataset: The CWRC Ontology
type: ethnicity
type: Concept
comment: La description de ce terme est basée sur celle de DBPedia. @fr
comment: The description for this term is indebted to DBpedia.
label: Créole @fr
definition: "The term Creole and its cognates in other languages â such as crioulo, criollo, creolo, créole, kriolu, criol, kreyol, kreol, kriol, krio, etc. â have been applied to people in different countries and epochs, with rather different meanings. Typically, are partially or fully descended from Caucasian European colonial settlers. Their language, culture and/or racial origin represents the creolization resulting from the interaction and adaptation of colonial-era emigrants from Europe with non-European peoples, climates, and cuisines." (DBpedia, 2018)
definition: «Le terme créole, Ã la fois nom et adjectif, en espagnol ancien creollo, devenu criollo. La première nation créole du monde fut les iles du cap-vert, découvertes par les portugais en 1456 et très vite peuplées d'européens et d'esclaves africains dont le métissage créa le premier peuple créole du monde, le Crioulo. Le mot crioulo dériverait du portugais "criado" qui signifie "serviteur". Le créole fut ensuite "exporté" aux Amériques après la découverte de l'Amérique par Christophe Colomb en 1492. Le terme créole est passé dans les langues française et anglaise entre 1595 et 1605, désigne d'une façon générale une personne née dans une ancienne colonie de parents venus d'ailleurs. Il est souvent compris restrictivement comme s'appliquant Ã une personne d'ascendance européenne.» (DBpedia, 2018) @fr
in scheme: ethnicity

Creole
in dataset: The CWRC Ontology
type: race or colour
type: Concept
label: Créole @fr
definition: Describes a person often born in a European (often British) colony, of "mixed race" parentage, usually but not always the child of both "White" and so-called "non-White" ancestry. The term originally designated "parts of the population made up of Caribbean descendants of colonists, born and brought up in the New World. In the context of postcolonial studies, the term 'creolization' is conceived as 'the process of intermixing and cultural change that produces a Creole society,' especially in the Caribbean (Ashcrofts, Griffiths, and Tiffin 1998, 58)" (Hawley et al., Encyclopedia of Post Colonial Studies 116).
in scheme: race or colour

cricket
in dataset: The CWRC Ontology
type: occupation
type: Concept
alternative label: cricket team captain
alternative label: cricketer
broader transitive: sports
in scheme: occupation

criminal
in dataset: The CWRC Ontology
type: occupation
type: Concept
alternative label: blackmailer
alternative label: con man
alternative label: convict
alternative label: thief
alternative label: transported criminal
hidden label: blackmailer extortionist
hidden label: confidence trickster
in scheme: occupation

critic
in dataset: The CWRC Ontology
type: occupation
type: Concept
alternative label: art critic
alternative label: drama critic
alternative label: film critic
alternative label: literary critic
alternative label: music critic
alternative label: television critic
alternative label: theatre critic
broader transitive: writer
hidden label: assistant drama critic
in scheme: occupation

cultural form
in dataset: The CWRC Ontology
subject-centric predicate: has a cultural form
type: ObjectProperty
label: forme culturelle @fr
sub property of: cultural form relationship

cultural form of
in dataset: The CWRC Ontology
type: ObjectProperty
inverse of: has a cultural form
definition: This is the inverse of has a cultural form.

cultural form relationship
in dataset: The CWRC Ontology
range includes: Work
range includes: AdminPlaceConcept
range includes: Feature
range includes: FormalOrganization
range includes: Person
subject-centric predicate: relates by cultural form to
type: ObjectProperty
sub property of: biographical relationship

curator
in dataset: The CWRC Ontology
type: occupation
type: Concept
alternative label: curator of art exhibitions
alternative label: gallery curator
alternative label: museum curator
in scheme: occupation
related: archivist
related: exhibitions

The Canadian Writing Research Collaboratory
type: Organization
name: Le Collaboratoire scientifique des écrits du Canada @fr

bicyclist
in dataset: The CWRC Ontology
type: occupation
type: Concept
alternative label: bicycling
broader transitive: sports
in scheme: occupation

The Woman-Identified Woman
issued: 1970
type: Book

Radicalesbians
type: Organization
based near: New York, NY, USA

Orlando: Women's Writing in the British Isles from the Beginnings to the Present
issued: 2006-2016
type: Book

Patricia Clements
first name: Patricia
last name: Clements
type: Person

Susan Brown
first name: Susan
last name: Brown
type: Person

Isobel Grundy
first name: Isobel
last name: Grundy
type: Person

Cambridge University Press
type: Organization
based near: Cambridge

Sorting things in: Feminist knowledge representation and changing modes of scholarly production
language: en
page end: 325
page start: 317
uri: http://www.sciencedirect.com/science/article/pii/S0277539506000215
type: AcademicArticle

Women's Studies International Forum
issued: May-June 2006
type: Journal

dairy work
in dataset: The CWRC Ontology
type: occupation
type: Concept
alternative label: milker
alternative label: milkwoman
broader transitive: farming
in scheme: occupation

dance
in dataset: The CWRC Ontology
type: occupation
type: Concept
alternative label: ballet dancer
alternative label: choreographer
alternative label: chorus girl
alternative label: dancer
hidden label: dancer and choreographer
in scheme: occupation

Darwinism
in dataset: The CWRC Ontology
type: religion
type: Concept
comment: La description de ce terme est basée sur celle de DBPedia. @fr
comment: The description for this term is indebted to DBpedia.
label: Darwinisme @fr
alternative label: Darwinist
alternative label: evolutionist
broader transitive: secularism
definition: "Darwinism is a theory of biological evolution developed by the English naturalist Charles Darwin (1809-1882) and others, stating that all species of organisms arise and develop through the natural selection of small, inherited variations that increase the individual's ability to compete, survive, and reproduce. Also called Darwinian theory, it originally included the broad concepts of transmutation of species or of evolution which gained general scientific acceptance after Darwin published On the Origin of Species in 1859, including concepts which predated Darwin's theories, but subsequently referred to specific concepts of natural selection, of the Weismann barrier or in genetics of the central dogma of molecular biology. Though the term usually refers strictly to biological evolution, creationists have appropriated it to refer to the origin of life, and it has even been applied to concepts of cosmic evolution, both of which have no connection to Darwin's work. It is therefore considered the belief and acceptance of Darwin's and of his predecessors' workâin place of other theories, including divine design and extraterrestrial origins. English biologist Thomas Henry Huxley coined the term Darwinism in April 1860. It was used to describe evolutionary concepts in general, including earlier concepts published by English philosopher Herbert Spencer. Many of the proponents of Darwinism at that time, including Huxley, had reservations about the significance of natural selection, and Darwin himself gave credence to what was later called Lamarckism. The strict neo-Darwinism of German evolutionary biologist August Weismann gained few supporters in the late 19th century. During the approximate period of the 1880s to about 1920, sometimes called "the eclipse of Darwinism," scientists proposed various alternative evolutionary mechanisms which eventually proved untenable. The development of the modern evolutionary synthesis from the 1930s to the 1950s, incorporating natural sel…
definition: «Le darwinisme désigne, en son sens strict, la théorie, formulée en 1859 (in De l'origine des espèces) par le naturaliste anglais Charles Darwin, et qui explique « l'évolution biologique des espèces par la sélection naturelle et la concurrence vitale ». Il est aussi relativement courant d'entendre parler d'évolution darwinienne, pour parler de l'évolution autonome d'un pool quelconque (population et distribution de caractères) sur plusieurs générations.» (DBpedia, 2018) @fr
in scheme: religion

data processing
in dataset: The CWRC Ontology
type: occupation
type: Concept
alternative label: data recorder
alternative label: encoder
in scheme: occupation
related: computer work

The CWRC Ontology
jurisdiction: Canada
attribution URL: http://www.cwrc.ca/
license: http://creativecommons.org/licenses/by-nc/4.0/
ctb: Constance Crompton
ctb: Members of the Orlando Project
fnd: Social Sciences and Humanities Research Council
pdr: Susan Brown
creator: Abigel Lemak
creator: Alliyya Mo
creator: Colin Faulkner
creator: Deborah Stacey
creator: Gurjap Singh
creator: Jade Penancier
creator: Jasmine Drudge-Willson
creator: Joel Cummings
creator: John Simpson
creator: Kim Martin
creator: Robert Warren
creator: Susan Brown
description: L'Ontologie CWRC est l'ontologie du Collaboratoire scientifique des écrits du Canada. @fr
description: The CWRC Ontology is the ontology of the Canadian Writing Research Collaboratory.
publisher: The Canadian Writing Research Collaboratory
subject: sh2009007122
subject: sh85013838
subject: sh85019388
subject: sh85043777
subject: sh85077519
title: L'Ontologie CWRC @fr
entities: 1745
triples: 19533
type: Dataset

daughter
in dataset: The CWRC Ontology
subject-centric predicate: has daughter
type: ObjectProperty
range: Person
sub property of: child

daughter of
in dataset: The CWRC Ontology
type: ObjectProperty
domain: Person
label: fille de @fr
range: Person
sub property of: child of
inverse of: has daughter
broader: parent

Getty Art and Architecture Thesaurus
date: 2017
uri: http://www.getty.edu/research/tools/vocabularies/aat/
type: Document

The J. Paul Getty Trust
type: Organization

A Room of One's Own
issued: 1929
type: Book

Virginia Woolf
first name: Virginia
last name: Woolf
type: Person

The Hogarth Press
type: Organization
based near: London

death date
in dataset: The CWRC Ontology
subject-centric predicate: has death date
type: ObjectProperty
sub property of: death relationship

death date of
in dataset: The CWRC Ontology
type: ObjectProperty
range: Person
inverse of: has death date

death place
in dataset: The CWRC Ontology
range includes: AdminPlaceConcept
range includes: Feature
subject-centric predicate: has death place
type: ObjectProperty
sub property of: death relationship
sub property of: spatial relationship

death place of
in dataset: The CWRC Ontology
type: ObjectProperty
range: Person
inverse of: has death place

death relationship
in dataset: The CWRC Ontology
range includes: Work
range includes: AdminPlaceConcept
range includes: Feature
range includes: FormalOrganization
range includes: Person
subject-centric predicate: relates by death to
type: ObjectProperty
sub property of: biographical relationship

decoder
in dataset: The CWRC Ontology
type: occupation
type: Concept
alternative label: cable decoder
alternative label: cipher breaker
alternative label: code breaker
alternative label: cryptologist
in scheme: occupation

deism
in dataset: The CWRC Ontology
type: religion
type: Concept
comment: La description de ce terme est basée sur celle de DBPedia. @fr
comment: The description for this term is indebted to DBpedia.
label: déisme @fr
alternative label: deist
definition: "Deism (/ËdiË.ÉªzÉm/â or /ËdeÉª.ÉªzÉm/), derived from a Latin word "deus" meaning "god", is a theological/philosophical position that combines the rejection of revelation and authority as a source of religious knowledge with the conclusion that reason and observation of the natural world are sufficient to determine the existence of a single creator of the universe. Deism gained prominence among intellectuals during the Age of Enlightenmentâespecially in Britain, France, Germany and the United Statesâwho, raised as Christians, believed in one God but became disenchanted with organized religion and notions such as the Trinity, Biblical inerrancy and the supernatural interpretation of events such as miracles. Included in those influenced by its ideas were leaders of the American and French Revolutions. Today, deism is considered to exist in two principal forms: classical and modern where the classical view takes what is called a "cold" approach by asserting the non-intervention of deity in the natural behavior of the created universe, while the modern deist formulation can be either "warm" (citing an involved deity) or cold, non-interventionist creator. These lead to many subdivisions of modern deism which tends, therefore, to serve as an overall category of belief. Despite this classification of Deism today, classical Deists themselves rarely wrote or accepted that the Creator is a non-interventionist during the flowering of Deism in the 16th and 17th centuries; using straw man arguments, their theological critics attempted to force them into this position." (DBpedia, 2018)
definition: «Le déisme, du latin deus (dieu), est une croyance ou une doctrine qui affirme l'existence d'un Dieu et son influence dans la création de l'Univers, sans s'appuyer sur des textes sacrés ou dépendre d'une religion révélée. Pour la pensée déiste, certaines caractéristiques de Dieu peuvent être comprises par les facultés intellectuelles de l'Homme. Le déisme prône une « religion naturelle » qui se vit par l'expérience individuelle et qui ne repose pas sur une tradition écrite. Pour certains déistes, on peut avoir une relation avec Dieu mais elle est directe (notamment par la contemplation). Il s'agit par conséquent d'une croyance individuelle et irréligieuse. Les déistes rejettent tous les événements surnaturels (prophéties, miracles) et affirment que Dieu (ou « l'Architecte suprême ») a un plan pour l'Univers, que Dieu n'altère ni n'intervient dans les affaires humaines, ni ne suspend les lois naturelles qui régissent l'Univers. Le déisme n'est donc pas un théisme. Ce que les religions structurées voient comme révélation divine et livres saints, un déiste le voit comme de simples interprétations faites par l'homme; ainsi aucune source religieuse ne peut faire autorité.» (DBpedia, 2018) @fr
in scheme: religion

delivery person
in dataset: The CWRC Ontology
type: occupation
type: Concept
alternative label: dispatch rider
alternative label: errand boy
alternative label: messenger girl
alternative label: newspaper deliverer
in scheme: occupation

democrat
in dataset: The CWRC Ontology
type: political affiliation
type: Concept
alternative label: democratic
alternative label: pro-democracy
definition: An advocate of democracy. See Democracy - Wikipedia.
in scheme: political affiliation

dentist
in dataset: The CWRC Ontology
type: occupation
type: Concept
broader transitive: healthcare provider
in scheme: occupation

designer
in dataset: The CWRC Ontology
type: occupation
type: Concept
alternative label: fabric designer
alternative label: gothic designer
alternative label: graphic designer
alternative label: house decoration
alternative label: housing designer
alternative label: interior decorator
alternative label: interior design
alternative label: interior designer
hidden label: prosthetics designer
in scheme: occupation

determinism
in dataset: The CWRC Ontology
type: religion
type: Concept
comment: La description de ce terme est basée sur celle de DBPedia. @fr
comment: The description for this term is indebted to DBpedia.
label: déterminisme @fr
alternative label: predestinarianism
definition: "Determinism is the philosophical doctrine that all events transpire in virtue of some necessity and are therefore inevitable. Traditionally, the view relies on strict notions of causality, and most philosophical arguments in its favor have attempted at clear definitions of cause and effect as a basis for the belief that determinism is true. Notably, the idea that the past choices of seemingly rational agents could have been performed differently - or even the idea that the future decisions of such agents will turn out to be other than what they will - is usually challenged under this view. Thus, the "problem" of free will - or the idea of free will as being an "illusion" - often arises as a result of the main claim made by determinism, that is, that the past, present, and future is identifiable with an essentially unbreakable chain of circumstances of which no single link in such a chain could possibly be avoided or altered. Some determinists deny the idea of any true "possibility" or "randomness" within reality altogether, even asserting that such ideas are only a creation of the mind and/or merely the result of imagination - ultimately a result of ignorance in the face of real explanations for such phenomena - which could otherwise, in principle, be either derived by reason or discovered by empirical experimentation. However, addressing free will is its own concern, and any discussion of determinism does not demand any discussion of free will. In addition to these issues, the length to which language can actually capture what exactly is at stake, assuming that anything is at stake at all - or even what the true nature of reality really is in spite of how convincing the nature of the concept of determinism seems to be - is itself disputed. This final note verges on - or fully engages in - the territory of the philosophy of language. The truth of determinism is often acknowledged - at bottom - as a belief, rather than a fact or scientifically viable theory or law. …
definition: «Le déterminisme est une notion philosophique selon laquelle la succession de chaque événement est déterminée en vertu du principe de causalité, du passé et des lois de la physique.» (DBpedia, 2018) @fr
in scheme: religion

My Gender Workbook: How to Become a Real Man, a Real Woman, the Real You, or Something Else Entirely
issued: 1998
type: Book

Routledge
type: Organization
based near: New York, NY, USA and London, UK

Kate Bornstein
first name: Kate
last name: Bornstein
type: Person

diploma
in dataset: The CWRC Ontology
type: credential
type: Concept
alternative label: Diploma
alternative label: Diploma in Social Work
alternative label: Diplome d'Etudes de Civilisation Française
alternative label: diploma in Psychopathology
alternative label: diploma in agriculture
alternative label: diploma in journalism
alternative label: diploma in literature
alternative label: diploma in school counselling
definition: Educational diploma.
in scheme: credential

diplomat
in dataset: The CWRC Ontology
type: occupation
type: Concept
alternative label: ambassador
alternative label: attaché
alternative label: british consul
alternative label: consul general
alternative label: diplomatic negotiation
alternative label: diplomatist
alternative label: envoy
alternative label: foreign service
hidden label: ambassador to constantinople
hidden label: ambassador to france
hidden label: ambassador to spain
hidden label: consul general in london for hawaii
hidden label: oriental secretary
in scheme: occupation
related: politics

director
in dataset: The CWRC Ontology
type: occupation
type: Concept
alternative label: directors
in scheme: occupation

disestablishmentarianism
in dataset: The CWRC Ontology
type: political affiliation
type: Concept
comment: The description for this term is indebted to DBpedia.
label: sécularisme anglais @fr
alternative label: anti-anglican
alternative label: anti-episcopal
alternative label: anti-episcopalian
alternative label: anti-tithes
definition: "Disestablishmentarianism refers to campaigns to sever links between church and state, particularly in relation to the Church of England as an established church. It was initially a movement in the United Kingdom in the 18th century. The established churches in Wales and Ireland could not count on even nominal adherence by a majority of the population of those countries. In Ireland, the predominantly Roman Catholic population campaigned against the position of the established Anglican Church of Ireland - eventually disestablished in Ireland from 1 January 1871. In England there was a campaign by Liberals, dissenters and nonconformists to disestablish the Church of England in the 19th century. The campaigners were called "Liberationists" (the "Liberation Society" was founded by Edward Miall in 1844). This campaign failed, but nearly all of the legal disabilities of nonconformists were gradually dismantled. The campaign for disestablishment was revived in the 20th century when Parliament rejected the 1929 revision of the Book of Common Prayer, leading to calls for separation of Church and State to prevent political interference in matters of worship. In the late 20th century, reform of the House of Lords also brought into question the position of the Lords Spiritual. Nick Clegg, the former Deputy Prime Minister of the United Kingdom and Leader of the Liberal Democrats, said in April 2014 that he thought the Church of England and the British state should be separated "in the long run". Prime Minister David Cameron, responding to Clegg's comments, said that disestablishmentarianism is "a long-term Liberal idea, but it is not a Conservative one" and that he believed having an established church works well. The Church of England was disestablished in Wales in 1920, becoming the Church in Wales. An Act of the British Parliament enabling the disestablishment of the Church of Ireland was passed in 1869, coming into effect on 1 January 1871. The Church of Scotland was disesta…
in scheme: political affiliation

Dissent (Protestant)
in dataset: The CWRC Ontology
type: political affiliation
type: religion
type: Concept
label: dissidents (ou non-conformistes) @fr
alternative label: Dissenter
alternative label: Dissenting Churches
alternative label: Dissenting Presbyterian
alternative label: Nonconformist
alternative label: Rational Dissent
broader transitive: Protestantism
definition: "English Dissenters were Christians who separated from the Church of England in the 16th, 17th and 18th centuries. A dissenter (from the Latin dissentire, "to disagree") is one who disagrees in matters of opinion, belief, etc. English Dissenters opposed state interference in religious matters, and founded their own churches, educational establishments, and communities; some emigrated to the New World. They originally agitated for a wide-reaching Protestant Reformation of the Established Church, and triumphed briefly under Oliver Cromwell." (DBpedia, 2017) See also: Nonconformist - Wikipedia
definition: "In English church history, a nonconformist was a Protestant who did not "conform" to the governance and usages of the established Church of England. Broad use of the term was precipitated after the Restoration of the British monarchy in 1660, when the Act of Uniformity 1662 re-established the opponents of reform within the Church of England. By the late 19th-century the term specifically included the Reformed Christians (Presbyterians, Congregationalists and other Calvinist sects), plus the Baptists and Methodists. The English Dissenters such as the Puritans who violated the Act of Uniformity 1559 â typically by practising radical, sometimes separatist, dissent â were retrospectively labelled as nonconformists." (DBpedia, 2017) Dissenting Protestantism and nonconformism are historical phenomena that become less relevant in the United Kingdom from the early twentieth century onwards, and many groups such as Baptists and Presbyterians have significant followings in other parts of the world.
definition: «Les Dissidents anglais (en anglais : English Dissenters ou nonconformists) sont des protestants anglais qui firent sécession de l'Ãglise d'Angleterre. Ils s'opposaient Ã l'interférence de l'Ãtat dans les affaires religieuses et fondèrent leurs propres communautés du XVIe au XVIIIe siècle. Les Dissidents triomphèrent un temps lors du gouvernement d'Oliver Cromwell, mais après la Restauration de la monarchie, en 1660, l'épiscopat fut rétabli et les droits civiques des Dissidents limités, dès les années 1660, par une série de lois dont l'Act of Uniformity, le Corporation Act et le Test Act. Ce n'est qu'en 1828 que ces lois discriminatoires sont abrogées. Parmi les Dissidents les plus connus, on peut citer le fondateur de la secte des Puritains Henry Jacob (en) (1563-1624), l'éditeur Joseph Johnson (1738-1809), la mystique Jane Leade (1623-1704), le philosophe Richard Price (1723-1791), ou encore le chimiste et théologien Joseph Priestley (1733-1804), ainsi que le fondateur d'une académie dissidente Ã Kendal (Cumbria), le révérend Caleb Rotherham, qui instruisit l'un des pères de la Révolution industrielle, le fondeur et beau-frère de Joseph Priestley, John Wilkinson.» (DBpedia, 2017)Voir aussi: Non-conformistes â Wikipédia @fr
definition: «Les non-conformistes, appelés aussi Dissidents (dissenters), étaient ceux qui, en Angleterre, refusaient de suivre la doctrine de l'Ãglise anglicane. Il s'agissait notamment des Puritains, des Presbytériens, des Anabaptistes ou des Calvinistes. On oppose les non-conformistes aux Conformistes.» (DBpedia, 2017) @fr
in scheme: religion

Dissenters
is replaced by: Dissent (Protestant)
in dataset: The CWRC Ontology
type: Concept
comment: Deprecated in favour of instance Dissent (Protestant).
comment: Désapprouver en faveur de l'instance dissidents (ou non-conformistes). @fr
label: dissidents (ou non-conformistes) @fr
deprecated: true
term status: deprecated
broader transitive: Anglicanism
definition: "One who dissents or disagrees in matters of opinion, belief, &c. The term "dissenter" is, however, practically restricted to the special sense of a member of a religious body in England which has, for one reason or another, separated from the Established Church. Strictly, the term includes the English Roman Catholics, who in the original draft of the Relief Act of 1791 were styled "Protesting Catholic Dissenters." It is in practice, however, restricted to the "Protestant Dissenters" referred to in sec. ii. of the Toleration Act of 1688. "(Encyclopedia Britannica, 1911)
in scheme: religion

Dissenting Christianity
is replaced by: Dissent (Protestant)
in dataset: The CWRC Ontology
type: Concept
comment: La description de ce terme est basée sur celle de DBPedia. @fr
comment: The description for this term is indebted to DBpedia.
label: Dissidence anglaise @fr
deprecated: true
term status: deprecated
broader transitive: Protestantism
definition: "English Dissenters were Christians who separated from the Church of England in the 16th, 17th and 18th centuries. A dissenter (from the Latin dissentire, "to disagree") is one who disagrees in matters of opinion, belief, etc. English Dissenters opposed state interference in religious matters, and founded their own churches, educational establishments, and communities; some emigrated to the New World. They originally agitated for a wide-reaching Protestant Reformation of the Established Church, and triumphed briefly under Oliver Cromwell." (DBpedia, 2017) See also: Nonconformist - Wikipedia
definition: «Les Dissidents anglais (en anglais : English Dissenters ou nonconformists) sont des protestants anglais qui firent sécession de l'Ãglise d'Angleterre. Ils s'opposaient Ã l'interférence de l'Ãtat dans les affaires religieuses et fondèrent leurs propres communautés du XVIe au XVIIIe siècle. Les Dissidents triomphèrent un temps lors du gouvernement d'Oliver Cromwell, mais après la Restauration de la monarchie, en 1660, l'épiscopat fut rétabli et les droits civiques des Dissidents limités, dès les années 1660, par une série de lois dont l'Act of Uniformity, le Corporation Act et le Test Act. Ce n'est qu'en 1828 que ces lois discriminatoires sont abrogées. Parmi les Dissidents les plus connus, on peut citer le fondateur de la secte des Puritains Henry Jacob (en) (1563-1624), l'éditeur Joseph Johnson (1738-1809), la mystique Jane Leade (1623-1704), le philosophe Richard Price (1723-1791), ou encore le chimiste et théologien Joseph Priestley (1733-1804), ainsi que le fondateur d'une académie dissidente Ã Kendal (Cumbria), le révérend Caleb Rotherham, qui instruisit l'un des pères de la Révolution industrielle, le fondeur et beau-frère de Joseph Priestley, John Wilkinson»(DBpedia, 2017)Voir aussi: Non-conformistes â Wikipédia @fr
in scheme: religion

Dissenting Churches
is replaced by: Dissent (Protestant)
in dataset: The CWRC Ontology
type: Concept
comment: Deprecated in favour of instance Dissent (Protestant).
comment: Désapprouver en faveur de l'instance dissidents (ou non-conformistes). @fr
label: Ãglises dissidentes @fr
deprecated: true
term status: deprecated
broader transitive: Anglicanism
definition: "English Dissenters were Christians who separated from the Church of England in the 16th, 17th, and 18th centuries. A dissenter (from the Latin dissentire, "to disagree") is one who disagrees in matters of opinion, belief, etc. English Dissenters opposed state interference in religious matters, and founded their own churches, educational establishments, and communities; some emigrated to the New World. They originally agitated for a wide-reaching Protestant Reformation of the Established Church, and triumphed briefly under Oliver Cromwell." (DBpedia, 2017)
definition: «Les Dissidents anglais (en anglais : English Dissenters ou nonconformists) sont des protestants anglais qui firent sécession de l'Ãglise d'Angleterre1. Ils s'opposaient Ã l'interférence de l'Ãtat dans les affaires religieuses et fondèrent leurs propres communautés du xvie au xviiie siècle. Les Dissidents triomphèrent un temps lors du gouvernement d'Oliver Cromwell, mais après la Restauration de la monarchie, en 1660, l'épiscopat fut rétabli et les droits civiques des Dissidents limités, dès les années 1660, par une série de lois dont l'Act of Uniformity, le Corporation Act et le Test Act. Ce n'est qu'en 1828 que ces lois discriminatoires sont abrogées.» (DBpedia, 2017) @fr
in scheme: religion

diver
in dataset: The CWRC Ontology
type: occupation
type: Concept
in scheme: occupation

dockyard work
in dataset: The CWRC Ontology
type: occupation
type: Concept
alternative label: dock manager
alternative label: docker
alternative label: docks manager
alternative label: dockyard labourer
alternative label: longshoreman
alternative label: wharfinger
in scheme: occupation

Ph.D.
in dataset: The CWRC Ontology
type: credential
type: Concept
comment: La description de ce terme est basée sur celle de DBPedia. @fr
comment: The description for this term is indebted to DBpedia.
label: Philosophiæ doctor @fr
alternative label: DPhil
alternative label: Doctor of Philosophy
alternative label: PhD
alternative label: PhD in Linguistics
alternative label: PhD in Philosophy
alternative label: doctorate
broader transitive: postgraduate degree
definition: "A Doctor of Philosophy (Ph.D. or D.Phil.) is a type of doctorate degree awarded by universities in many countries. Ph.D.s are awarded for a wide range of programs in the sciences (e.g., biology, physics, mathematics, etc.), engineering, and humanities (e.g., history, literature, musicology, etc.), among others. The Ph.D. is a terminal degree in many fields. The completion of a Ph.D. is a requirement for employment as a university professor, researcher, or scientist in many fields. A clear distinction is made between an "earned doctorate", which is awarded for completion of a course of study and a thesis or dissertation, and an "honorary doctorate", a title granted by a university to a successful or notable person who has not completed doctoral academic work or completed a dissertation at the university. Individuals with an earned doctorate can use the title of "Doctor" with their name and use the initials "Ph.D." (or "D.Phil.") after their name. The requirements to earn a Ph.D. degree varies considerably according to the country, institution, and time period, from entry-level research degrees to higher doctorates. A person who attains a doctorate of philosophy is automatically awarded the academic title of doctor. During the studies that lead to the degree, the student is called doctoral student or Ph.D. student, but also "doctoral candidate" or "Ph.D. candidate" once the student has completed all of the coursework and comprehensive examinations and is working on their thesis or dissertation. A Ph.D. candidate must submit a project, thesis or dissertation often consisting of a body of original academic research, which is in principle worthy of publication in a peer-reviewed journal. In many countries a candidate must defend this work before a panel of expert examiners appointed by the university. Universities award other types of doctorates besides the Ph.D., such as the Doctor of Musical Arts (D.M.A.), a degree for music performers and the Doctor of Education (Ed.…
definition: «Philosophiæ doctor (ou doctor philosophiæ ; abrégé PhD ou Ph. D. ; littéralement « docteur en philosophie ») est, dans le système universitaire anglo-saxon ou franco-canadien, l'intitulé le plus courant d'un diplôme de doctorat. Le terme philosophie est utilisé dans son sens antérieur au XXe siècle, tel qu'il a été répandu par les universités allemandes, et désigne ici l'étude générale des connaissances.» (DBpedia, 2018) @fr
in scheme: credential

domain includes
in dataset: The CWRC Ontology
type: ObjectProperty
domain: Thing
range: Thing
definition: Specifies a particular class type that is acceptable to use for a relation's domain.

domestic servant
in dataset: The CWRC Ontology
type: occupation
type: Concept
alternative label: house servant
alternative label: housemaid
alternative label: indentured servant
alternative label: kitchen scullion
alternative label: lady's maid
alternative label: upper servant
alternative label: valet
broader transitive: servant
in scheme: occupation

domestic work
in dataset: The CWRC Ontology
type: occupation
type: Concept
alternative label: helping at home
alternative label: kitchen work
alternative label: managing her households
alternative label: meal provider
hidden label: care of parents
in scheme: occupation

Dominican
in dataset: The CWRC Ontology
type: religion
type: Concept
comment: La description de ce terme est basée sur celle de DBPedia. @fr
comment: The description for this term is indebted to DBpedia.
label: Ordre des Prêcheurs @fr
broader transitive: Roman Catholicism
definition: "The Order of Preachers (Latin: Ordo Praedicatorum, postnominal abbreviation O.P.), also known as the Dominican Order, is a mendicant Catholic religious order founded by the Spanish priest Saint Dominic de Guzman in France, approved by Pope Honorius III on 22 December 1216. Members of the order, who are referred to as Dominicans, generally carry the letters O.P. after their names, standing for Ordinis Praedicatorum, meaning of the Order of Preachers. Membership in the order includes friars, nuns, active sisters, and affiliated lay or secular Dominicans (formerly known as tertiaries, though recently there has been a growing number of associates who are unrelated to the tertiaries). Founded to preach the Gospel and to oppose heresy, the teaching activity of the order and its scholastic organisation placed the Preachers in the forefront of the intellectual life of the Middle Ages. The order is famed for its intellectual tradition, having produced many leading theologians and philosophers. The Dominican Order is headed by the Master of the Order, currently Bruno Cadoré. In the year 2000, there were 5,171 Dominican friars in solemn vows, 917 student brothers, and 237 novices. By the year 2013 there were 6,058 Dominican friars, including 4,470 priests. A number of other names have been used to refer to both the order and its members. * In England and other countries the Dominican friars are referred to as "Black Friars" because of the black cappa or cloak they wear over their white habits. Dominicans were "Blackfriars", as opposed to "Whitefriars" (i.e., Carmelites) or "Greyfriars" (i.e., Franciscans). They are also distinct from the Augustinian Friars (the Austin friars) who wear a similar habit. * In France, the Dominicans were known as "Jacobins" because their convent in Paris was attached to the Church of Saint-Jacques, now disappeared, on the way to Saint-Jacques-du-Haut-Pas, which belonged to the Italian Order of Saint James of Altopascio (St. James) Sanctus Iacobu…
definition: «Lâordre des Prêcheurs ou des Frères Prêcheurs (O.P. â en latin : Ordo Fratrum Prædicatorum), plus connu sous le nom dâordre dominicain, est un ordre catholique né sous lâimpulsion de saint Dominique en 1215. Il appartient, comme l'ordre des Frères mineurs ou franciscains, Ã la catégorie des ordres mendiants. Proche de la population, il se différencie d'autres ordres qui ont pour vÅux de s'isoler, comme l'ordre cistercien. Suivant la règle de saint Augustin, ainsi que ses propres Constitutions, en partie inspirées de celles des prémontrés (O.Præm), il sâest donné pour mission lâapostolat et la contemplation. Le Pape Jean-Paul II rappelait que depuis son origine, l'une des missions principales confiées Ã l'Ordre a été la proclamation de la vérité du Christ en réponse Ã l'hérésie (d'abord albigeoise, puis toutes les nouvelles formes d'hérésie manichéenne récurrente que le christianisme a dû affronter dès ses débuts, souvent centrées sur la négation de l'Incarnation). Sa devise est Veritas (la vérité). D'autres devises lui ont aussi été assignées, par exemple: « annoncer ce que nous avons contemplé » (contemplata aliis tradere), reprise de saint Thomas d'Aquin, ou encore « louer, bénir, prêcher » qui est une formule liturgique. Les dominicains sont des religieux mais pas des moines : ils ont la particularité de ne prononcer qu'un seul vÅu, celui d'obéissance, dans les mains du maître de l'ordre (ou de son représentant), les vÅux de pauvreté et de chasteté étant implicitement inclus. Ils ne font, par contre, pas vÅu de stabilité comme les moines. Ils vivent dans des couvents et non dans des monastères. Leur vocation étant de prêcher, leurs couvents sont souvent situés dans de grandes villes.» (DBpedia, 2018) @fr
in scheme: religion

draper
in dataset: The CWRC Ontology
type: occupation
type: Concept
alternative label: linen draper
alternative label: master draper
in scheme: occupation

dress reform
in dataset: The CWRC Ontology
type: political affiliation
type: Concept
comment: The description for this term is indebted to DBpedia.
label: réforme vestimentaire @fr
alternative label: Rational Dress Movement
alternative label: dress reformer
broader transitive: feminism
definition: "Victorian dress reform was an objective of the Victorian dress reform movement (also known as the rational dress movement) of the middle and late Victorian era, comprising various reformers who proposed, designed, and wore clothing considered more practical and comfortable than the fashions of the time. Dress reformists were largely middle class women involved in the first wave of feminism in the United States and in Britain, from the 1850s through the 1890s. The movement emerged in the Progressive Era along with calls for temperance, women's education, suffrage and moral purity. Dress reform called for emancipation from the "dictates of fashion", expressed a desire to "cover the limbs as well as the torso adequately," and promoted "rational dress". The movement had its greatest success in the reform of women's undergarments, which could be modified without exposing the wearer to social ridicule. Dress reformers were also influential in persuading women to adopt simplified garments for athletic activities such as bicycling or swimming. The movement was much less concerned with men's clothing, although it initiated the widespread adoption of knitted wool union suits or long johns. Some proponents of the movement established dress reform parlors, or storefronts, where women could buy sewing patterns for the newfangled garments, or buy them directly." (DBpedia, 2017)
in scheme: political affiliation

dressmaking
in dataset: The CWRC Ontology
type: occupation
type: Concept
alternative label: clothes mending
alternative label: dressmaker
alternative label: dressmaker's apprentice
alternative label: dressmaking business
alternative label: seamstress
alternative label: silk manufacturer
alternative label: textile manufacturer
broader transitive: clothing production
hidden label: dressmaking; seamstress
in scheme: occupation
related: tailor

Dreyfusard
in dataset: The CWRC Ontology
contrary to: antisemitism
type: political affiliation
type: Concept
comment: The description for this term is indebted to DBpedia.
broader transitive: human rights
definition: Défenseurs du capitaine Alfred Dreyfus lors de son procès. Voir Affaire Dreyfus â Wikipédia @fr
definition: Supporters of Captain Alfred Dreyfus in his prosecution by the French military. See: Dreyfus affair - Wikipedia
in scheme: political affiliation
related: anti-antisemitism

drinking
in dataset: The CWRC Ontology
type: occupation
type: Concept
alternative label: alcoholic
alternative label: drinking problem
hidden label: daily drinking bouts
hidden label: drinking and chasing women
in scheme: occupation

drug abuse
in dataset: The CWRC Ontology
type: occupation
type: Concept
alternative label: drug addict
alternative label: drug user
alternative label: laudanum addict
in scheme: occupation

Dutch
in dataset: The CWRC Ontology
type: national heritage
type: Concept
comment: La description de ce terme est basée sur celle de DBPedia. @fr
comment: The description for this term is indebted to DBpedia.
label: Néerlandais @fr
definition: "The Dutch (Dutch: ), occasionally referred to as Netherlandersâa term that is cognate to the Dutch word for Dutch people, "Nederlanders"âare a Germanic ethnic group native to the Netherlands. They share a common culture and speak the Dutch language. Dutch people and their descendants are found in migrant communities worldwide, notably in Aruba, Suriname, Guyana, Curaçao, Argentina, Brazil, Canada, Australia, South Africa, New Zealand, and the United States." (DBpedia, 2018)
definition: «Le peuple néerlandais est un groupe ethnique originaire des Pays-Bas. Les Néerlandais partagent une culture commune et parlent le néerlandais. Le peuple néerlandais et ses descendants sont présents sur tous les continents des suites de la colonisation européenne, et particulièrement au Suriname, au Chili, au Brésil, au Canada, en Australie, en Afrique du Sud, en Nouvelle-Zélande et aux Ãtats-Unis.» (DBpedia, 2018) @fr
in scheme: national heritage

Cybertypes: Race, ethnicity, and identity on the internet
issued: 2002
type: Book

Routledge
type: Organization
based near: London, UK

Lisa Nakamura
first name: Lisa
last name: Nakamura
type: Person

Questions of Cultural Identity
issued: 1996
language: eng
type: Book

SAGE Publications Ltd.
type: Organization
based near: London

The Ladies of Llangollen: A Study in Romantic Friendship
issued: 1971
type: Book

Joseph
type: Organization
based near: London, UK

Elizabeth Mayor
first name: Elizabeth
last name: Mayor
type: Person

Cited Documents as Concept Symbols
language: eng
issue: 3
volume: 8
type: Document

Social Studies of Science
type: Document

The Well of Loneliness
issued: 1928
type: Book

Jonathan Cape
type: Organization
based near: London, UK

Hall Radclyffe
first name: Hall
last name: Radclyffe
type: Person

eastern religions
in dataset: The CWRC Ontology
type: religion
type: Concept
comment: The description for this term is indebted to DBpedia.
definition: "Eastern religions refers to religions originating in the Eastern worldâ East, South and Southeast Asia âand thus having dissimilarities with Western religions. This includes the East Asian (namely Taoism and Confucianism) and Indian (namely Hinduism and Buddhism) religious traditions, as well as animistic indigenous religions. This East-West religious distinction, just as with the East-West culture distinction, and the implications that arise from it, are broad and not precise. Furthermore, the geographical distinction has less meaning in the current context of global transculturation. While many Western observers attempt to distinguish between Eastern philosophies and religions, this is a distinction that does not exist in some Eastern traditions." (DBpedia, 2018)
in scheme: religion

Knowledge Representation and Ontologies
language: eng
type: Chapter

Pascal Hitzler
first name: Pascal
last name: Hitzler
type: Person

Andreas Abecker
first name: Andreas
last name: Abecker
type: Person

Stephan Grimm
first name: Stephan
last name: Grimm
type: Person

Semantic Web Services: Concepts, Technologies, and Applications
issued: 2007-01
isbn: 978-3-540-70893-3
type: Document

Springer Verlag
type: Organization

Surpassing the Love of Men: Romantic Friendship and Love between Women from the Renaissance to the Present
issued: 1981
type: Book

Lillian Faderman
first name: Lillian
last name: Faderman
type: Person

Morrow
type: Organization
based near: New York, NY, USA

economic relationship
in dataset: The CWRC Ontology
range includes: Work
range includes: AdminPlaceConcept
range includes: Feature
range includes: FormalOrganization
range includes: Person
subject-centric predicate: relates economically to
type: ObjectProperty
domain: Person
sub property of: biographical relationship

ecumenism
in dataset: The CWRC Ontology
type: religion
type: Concept
comment: La description de ce terme est basée sur celle de DBPedia. @fr
comment: The description for this term is indebted to DBpedia.
label: Åcuménisme @fr
alternative label: ecumenical
broader transitive: Christianity
definition: "Ecumenism refers to efforts by Christians of different church traditions to develop closer relationships and better understandings. The term is also often used to refer to efforts towards the visible and organic unity of different Christian churches in some form. The adjective ecumenical can also be applied to any interdenominational initiative that encourages greater cooperation among Christians and their churches, whether or not the specific aim of that effort is full, visible unity. The terms ecumenism and ecumenical come from the Greek Î¿á¼°ÎºÎ¿Ï μένη (oikoumene), which means "the whole inhabited world", and was historically used with specific reference to the Roman Empire. The ecumenical vision comprises both the search for the visible unity of the Church (Ephesians 4:3) and the "whole inhabited earth" (Matthew 24:14) as the concern of all Christians. In Christianity the qualification ecumenical is originally (and still) used in terms such as "ecumenical council" and "Ecumenical Patriarch" in the meaning of pertaining to the totality of the larger Church (such as the Catholic Church or the Orthodox Church) rather than being restricted to one of its constituent local churches or dioceses. Used in this original sense, the term carries no connotation of re-uniting the historically separated Christian denominations, but presumes a unity of local congregations in a worldwide communion." (DBpedia, 2018)
definition: «LâÅcuménisme, parfois orthographié écuménisme, est un mouvement interconfessionnel qui tend Ã promouvoir des actions communes entre les divers courants du christianisme, en dépit de leurs différences doctrinales, avec pour objectif lâunité visible des chrétiens. Se développant Ã partir de la fin du XIXe siècle, l'Åcuménisme se concrétise aujourd'hui par l'existence de divers accords, de nombreuses instances de dialogue, mais aussi par un certain nombre de réalisations concrètes, comme des entreprises de traduction commune des textes saints ou la semaine de prière commune pour l'unité des chrétiens. Parmi les pionniers de lâÅcuménisme, on dénombre le patriarche orthodoxe Germain V de Constantinople, lâévêque anglican américain Charles Brent, le pasteur réformé hollandais Willem Visser 't Hooft, le prêtre catholique français Yves Congar ou encore l'archevêque luthérien suédois Nathan Söderblom et le laïc américain John Mott, qui ont tous deux reçu le prix Nobel de la paix pour cette activité.» (DBpedia, 2018) @fr
in scheme: religion

editing
in dataset: The CWRC Ontology
type: occupation
type: Concept
alternative label: assistant editor
alternative label: associate editor
alternative label: co editor
alternative label: colonial editor
alternative label: consulting editor
alternative label: copy editor
alternative label: deputy editor
alternative label: editor
alternative label: editorial assistant
alternative label: editorial board member
alternative label: editorial reader
alternative label: encyclopedia editor
alternative label: fashion editor
alternative label: foreign editor
alternative label: founding editor
alternative label: journal editor
alternative label: literary editor
alternative label: magazine editor
alternative label: managing editor
alternative label: newspaper editor
alternative label: parish magazine editor
alternative label: part time editor
alternative label: periodical editor
alternative label: poetry editor
alternative label: proofreader
alternative label: publisher's editor
alternative label: publishers' editor
alternative label: science editor
alternative label: sub editor
alternative label: trade journal editor
hidden label: edited
hidden label: edited school texts
hidden label: editor for religious society
hidden label: editor of the women's page
hidden label: editorial
hidden label: editorship
hidden label: news subeditor
hidden label: newspaper sub editor
in scheme: occupation

education
in dataset: The CWRC Ontology
type: occupation
type: Concept
alternative label: educational popularizer
alternative label: educationist
in scheme: occupation

education reform
in dataset: The CWRC Ontology
type: political affiliation
type: Concept
comment: The description for this term is indebted to DBpedia.
label: réforme de l'éducation @fr
alternative label: education reformer
alternative label: educational reform
alternative label: educational reformer
alternative label: educationalist
alternative label: state education movement
broader transitive: social reform
definition: "Education reform is the name given to the goal of changing public education. Historically, reforms have taken different forms because the motivations of reformers have differed. However, since the 1980s, education reform has been focused on changing the existing system from one focused on inputs to one focused on outputs (i.e., student achievement). In the United States, education reform acknowledges and encourages public education as the primary source of K-12 education for American youth. Education reformers desire to make public education into a market (in the form of an input-output system), where accountability creates high-stakes from curriculum standards tied to standardized tests. As a result of this input-output system, equality has been conceptualized as an end point, which is often evidenced by an achievement gap among diverse populations. This conceptualization of education reform is based on the market-logic of competition. As a consequence, competition creates inequality which has continued to drive the market-logic of equality at an end point by reproducing the achievement gap among diverse youth. Overall, education reform has and continues to be used as a substitute for needed economic reforms in the United States. The one constant for all forms of education reform includes the idea that small changes in education will have large social returns in citizen health, wealth, and well-being. For example, a stated motivation has been to reduce cost to students and society. From ancient times until the 1800s, one goal was to reduce the expense of a classical education. Ideally, classical education is undertaken with a highly educated full-time (extremely expensive) personal tutor. Historically, this was available only to the most wealthy. Encyclopedias, public libraries and grammar schools are examples of innovations intended to lower the cost of a classical education. Related reforms attempted to develop similar classical results by concentrating on "why"…
in scheme: political affiliation
related: civil rights movement

education relationship
in dataset: The CWRC Ontology
range includes: Work
range includes: AdminPlaceConcept
range includes: Feature
range includes: FormalOrganization
range includes: Person
subject-centric predicate: relates by education to
type: ObjectProperty
sub property of: biographical relationship

educational administration
in dataset: The CWRC Ontology
type: occupation
type: Concept
alternative label: academic programme administrator
alternative label: college principal
alternative label: college vice principal
alternative label: dean
alternative label: deputy head of school
alternative label: education
alternative label: education campaigner
alternative label: education liaison officer
alternative label: educational officer
alternative label: educational theorist
alternative label: educator
alternative label: examiner
alternative label: external examiner
alternative label: headmaster
alternative label: headmistress
alternative label: inspectress of schools
alternative label: lord rector
alternative label: marker
alternative label: principal
alternative label: principal of institute
alternative label: provost
alternative label: school administration
alternative label: school director
alternative label: school governor
alternative label: school management
alternative label: school monitor
alternative label: school organizer
alternative label: school proprietor
alternative label: school supervisor
alternative label: school vice president
alternative label: sunday school superintendent
alternative label: sunday school worker
alternative label: superintendent
alternative label: superintendent of schools
alternative label: university chancellor
alternative label: vice principal
broader transitive: education
hidden label: associate of newnham college
hidden label: college governor
hidden label: college vice president
hidden label: dean of trinity college, oxford
hidden label: demonstrator of anatomy
hidden label: director of the creative writing program
hidden label: director of the tulsa center for the study of women's literature
hidden label: education of her own children
hidden label: establish schools
hidden label: established a school for english and american boys
hidden label: founded st boniface school
hidden label: founded the derry and raphoe diocesan institution for the education of the deaf and dumb
hidden label: master of the free school
hidden label: member of the executive committee of girton college
hidden label: opened their sunday school
hidden label: pedagogic theorist
hidden label: principal of queen's college
hidden label: principal of the chelsea art school
hidden label: rector of edinburgh university
hidden label: running their school
hidden label: taught
hidden label: teach
in scheme: occupation

educational award prize
in dataset: The CWRC Ontology
type: educational award
label: prix éducatif @fr
definition: An educational prize is a medal or award, monetary or otherwise, presented by either an institution or person of authority to an individual who has excelled beyond their peers, reached a great achievement, and/or produced a very high standard of work.
definition: Un prix éducatif est une médaille ou une récompense, financière ou autre, attribuée par une institution ou une personne d'autorité Ã un individu ayant excellé par rapport Ã ses camarades, a concrétisé un projet d'envergure et/ou a fourni un travail de grande qualité. @fr
in scheme: educational award

educational award scholarship
in dataset: The CWRC Ontology
type: educational award
label: bourse d'étude @fr
definition: A scholarship is an award of financial aid for a student to further their education. Scholarships are awarded based upon various criteria, which usually reflect the values and purposes of the donor or founder of the award. Scholarship money is not required to be repaid.
definition: Une bourse d'études est une bourse d'aide financière qui permet Ã un·e étudiant·e de poursuivre ses études. Les bourses sont accordées en fonction de critères variés, qui reflètent généralement les valeurs et les objectifs du/de la donateur·ice ou fondateur·ice de la bourse. Les bourses d'études ne sont pas destinées Ã être remboursées. @fr
in scheme: educational award

egalitarianism
in dataset: The CWRC Ontology
type: political affiliation
type: Concept
comment: La description de ce terme est basée sur celle de DBPedia. @fr
comment: The description for this term is indebted to DBpedia.
label: Ãgalitarisme @fr
alternative label: egalitarian
definition: "Egalitarianism (from French égal, meaning "equal")âor equalitarianismâis a trend of thought that favors equality for all people. Egalitarian doctrines maintain that all humans are equal in fundamental worth or social status, according to the Stanford Encyclopedia of Philosophy. According to the Merriam-Webster Dictionary, the term has two distinct definitions in modern English: either as a political doctrine that all people should be treated as equals and have the same political, economic, social, and civil rights; or as a social philosophy advocating the removal of economic inequalities among people, economic egalitarianism, or the decentralization of power. Some sources define egalitarianism as the point of view that equality reflects the natural state of humanity." (DBpedia, 2017)
definition: «L'égalitarisme est une doctrine politique prônant l'égalité des citoyens en matière politique, économique et/ou sociale, selon les contextes. Dans le sens vulgaire, l'égalitarisme désigne plus particulièrement la doctrine qui a pour valeur politique suprême l'égalité matérielle de tous.» (DBpedia, 2017) @fr
in scheme: political affiliation
related: feminism

Egyptian nationalism
in dataset: The CWRC Ontology
type: political affiliation
type: Concept
comment: The description for this term is indebted to DBpedia.
label: nationalisme égyptien @fr
broader transitive: nationalism
definition: "Egyptian nationalism refers to the nationalism of Egyptians and Egyptian culture. Egyptian nationalism has typically been a civic nationalism that has emphasised the unity of Egyptians regardless of ethnicity or religion. Egyptian nationalism first manifested itself in Pharaonism beginning in the 19th century that identified Egypt as being a unique and independent political unit in the world since the era of the Pharaohs in ancient Egypt. Both the Arabic language spoken in modern Egypt and the ancient Egyptian language are Afroasiatic languages. The rule of Muhammad Ali of Egypt led Egypt into an advanced level of socioeconomic development in comparison with Egypt's neighbours, which along with the discoveries of relics of ancient Egyptian civilization, helped to foster Egyptian identity and Egyptian nationalism. The Urabi movement in the 1870s and 1880s was the first major Egyptian nationalist movement that demanded an end to the alleged despotism of the Muhammed Ali family and demanded curbing the growth of European influence in Egypt. It campaigned under the nationalist slogan of "Egypt for Egyptians". After the British occupation of Egypt in 1882, Egyptian nationalism became focused upon ending British colonial rule. Egyptian nationalism reached its peak in popularity in 1919 when revolution against British rule took place in response to wartime deprivations imposed by the British upon Egypt during World War I. Three years of protest and political turmoil followed until Britain unilaterally declared the independence of Egypt in 1922 that was a monarchy, though Britain reserved several areas for British supervision. During the period of the Kingdom of Egypt, Egyptian nationalists remained determined to terminate the remaining British presence in Egypt. Though Arab nationalism rose as a political force in the 1930s, there remained a strong regional attachment to Egypt by those who advocated cooperation with other Arab or Muslim neighbours. After the Egyptian Revo…
in scheme: political affiliation

elder rights
in dataset: The CWRC Ontology
type: political affiliation
type: Concept
comment: The description for this term is indebted to DBpedia.
label: droit des personnes âgées @fr
alternative label: elder care activist
broader transitive: civil rights movement
definition: "Elder rights are the rights of the aged, who in the United States are not recognized as a constitutionally protected class. Common rights issues faced by elders include age-related job discrimination (such as forced age of retirement), lack of access to medical treatments because of age or age-related obstacles, societal perceptions of ability/disability due to age, and vulnerability to abuse, including financial, physical, psychological, social, and sexual because of diminished capacity and lack of access to/ability to use technology." (DBpedia, 2017)
in scheme: political affiliation

eldest
in dataset: The CWRC Ontology
type: birth position
type: Concept
label: aîné·e @fr
definition: Indicates that the subject is the eldest child in the family.
definition: Indique que la personne est l'enfant le plus âgé de la famille. @fr
in scheme: birth position

elevator operator
in dataset: The CWRC Ontology
type: occupation
type: Concept
in scheme: occupation

elucutionist
in dataset: The CWRC Ontology
type: occupation
type: Concept
alternative label: elocutionist
in scheme: occupation

emigration
in dataset: The CWRC Ontology
range includes: AdminPlaceConcept
range includes: Feature
subject-centric predicate: emigrated from
type: ObjectProperty
sub property of: habitation

employer
in dataset: The CWRC Ontology
type: occupation
type: Concept
alternative label: domestic employer
in scheme: occupation

employment
in dataset: The CWRC Ontology
range includes: Work
range includes: FormalOrganization
range includes: Person
subject-centric predicate: has employer
type: ObjectProperty
sub property of: occupation relationship

employment agent
in dataset: The CWRC Ontology
type: occupation
type: Concept
alternative label: work force recruiter
in scheme: occupation

engineering
in dataset: The CWRC Ontology
type: occupation
type: Concept
alternative label: aeronautical engineer
alternative label: chief engineer
alternative label: civil engineer
alternative label: electrical engineer
alternative label: engineer
alternative label: engineering firm
alternative label: marine engineer
alternative label: mining engineer
alternative label: motor engineer
alternative label: radio engineer
alternative label: railway engineer
in scheme: occupation

England
is replaced by: England
in dataset: The CWRC Ontology
represented by: English identity
type: Thing
type: Concept
comment: Deprecated in favour of instance England.
comment: Désapprouver en faveur de l'instance Angleterre. @fr
label: Angleterre @fr
deprecated: true
term status: deprecated
in scheme: geographic heritage

England
is replaced by: English identity
in dataset: The CWRC Ontology
type: textual label
comment: Deprecated in favour of instance English identity.
comment: Désapprouver en faveur de l'instance identité anglais. @fr
label: Angleterre @fr
deprecated: true
one of: England
term status: deprecated
in scheme: textual label

English
in dataset: The CWRC Ontology
type: ethnicity
type: Concept
comment: La description de ce terme est basée sur celle de DBPedia. @fr
comment: The description for this term is indebted to DBpedia.
label: Anglais @fr
alternative label: England
broader transitive: European
definition: "The English are a nation and an ethnic group native to England, who speak the English language. The English identity is of early medieval origin, when they were known in Old English as the Angelcynn ("family of the Angles"). Their ethnonym is derived from the Angles, one of the Germanic peoples who migrated to Great Britain around the 5th century AD. England is one of the countries of the United Kingdom." (DBpedia, 2018)
definition: «Les Anglais sont les habitants de lâAngleterre. Le nom anglais les désignant est English, il est toujours employé au pluriel pour désigner collectivement tous les Anglais (un Anglais = an Englishman, une Anglaise = an Englishwoman). Il y a beaucoup de théories sur le peuplement de lâAngleterre. Ã cause d'un écart "celtique-germanique" sur les îles-britanniques, les historiens considèrent que lâAngleterre a été peuplée lors des invasions du Ve et VIe siècles par des peuples germaniques, ce qu'on appelle les Anglo-Saxons : c'est-Ã -dire essentiellement des Angles, des Jutes et des Saxons).Certains néanmoins, comme Stephen Oppenheimer, proposent que la différence génétique et culturelle entre les Anglais et les autres peuples britanniques s'est produite juste après le retrait du glacier qui se trouvait sur l'ensemble de la Grande-Bretagne. Cela signifierait que, contrairement Ã ce que l'on pense généralement, les Anglais sont aussi natifs que les Gallois et que les Ãcossais.[réf. souhaitée] Bien qu'il arrive assez souvent que certaines personnes utilisent le terme "Anglais" pour désigner plus largement les Britanniques, cet usage est incorrect puisque le Royaume-Uni est bien composé de quatre nations : l'Angleterre, le Pays de Galles, l'Ãcosse et l'Irlande du Nord. Selon une étude britannique menée Ã la fin des années 2000 par l'ONS (Office of National Statistics), l'homme anglais mesure en moyenne 175,3 cm (5ft 9in) pour un poids moyen de 83,6 kg (13.16 stone). La femme anglaise mesure en moyenne 161,6 cm (5ft 3in) pour un poids moyen de 70,2 kg (11 stone).» (DBpedia, 2018) @fr
in scheme: ethnicity

England
in dataset: The CWRC Ontology
represented by: English identity
type: geographic heritage
type: Concept
label: Angleterre @fr
definition: Indicates a subject's identification with or labeling as of English heritage in relation to a place, often England.
definition: Indique qu'un sujet s'identifie ou s'est vu assigner une identité anglaise par rapport Ã un endroit, généralement l'Angleterre. @fr
in scheme: geographic heritage

English identity
in dataset: The CWRC Ontology
represents: eng
represents: England
represents: English
represents: ISO 3166-2:GB-ENG
type: textual label
type: Concept
label: identité anglais @fr
alternative label: english
definition: A subclass of textual label, this discursive label reflects the ambiguity of Englishness associated with different cultural forms. It provides a means of aggregating and searching multiple instances of "English" (e.g. ISO 3166-2:GB-ENG, England) cultural identities.
definition: Une sous-classe d'étiquettes textuelles, cette étiquette discursive reflète l'ambiguité du terme «anglais·e». Elle permet de compiler et de rechercher les multiples instances d'identités culturelles «anglaises» (par exemple ISO 3166-2:GB-ENG, Angleterre). @fr
in scheme: textual label
narrower: eng

English
in dataset: The CWRC Ontology
represented by: English identity
type: Concept
comment: Deprecated in favour of foreign instance ISO 3166-2:GB-ENG.
comment: Désapprouver en faveur de l'instance ISO 3166-2:GB-ENG. @fr
label: Anglais @fr
deprecated: true
term status: deprecated
definition: Indicates a subject's identification with or labelling as English as an inherited national identity.
definition: Indique qu'un sujet s'identifie Ã ou s'est vu assigner un héritage national anglais. @fr

English
in dataset: The CWRC Ontology
represented by: English identity
type: Concept
comment: Deprecated in favour of foreign instance ISO 3166-2:GB-ENG.
comment: Désapprouver en faveur de l'instance ISO 3166-2:GB-ENG. @fr
label: Anglais @fr
deprecated: true
term status: deprecated
definition: Indicates a subject's identification with or labelling as English as a national identity.
definition: Indique qu'un sujet s'identifie Ã ou s'est vu assigner une identité nationale anglaise. @fr
in scheme: national identity

English
in dataset: The CWRC Ontology
type: race or colour
type: Concept
comment: La description de ce terme est basée sur celle de DBPedia. @fr
comment: The description for this term is indebted to DBpedia.
label: Anglais @fr
definition: "The English are a nation and an ethnic group native to England, who speak the English language. The English identity is of early medieval origin, when they were known in Old English as the Angelcynn ("family of the Angles"). Their ethnonym is derived from the Angles, one of the Germanic peoples who migrated to Great Britain around the 5th century AD. England is one of the countries of the United Kingdom." (DBpedia, 2018)
definition: «Les Anglais sont les habitants de lâAngleterre. Le nom anglais les désignant est English, il est toujours employé au pluriel pour désigner collectivement tous les Anglais (un Anglais = an Englishman, une Anglaise = an Englishwoman). Il y a beaucoup de théories sur le peuplement de lâAngleterre. Ã cause d'un écart "celtique-germanique" sur les îles-britanniques, les historiens considèrent que lâAngleterre a été peuplée lors des invasions du Ve et VIe siècles par des peuples germaniques, ce qu'on appelle les Anglo-Saxons : c'est-Ã -dire essentiellement des Angles, des Jutes et des Saxons).Certains néanmoins, comme Stephen Oppenheimer, proposent que la différence génétique et culturelle entre les Anglais et les autres peuples britanniques s'est produite juste après le retrait du glacier qui se trouvait sur l'ensemble de la Grande-Bretagne. Cela signifierait que, contrairement Ã ce que l'on pense généralement, les Anglais sont aussi natifs que les Gallois et que les Ãcossais.[réf. souhaitée] Bien qu'il arrive assez souvent que certaines personnes utilisent le terme "Anglais" pour désigner plus largement les Britanniques, cet usage est incorrect puisque le Royaume-Uni est bien composé de quatre nations : l'Angleterre, le Pays de Galles, l'Ãcosse et l'Irlande du Nord. Selon une étude britannique menée Ã la fin des années 2000 par l'ONS (Office of National Statistics), l'homme anglais mesure en moyenne 175,3 cm (5ft 9in) pour un poids moyen de 83,6 kg (13.16 stone). La femme anglaise mesure en moyenne 161,6 cm (5ft 3in) pour un poids moyen de 70,2 kg (11 stone).» (DBpedia, 2018) @fr
in scheme: race or colour

engraver
in dataset: The CWRC Ontology
type: occupation
type: Concept
alternative label: wood engraver
in scheme: occupation

entrepreneurial industrialism
is replaced by: entrepreneurial
in dataset: The CWRC Ontology
type: Concept
comment: Deprecated in favour of instance entrepreneurial.
comment: Désapprouver en faveur de l'instance entreprenariat. @fr
label: entrepreneuriat industriel @fr
deprecated: true
term status: deprecated

entrepreneurial
in dataset: The CWRC Ontology
type: social class
type: Concept
label: entreprenariat @fr
alternative label: ENTREPRENEURIAL-INDUSTRIALIST
definition: Cette classe comprend les propriétaires de grandes entreprises comme les usines, les individus qui soutiennent ces entreprises en y investissant des fonds, ou plus particulièrement les femmes et les filles de ces derniers, telles que Elizabeth Montagu ou Beatrice Webb, pour les périodes historiques anciennes au cours desquelles les les agents économiques étaient rarement des femmes. @fr
definition: This class comprises the owners of large-scale enterprises such as factories, those who back such enterprises through investing money, or especially in the earlier historical periods when women were rarely economic agents, the wives and daughters of those who do, for instance, Elizabeth Montagu or Beatrice Webb.(Brown, 2006)
in scheme: social class

environmentalism
in dataset: The CWRC Ontology
type: political affiliation
type: Concept
comment: La description de ce terme est basée sur celle de DBPedia. @fr
comment: The description for this term is indebted to DBpedia.
label: Ãcologisme @fr
alternative label: ecologist
alternative label: environmentalist
alternative label: green
alternative label: nature conservationist
definition: "Environmentalism or environmental rights is a broad philosophy, ideology, and social movement regarding concerns for environmental protection and improvement of the health of the environment, particularly as the measure for this health seeks to incorporate the concerns of non-human elements. Environmentalism advocates the lawful preservation, restoration and/or improvement of the natural environment, and may be referred to as a movement to control pollution or protect plant and animal diversity. For this reason, concepts such as a land ethic, environmental ethics, biodiversity, ecology, and the biophilia hypothesis figure predominantly. At its crux, environmentalism is an attempt to balance relations between humans and the various natural systems on which they depend in such a way that all the components are accorded a proper degree of sustainability. The exact measures and outcomes of this balance is controversial and there are many different ways for environmental concerns to be expressed in practice. Environmentalism and environmental concerns are often represented by the color green, but this association has been appropriated by the marketing industries for the tactic known as greenwashing. Environmentalism is opposed by anti-environmentalism, which says that the Earth is less fragile than some environmentalists maintain, and portrays environmentalism as overreacting to the human contribution to climate change or opposing human advancement." (DBpedia, 2017)
definition: «L'écologisme, ou environnementalisme, est Ã la fois un courant de pensée (idéologie ou philosophie), un corpus de valeurs et de propositions incluant notamment celles du mouvement écologiste. L'orientation de l'activité politique ou parapolitique vise au respect, Ã la protection, la préservation ou la restauration de l'environnement dans une forme très poussée. James Lovelock, père de la théorie Gaïa, est l'un des représentants les plus célèbres de cette doctrine. Ce mouvement éco-centrique a comme projet la conservation de la nature et le «respect» des équilibres naturels. L'environnementalisme et le mouvement écologiste ont parmi leurs priorités : la conservation des ressources naturelles, la préservation de la «vie sauvage» (wilderness), la lutte contre la dégradation, la fragmentation et la destruction des habitats et des écosystèmes au sens le plus large. Ils définissent de nouveaux rapports territoriaux dans les milieux habités par l'humain, dont les milieux urbains considérés comme les habitats potentiels de substitution et comme cadre de vie d'une part grandissante de l'humanité. Ces différentes demandes sociales et politiques, ou même protestations s'expriment dès le début du XXe siècle : en 1902, une convention internationale pour la protection des oiseaux utiles était signée entre 11 pays d'Europe, et en 1913, le congrès de Berne réclamait une «Protection mondiale de la nature», principalement du constat de la dégradation de la nature par l'homme, notamment par la chasse et la surexploitation de la nature, puis par la pollution et la destruction Ã grande échelle de milieux naturels (forêts tropicales) notamment.» (DBpedia, 2017) @fr
in scheme: political affiliation

equine activity
in dataset: The CWRC Ontology
type: occupation
type: Concept
alternative label: clerk of the course
alternative label: dressage
alternative label: horse breeder
alternative label: horse racing
alternative label: horse trainer
alternative label: horsebreaker
alternative label: horseman
alternative label: horsemaster
alternative label: horsewoman
alternative label: racehorse owner
in scheme: occupation

erotic relationship
in dataset: The CWRC Ontology
subject-centric predicate: has erotic relationship with
type: ObjectProperty
range: Person
sub property of: intimate relationship

ethnic identity
in dataset: The CWRC Ontology
subject-centric predicate: has ethnic identity
type: ObjectProperty
domain: Person
label: ethnicité @fr
range: ethnicity
sub property of: cultural form

ethnic identity of
in dataset: The CWRC Ontology
type: ObjectProperty
domain: ethnicity
range: Person
sub property of: cultural form of

ethnic identity (reported)
in dataset: The CWRC Ontology
subject-centric predicate: has ethnic identity (reported)
type: ObjectProperty
domain: Person
label: ethnicité (déclarée) @fr
range: ethnicity
sub property of: ethnic identity

ethnic identity (reported) of
in dataset: The CWRC Ontology
type: ObjectProperty
domain: ethnicity
range: Person
sub property of: ethnic identity of

ethnic identity (self-reported)
in dataset: The CWRC Ontology
subject-centric predicate: has ethnic identity (self-reported)
type: ObjectProperty
domain: Person
label: ethnicité (autodéclarée) @fr
range: ethnicity
sub property of: ethnic identity

ethnic identity (self-reported) of
in dataset: The CWRC Ontology
type: ObjectProperty
domain: ethnicity
range: Person
sub property of: ethnic identity of

eugenics
in dataset: The CWRC Ontology
type: political affiliation
type: Concept
comment: La description de ce terme est basée sur celle de DBPedia. @fr
comment: The description for this term is indebted to DBpedia.
label: Eugénisme @fr
alternative label: eugenicist
definition: "Eugenics (/juËËdÊÉnÉªks/; from Greek Îµá½Î³ÎµÎ½Î®Ï eugenes "well-born" from Îµá½ eu, "good, well" and Î³Î­Î½Î¿Ï genos, "race, stock, kin") is a set of beliefs and practices that aims at improving the genetic quality of the human population. It is a social philosophy advocating the improvement of human genetic traits through the promotion of higher rates of sexual reproduction for people with desired traits (positive eugenics), or reduced rates of sexual reproduction and sterilization of people with less-desired or undesired traits (negative eugenics), or both. Alternatively, gene selection rather than "people selection" has recently been made possible through advances in genome editing (e.g. CRISPR). The exact definition of eugenics has been a matter of debate since the term was coined. The definition of it as a "social philosophy"âthat is, a philosophy with implications for social orderâis not universally accepted, and was taken from Frederick Osborn's 1937 journal article "Development of a Eugenic Philosophy". While eugenic principles have been practiced as far back in world history as Ancient Greece, the modern history of eugenics began in the early 20th century when a popular eugenics movement emerged in the United Kingdom and spread to many countries, including the United States, Canada and most European countries. In this period, eugenic ideas were espoused across the political spectrum. Consequently, many countries adopted eugenic policies meant to improve the genetic stock of their countries. Such programs often included both "positive" measures, such as encouraging individuals deemed particularly "fit" to reproduce, and "negative" measures such as marriage prohibitions and forced sterilization of people deemed unfit for reproduction. People deemed unfit to reproduce often included people with mental or physical disabilities, people who scored in the low ranges of different IQ tests, criminals and deviants, and members of disfavored minority groups. The eug…
definition: «L'eugénisme peut être défini comme l'ensemble des méthodes et pratiques visant Ã intervenir sur le patrimoine génétique de l'espèce humaine, dans le but de le faire tendre vers un idéal déterminé, du moins tel que conçu Ã l'époque en cours. Il peut être le fruit d'une politique délibérément menée par un Ãtat. Il peut aussi être le résultat collectif d'une somme de décisions individuelles convergentes prises par les futurs parents, dans une culture qui valoriserait la recherche de l'«enfant parfait». Le terme eugenics a été employé pour la première fois en 1883 par le scientifique britannique Francis Galton. Les travaux de celui-ci participèrent Ã la constitution et Ã la diffusion de la mouvance eugéniste. Mené par des scientifiques et des médecins, le mouvement de promotion de l'eugénisme qui se met en place au tournant du XXe siècle milite en faveur de politiques volontaristes d'éradication des caractères jugés handicapants ou dans le but de favoriser des caractères jugés bénéfiques. Son influence sur la législation s'est traduite principalement dans trois domaines : la mise en place de programmes de stérilisations contraintes là où la culture dominante le permettait, un durcissement de l'encadrement juridique du mariage et des mesures de restriction ou promotion de tel ou tel type d'immigration. Dans la période contemporaine, les progrès du génie génétique et le développement des techniques de procréation médicalement assistée ont ouvert de nouvelles possibilités médicales (diagnostic prénatal, diagnostic préimplantatoireâ¦) qui ont nourri les débats éthiques concernant la convergence des techniques biomédicales et des pratiques sélectives. Singapour a mis en place, ainsi que la Chine, un système qualifié d'eugéniste.» (DBpedia, 2017) @fr
in scheme: political affiliation

Eurasian identity
in dataset: The CWRC Ontology
represents: eurasian
type: textual label
type: Concept
label: identité Eurasian @fr
definition: A subclass of textual label, this discursive label reflects the ambiguity of the term Eurasian as associated with different cultural forms. It provides a means of aggregating and searching multiple instances of "Eurasian" (e.g. eurasian) cultural identities.
definition: Une sous-classe d'étiquettes textuelles, cette étiquette discursive reflète l'ambiguité du terme «eurasien·ne». Elle permet de compiler et de rechercher les multiples instances d'identités culturelles «eurasiennes» (par exemple eurasien) @fr
in scheme: textual label
narrower: eurasian

eurasian
is replaced by: eurasian
in dataset: The CWRC Ontology
represented by: Eurasian identity
type: Concept
comment: Deprecated in favour of instance eurasian.
comment: Désapprouver en faveur de l'instance eurasien. @fr
comment: La description de ce terme est basée sur celle de DBPedia. @fr
comment: The description for this term is indebted to DBpedia.
label: eurasien @fr
deprecated: true
term status: deprecated
definition: "A Eurasian is a person of mixed Asian and European ancestry. In 19th-century British India, Eurasians â later called Anglo-Indians â were of mixed Portuguese, Dutch, British, Indian or, more rarely, French descent, but now their parentage may be from other parts of South, East or Southeast Asia. The term has been used in anthropological literature since the 1960s. It may also be extended to those with Central Asian heritage." (DBpedia, 2017)
definition: «Un·e Eurasien·ne e est une personne d'ascendance mixte asiatique et européenne. Dans l'Inde britannique du XIXe siècle, les personnes d'ascendance eurasienne (plus tard anglo-indienne) étaient d'origine mixte portugaise, hollandaise, britannique, indienne ou, plus rarement, française, mais leur ascendance pouvait provenir d'autres régions de l'Asie du Sud, de l'Est ou du Sud-Est. Le terme est utilisé en anthropologie depuis les années 1960. Il peut également être étendu aux personnes possédant des origines d'Asie centrale.» (DBpedia, 2017) @fr
in scheme: race or colour

eurasian
in dataset: The CWRC Ontology
represented by: Eurasian identity
type: race or colour
type: Concept
comment: La description de ce terme est basée sur celle de DBPedia. @fr
comment: The description for this term is indebted to DBpedia.
label: eurasien @fr
definition: "A Eurasian is a person of mixed Asian and European ancestry. In 19th-century British India, Eurasians â later called Anglo-Indians â were of mixed Portuguese, Dutch, British, Indian or, more rarely, French descent, but now their parentage may be from other parts of South, East or Southeast Asia. The term has been used in anthropological literature since the 1960s. It may also be extended to those with Central Asian heritage." (DBpedia, 2017)
definition: «Un·e Eurasien·ne e est une personne d'ascendance mixte asiatique et européenne. Dans l'Inde britannique du XIXe siècle, les personnes d'ascendance eurasienne (plus tard anglo-indienne) étaient d'origine mixte portugaise, hollandaise, britannique, indienne ou, plus rarement, française, mais leur ascendance pouvait provenir d'autres régions de l'Asie du Sud, de l'Est ou du Sud-Est. Le terme est utilisé en anthropologie depuis les années 1960. Il peut également être étendu aux personnes possédant des origines d'Asie centrale.» (DBpedia, 2017) @fr
in scheme: race or colour

European
in dataset: The CWRC Ontology
type: ethnicity
type: Concept
comment: La description de ce terme est basée sur celle de DBPedia. @fr
comment: The description for this term is indebted to DBpedia.
label: Européen @fr
definition: "The ethnic groups in Europe are the focus of European ethnology, the field of anthropology related to the various ethnic groups that reside in the nations of Europe. According to German monograph Minderheitenrechte in Europa co-edited by Pan and Pfeil (2002) there are 87 distinct peoples of Europe, of which 33 form the majority population in at least one sovereign state, while the remaining 54 constitute ethnic minorities. The total number of national minority populations in Europe is estimated at 105 million people, or 14% of 770 million Europeans." (DBpedia, 2017)
definition: Les Européens sont les habitants de l'Europe. Au sens anthropologique, ils peuvent, plus simplement, être désignés par leur couleur de peau, c'est-Ã -dire comme «Blancs», bien que ce dernier terme soit moins précis car n'étant pas exclusif aux populations européennes. Du fait de la colonisation et de l'émigration européennes durant les siècles passés, de nombreux Européens ont quitté l'Europe, et le monde d'aujourd'hui se caractérise par une 'diaspora' européenne dans de nombreux pays (Amérique du Nord, Australie, Nouvelle-Zélande, pays du Sud de l'Amérique latineâ¦), qui forment le monde occidental. Ce gentilé peut aussi désigner, selon une conception strictement géographique, les habitants du continent européen ; on peut plus rarement désigner comme Européens les citoyens de l'Union européenne (même si tout Européen n'est pas nécessairement citoyen de l'Union Européenne). Wikipédia @fr
in scheme: ethnicity

European
in dataset: The CWRC Ontology
type: national heritage
type: Concept
label: Européen @fr
definition: Indicates a subject's identity or labelling as of European national heritage.
definition: indique l'identité ou l'étiquetage d'un sujet Ã l'héritage national européen. @fr
in scheme: national heritage

European
in dataset: The CWRC Ontology
type: national identity
type: Concept
definition: Indicates a subject's identification with or labelling as European as a national identity.
in scheme: national identity

Evangelicalism
in dataset: The CWRC Ontology
type: religion
type: Concept
comment: La description de ce terme est basée sur celle de DBPedia. @fr
comment: The description for this term is indebted to DBpedia.
label: évangélisme @fr
alternative label: Evangelical
alternative label: Evangelical Christian
alternative label: Evangelical Church
alternative label: Evangelicism
definition: "Evangelicalism (/ËiËvænËdÊÉlÉªkÉlËÉªzÉm/, /ËÉvÉn/-), Evangelical Christianity, or Evangelical Protestantism is a worldwide, transdenominational movement within Protestant Christianity maintaining that the essence of the gospel consists in the doctrine of salvation by grace through faith in Jesus Christ's atonement. Evangelicals believe in the centrality of the conversion or "born again" experience in receiving salvation, in the authority of the Bible as God's revelation to humanity, and spreading the Christian message. The movement gained great momentum in the 18th and 19th centuries with the Great Awakenings in the United Kingdom and North America. The origins of Evangelicalism are usually traced back to English Methodism, the Moravian Church (in particular the theology of its bishop Nicolaus Zinzendorf), and German Lutheran Pietism. Today, Evangelicals may be found in many of the Protestant branches, as well as in Protestant denominations not subsumed to a specific branch. Among leaders and major figures of the Evangelical Protestant movement were John Wesley, George Whitefield, Jonathan Edwards, Billy Graham, Harold John Ockenga, John Stott and Martyn Lloyd-Jones. There are an estimated 285 million Evangelicals, comprising 13.1% of the total Christian population and 4.1% of the total world population. The Americas, Africa and Asia are home to the majority of Evangelicals. The United States has the largest concentration of Evangelicals. Evangelicalism, a major part of popular Protestantism, is among the most dynamic religious movements in the contemporary world, alongside resurgent Islam. While on the rise globally, the developing world is particularly influenced by its spread." (DBpedia, 2018)
definition: «L'évangélisme, plus couramment nommé christianisme évangélique ou protestantisme évangélique, est une partie importante du christianisme. Cet ensemble réunit des confessions chrétiennes initialement inspirées par la Réforme protestante dans diverses Ãglises. Le terme « évangélique » est au départ un simple adjectif découlant du mot Ãvangile. Les évangéliques se reconnaissent comme issus de la Réforme protestante, mais ils ont parfois été rejetés par les autres protestants ; ce fut le cas du baptisme Ã partir de 1609, du pentecôtisme Ã partir de 1906, entre autresâ¦ Les églises issues de l'évangélisme sont toutefois nombreuses aujourd'hui Ã avoir adhéré au Conseil Åcuménique des Ãglises. Les chrétiens évangéliques ont essentiellement en commun l'importance cruciale qu'ils accordent Ã la conversion individuelle relevant d'un choix personnel et, Ã la suite, de l'expérience religieuse de la « rencontre avec le Christ ». Ceci implique donc un changement de vie et une relation individuelle avec Dieu s'articulant en toute connaissance de cause autour de la lecture de la Bible et de la communion par la prière (personnelle ou en communauté). Le premier point de distinction d'une église chrétienne évangélique est la nouvelle naissance (conversion personnelle) et le baptême du croyant (adulte). Selon les chiffres du Pew Research Center, en 2011, le mouvement (comprenant le baptisme, pentecôtisme, mouvement charismatique évangélique, mouvement néo-charismatique et christianisme non-dénominationnel) compte 656 millions de croyants.» (DBpedia, 2018) @fr
in scheme: religion

event of
in dataset: The CWRC Ontology
type: ObjectProperty
domain: Event
range: Thing
inverse of: has event
definition: Associates an event with a subject or an event with another event.

event organizer
in dataset: The CWRC Ontology
type: occupation
type: Concept
alternative label: bazaar organizer
alternative label: community organizer
alternative label: entertainment organizer
alternative label: exhibition organizer
alternative label: festival organizer
alternative label: organizer
alternative label: peace congress organizer
alternative label: poetry organizer
hidden label: demonstration organiser
hidden label: local organiser
hidden label: organized evening lectures for women
in scheme: occupation

exhibitions
in dataset: The CWRC Ontology
type: occupation
type: Concept
alternative label: exhibition organiser
alternative label: exhibitor
hidden label: bbc drama producer
hidden label: governor of the bbc
in scheme: occupation

existentialism
in dataset: The CWRC Ontology
type: political affiliation
type: Concept
comment: La description de ce terme est basée sur celle de DBPedia. @fr
comment: The description for this term is indebted to DBpedia.
label: Existentialisme @fr
alternative label: existentialist
definition: "Existentialism (/ÉÉ¡zÉªËstÉnÊÉlÉªzÉm/) is a term applied to the work of certain late-19th- and 20th-century European philosophers who, despite profound doctrinal differences, shared the belief that philosophical thinking begins with the human subjectânot merely the thinking subject, but the acting, feeling, living human individual. While the predominant value of existentialist thought is commonly acknowledged to be freedom, its primary virtue is authenticity. In the view of the existentialist, the individual's starting point is characterized by what has been called "the existential attitude", or a sense of disorientation and confusion in the face of an apparently meaningless or absurd world. Many existentialists have also regarded traditional systematic or academic philosophies, in both style and content, as too abstract and remote from concrete human experience. Søren Kierkegaard is generally considered to have been the first existentialist philosopher, though he did not use the term existentialism. He proposed that each individualânot society or religionâis solely responsible for giving meaning to life and living it passionately and sincerely, or "authentically". Existentialism became popular in the years following World War II, and strongly influenced many disciplines besides philosophy, including theology, drama, art, literature, and psychology." (DBpedia, 2017)
definition: «L'existentialisme est un courant philosophique ainsi que littéraire qui postule que l'être humain forme l'essence de sa vie par ses propres actions, celles-ci n'étant pas prédéterminées par des doctrines théologiques, philosophiques ou morales. L'existentialisme considère chaque personne comme un être unique maître de ses actes, de son destin et des valeurs qu'il décide d'adopter. Bien qu'il existe des tendances communes entre les penseurs existentialistes, des différences subsistent : il y a notamment un fossé entre les existentialistes athées comme Jean-Paul Sartre et les philosophes existentiels chrétiens comme Søren Kierkegaard, Paul Tillich ou Gabriel Marcel, sans oublier la philosophie juive de l'existence de Martin Buber et Emmanuel Levinas ou encore musulmane d'Abdennour Bidar. Certains auteurs tels que Albert Camus ou Martin Heidegger ont même refusé d'être étiquetés comme existentialistes. Sartre a livré quant Ã lui sa propre définition et conception de l'existentialisme et a donné une conférence sur le sujet : L'existentialisme est un humanisme.» (DBpedia, 2017) @fr
in scheme: political affiliation

explorer
in dataset: The CWRC Ontology
type: occupation
type: Concept
alternative label: adventurer
in scheme: occupation

A Description of Millenium Hall
issued: 1762
language: eng
type: Book

Sarah Scott
first name: Sarah
last name: Scott
type: Person

Broadview Press
type: Organization
based near: Peterborough, ON, Canada

Gary Kelly
first name: Gary
last name: Kelly
type: Person

Situated Knowledges: The Science Question in Feminism and the Privilege of Partial Perspective
language: eng
doi: http://doi.org/10.2307/3178066
issue: 3
page end: 599
page start: 575
uri: http://www.jstor.org/stable/3178066
volume: 14
type: AcademicArticle

Donna Haraway
first name: Donna
last name: Haraway
type: Person

Feminist Studies
issued: 1988
issn: 0046-3663
type: Journal

Debates in the Digital Humanities 2012
issued: 2012
language: eng
isbn: 978-0-8166-7795-5
type: Book

Univ Of Minnesota Press
type: Organization

Matthew K. Gold
last name: Matthew K. Gold
type: Person

differences: A Journal of Feminist Cultural Studies
issue: 2
page end: Introduction, pp. iii-xviii
page start: Introduction, pp. iii-xviii
type: AcademicArticle

Teresa De Lauretis
first name: Teresa
last name: De Lauretis
type: Person

Duke University Press
issued: 1991
type: Journal

Elizabeth Weed
first name: Elizabeth
last name: Weed
type: Person

Ellen Rooney
first name: Ellen
last name: Rooney
type: Person

factory worker
in dataset: The CWRC Ontology
type: occupation
type: Concept
alternative label: assembly line worker
alternative label: factory hand
alternative label: factory work
alternative label: kiln fireman
alternative label: mill worker
hidden label: black borderer
hidden label: worked briefly at a wine bottling plant
in scheme: occupation

faith healing
in dataset: The CWRC Ontology
type: religion
type: Concept
comment: The description for this term is indebted to DBpedia.
alternative label: faith-healing
definition: "Faith healing is the ritualistic practice of prayer and gestures (such as laying on of hands) that are claimed to elicit divine intervention in spiritual and physical healing, especially the Christian practice. Believers assert that the healing of disease and disability can be brought about by religious faith through prayer and/or other rituals that, according to adherents, stimulate a divine presence and power. Belief in such divine intervention is derived from religious belief. Claims "attributed to a myriad of techniques" such as prayer, divine intervention, or the ministrations of an individual healer can cure illness have been popular throughout history. There have been claims that faith can cure blindness, deafness, cancer, AIDS, developmental disorders, anemia, arthritis, corns, defective speech, multiple sclerosis, skin rashes, total body paralysis, and various injuries. Miraculous recoveries have been attributed to many techniques commonly classified as faith healing. It can involve prayer, a visit to a religious shrine, or simply a strong belief in a supreme being. Many people interpret the Bible, especially the New Testament, as teaching belief in, and the practice of, faith healing. According to a Newsweek poll, 72 percent of Americans say they believe that praying to God can cure someone, even if science says the person doesn't stand a chance. Unlike faith healing, advocates of spiritual healing make no attempt to seek divine intervention, instead believing in divine energy. The increased interest in alternative medicine at the end of the 20th century has given rise to a parallel interest among sociologists in the relationship of religion to health. Faith healing can be classified as a spiritual, supernatural, or paranormal event, and, in some cases, belief in faith healing can be classified as magical thinking. The American Cancer Society states "available scientific evidence does not support claims that faith healing can actually cure physical ailmen…
in scheme: religion

family based occupation
in dataset: The CWRC Ontology
subject-centric predicate: has family-based occupation
type: ObjectProperty
range: occupation
sub property of: occupation

family-based occupation of
in dataset: The CWRC Ontology
type: ObjectProperty
domain: occupation
range: Person
sub property of: occupation of

farming
in dataset: The CWRC Ontology
type: occupation
type: Concept
alternative label: agricultural adviser
alternative label: agriculturalist
alternative label: apricot ranch
alternative label: beekeeper
alternative label: cattle breeder
alternative label: cattleman
alternative label: corn inspector
alternative label: dairy farmer
alternative label: dairying
alternative label: farm labour
alternative label: farm labourer
alternative label: farm manager
alternative label: farm worker
alternative label: farmer
alternative label: farmers
alternative label: fruit farmer
alternative label: fruit picker
alternative label: husbandman
alternative label: part time farmer
alternative label: pig breeder
alternative label: pig farmer
alternative label: ranch hand
alternative label: rancher
alternative label: sheep breeder
alternative label: shepherd
alternative label: smallholder
alternative label: sugar planter
alternative label: tenant farmer
alternative label: yeoman farmer
in scheme: occupation

fascism
in dataset: The CWRC Ontology
type: political affiliation
type: Concept
comment: La description de ce terme est basée sur celle de DBPedia. @fr
comment: The description for this term is indebted to DBpedia.
label: Fascisme @fr
alternative label: fascist
alternative label: fascist party
alternative label: pro-fascist
definition: "Fascism /ËfæÊÉªzÉm/ is a form of radical authoritarian nationalism that came to prominence in early 20th-century Europe, influenced by national syndicalism. Fascism originated in Italy during World War I and spread to other European countries. Fascism opposes liberalism, Marxism and anarchism and is usually placed on the far-right within the traditional leftâright spectrum. Fascists saw World War I as a revolution that brought massive changes in the nature of war, society, the state, and technology. The advent of total war and total mass mobilization of society had broken down the distinction between civilian and combatant. A "military citizenship" arose in which all citizens were involved with the military in some manner during the war. The war had resulted in the rise of a powerful state capable of mobilizing millions of people to serve on the front lines and providing economic production and logistics to support them, as well as having unprecedented authority to intervene in the lives of citizens. Fascists believe that liberal democracy is obsolete, and they regard the complete mobilization of society under a totalitarian one-party state as necessary to prepare a nation for armed conflict and to respond effectively to economic difficulties. Such a state is led by a strong leaderâsuch as a dictator and a martial government composed of the members of the governing fascist partyâto forge national unity and maintain a stable and orderly society. Fascism rejects assertions that violence is automatically negative in nature, and views political violence, war, and imperialism as means that can achieve national rejuvenation. Fascists advocate a mixed economy, with the principal goal of achieving autarky through protectionist and interventionist economic policies. Since the end of World War II in 1945, few parties have openly described themselves as fascist, and the term is instead now usually used pejoratively by political opponents. The descriptions neo-fascist or post…
definition: «Le terme fascisme (prononcé [fa.Êism], calque de la prononciation italienne [faËÊizmo] ; ou plus rarement [fa.sism]) s'applique au sens étroit Ã la période mussolinienne de l'histoire italienne et au sens large Ã un système politique aux caractéristiques inspirées par l'exemple italien mais qui a pu prendre des aspects différents selon les pays. Des débats existent entre les historiens quant Ã la qualification de certains régimes (France de Vichy, Espagne franquiste...). Le terme même (en italien fascismo) vient du mot «fascio» («faisceau») désignant le rassemblement des fusils au repos ou l'attribut du licteur dans la Rome antique. La différence entre fascisme et totalitarisme fait l'objet de nombreux débats. Le fascisme est un système politique autoritaire qui associe populisme, nationalisme et totalitarisme au nom d'un idéal collectif suprême. Ã la fois révolutionnaire et conservateur, il s'oppose frontalement Ã la démocratie parlementaire et Ã l'Ãtat libéral garant des droits individuels. Issu de diverses composantes de la philosophie européenne du XIXe siècle, le fascisme a trouvé dans les circonstances économiques et historiques de l'après-première guerre mondiale le contexte qui lui a permis d'accéder au pouvoir, d'abord en Italie dans les années 1920 avec Mussolini, puis sous une variante accentuée, militariste et terroriste, en Allemagne dans les années 1930 avec le nazisme et Hitler. Niant l'individu et la démocratie au nom de la masse incarnée dans un chef providentiel, le fascisme embrigade les groupes sociaux (jeunesse, milices) et justifie la violence d'Ãtat menée contre les opposants assimilés Ã des ennemis intérieurs, l'unité de la nation devant dépasser et résoudre les antagonismes des classes sociales dans un parti unique. Dans le domaine économique, l'état conduit une politique dirigiste mais maintient la propriété privée et capitaliste.En même temps il rejette la notion d'égalité au nom d'un ordr… @fr
in scheme: political affiliation

fashion
in dataset: The CWRC Ontology
type: occupation
type: Concept
alternative label: fashion buyer
alternative label: fashion consultant
alternative label: fashion designer
hidden label: leader of fashion
in scheme: occupation

fatalism
in dataset: The CWRC Ontology
type: religion
type: Concept
comment: La description de ce terme est basée sur celle de DBPedia. @fr
comment: The description for this term is indebted to DBpedia.
label: fatalisme @fr
alternative label: Necessarian
alternative label: fatalist
definition: "Fatalism is a philosophical doctrine stressing the subjugation of all events or actions to fate. Fatalism generally refers to any of the following ideas: 1. * The view that we are powerless to do anything other than what we actually do. Included in this is that man has no power to influence the future, or indeed, his own actions. This belief is very similar to predeterminism. 2. * An attitude of resignation in the face of some future event or events which are thought to be inevitable. Friedrich Nietzsche named this idea with "Turkish fatalism" in his book The Wanderer and His Shadow. 3. * That acceptance is appropriate, rather than resistance against inevitability. This belief is very similar to defeatism." (DBpedia, 2018)
definition: «Le fatalisme (mot formé Ã partir du latin fatum : le « destin ») est une doctrine selon laquelle le monde dans son ensemble, et l'existence humaine en particulier, suivent une marche inéluctable (fatalité), où le cours des événements échappe Ã la volonté humaine. De ce point de vue, le destin serait fixé dâavance par une puissance supérieure aux êtres humains, qui peut être Dieu, ou bien la nécessité naturelle, ou encore les lois gouvernant lâhistoire. Du point de vue moral, le fatalisme est un déterminisme ou un prédéterminisme, selon lequel les causes du cours des événements sont indépendantes de la volonté humaine, ce qui revient Ã nier Ã première vue la liberté de choix de lâhomme. Dans un sens affaibli, le fatalisme peut désigner une attitude ponctuelle, Ã savoir le défaitisme ou le pessimisme de celui qui, se sentant voué Ã l'échec, laisse le destin suivre son cours et abandonne le combat, ou quitte une situation délicate en baissant les bras.» (DBpedia, 2018) @fr
in scheme: religion

father
in dataset: The CWRC Ontology
subject-centric predicate: has father
type: ObjectProperty
range: Person
sub property of: parent

father of
in dataset: The CWRC Ontology
type: ObjectProperty
label: père de @fr
sub property of: parent of
inverse of: has father
broader: children

fellow
in dataset: The CWRC Ontology
type: occupation
type: Concept
alternative label: creative writing fellow
alternative label: creative writing fellowships
alternative label: fellow of the royal society
alternative label: visiting fellow
hidden label: compton fellow of creative writing
hidden label: creative writing fellowship
hidden label: fellow of king's college
hidden label: fellow of the institute of hospital administration
hidden label: fellow student at the regent street polytechnic
in scheme: occupation

Female
is replaced by: Woman/Female
in dataset: The CWRC Ontology
type: Thing
type: Concept
comment: Deprecated in favour of instance Woman/Female.
comment: Désapprouver en faveur de l'instance Femme/Femelle. @fr
label: Femelle @fr
deprecated: true
term status: deprecated

feminism
in dataset: The CWRC Ontology
type: occupation
type: political affiliation
type: Concept
comment: La description de ce terme est basée sur celle de DBPedia. @fr
comment: The description for this term is indebted to DBpedia.
label: Féminisme @fr
alternative label: Equality Feminism
alternative label: New Woman
alternative label: Women's Liberation
alternative label: activist for women and children
alternative label: advocate of female education
alternative label: anti-sexist
alternative label: contraceptionist
alternative label: feminist
alternative label: feminist movement
alternative label: feminist reformer
alternative label: gender egalitarian
alternative label: lobby for the rights of women
alternative label: maternal feminist
alternative label: moderate feminist
alternative label: non-separatist feminist
alternative label: political issues concerning women
alternative label: proto-feminist
alternative label: proto-feminist consciousness
alternative label: sexual egalitarian
alternative label: women's cause
alternative label: women's issues
alternative label: women's movement
alternative label: women's rights
alternative label: women's rights activist
broader transitive: civil rights movement
broader transitive: politics
definition: "Feminism is a range of political movements, ideologies, and social movements that share a common goal: to define, establish, and achieve political, economic, personal, and social rights for women that are equal to those of men. This includes seeking to establish equal opportunities for women in education and employment. Feminist movements have campaigned and continue to campaign for women's rights, including the right to vote, to hold public office, to work, to earn fair wages or equal pay, to own property, to receive education, to enter contracts, to have equal rights within marriage, and to have maternity leave. Feminists have also worked to promote bodily autonomy and integrity, and to protect women and girls from rape, sexual harassment, and domestic violence. Feminist campaigns are generally considered to be one of the main forces behind major historical societal changes for women's rights, particularly in the West, where they are near-universally credited with having achieved women's suffrage, gender neutrality in English, reproductive rights for women (including access to contraceptives and abortion), and the right to enter into contracts and own property. Although feminist advocacy is, and has been, mainly focused on women's rights, some feminists, including bell hooks, argue for the inclusion of men's liberation within its aims because men are also harmed by traditional gender roles. Feminist theory, which emerged from feminist movements, aims to understand the nature of gender inequality by examining women's social roles and lived experience; it has developed theories in a variety of disciplines in order to respond to issues concerning gender. Numerous feminist movements and ideologies have developed over the years and represent different viewpoints and aims. Some forms of feminism have been criticized for taking into account only white, middle class, and educated perspectives. This criticism led to the creation of ethnically specific or multicultural for…
definition: «Le féminisme est un ensemble de mouvements et d'idées politiques, philosophiques et sociales, qui partagent un but commun : définir, établir et atteindre l'égalité politique, économique, culturelle, personnelle, sociale et juridique entre les femmes et les hommes. Le féminisme a donc pour objectif d'abolir, dans ces différents domaines, les inégalités homme-femme dont les femmes sont les principales victimes, et ainsi de promouvoir les droits des femmes dans la société civile et dans la sphère privée. Si le terme «féminisme» ne prend son sens actuel qu'à la fin du XIXe siècle, les idées de libération de la femme prennent leurs racines dans le siècle des Lumières et se réclament de mouvements plus anciens ou de combats menés dans d'autres contextes historiques. L'objectif principal de la première vague féministe est de réformer les institutions, de sorte que les hommes et les femmes deviennent égaux devant la loi : droit Ã l'éducation, droit au travail, droit Ã la maîtrise de leurs biens et droit de vote des femmes constituent les revendications principales de cette période. Le mouvement féministe a produit une grande diversité d'analyses sociologiques et philosophiques. La deuxième vague féministe, qui intervient Ã la fin des années 1960 avec la naissance du Mouvement de libération des femmes (MLF) et du Women's Lib, a ainsi élaboré plusieurs concepts qui entendent rendre compte de la spécificité du rapport de domination exercé sur les femmes. C'est Ã cette période qu'est reformulé le concept de patriarcat, élaboré celui de sexisme et que l'accent est mis sur la sphère privée comme lieu privilégié de la domination masculine : le «privé est politique». Les revendications touchant au contrôle de leur corps par les femmes (avortement, contraception) sont placées au premier plan mais, plus largement, c'est Ã la construction de nouveaux rapports sociaux de sexe qu'appellent les féministes de cette deuxième vague… @fr
hidden label: advocate for women's education
hidden label: worked devotedly for the society for promoting the employment of women
hidden label: worked to establish pay equity
in scheme: political affiliation

feminist anti-violence activism
in dataset: The CWRC Ontology
type: political affiliation
type: Concept
comment: The description for this term is indebted to DBpedia.
label: féminisme contre la violence @fr
alternative label: anti-female-genital-mutilation
broader transitive: feminism
definition: Activism opposing violence from a feminist perspective, often but not exclusively violence against women and children, including sexual and domestic violence and female genital mutilation.
definition: Lutte contre la violence dans une perspection féministe, souvent mais non exclusivement dans le cadre des violences envers les femmes et les enfants, incuant les violences sexuelles et conjugales et les mutilations génitales féminines. @fr
in scheme: political affiliation

feminist internationalism
in dataset: The CWRC Ontology
type: political affiliation
type: Concept
comment: The description for this term is indebted to DBpedia.
label: féminisme internationaliste @fr
broader transitive: feminism
broader transitive: internationalism
definition: Feminist participant in the internationalism movement. See Internationalism (politics) - Wikipedia
definition: Féminisme en lien avec le mouvement internationaliste. Voir Internationalisme â Wikipédia @fr
in scheme: political affiliation

feminist pacifism
in dataset: The CWRC Ontology
type: political affiliation
type: Concept
comment: The description for this term is indebted to DBpedia.
label: féminisme pacifiste @fr
broader transitive: feminism
broader transitive: pacifism
definition: Feminist participant in the pacifist movement. See Internationalism (politics) - Wikipedia Also see: Pacifism - Wikipedia
definition: Féminisme en lien avec le mouvement pacifiste. Voir Pacifisme â Wikipédia @fr
in scheme: political affiliation

Nobody Passes: Rejecting the Rules of Gender and Conformity
issued: 2006
type: Book

Seal P
type: Organization
based near: Emeryville, CA, USA

Mattilda Bernstein Sycamore
first name: Mattilda Bernstein
last name: Sycamore
type: Person

Fifth Monarchists
in dataset: The CWRC Ontology
type: religion
type: Concept
type: Organization
comment: La description de ce terme est basée sur celle de DBPedia. @fr
comment: The description for this term is indebted to DBpedia.
label: Cinquièmes Monarchistes @fr
broader transitive: Dissent (Protestant)
broader transitive: millenarianism
definition: "The Fifth Monarchists or Fifth Monarchy Men were active from 1649 to 1660 during the Interregnum, following the English Civil Wars of the 17th century. They took their name from a prophecy in the Book of Daniel that four ancient monarchies (Babylonian, Persian, Macedonian, and Roman) would precede the kingdom of Christ. They also referred to the year 1666 and its relationship to the biblical Number of the Beast indicating the end of earthly rule by carnal human beings. They were one of a number of nonconformist dissenting groups that emerged around this time." (DBpedia, 2017)
definition: «Les hommes de la Cinquième Monarchie, ou Cinquièmes Monarchistes (Fifth Monarchy Men ou Fifth Monarchists en anglais) sont une faction idéologique de la Première Révolution anglaise, active de 1649 Ã 1661. Ils tiennent leur nom de leur croyance en la fondation prochaine d'un royaume planétaire par Jésus retournant sur terre.» (DBpedia, 2017) @fr
in scheme: religion

film industry
in dataset: The CWRC Ontology
type: occupation
type: Concept
alternative label: continuity clerk
alternative label: documentarian
alternative label: documentary film maker
alternative label: documentary maker
alternative label: film actor
alternative label: film assistant
alternative label: film director
alternative label: film extra
alternative label: film maker
alternative label: film performer
alternative label: film producer
alternative label: film stand in
in scheme: occupation

finance
in dataset: The CWRC Ontology
type: occupation
type: Concept
alternative label: bank clerk
alternative label: bank director
alternative label: bank employee
alternative label: bank manager
alternative label: bank president
alternative label: banker
alternative label: clerk in a bank
alternative label: financial manager
alternative label: financier
alternative label: investment banker
alternative label: merchant banker
alternative label: money lender
alternative label: ship broker
hidden label: director and chairman of the bank of new zealand
hidden label: director of the bank of england
hidden label: teller at the bank of england
in scheme: occupation
related: investor

firefighter
in dataset: The CWRC Ontology
type: occupation
type: Concept
hidden label: fire watcher
in scheme: occupation

first aid
in dataset: The CWRC Ontology
type: occupation
type: Concept
alternative label: first aid work
in scheme: occupation

fisherman
in dataset: The CWRC Ontology
type: occupation
type: Concept
alternative label: fish handler
alternative label: fisherwoman
in scheme: occupation

fishmonger
in dataset: The CWRC Ontology
type: occupation
type: Concept
in scheme: occupation

Flemish
in dataset: The CWRC Ontology
type: national heritage
type: Concept
comment: La description de ce terme est basée sur celle de DBPedia. @fr
comment: The description for this term is indebted to DBpedia.
label: Flandre @fr
definition: "The Flemish or Flemings (Dutch: Vlamingen) are a Germanic ethnic group, who speak Flemish Dutch. They are mostly found in the contemporary region of Flanders. They are one of two principal ethnic groups in Belgium, the other being the French-speaking Walloons. The Flemings make up the majority of the Belgian population (about 60%). Historically, all inhabitants of the medieval County of Flanders were called Flemings, irrespective of the language spoken. The contemporary region of Flanders comprises a part of this historical county, as well as parts of the medieval duchy of Brabant and the medieval county of Loon." (DBpedia, 2018)
definition: «La « Flandre » ou les « Flandres » est un toponyme Ã la source de confusions et de débats dû Ã ses multiples usages pour définir au fil du temps des zones géographiquement, politiquement, historiquement, linguistiquement et ethniquement différentes. Les occupants successifs de ce territoire ont nommé de la même manière des entités diverses et des formes différentes d'une unique entité, ce qui entraîne des divergences de perception aussi bien pour ses habitants que pour les étrangers. Ces derniers ont préféré occulter leurs origines flamandes et se définir comme :» (DBpedia, 2018) @fr
in scheme: national heritage

Florentine
in dataset: The CWRC Ontology
type: national identity
type: Concept
label: Florentin @fr
definition: Indicates a subject's identification with or labelling as Florentine as a national identity.
definition: Indique qu'un sujet s'identifie Ã ou s'est vu assigner une identité nationale florentine. @fr
in scheme: national identity

food distribution
in dataset: The CWRC Ontology
type: occupation
type: Concept
alternative label: food distributor
alternative label: food supplier
alternative label: provision merchant
alternative label: provisioner
broader transitive: merchant
in scheme: occupation

forebear of
in dataset: The CWRC Ontology
type: DeprecatedProperty
comment: Deprecated, with no current equivalence.
comment: Désapprouver sans équivalence. @fr
domain: Person
label: ancêtre de @fr
range: Person
sub property of: relative of
deprecated: true
term status: deprecated

foster-parent
in dataset: The CWRC Ontology
type: occupation
type: Concept
alternative label: foster mother
alternative label: foster parent
in scheme: occupation

founder
in dataset: The CWRC Ontology
type: occupation
type: Concept
alternative label: church founder
alternative label: college founder
alternative label: company founder
alternative label: founder of arts centre
alternative label: founder of benefit society
alternative label: founder of chapel
alternative label: founder of charitable organization
alternative label: founder of club
alternative label: founder of college
alternative label: founder of convent
alternative label: founder of educational organization
alternative label: founder of literary prize
alternative label: founder of literary society
alternative label: founder of prostitutes' home
alternative label: founder of relief organization
alternative label: founder of savings bank
alternative label: founder of woman's refuge
alternative label: founder of women's organization
alternative label: founder of writer' centre
alternative label: health society founder
alternative label: hospice founder
alternative label: hospital founder
alternative label: library founder
alternative label: magazine founder
alternative label: newspaper founder
alternative label: nursing home founder
alternative label: orphanage founder
alternative label: periodical founder
alternative label: refuge founder
alternative label: school founder
alternative label: society founder
alternative label: sunday school founder
alternative label: theatre founder
alternative label: university founder
hidden label: charity founder
hidden label: co founder of arlen house press
hidden label: co founder of, and remained closely involved in, the writers' action group
hidden label: educational institution founder
hidden label: founded
hidden label: founded a discussion society for ladies
hidden label: founder of charitable society
hidden label: founder of school
hidden label: founder of schools
hidden label: founder of the key west writers' workshop
hidden label: founder of the magazines vanity fair and the lady
hidden label: founder or co founder
hidden label: founding directors
hidden label: founding member of the london bach choir
hidden label: founding the irish confederation
hidden label: literary society founder
in scheme: occupation

free trade movement
in dataset: The CWRC Ontology
type: political affiliation
type: Concept
comment: The description for this term is indebted to DBpedia.
label: mouvement pour le libre-échange @fr
alternative label: free trader
definition: "Free Trader was a political label used in the United Kingdom by several candidates in the 1906 general election and January 1910 general election. Its candidates were in university constituencies, led by John Eldon Gorst, who had been previously elected as a Conservative Party but had split from the party in 1902. The group was in favour of limited social reforms, and in particular of free trade. While several of its candidates received substantial votes, none were elected, and in 1910 Gorst stood instead as a Liberal Party candidate, the remainder of the grouping soon petering out." (DBpedia, 2017)
in scheme: political affiliation

Freemasonry
in dataset: The CWRC Ontology
type: religion
type: Concept
comment: La description de ce terme est basée sur celle de DBPedia. @fr
comment: The description for this term is indebted to DBpedia.
label: franc-maçonnerie @fr
alternative label: Freemason
definition: "Freemasonry or Masonry consists of fraternal organisations that trace their origins to the local fraternities of stonemasons, which from the end of the fourteenth century regulated the qualifications of stonemasons and their interaction with authorities and clients. The degrees of freemasonry retain the three grades of medieval craft guilds, those of Apprentice, Journeyman or fellow (now called Fellowcraft), and Master Mason. These are the degrees offered by Craft (or Blue Lodge) Freemasonry. Members of these organisations are known as Freemasons or Masons. There are additional degrees, which vary with locality and jurisdiction, and are usually administered by different bodies than the craft degrees. The basic, local organisational unit of Freemasonry is the Lodge. The Lodges are usually supervised and governed at the regional level (usually coterminous with either a state, province, or national border) by a Grand Lodge or Grand Orient. There is no international, worldwide Grand Lodge that supervises all of Freemasonry; each Grand Lodge is independent, and they do not necessarily recognise each other as being legitimate. Modern Freemasonry broadly consists of two main recognition groups. Regular Freemasonry insists that a volume of scripture is open in a working lodge, that every member profess belief in a Deity, that no women are admitted, and that the discussion of religion and politics is banned. Continental Freemasonry is now the general term for the "liberal" jurisdictions who have removed some, or all, of these restrictions." (DBpedia, 2018)
definition: «Le mot franc-maçonnerie désigne un ensemble d'espaces de sociabilité sélectifs, formé de phénomènes historiques et sociaux très divers. Le recrutement des membres est fait par cooptation et pratique des rites initiatiques se référant Ã un secret maçonnique et Ã l'art de bâtir.Difficilement traçable historiquement, la franc-maçonnerie semble apparaître en 1598 en Ãcosse (Statuts Schaw), puis en Angleterre au XVIIe siècle. Elle se décrit, suivant les époques, les pays et les formes, comme une « association essentiellement philosophique et philanthropique », comme un « système de morale illustré par des symboles » ou comme un « ordre initiatique ». Organisée en obédiences depuis 1717 Ã Londres, la franc-maçonnerie dite « spéculative » â c'est-Ã -dire philosophique â fait référence aux rites des Anciens Devoirs de la « maçonnerie » dite « opérative » formée par les corporations de bâtisseurs qui édifièrent, entre autres, les cathédrales. Elle prodigue un enseignement ésotérique progressif Ã l'aide de symboles et de rituels. Elle encourage ses membres Ã Åuvrer pour le progrès de l'humanité, laisse Ã chacun le soin d'interpréter ces mots. Sa vocation se veut universelle, bien que ses pratiques et ses modes d'organisation soient extrêmement variables selon les pays et les époques. Elle s'est structurée au fil des siècles autour d'un grand nombre de rites et de traditions, ce qui a entraîné la création d'une multitude d'obédiences, qui ne se reconnaissent pas toutes entre elles. Elle a toujours fait l'objet de nombreuses critiques et dénonciations, aux motifs très variables selon les époques et les pays. Une discipline de réflexion porte sur la franc-maçonnerie : la maçonnologie.» (DBpedia, 2018) @fr
in scheme: religion

freethought
in dataset: The CWRC Ontology
type: religion
type: Concept
comment: La description de ce terme est basée sur celle de DBPedia. @fr
comment: The description for this term is indebted to DBpedia.
label: libre-pensée @fr
alternative label: free-thinker
alternative label: sceptic
definition: "Freethought or free thought is a philosophical viewpoint which holds that positions regarding truth should be formed on the basis of logic, reason, and empiricism, rather than authority, tradition, revelation, or other dogma. The cognitive application of freethought is known as "freethinking", and practitioners of freethought are known as "freethinkers". The term first came into use in the 17th century to indicate people who inquired into the basis of traditional religious beliefs." (DBpedia, 2018)
definition: «La libre-pensée ou libre pensée est une attitude qui consiste Ã refuser tout dogmatisme religieux, philosophique ou autre, et Ã se fier principalement Ã ses propres expériences et raison (rationalisme, empirisme) pour penser ou juger, quitte Ã jouer d'opportunisme. De la Grèce antique Ã la Chine de la dynastie Song en passant par la Perse médiévale, l'histoire de la libre-pensée trouve sa richesse au travers de diverses époques et civilisations. Un auteur typique de la libre-pensée est François Rabelais. En tant que mouvement culturel, dans le monde francophone la libre-pensée est principalement issue des développements de la Révolution française. Par nature contestataire, l'opposition en particulier aux autorités et dogmes religieux y est centrale, surtout dans l'acception moderne du terme (ainsi qu'anglophone (en)). Les libres-penseurs peuvent être athées, agnostiques, déistes, anarchistes (ou libertaires) et rationalistes.» (DBpedia, 2018) @fr
in scheme: religion

French nationalism
in dataset: The CWRC Ontology
type: political affiliation
type: Concept
comment: La description de ce terme est basée sur celle de DBPedia. @fr
comment: The description for this term is indebted to DBpedia.
label: Nationalisme en France @fr
broader transitive: nationalism
definition: "French nationalism is the nationalism that asserts that the French are a nation and promotes the cultural unity of the French." (DBpedia, 2017)
definition: «Le nationalisme en France est apparu au cours du XVIIIe siècle dans la bourgeoisie, sous la plume des philosophes des Lumières. Le nationalisme signifiait pour eux, Ã cette époque, que c'est le peuple qui incarne le pays, par opposition Ã la vision de l'ancien régime pour lequel le pays est incarné par le Roi de France. Au XIXe siècle, le nationalisme devient une opposition aux autres nations, voire aux autres peuples, cette idée prenant clairement forme Ã la fin de ce siècle, dans les mouvements politiques entrant en jeu dans le système démocratique français, est née en 1870, avec la Troisième République. Ã cette époque, tous les partis manifestent ostensiblement de telles idées nationalistes et anti-allemandes : la Prusse venait de gagner une guerre et avait pris l'Alsace-Lorraine.» (DBpedia, 2017) @fr
in scheme: political affiliation

frigidity
in dataset: The CWRC Ontology
type: sexuality
type: Concept
label: frigidité @fr
alternative label: frigid
definition: Frigidity labels a female subject as sexually withdrawn or unenthusiastic (read: non-consenting) in relation to the sexual advance, usually of men within a heterosexual framework, and suggests a lack of pleasure from sexual activities. Unlike asexual and celibate, this term is often ascribed to women, as opposed to self-referential. The term "frigid" was coined in the 1920s by sexologists (Sex and Society, Vol. 1, 285). Its use in discourse surrounding female sexuality is waning.
definition: La frigidité est attribuée aux femmes qui se montrent distantes ou peu enthousiastes (comprendre non consentantes) face aux avances sexuelles, le plus souvent de la part d'hommes dans un cadre hétéronormé, et suggère un manque de plaisir associé aux pratiques sexuelles. Contrairement Ã l'asexualité et au célibat, ce terme est souvent assigné Ã des femmes, et n'est donc pas autoréférentiel. Le terme «frigide» a été formulé dans les années 20 par des sexologues (Sex and Society, Vol. 1, 285). Son usage est en déclin dans les discours Ã propos de la sexualité féminine. @fr
in scheme: sexuality

fundraiser
in dataset: The CWRC Ontology
type: occupation
type: Concept
alternative label: educational fundraiser
alternative label: fundraising
alternative label: hospital fundraiser
in scheme: occupation

Gael
in dataset: The CWRC Ontology
type: ethnicity
type: Concept
comment: La description de ce terme est basée sur celle de DBPedia. @fr
comment: The description for this term is indebted to DBpedia.
alternative label: highland
broader transitive: Scottish
definition: "The Gaels (English pronunciation: /É¡eËlË /; Irish: Na Gaeil; Scottish Gaelic: Na GÃ idheil), also known as Goidels, are an ethnolinguistic group indigenous to northwestern Europe. They are associated with the Gaelic languages; a branch of the Celtic languages comprising Irish, Manx and Scottish Gaelic. Other ethnonyms historically associated with the Gaels include Irish and Scots, but the scope of those nationalities is today more complex. Gaelic language and culture originated in Ireland, extending to Dál Riata in southwest Scotland. In the Middle Ages, it became dominant throughout Scotland and the Isle of Man also. However, in most areas, the Gaels were gradually anglicized and the Gaelic languages supplanted by English. The modern descendants of the Gaels have spread throughout much of Great Britain and as far as the Americas and Oceania." (DBpedia, 2017)
definition: «Les Gaels ou Goidels étaient un peuple celtique implanté dans les îles Britanniques (principalement en Ãcosse, en Irlande et sur l'île de Man) lors de la période protohistorique. Les Gaels auraient donné leur nom aux différents peuples gaéliques et Ã la famille des langues gaéliques. Le nom « Gael » a été adopté en 1810 Ã partir du gaélique écossais Gaidheal (en irlandais Gael et vieil irlandais Goidhel-Goídeleg) pour désigner un montagnard (EOD). Gael ou Goídeleg ont d'abord été utilisés comme un terme générique pour décrire les habitants d'Irlande. Dans son Åuvre, Celtic Culture: Aberdeen breviary-celticism, John T. Koch , professeur de langue et littérature celtiques précise que la racine de ce mot correspond au vieil irlandais, fíad, au vieux breton, guoid, et au moyen gallois, gŵyh, tous signifiant sauvage, et donc Gael signifierait peuple de la forêt ou sauvages. Beaucoup de personnes qui ne parlent pas le gaélique se considèrent comme Gaels dans un sens plus large, en raison de leur ascendance historique et de leur héritage.»(DBpedia, 2017) @fr
in scheme: ethnicity

gambling
in dataset: The CWRC Ontology
type: occupation
type: Concept
alternative label: gambler
hidden label: stock exchange gambler
in scheme: occupation

gardener
in dataset: The CWRC Ontology
type: occupation
type: Concept
alternative label: garden design
alternative label: gardening
alternative label: hedge setter
alternative label: horticulturalist
alternative label: horticulturist
alternative label: landscape gardener
in scheme: occupation

gastronome
in dataset: The CWRC Ontology
type: occupation
type: Concept
in scheme: occupation

gay rights movement
in dataset: The CWRC Ontology
type: political affiliation
type: Concept
comment: La description de ce terme est basée sur celle de DBPedia. @fr
comment: The description for this term is indebted to DBpedia.
label: Mouvement LGBT @fr
alternative label: gay rights advocate
alternative label: pro-sexual preference
broader transitive: civil rights movement
definition: "Lesbian, gay, bisexual, transgender, and queer (LGBTQ) social movements are social movements that advocate for the equalized acceptance of LGBT people in society. In these movements, LGBTQ people and their allies have a long history of campaigning for what is now generally called LGBTQ rights, sometimes also called gay rights or gay and lesbian rights. Although there is not a primary or an overarching central organisation that represents all LGBT people and their interests, numerous LGBT rights organisations are active worldwide. The earliest organisations to support LGBT rights were formed in the 19th century. A commonly stated goal among these movements is social equality for LGBT people. Some have also focused on building LGBT communities or worked towards liberation for the broader society from biphobia, homophobia, and transphobia. LGBT movements organized today are made up of a wide range of political activism and cultural activity, including lobbying, street marches, social groups, media, art, and research." (DBpedia, 2017)
definition: «Le mouvement lesbien, gay, bisexuel et transsexuel (LGBT) désigne l'ensemble des mouvements et actions individuelles ou collectives qui cherchent Ã faire évoluer la perception sociale des minorités sexuelles, de l'homosexualité, de la bisexualité et de la transsexualité. Un objectif fréquemment avancé par ces mouvements est l'égalité des droits civils et sociaux pour les personnes LGBT et, parfois, la construction de communautés LGBT ou la libération de l'ensemble de la société de la biphobie, de l'homophobie et de la transphobie. Il n'existe pas d'organisation qui regroupe l'ensemble des LGBT et de nombreuses structures existent dans différents pays Ã travers le monde. Le mouvement se concrétise notamment par des actions militantes, culturelles et artistiques ou des manifestations de rue telle que la Marche des fiertés.» (DBpedia, 2017) @fr
in scheme: political affiliation

gender identity
in dataset: The CWRC Ontology
subject-centric predicate: has gender identity
type: ObjectProperty
domain: Person
label: genre @fr
range: gender
sub property of: cultural form

man/male
is replaced by: man
in dataset: The CWRC Ontology
type: Thing
type: Concept
comment: Deprecated in favour of instance man.
comment: Désapprouver en faveur de l'instance homme. @fr
label: homme/mâle @fr
deprecated: true
term status: deprecated

gender identity of
in dataset: The CWRC Ontology
type: ObjectProperty
domain: gender
range: Person
sub property of: cultural form of

gender identity (reported)
in dataset: The CWRC Ontology
subject-centric predicate: has gender identity (reported)
type: ObjectProperty
domain: Person
label: genre (déclaré) @fr
range: gender
sub property of: gender identity

gender identity (reported) of
in dataset: The CWRC Ontology
type: ObjectProperty
domain: gender
range: Person
sub property of: gender identity of

gender identity (self-reported)
in dataset: The CWRC Ontology
subject-centric predicate: has gender identity (self-reported)
type: ObjectProperty
domain: Person
label: genre (autodéclaré) @fr
range: gender
sub property of: gender identity

gender identity (self-reported) of
in dataset: The CWRC Ontology
type: ObjectProperty
domain: gender
range: Person
sub property of: gender identity of

Transman/Transmale
is replaced by: trans man/trans male
in dataset: The CWRC Ontology
type: Concept
comment: Deprecated in favour of instance trans man/trans male.
comment: Désapprouver en faveur de l'instance homme trans. @fr
label: Homme Trans @fr
deprecated: true
term status: deprecated

Transwoman/Transfemale
is replaced by: trans woman/trans female
in dataset: The CWRC Ontology
type: Concept
comment: Deprecated in favour of instance trans woman/trans female.
comment: Désapprouver en faveur de l'instance femme trans. @fr
label: Femme Trans @fr
deprecated: true
term status: deprecated

Woman/Female
is replaced by: woman
in dataset: The CWRC Ontology
type: Thing
type: Concept
comment: Deprecated in favour of instance woman.
comment: Désapprouver en faveur de l'instance femme. @fr
label: Femme/Femelle @fr
deprecated: true
term status: deprecated

gendered political activity
in dataset: The CWRC Ontology
range includes: political affiliation
range includes: political organization
range includes: religion
subject-centric predicate: has gendered political activity
type: ObjectProperty
domain: Person
sub property of: political affiliation

genealogist
in dataset: The CWRC Ontology
type: occupation
type: Concept
alternative label: family genealogist
alternative label: genealogical scholar
in scheme: occupation

gentleman
in dataset: The CWRC Ontology
type: occupation
type: Concept
alternative label: country gentleman
in scheme: occupation

gentry
in dataset: The CWRC Ontology
type: social class
type: Concept
label: aristocratie @fr
alternative label: GENTRY
alternative label: gentility
definition: L'appartenance Ã l'aristocratie indique la possession d'une propriété, sous la forme de terres, d'actions ou d'obligations. Elle «indique d'abord la possession d'armes et d'armoiries, mais se distingue de la noblesse car les biens financiers ne sont pas nécessairement liés Ã un sang ou un titre nobles. Les gentlemen désintéressés font partie de cette classe (i.e. Mr Bennett dans Jane Austen).» Les gentlewomen appartiennent également Ã cette classe, y compris dans le cas où elles sont entretenues par un père ou un frère au lieu d'être propriétaires, ou lorsqu'elles se retrouvent en difficulté, c'est-Ã -dire passées Ã un état de précarité financière, comme c'est le cas de Jane Eyre ou la Jane Fairfax de Austen. @fr
definition: Membership in the gentry indicates property-ownership or relation to the same; property can be land or stocks and bonds. It "begins in the idea of owning arms and having a coat of arms, but is distinguished from nobility insofar as money is not necessarily related to blood and title. Disinterested gentlemen are of this class (i.e. Mr. Bennett in Jane Austen)."(Brown, 2006) Gentlewomen belong to this class, even though they may not themselves own much property but instead be supported by a father or brother, or they may be distressed, which is to say, impoverished gentlewomen, as in the case of Jane Eyre or Austen's Jane Fairfax.
in scheme: social class

geographer
in dataset: The CWRC Ontology
type: occupation
type: Concept
in scheme: occupation

geographic heritage
in dataset: The CWRC Ontology
range includes: geographic heritage
range includes: AdminPlaceConcept
range includes: Feature
subject-centric predicate: has geographic heritage
type: ObjectProperty
domain: Person
label: un héritage géographique @fr
sub property of: cultural form

geographic heritage of
in dataset: The CWRC Ontology
domain includes: geographic heritage
domain includes: AdminPlaceConcept
domain includes: Feature
type: ObjectProperty
range: Person
sub property of: cultural form of

geographic heritage (reported)
in dataset: The CWRC Ontology
range includes: geographic heritage
range includes: AdminPlaceConcept
range includes: Feature
subject-centric predicate: has geographic heritage (reported)
type: ObjectProperty
domain: Person
label: un héritage géographique (déclaré) @fr
sub property of: geographic heritage

geographic heritage (reported) of
in dataset: The CWRC Ontology
domain includes: geographic heritage
domain includes: AdminPlaceConcept
domain includes: Feature
type: ObjectProperty
range: Person
sub property of: geographic heritage of

geographic heritage (self-reported)
in dataset: The CWRC Ontology
range includes: geographic heritage
range includes: AdminPlaceConcept
range includes: Feature
subject-centric predicate: has geographic heritage (self-reported)
type: ObjectProperty
domain: Person
label: un héritage géographique (autodéclaré) @fr
sub property of: geographic heritage

geographic heritage (self-reported) of
in dataset: The CWRC Ontology
domain includes: geographic heritage
domain includes: AdminPlaceConcept
domain includes: Feature
type: ObjectProperty
range: Person
sub property of: geographic heritage of

geologist
in dataset: The CWRC Ontology
type: occupation
type: Concept
broader transitive: scientist
in scheme: occupation

German nationalism
in dataset: The CWRC Ontology
type: political affiliation
type: Concept
comment: The description for this term is indebted to DBpedia.
label: nationalisme allemand @fr
alternative label: pro-German
broader transitive: nationalism
definition: "German nationalism is the idea that asserts that Germans are a nation and promotes the cultural unity of Germans. The earliest origins of German nationalism began with the birth of Romantic nationalism during the Napoleonic Wars when Pan-Germanism started to rise. Advocacy of a German nation began to become an important political force in response to the invasion of German territories by France under Napoleon. After the rise and fall of Nazi Germany during World War II, German nationalism has been generally viewed in the country as taboo. However, during the Cold War, German nationalism arose that supported the reunification of East and West Germany that was achieved in 1990. German nationalism has faced difficulties in promoting a united German identity as well as facing opposition within Germany. The Catholic-Protestant divide in Germany at times created extreme tension and hostility between Catholic and Protestant Germans after 1871, such as in response to the policy of Kulturkampf in Prussia by German Chancellor and Prussian Prime Minister Otto von Bismarck, that sought to dismantle Catholic culture in Prussia, provoking outrage amongst Germany's Catholics and resulting in the rise of the pro-Catholic Centre Party and the Bavarian People's Party. There have been rival nationalists within Germany, particularly Bavarian nationalists who claim that the terms that Bavaria entered into Germany in 1871 were controversial and have claimed the German government has long intruded into the domestic affairs of Bavaria. Outside of modern-day Germany in Austria, there are Austrian nationalists who have rejected unification of Austria with Germany on the basis of preserving Austrians' Catholic religious identity from the potential danger posed by being part of a Protestant-majority Germany." (DBpedia, 2017)
in scheme: political affiliation

Girondin
in dataset: The CWRC Ontology
type: political affiliation
type: Concept
comment: La description de ce terme est basée sur celle de DBPedia. @fr
comment: The description for this term is indebted to DBpedia.
label: Gironde (Révolution française) @fr
definition: "The Girondins or Girondists were members of the Gironba, a political group operating in France from 1791 to 1795 during the French Revolution. The Girondins were active within the Legislative Assembly and the National Convention. They were part of the Jacobin movement, though not every Girondin was a member of the Jacobin Club. The Girondins campaigned for the end of the monarchy but then resisted the spiraling momentum of the Revolution. They came into conflict with The Mountain (Montagnards), a radical faction within the Jacobin Club. This conflict eventually led to the fall of the Girondins and their mass execution, the beginning of the Reign of Terror. The Girondins comprised a group of loosely affiliated individuals rather than an organized political party, and the name was at first informally applied because the most prominent exponents of their point of view were deputies to the Legislative Assembly from the department of Gironde in southwest France. The term became standard with Lamartine's history in 1847. Girondin leader Jacques-Pierre Brissot proposed an ambitious military plan to spread the Revolutionâone that Napoleon later achieved. He called on the Convention to dominate Western Europe by conquering the Rhineland, Poland, and Holland, with a goal of creating a protective ring of satellite republics in Britain, Spain and Italy by 1795. The Girondins were thus the war party in 1792â93. Other prominent Girondins included Jean Marie Roland and his wife Madame Roland. They had an ally in the English-born, sometime American, activist Thomas Paine. Brissot and Madame Roland were executed and Jean Roland (who had gone into hiding) committed suicide when he learned what had transpired. Paine was arrested and imprisoned but narrowly escaped execution. The famous painting Death of Marat depicts the killing of the fiery radical journalist (and denouncer of the Girondins) Jean-Paul Marat by the Girondin sympathizer Charlotte Corday, who was executed." (DBpedia, 2…
definition: «Certains Girondins, comme Condorcet, Brissot, Roland, Guadet, Vergniaud, Isnard, Ducos et Buzot étaient des républicains convaincus. Ses membres, pour la plupart inscrits au club des Jacobins Ã Paris ou en province, constituaient l'aile la plus avancée de l'Assemblée législative, avant de représenter l'aile droite de la Convention nationale face aux Montagnards, qui étaient en force parmi les députés de Paris, et incarnés par les figures de Robespierre, Danton ou Marat. Les affrontements violents entre Girondins et Montagnards dominent les premiers mois de la Convention.» (DBpedia, 2017) @fr
in scheme: political affiliation
related: Jacobinism

glass worker
in dataset: The CWRC Ontology
type: occupation
type: Concept
alternative label: glass stainer
alternative label: glassworks
alternative label: glazier
alternative label: stained glass designer
in scheme: occupation

glover
in dataset: The CWRC Ontology
type: occupation
type: Concept
broader transitive: clothing production
in scheme: occupation

Gnosticism
in dataset: The CWRC Ontology
type: religion
type: Concept
comment: La description de ce terme est basée sur celle de DBPedia. @fr
comment: The description for this term is indebted to DBpedia.
label: gnosticisme @fr
definition: "Gnosticism (from Ancient Greek: Î³Î½ÏÏÏÎ¹ÎºÏÏ gnostikos, "having knowledge", from Î³Î½á¿¶ÏÎ¹Ï gnÅsis, knowledge) is a modern term categorizing a collection of ancient religions whose adherents shunned the material world â which they viewed as created by the demiurge â and embraced the spiritual world. Gnostic ideas influenced many ancient religions that teach that gnosis (variously interpreted as knowledge, enlightenment, salvation, emancipation or 'oneness with God') may be reached by practicing philanthropy to the point of personal poverty, sexual abstinence (as far as possible for hearers, entirely for initiates) and diligently searching for wisdom by helping others. However, practices varied among those who were Gnostic. In Gnosticism, the world of the demiurge is represented by the underworld, which is associated with flesh, time, and more particularly, the imperfect ephemeral world. The world of God is represented by the upper world and is associated with the soul and perfection. The world of God is eternal and not part of the physical. It is impalpable and timeless. Gnosticism is primarily defined in a Christian context. In the past, some scholars thought that gnosticism predated Christianity and included pre-Christian religious beliefs and spiritual practices argued to be common to early Christianity, Neoplatonism, Hellenistic Judaism, Greco-Roman mystery religions, and Zoroastrianism (especially Zurvanism). The discussion of gnosticism changed radically with the discovery of the Nag Hammadi library and led to a revision of older assumptions. To date, no pre-Christian gnostic texts have been found, and gnosticism as a unique and recognizable belief system is considered to be a second century (or later) development." (DBpedia, 2018)
definition: «Le gnosticisme est un système de pensée dualiste qui regroupe des doctrines variées du bassin méditerranéen et du Moyen-Orient qui se caractérisent généralement par l'affirmation que les êtres humains sont des âmes divines emprisonnées dans un monde matériel créé par un dieu mauvais ou imparfait appelé Démiurge ou Yahvé. Le mouvement connut son apogée au cours du IIe siècle. Le Démiurge, représenté sous la forme d'un archange, est considéré comme l'incarnation du mal ou comme un créateur bon mais imparfait. A l'opposé de cette divinité créatrice néfaste, il existe un autre être suprême plus éloigné (Dieu) incarnant le bien. Ainsi, aux yeux des adeptes du gnosticisme, l'homme est prisonnier du temps, de son corps, de son âme inférieure et du monde ; ils en concluent : « Je suis au monde, mais je ne suis pas de ce monde » ; de ce point de vue, le monde et l'existence dans le monde apparaîtront mauvais parce qu'ils sont mélange de deux natures et de deux mondes d'êtres contraires et inconciliables. Les adeptes du gnosticisme opposent lâEsprit et la matière et par conséquent Dieu et lâhomme. Le gnosticisme ne doit pas être confondu avec la gnose chrétienne avec laquelle il est en totale opposition. Contrairement aux adeptes du gnosticisme, les gnostiques chrétiens défendus par les pères de l'Ãglise croient que, par la connaissance de soi, l'homme peut trouver Dieu en lui. La matière (le corps, le monde, etc.) ne sont pas rejetés ; au contraire, l'acceptation de la matière participe Ã la transformation intérieure du fidèle et Ã sa divinisation (Theosis). D'inspiration chrétienne, le gnosticisme fut qualifié d'hérésie par les Pères de l'Ãglise de ce qui allait devenir la « Grande Ãglise » chrétienne. Irénée de Lyon, dans la deuxième moitié du IIe siècle dans sa Dénonciation et réfutation de la gnose au nom menteur (ou Contre les hérésies) en a laissé le témoignage antique le plus important et le nom … @fr
in scheme: religion

goldsmith
in dataset: The CWRC Ontology
type: occupation
type: Concept
broader transitive: jeweller
in scheme: occupation

governess
in dataset: The CWRC Ontology
type: occupation
type: Concept
broader transitive: education
in scheme: occupation

government
in dataset: The CWRC Ontology
type: occupation
type: Concept
alternative label: elected
alternative label: government adviser
alternative label: representative
alternative label: served in the legislature
hidden label: government fishery advisor
in scheme: occupation
related: politics

government official
in dataset: The CWRC Ontology
type: occupation
type: Concept
alternative label: civic work
alternative label: civil servant
alternative label: coroner
alternative label: county court bailiff
alternative label: custos rotulorum
alternative label: distributor of stamps
alternative label: exchequer clerk
alternative label: government employee
alternative label: health officer
alternative label: local government clerk
alternative label: member of the indian civil service
alternative label: poor law guardian
alternative label: prison governor
alternative label: prison guard
alternative label: queen's champion
alternative label: queen's messenger
alternative label: registrar
alternative label: registrar of births and deaths
alternative label: resident magistrate
alternative label: sanitary inspector
alternative label: secretary to parliamentary commission
alternative label: senior civil servant
alternative label: sequestrator
alternative label: sheriff clerk
alternative label: town planner
alternative label: traffic superintendent
broader transitive: government
hidden label: deputy director of the women's branch of the ministry of agriculture
hidden label: deputy keeper of her majesty's records
hidden label: deputy theatre censor
hidden label: director general of the tapu land registry
hidden label: east india company officer
hidden label: magistrate for the county of middlesex
hidden label: master of the savoy
hidden label: secretary of the fine arts commission
hidden label: secretary of the royal united service institution
hidden label: secretary to the lord keeper of the great seal of england
in scheme: occupation

governor general
in dataset: The CWRC Ontology
type: occupation
type: Concept
broader transitive: higher government
hidden label: governor general of canada
hidden label: governor general of india
in scheme: occupation

grandchild
in dataset: The CWRC Ontology
subject-centric predicate: has grandchild
type: ObjectProperty
range: Person
sub property of: relative

grandchild of
in dataset: The CWRC Ontology
type: ObjectProperty
domain: Person
label: petit enfant de @fr
range: Person
sub property of: relative of
inverse of: has grandchild

granddaughter
in dataset: The CWRC Ontology
subject-centric predicate: has granddaughter
type: ObjectProperty
range: Person
sub property of: grandchild

granddaughter of
in dataset: The CWRC Ontology
type: ObjectProperty
domain: Person
label: petite fille de @fr
range: Person
sub property of: grandchild of
inverse of: has granddaughter

grandfather
in dataset: The CWRC Ontology
subject-centric predicate: has grandfather
type: ObjectProperty
range: Person
sub property of: grandparent

grandfather of
in dataset: The CWRC Ontology
type: ObjectProperty
domain: Person
label: grand-père de @fr
range: Person
sub property of: grandparent of
inverse of: has grandfather

grandmother
in dataset: The CWRC Ontology
subject-centric predicate: has grandmother
type: ObjectProperty
range: Person
sub property of: grandparent

grandmother of
in dataset: The CWRC Ontology
type: ObjectProperty
domain: Person
label: grand-mère de @fr
range: Person
sub property of: grandparent of
inverse of: has grandmother

grandparent
in dataset: The CWRC Ontology
subject-centric predicate: has grandparent
type: ObjectProperty
range: Person
sub property of: relative

grandparent of
in dataset: The CWRC Ontology
type: ObjectProperty
domain: Person
label: grandparent de @fr
range: Person
sub property of: relative of
inverse of: has grandparent

grandson
in dataset: The CWRC Ontology
subject-centric predicate: has grandson
type: ObjectProperty
range: Person
sub property of: grandchild

grandson of
in dataset: The CWRC Ontology
type: ObjectProperty
domain: Person
label: petit fils de @fr
range: Person
sub property of: grandchild of
inverse of: has grandson

Greek nationalism
in dataset: The CWRC Ontology
type: political affiliation
type: Concept
comment: The description for this term is indebted to DBpedia.
label: nationliste grec @fr
broader transitive: nationalism
definition: "Greek nationalism (or Hellenic nationalism) refers to the nationalism of Greeks and Greek culture. As an ideology, Greek nationalism originated and evolved in pre-modern times. It became a major political movement beginning in the 18th century, which culminated in the Greek War of Independence (1821â1829) against the Ottoman Empire. It became a potent movement in Greece shortly prior to, and during World War I under the leadership of nationalist figure Eleutherios Venizelos who pursued the Megali Idea and managed to liberate Greece in the Balkan Wars and after World War I, briefly annexed the region of Izmir before it was retaken by Turkey. Today Greek nationalism remains important in the Greco-Turkish dispute over Cyprus." (DBpedia, 2017)
in scheme: political affiliation

grocer
in dataset: The CWRC Ontology
type: occupation
type: Concept
alternative label: royal grocer
in scheme: occupation

guardian
in dataset: The CWRC Ontology
subject-centric predicate: has guardian
type: occupation
type: ObjectProperty
type: Concept
range: Person
sub property of: interpersonal relationship
in scheme: occupation

guardian of
in dataset: The CWRC Ontology
type: ObjectProperty
label: tuteur (âtrice) / gardien (ne) @fr
sub property of: has interpersonal relationship with
inverse of: has guardian
definition: Une personne placé en charge du bienfait d'un personne mineure. @fr

Guelph party (Florence)
in dataset: The CWRC Ontology
type: political affiliation
type: Concept
comment: La description de ce terme est basée sur celle de DBPedia. @fr
comment: The description for this term is indebted to DBpedia.
label: Guelfes et gibelins @fr
alternative label: Guelph
definition: The Guelphs and Ghibellines were factions supporting the Pope and the Holy Roman Emperor, respectively, in the Italian city-states of Central and Northern Italy. During the 12th and 13th centuries, rivalry between these two parties formed a particularly important aspect of the internal politics of medieval Italy. The struggle for power between the Papacy and the Holy Roman Empire had arisen with the Investiture Controversy, which began in 1075 and ended with the Concordat of Worms in 1122. The division between the Guelphs and Ghibellines in Italy, however, persisted until the 15th century.
definition: «Les guelfes et les gibelins sont deux factions (parti ou, plus souvent, brigate ou sette) médiévales qui s'opposèrent militairement, politiquement et culturellement dans l'Italie des Duecento et Trecento. Ã l'origine, elles soutenaient respectivement deux dynasties qui se disputaient le trône du Saint-Empire : la pars Guelfa appuyait les prétentions de la dynastie des «Welfs» et de la papauté, puis de la maison d'Anjou, la pars Gebellina, celles des Hohenstaufen, et au-delà celles du Saint-Empire. Conflit en apparence limité au Saint-Empire, l'opposition entre Guelfes et Gibelins va se transporter dans diverses parties d'Europe, principalement dans les villes de la péninsule italienne. Dans cette bipolarisation, parfois surestimée, les allégeances dynastiques sont parfois secondaires, les adhésions fluctuantes, et il faut attendre le règne de Frédéric II pour que papauté et empire deviennent des symboles forts de ralliement et que se construise une véritable division antithétique. Ce clivage trouve des manifestations dans le domaine civique et religieux et cristallise les tensions entre les villes italiennes, au sein de leurs élites et parfois entre la ville et son contado. L'écho du conflit se manifeste Ã des époques ultérieures, en revêtant de nouveaux caractères et en stigmatisant des oppositions idéologiques nouvelles.» (DBpedia, 2017) @fr
in scheme: political affiliation
related: pro-Catholicism

haberdasher
in dataset: The CWRC Ontology
type: occupation
type: Concept
in scheme: occupation

habitation
in dataset: The CWRC Ontology
range includes: AdminPlaceConcept
range includes: Feature
subject-centric predicate: inhabited
type: ObjectProperty
sub property of: spatial relationship

half-brother
in dataset: The CWRC Ontology
subject-centric predicate: has half-brother
type: ObjectProperty
range: Person
sub property of: brother
note: Comment: This term is a CWRC-specific addition not in the original Orlando tag set.

half-brother of
in dataset: The CWRC Ontology
type: ObjectProperty
domain: Person
range: Person
sub property of: brother of
inverse of: has half-brother
broader: sibling
note: Comment: This term is a CWRC-specific addition not in the original Orlando tag set.

half-sister
in dataset: The CWRC Ontology
subject-centric predicate: has half-sister
type: ObjectProperty
range: Person
sub property of: sister
note: Comment: This term is a CWRC-specific addition not in the original Orlando tag set.

half-sister of
in dataset: The CWRC Ontology
type: ObjectProperty
domain: Person
range: Person
sub property of: sister of
inverse of: has half-sister
broader: sibling
note: Comment: This term is a CWRC-specific addition not in the original Orlando tag set.

handwriting expert
in dataset: The CWRC Ontology
type: occupation
type: Concept
in scheme: occupation

Hanoverian
in dataset: The CWRC Ontology
type: political affiliation
type: Concept
comment: La description de ce terme est basée sur celle de DBPedia. @fr
comment: The description for this term is indebted to DBpedia.
label: Maison de Hanovre @fr
alternative label: House of Hanover
definition: "The House of Hanover is a German royal dynasty that ruled the Electorate and then the Kingdom of Hanover, and that also provided monarchs of Great Britain and Ireland from 1714 and ruled the United Kingdom until the death of Queen Victoria in 1901. The House of Hanover was formally named the House of Brunswick-Lüneburg, Hanover line, as it was originally a cadet branch of the House of Brunswick-Lüneburg. The senior branch became extinct in 1884, and the House of Hanover is now the only surviving branch of the House of Welf, which is the senior branch of the House of Este. The current head of the House of Hanover is Ernst August, Prince of Hanover." (DBpedia, 2017)
definition: «La Maison de Hanovre est une dynastie royale allemande qui a régné sur le duché de Brunswick-Lunebourg (en allemand Braunschweig-Lüneburg), le royaume de Hanovre, le royaume de Grande-Bretagne, puis du Royaume-Uni. Elle succède Ã la Maison Stuart sur le trône britannique en 1714 et s'y maintient jusqu'à la mort de Victoria en 1901. Elle est parfois appelée Maison de Brunswick-Lüneburg. Ã la mort de Victoria, le trône du Royaume-Uni est passé dans la maison de Saxe-Cobourg-Gotha en la personne d'Ãdouard VII du Royaume-Uni, devenue la maison Windsor en 1917.» (DBpedia, 2017) @fr
in scheme: political affiliation

Hanoverian
in dataset: The CWRC Ontology
type: national identity
type: Concept
label: Hanovrien @fr
definition: Indicates a subject's identification with or labelling as Hanoverian as a national identity. See Hanover - Wikipedia.
definition: Indique qu'un sujet s'identifie Ã ou s'est vu assigner une identité nationale hanovrienne. Voir Hanovre â Wikipédia. @fr
in scheme: national identity

has activist involvement from
in dataset: The CWRC Ontology
domain includes: political affiliation
domain includes: political organization
type: ObjectProperty
range: Person
sub property of: has political membership from

has activist involvement in
in dataset: The CWRC Ontology
range includes: political affiliation
range includes: political organization
range includes: religion
type: ObjectProperty
domain: Person
sub property of: has political membership in
inverse of: has activist involvement from
definition: Indicates the highest level of political involvement in a particular cause. It indicates such activities as suffragists chaining themselves to railings or women camping out at Greenham Common, as well as very active leadership roles in a political organization. Thus Josephine Butler, founder of the Ladies' National Association Against the Contagious Diseases Acts, qualifies as activist for having founded the organization, directed its activities, and for speaking publicly at meetings at considerable personal risk.

has ancestor
in dataset: The CWRC Ontology
type: ObjectProperty
domain: Person
range: Person
sub property of: has relative
alternative label: forebear
definition: Relates a person to an ancestor or forebear, usually at a remove of two generations or more.

has aunt
in dataset: The CWRC Ontology
type: ObjectProperty
domain: Person
range: Person
sub property of: has relative
broader: relatedTo
definition: Relates a person to the sister of their father or mother, but can also refer to any maternal relationship and need not be restricted to a consanguineal relation.

has award
in dataset: The CWRC Ontology
type: ObjectProperty
label: a une récompense @fr
sub property of: relates by education to
inverse of: awarded to
definition: Indicates an award, prize, or recognition that a person has won, such as a literary award or an educational award prize.
definition: Indique une récompense, un prix ou une distinction qu'une personne a gagné, tel qu'un prix littéraire ou un prix d'éducation. @fr

has biographical relation to
in dataset: The CWRC Ontology
range includes: Work
range includes: AdminPlaceConcept
range includes: Feature
range includes: FormalOrganization
range includes: Person
type: ObjectProperty
domain: Person
definition: Indicates a relationship or assertion based on an account of the life of a person or persons.

has birth date
in dataset: The CWRC Ontology
type: ObjectProperty
domain: Person
sub property of: relates by birth to
definition: Indicates the date on which a person was born.

has birth place
in dataset: The CWRC Ontology
type: ObjectProperty
domain: Person
sub property of: has spatial relation to
sub property of: relates by birth to
definition: Indicates where a person was born.

has birth position
in dataset: The CWRC Ontology
type: ObjectProperty
domain: Person
range: birth position
sub property of: relates by birth to
definition: Indicates a person's birth position relative to their siblings, with accompanying context provided by birth context annotations.

has brother
in dataset: The CWRC Ontology
type: ObjectProperty
domain: Person
range: Person
sub property of: has sibling
broader: sibling
definition: Relates a person to a male-identified sibling. Although the term typically refers to consanguineal relationships, it is often used to describe relationships beyond "blood ties."

has burial place
in dataset: The CWRC Ontology
type: ObjectProperty
domain: Person
sub property of: has spatial relation to
sub property of: relates by death to
definition: Indicates where a person was buried after death.

has cause of death
in dataset: The CWRC Ontology
type: ObjectProperty
domain: Person
label: a une cause de décès @fr
range: IllnessInjury
sub property of: relates by death to
definition: Describes a person's death.
definition: Décrit le décès d'une personne. @fr

has certainty
in dataset: The CWRC Ontology
type: FunctionalProperty
type: ObjectProperty
comment: The description for this term is indebted to the Text Encoding Initiative's P5: Guidelines for Electronic Text Encoding and Interchange. Equivalent to the certainty element of the Text Encoding Initiative.
range: certainty
definition: Associates a level of certainty with an assertion, description, identification, or value.

has child
in dataset: The CWRC Ontology
type: ObjectProperty
domain: Person
range: Person
sub property of: has relative
definition: Relates a person to a child, consanguineal or otherwise.

has children
in dataset: The CWRC Ontology
type: ObjectProperty
domain: Person
range: nonNegativeInteger
sub property of: has relative
definition: Indicates the number of the subject's children. Values range from zero upwards, and modes of counting vary according to context because families and reproduction are complex matters. Children need not necessarily be biologically related to the subject: they may be adopted or otherwise considered a person's child. See related property has reproductive history.
related: has reproductive history

has cohabitant
in dataset: The CWRC Ontology
type: ObjectProperty
type: SymmetricProperty
domain: Person
range: Person
sub property of: has intimate relationship with
definition: Describes a relationship of cohabitation which may or may not be an intimate or erotic relationship, since historical evidence with respect to the nature of such relationships is often lacking.

has companion
in dataset: The CWRC Ontology
type: ObjectProperty
domain: Person
label: a un·e camarade @fr
range: Person
sub property of: relates by education to
sub property of: relates socially to
definition: Describes a relationship with a person, usually a peer, in the context of the subject's education.
definition: Décrit la relation du sujet avec une personne, habituellement un·e camarade, dans le contexte de son éducation. @fr

has nonconformant behaviour
in dataset: The CWRC Ontology
type: ObjectProperty
domain: Person
label: comportement contesté @fr
sub property of: relates by education to
definition: Describes behaviour, which is perceived as negative, in the context of the subject's education. Often indicative of struggle against systemic discrimination, including within the structures of educational institutions.
definition: Décrit le comportement, perçu comme négatif, dans le contexte de l'éducation du sujet. Souvent indicateur d'une lutte contre la discrimination systémique, y compris au sein des structures de l'éducation insitutionnelle. @fr

context predicate
type: FunctionalProperty
type: ObjectProperty
domain: ObjectProperty
range: ObjectProperty
definition: Indicates the version of this predicate associated with Context annotations, where such annotations exist.

has cousin
in dataset: The CWRC Ontology
type: ObjectProperty
domain: Person
range: Person
sub property of: has relative
broader: relatedTo
definition: Relates a person to the child of their aunt or uncle; a person belonging to the same extended family, consanguineal or otherwise.

has credential
in dataset: The CWRC Ontology
type: ObjectProperty
domain: Person
range: credential
sub property of: relates by education to
definition: Indicates an educational credential awarded to a person.

has credential in
is replaced by: has credential
in dataset: The CWRC Ontology
type: DeprecatedProperty
comment: Deprecated in favour of instance has credential.
comment: Désapprouver en faveur de l'instance . @fr
domain: Person
range: credential
sub property of: relates by education to
deprecated: true
term status: deprecated
definition: Indicates an educational credential awarded to a person.

has credential subject
in dataset: The CWRC Ontology
type: ObjectProperty
domain: Person
range: educational subject
sub property of: relates by education to
definition: Indicates a subject in which a person has pursued or received a degree.

has a cultural form
in dataset: The CWRC Ontology
type: ObjectProperty
label: a une forme culturelle @fr
sub property of: relates by cultural form to
definition: Associe des concepts et des catégories spécifiques au processus de formation identitaire par des processus culturels. Les sujets eux-mêmes peuvent ou ont pu s'approprier de telles associations, ou d'autres personnes les leur ont attribuées. Les concepts et les catégories classés dans forme culturelle se chevauchent pour les concepts et les étiquettes utilisés. @fr
definition: This associates specific concepts and categories with the process of identity formation through cultural processes. Such associations may be or have been embraced by the subject her/himself or attributed by others. The concepts and categories classed as a cultural form are understood to overlap with each other conceptually and in terms of the labels used.

has a cultural form
is replaced by: has a cultural form
in dataset: The CWRC Ontology
type: DeprecatedProperty
comment: Deprecated in favour of object property has a cultural form.
comment: Désapprouver en faveur de la propriété a une forme culturelle. @fr
label: a une forme culturelle @fr
equivalent property: has a cultural form
term status: deprecated
definition: Cette sous-classe de culturalFormation associe des concepts et des catégories spécifiques au processus de formation identitaire Ã travers les processus culturels. Le sujet elle/lui-même peut ou a pu s'approprier de telles associations, ou d'autres personnes les lui ont attribuées. Les concepts et les catégories classés dans culturalForms se chevauchent en théorie et en terme d'étiquettes utilisés. @fr
definition: This sub-class of culturalFormation associates specific concepts and categories with the process of identity formation through cultural processes. Such associations may be or have been embraced by the subject her/himself or attributed by others. The concepts and categories classed as culturalForms are understood to overlap with each other conceptually and in terms of the labels used.

has daughter
in dataset: The CWRC Ontology
type: ObjectProperty
domain: Person
range: Person
sub property of: has child
broader: children
definition: Relates a person to a female-identified child, consanguineal or otherwise.

has death date
in dataset: The CWRC Ontology
type: ObjectProperty
domain: Person
sub property of: relates by death to
inverse of: death date of
definition: Indicates the date of which a person has died.

has death place
in dataset: The CWRC Ontology
type: ObjectProperty
domain: Person
sub property of: has spatial relation to
definition: Indicates where a person has died.

has education
in dataset: The CWRC Ontology
type: DeprecatedProperty
comment: Deprecated, with no current equivalence.
comment: Désapprouver sans équivalence. @fr
domain: natural person
label: a une éducation @fr
range: education context
deprecated: true
term status: deprecated
definition: Links a person to information about their education in education context.
definition: Relie une personne Ã des renseignements sur son contexte éducatif. @fr

has emigrant
in dataset: The CWRC Ontology
domain includes: AdminPlaceConcept
domain includes: Feature
type: ObjectProperty
range: Person
sub property of: has inhabitant

has employee
in dataset: The CWRC Ontology
domain includes: FormalOrganization
domain includes: Person
range includes: FormalOrganization
range includes: Person
type: ObjectProperty

has employer
in dataset: The CWRC Ontology
range includes: Work
range includes: FormalOrganization
range includes: Person
type: ObjectProperty
domain: Person
sub property of: relates by occupation to
inverse of: has employee
definition: Indicates a person's employer.
related: has occupation

has erotic relationship with
in dataset: The CWRC Ontology
type: ObjectProperty
type: SymmetricProperty
domain: Person
range: Person
sub property of: has intimate relationship with
definition: Describes intimate relationships that are erotic and/or explicitly sexual. Erotic in this context sometimes suggests that sexuality was an issue in the relationship, whether or not it was acted upon. In not wishing to assume that heterosexual relations between sexual partners are the only standard for intimate relationships, we include both erotic and non-erotic relations as central to a subjectâs life and use has erotic relationship with to distinguish between the two. See has interpersonal relationship with, has erotic relationship with, has intimate relationship with, has possibly erotic relationship with.

has ethnic identity
in dataset: The CWRC Ontology
type: ObjectProperty
domain: Person
label: d'ethnicité @fr
range: ethnicity
sub property of: has a cultural form
inverse of: ethnic identity of
definition: Décrit l'ethnicité d'une personne. De même que pour les autres formes culturelles, une même personne peut cumuler plus d'une propriété ou description de ce type. Pour plus d'informations sur cette propriété, voir ethnicité @fr
definition: Indicates a person's ethnic identity, which may be self-reported or reported by another, with accompanying context, where present, provided by race or ethnicity context annotations. As with other cultural forms, an individual may have more than one property or descriptor of this type. For further information about this property, see ethnicity.

has ethnic identity (reported)
in dataset: The CWRC Ontology
type: ObjectProperty
domain: Person
label: d'ethnicité (déclarée) @fr
range: ethnicity
sub property of: has ethnic identity
inverse of: ethnic identity (reported) of
definition: Décrit l'ethnicité déclarée, accompagnée du contexte fourni par les annotations de contexte ethnique ou racial là ou il est disponible. Pour plus d'informations sur cette propriété, voir ethnicité. @fr
definition: Indicates a person's reported ethnic identity, with accompanying context, where present, provided by race or ethnicity context annotations. For more information on this property, see ethnicity.

has ethnicity (self defined)
is replaced by: has ethnic identity (self-reported)
in dataset: The CWRC Ontology
type: DeprecatedProperty
comment: Deprecated in favour of instance has ethnic identity (self-reported).
comment: Désapprouver en faveur de l'instance d'ethnicité (autodéclarée). @fr
label: d'ethnicité (autodéclarée) @fr
range: ethnicity
sub property of: personal property (self-reported)
deprecated: true
term status: deprecated

has ethnic identity (self-reported)
in dataset: The CWRC Ontology
type: ObjectProperty
domain: Person
label: d'ethnicité (autodéclarée) @fr
range: ethnicity
sub property of: has ethnic identity
inverse of: ethnic identity (self-reported) of
definition: Décrit l'ethnicité autodéclarée, accompagnée du contexte fourni par les annotations de contexte ethnique ou racial là ou il est disponible. Pour plus d'informations sur cette propriété, voir ethnicité. @fr
definition: Indicates a person's self-reported ethnic identity, with accompanying context, where present, provided by race or ethnicity context annotations. For more information on this property, see ethnicity.

has event
in dataset: The CWRC Ontology
type: ObjectProperty
domain: Thing
range: Event
definition: Associates a Context with an Event.

has family-based occupation
in dataset: The CWRC Ontology
type: ObjectProperty
domain: Person
range: occupation
sub property of: has occupation
inverse of: family-based occupation of
definition: Indicates a position or activity that was family-directed, typically bread-winning businesses rather than domestic work although the two may overlap.

has father
in dataset: The CWRC Ontology
type: ObjectProperty
domain: Person
range: Person
sub property of: has parent
broader: parent
definition: Relates a person to their father, the male-identified parent, consanguineal or otherwise.

has functional relation
in dataset: The CWRC Ontology
type: ObjectProperty
definition: Relates terms within the CWRC ontology to external terms that are semantically incommensurate but that may be pragmatically related for processing purposes such as search and retrieval. For example, the gender instance woman relates functionally to appearances:SexISO5218-2 because important datasets employ the ISO5218 value "female". has functional relation can be leveraged by search tools to broaden the results returned.

has gender identity
in dataset: The CWRC Ontology
type: ObjectProperty
domain: Person
label: est de genre @fr
range: gender
sub property of: has a cultural form
inverse of: gender identity of
definition: Describes a person's gender identity, which may be self-reported or reported by another, with accompanying context, where present, provided by gender context annotations. As with other cultural forms, an individual may have more than one property or descriptor of this type.

has gender identity (reported)
in dataset: The CWRC Ontology
type: ObjectProperty
domain: Person
label: est de genre (déclaré) @fr
range: gender
sub property of: has gender identity
inverse of: gender identity (reported) of
definition: Indicates a person's reported gender identity, with accompanying context, where present, provided by gender context annotations.

has gender (self declared)
is replaced by: has gender identity (self-reported)
in dataset: The CWRC Ontology
type: DeprecatedProperty
comment: Deprecated in favour of instance has gender identity (self-reported).
comment: Désapprouver en faveur de l'instance est de genre (autodéclaré). @fr
label: est de genre (autodéclaré) @fr
range: gender
sub property of: personal property (self-reported)
deprecated: true
term status: deprecated

has gender identity (self-reported)
in dataset: The CWRC Ontology
type: ObjectProperty
domain: Person
label: est de genre (autodéclaré) @fr
range: gender
sub property of: has gender identity
inverse of: gender identity (self-reported) of
definition: Cela indique le genre autoproclamé d'une personne. @fr
definition: Describes a person's self-reported gender identity, with accompanying context, where present, provided by gender context annotations.

has gendered political activity
in dataset: The CWRC Ontology
range includes: political affiliation
range includes: political organization
range includes: religion
type: ObjectProperty
domain: Person
sub property of: has political affiliation
inverse of: has gendered political activity from

has gendered political activity from
in dataset: The CWRC Ontology
domain includes: political affiliation
domain includes: political organization
type: ObjectProperty
range: Person
sub property of: political affiliation of

has geographic heritage
in dataset: The CWRC Ontology
range includes: geographic heritage
range includes: AdminPlaceConcept
range includes: Feature
type: ObjectProperty
domain: Person
label: A un héritage géographique @fr
sub property of: has a cultural form
inverse of: geographic heritage of
definition: Describes a person's heritage in relation to a place, which may be self-reported or reported by another, with accompanying context, where present, provided by nationality context annotations. Place names and boundaries change over time, and a conception of geographical heritage from one historical period may not be commensurate with those from an earlier or later period, even if they go by the same name. Similarly, a sense of geographical heritage may differ from a sense of identity with a political entity that goes by the same name. As with other cultural forms, an individual may have more than one property or descriptor of this type. For further information about this property, see geographic heritage.
definition: Décrit l'héritage d'une personne en lien avec une situation géographique. Comme les toponomies et les frontières changent au cours du temps, une description de l'héritage géographique associée Ã une période historique donnée ne correspond pas toujours Ã celles des périodes antérieures ou postérieures, et ce même si elles possèdent le même nom. De même, le sentiment d'appartenance Ã un héritage géographique peut différer du sentiement d'appartenance Ã une entité politique du même nom. De même que pour les autres formes culturelles, une même personne peut cumuler plus d'une propriété ou description de ce type. Pour plus d'informations sur cette propriété, voir héritage géographique. @fr

has geographic heritage (reported)
in dataset: The CWRC Ontology
range includes: geographic heritage
range includes: AdminPlaceConcept
range includes: Feature
type: ObjectProperty
domain: Person
label: a un héritage géographique (déclaré) @fr
sub property of: has geographic heritage
inverse of: geographic heritage (reported) of
definition: Describes a person's reported geographic heritage, with accompanying context, where present, provided by nationality context annotations.

has geographic heritage (self declared)
is replaced by: has geographic heritage (self-reported)
in dataset: The CWRC Ontology
type: DeprecatedProperty
comment: Deprecated in favour of instance has geographic heritage (self-reported).
comment: Désapprouver en faveur de l'instance a un héritage géographique (autodéclaré). @fr
label: a un héritage géographique (autodéclaré) @fr
range: geographic heritage
sub property of: personal property
deprecated: true
term status: deprecated

has geographic heritage (self-reported)
in dataset: The CWRC Ontology
range includes: geographic heritage
range includes: AdminPlaceConcept
range includes: Feature
type: ObjectProperty
domain: Person
label: a un héritage géographique (autodéclaré) @fr
sub property of: has geographic heritage
inverse of: geographic heritage (self-reported) of
definition: Describes a person's self-reported geographic heritage, with accompanying context, where present, provided by nationality context annotations.

has grandchild
in dataset: The CWRC Ontology
type: ObjectProperty
domain: Person
range: Person
sub property of: has relative
definition: Relates a person to a child of a person's child.

has granddaughter
in dataset: The CWRC Ontology
type: ObjectProperty
domain: Person
range: Person
sub property of: has grandchild
definition: Relates a person to a female-identified child of a person's child.

has grandfather
in dataset: The CWRC Ontology
type: ObjectProperty
domain: Person
range: Person
sub property of: has grandparent
definition: Relates a person to the father of their mother or father.

has grandmother
in dataset: The CWRC Ontology
type: ObjectProperty
domain: Person
range: Person
sub property of: has grandparent
definition: Relates a person to the mother of their mother or father.

has grandparent
in dataset: The CWRC Ontology
type: ObjectProperty
domain: Person
range: Person
sub property of: has relative
definition: Relates a person to the parent of their mother or father.

has grandson
in dataset: The CWRC Ontology
type: ObjectProperty
domain: Person
range: Person
sub property of: has grandchild
definition: Relates a person to a male-identified child of a person's child.

has guardian
in dataset: The CWRC Ontology
type: ObjectProperty
domain: Person
range: Person
sub property of: has interpersonal relationship with
definition: Relates a person (usually a minor) to another, usually an adult who is charged with their care. This term stretches beyond the legal definition of "guardian" to include a broader social relation between dependant and dependee (e.g.: in loco parentis)

has half-brother
in dataset: The CWRC Ontology
type: ObjectProperty
domain: Person
range: Person
sub property of: has brother
broader: sibling
definition: Relates a male-identified person to the someone with whom they have one parent in common.
note: Comment: This term is a CWRC-specific addition not in the original Orlando tag set.

has half-sister
in dataset: The CWRC Ontology
type: ObjectProperty
domain: Person
range: Person
sub property of: has sister
broader: sibling
definition: Relates a female-identified person to the someone with whom they have one parent in common.
note: Comment: This term is a CWRC-specific addition not in the original Orlando tag set.

has husband
in dataset: The CWRC Ontology
type: ObjectProperty
domain: Person
range: Person
sub property of: has partner
broader: spouse
definition: Relates a person to a male-identified partner in a marital relationship.

has ID dependency on
in dataset: The CWRC Ontology
type: ObjectProperty
domain: context
range: context
definition: Indicates that the subject entity is dependent upon the identifications made in the object entity. For instance, this predicate can be used to link web annotations with bodies containing RDF triples to annotations that identify entities used in those triples.

has immigrant
in dataset: The CWRC Ontology
domain includes: AdminPlaceConcept
domain includes: Feature
type: ObjectProperty
range: Person
sub property of: has inhabitant
sub property of: has traveller

has inhabitant
in dataset: The CWRC Ontology
domain includes: AdminPlaceConcept
domain includes: Feature
type: ObjectProperty
range: Person
sub property of: has spatial relation to

has instructor
in dataset: The CWRC Ontology
type: ObjectProperty
label: a un instructeur·ice @fr
range: Person
sub property of: relates by education to
definition: Describes the subject's relationship with an educational instructor or mentor, formal or informal.
definition: Décrit la relation du sujet avec un instructeur pédagogique ou un·e mentor·e, formel·le ou informel·le. @fr

has interpersonal relationship with
in dataset: The CWRC Ontology
type: ObjectProperty
label: a relation interpersonnelle avec @fr
sub property of: relates socially to
definition: Indicates personal knowledge of someone, covering a broad spectrum of social relations ranging from friendship to enmities and casual associations: it can include a writer having coffee with Samuel Johnson on one notable day, without needing a historical record of whether they were necessarily friends, through to substantial longlasting relationships. See also has intimate relationship with, has erotic relationship with, has possibly erotic relationship with.

has intimate relationship with
in dataset: The CWRC Ontology
type: ObjectProperty
type: SymmetricProperty
domain: Person
range: Person
sub property of: has interpersonal relationship with
definition: Indicates a relationship that involves any type of intimacy ranging from emotional through psychological or material to sexual. Counters the traditional assumption that the only intimate relations happen within the context of marriage or heterosexual relations between sexual partners, challenging the historical and ideological silence placed upon same-sex relationships. For instance, it includes lifelong female friendships, defining psychological connections, or erotically-charged same sex or opposite sex relationships. It may or may not be erotic, and may apply to both brief sexual affairs and lifelong non-sexual relationships. Biographical information concerning these relationships is often scant; therefore this predicate recognizes these relations as significant while not assuming that they were sexual. See has interpersonal relationship with, has erotic relationship with, has possibly erotic relationship with.

language known
in dataset: The CWRC Ontology
type: ObjectProperty
domain: Person
label: maîtrise une langue @fr
range: language
sub property of: has a cultural form
inverse of: language known of
definition: Capacité d'écrire ou de lire une langue. @fr
definition: Knowledge of the language for speaking, writing, or reading, which may be self-reported or reported by another, with accompanying context, where present, provided by cultural form context. As with other cultural forms, an individual may have more than one property or descriptor of this type.

language known (reported)
in dataset: The CWRC Ontology
type: ObjectProperty
domain: Person
label: maîtrise une langue (déclaré) @fr
range: language
sub property of: language known
inverse of: language known (reported) of
definition: Le sujet déclare maîtriser une langue Ã l'oral ou Ã l'écrit. Pour plus d'information sur cette propriété, voir aptitude linguistique (écrit ou parlé). @fr
definition: Reported knowledge of the language for speaking, writing, or reading, with accompanying context, where present, provided by cultural form context. For further information about this property, see linguistic ability (spoken and/or writen).

language known (self declared)
is replaced by: language known (self-reported)
in dataset: The CWRC Ontology
type: DeprecatedProperty
comment: Deprecated in favour of instance language known (self-reported).
comment: Désapprouver en faveur de l'instance maîtrise une langue (autodéclaré). @fr
label: connait la langue (autodéclaré) @fr
range: linguistic ability (spoken and/or writen)
sub property of: personal property (self-reported)
deprecated: true
term status: deprecated

language known (self-reported)
in dataset: The CWRC Ontology
type: ObjectProperty
domain: Person
label: maîtrise une langue (autodéclaré) @fr
range: language
sub property of: language known
inverse of: language known (self-reported) of
definition: Le sujet déclare maîtriser une langue Ã l'oral ou Ã l'écrit. Pour plus d'information sur cette propriété, voir aptitude linguistique (écrit ou parlé). @fr
definition: Self-reported knowledge of the language for speaking, writing, or reading, with accompanying context, where present, provided by cultural form context. For further information about this property, see linguistic ability (spoken and/or writen).

has location
in dataset: The CWRC Ontology
type: ObjectProperty
domain: Thing
definition: The location of a thing. For example where an event took place or a organization is located

has mapped place
in dataset: The CWRC Ontology
type: ObjectProperty
comment: Note: Instances of places and coordinates for mapping are taken from a range of sources, including GeoNames and the Getty Thesaurus of Geographic Names (Getty Research Institute) that have their own classification schemes. Geonames will sometimes categorize places that are now abandoned as "populated places."
definition: Associates a mapped place with coordinates for its location.

has mother
in dataset: The CWRC Ontology
type: ObjectProperty
domain: Person
range: Person
sub property of: has parent
broader: parent
definition: Relates a person to their mother, the female-identified parent, consanguineal or otherwise.

has name
in dataset: The CWRC Ontology
type: ObjectProperty
sub property of: has biographical relation to
definition: Indicates a person's name.

has name part
in dataset: The CWRC Ontology
range includes: personal name
type: ObjectProperty
definition: Indicates a component of a name. Order of name parts is indicated by has sort order

has national heritage
in dataset: The CWRC Ontology
type: ObjectProperty
domain: Person
label: de héritage national @fr
range: national heritage
sub property of: has a cultural form
inverse of: national heritage of
definition: Describes a person's national heritage, which may be self-reported or reported by another, with accompanying context, where present, provided by nationality context annotations. As with other cultural forms, an individual may have more than one property or descriptor of this type.

has national heritage (reported)
in dataset: The CWRC Ontology
type: ObjectProperty
domain: Person
label: de héritage national (déclarée) @fr
range: national heritage
sub property of: has national heritage
inverse of: national heritage (reported) of
definition: Describes a person's reported national heritage, with accompanying context, where present, provided by nationality context annotations. As with other cultural forms, an individual may have more than one property or descriptor of this type.

has national heritage (self-reported)
in dataset: The CWRC Ontology
type: ObjectProperty
domain: Person
label: de héritage national (autodéclarée) @fr
range: national heritage
sub property of: has national heritage
inverse of: national heritage (self-reported) of
definition: Describes a person's self-reported national heritage, with accompanying context, where present, provided by nationality context annotations. As with other cultural forms, an individual may have more than one property or descriptor of this type.

has national identity
in dataset: The CWRC Ontology
type: ObjectProperty
domain: Person
label: de nationalité @fr
range: national identity
sub property of: has a cultural form
inverse of: national identity of
definition: Describes a person's national identity identity, which may be self-reported or reported by another, with accompanying context, where present, provided by nationality context annotations. As with other cultural forms, an individual may have more than one property or descriptor of this type.
definition: Décrit la identité nationale d'une personne. De même que pour les autres formes culturelles, une même personne peut cumuler plus d'une propriété ou description de ce type. @fr

has national identity (reported)
in dataset: The CWRC Ontology
type: ObjectProperty
domain: Person
label: de nationalité (déclarée) @fr
range: national identity
sub property of: has national identity
inverse of: national identity (reported) of
definition: Décrit la/les nationalité(s) proclamée(s) d'une personne, différant de la citoyenneté et n'étant pas proportionnelle Ã la zone géographique ou au territoire sur lequel elle réside. @fr
definition: This property indicates a person's reported national identity, with accompanying context, where present, provided by nationality context annotations. It is neither the same as citizenship nor commensurate with the geographical region or territory in which a person resides. For more information on this property see national identity.

has nationality (self declared)
is replaced by: has national identity (self-reported)
in dataset: The CWRC Ontology
type: DeprecatedProperty
comment: Deprecated in favour of instance has national identity (self-reported).
comment: Désapprouver en faveur de l'instance de nationalité (autodéclarée). @fr
label: de nationalité (autodéclarée) @fr
range: national identity
sub property of: personal property (self-reported)
deprecated: true
term status: deprecated

has national identity (self-reported)
in dataset: The CWRC Ontology
type: ObjectProperty
domain: Person
label: de nationalité (autodéclarée) @fr
range: national identity
sub property of: has national identity
inverse of: national identity (self-reported) of
definition: Décrit la/les nationalité(s) autoproclamée(s) d'une personne, différant de la citoyenneté et n'étant pas proportionnelle Ã la zone géographique ou au territoire sur lequel elle réside. @fr
definition: This property indicates a person's self-reported national identity, with with accompanying context, where present, provided by nationality context annotations. It is neither the same as citizenship nor commensurate with the geographical region or territory in which a person resides. For more information on this property see national identity.

natively known language
in dataset: The CWRC Ontology
type: ObjectProperty
domain: Person
label: langue native @fr
range: language
sub property of: language known
inverse of: natively known language of
definition: Capacité d'écrire ou de lire une langue acquise dès l'enfance. Comme pour d'autres formes culturelles, un individu peut avoir plus d'une propriété ou descripteur de ce type. @fr
definition: Knowledge of the language, acquired during a personâs upbringing, for speaking, writing or reading, which may be self-reported or reported by another, and with accompanying context, where present, provided by cultural form context. As with other cultural forms, an individual may have more than one property or descriptor of this type.

natively known language (reported)
in dataset: The CWRC Ontology
type: ObjectProperty
domain: Person
label: langue native (déclarée) @fr
range: language
sub property of: natively known language
inverse of: natively known language (reported) of
definition: Le sujet déclare lire et écrire une langue maîtrisée depuis l'enfance. @fr
definition: Reported knowledge of the language, acquired during a personâs upbringing, for speaking, writing, or reading, with accompanying context, where present, provided by cultural form context.

natively known language (self declared)
is replaced by: language known (self-reported)
in dataset: The CWRC Ontology
type: DeprecatedProperty
comment: Deprecated in favour of instance language known (self-reported).
comment: Désapprouver en faveur de l'instance maîtrise une langue (autodéclaré). @fr
label: a une langue maternelle (autodéclaré) @fr
range: linguistic ability (spoken and/or writen)
sub property of: language known (self declared)
deprecated: true
term status: deprecated

natively known language (self-reported)
in dataset: The CWRC Ontology
type: ObjectProperty
domain: Person
label: langue native (autodéclarée) @fr
range: language
sub property of: natively known language
inverse of: natively known language (self-reported) of
definition: Connaissance parlée, écrite ou lue d'une langue acquise durant l'éducation, qui peut être autodéclarée ou assignée par une autre personne, accompagné par le contexte fourni par le contexte de forme culturelle en contexte lorsqu'il est disponible. Comme pour d'autres formes culturelles, un individu peut avoir plus d'une propriété ou descripteur de ce type. @fr
definition: Self-reported knowledge of the language, acquired during a personâs upbringing, for speaking, writing, or reading, with accompanying context, where present, provided by cultural form context.

has nephew
in dataset: The CWRC Ontology
type: ObjectProperty
domain: Person
range: Person
sub property of: has relative
broader: relatedTo
definition: Relates a person to the son of their sibling.

has niece
in dataset: The CWRC Ontology
type: ObjectProperty
domain: Person
range: Person
sub property of: has relative
broader: relatedTo
definition: Relates a person to the daughter of their sibling.

has non-erotic relationship with
in dataset: The CWRC Ontology
type: ObjectProperty
type: SymmetricProperty
domain: Person
range: Person
sub property of: has intimate relationship with
definition: Describes an intimate relationship with the subject that is neither erotic nor sexual in nature. See has interpersonal relationship with, has erotic relationship with, has intimate relationship with, has possibly erotic relationship with.

has occupation
in dataset: The CWRC Ontology
type: ObjectProperty
domain: Person
range: occupation
sub property of: relates by occupation to
inverse of: occupation of
definition: Indicates a regular position or activity significant to a person's life, including paid, unpaid, and voluntary work.

has occupation income
in dataset: The CWRC Ontology
type: ObjectProperty
domain: Person
sub property of: relates by occupation to
inverse of: occupation income of
definition: Describes or provides information regarding a person's incomes related to an occupation.
related: has occupation

has organization
in dataset: The CWRC Ontology
type: ObjectProperty
range: FormalOrganization
definition: Indicates that the organization in question belongs in some sense to the specified conceptual entity. For instance, a particular religion may have one or more organizational groups associated with it, a political campaign may have multiple political groups associated with it simultaneously or sequentially, or an artistic movement may have various contributing groups.

has paid occupation
in dataset: The CWRC Ontology
type: ObjectProperty
domain: Person
range: occupation
sub property of: has occupation
inverse of: paid occupation of
definition: Indicates a position or activity for which a person was paid.

has parent
in dataset: The CWRC Ontology
type: ObjectProperty
domain: Person
range: Person
sub property of: has relative
definition: Relates a person to their father, mother, or, in certain cases, their guardian.

has participant
in dataset: The CWRC Ontology
type: ObjectProperty
domain: event
range: Person
definition: Associates an event with a person.

has partner
in dataset: The CWRC Ontology
type: ObjectProperty
domain: Person
range: Person
sub property of: has intimate relationship with
sub property of: has relative
definition: Ce terme représente uniquement les relations affectives, amoureuses ou familiales et non des relations d'affaires. @fr
definition: Relates two people through a romantic, emotional, or spousal relationship. Distinct from a business or corporate partnership.

has Peformance
is replaced by: hasEventElement
in dataset: The CWRC Ontology
type: DeprecatedProperty
comment: Deprecated in favour of property [http://sparql.cwrc.ca/ontologies/cwrc#hasEventElement].
comment: Désapprouver en faveur de la propriété [http://sparql.cwrc.ca/ontologies/cwrc#hasEventElement]. @fr
domain: event
domain: performance
label: a une interprétation @fr
range: performance
deprecated: true
equivalent property: hasEventElement
term status: deprecated
definition: Associates an event or performance to a performance.

has persona
in dataset: The CWRC Ontology
type: ObjectProperty
domain: natural person
label: a persona @fr
range: persona
definition: Associates a persona with one more natural person(s).
definition: Associe un persona Ã une ou plusieurs personne(s) physique(s). @fr

has political affiliation
in dataset: The CWRC Ontology
range includes: political affiliation
range includes: political organization
range includes: religion
type: ObjectProperty
domain: Person
label: a une appartenance politique @fr
sub property of: has a cultural form
inverse of: political affiliation of
definition: Describes a person's political affiliation, which may be self-reported or reported by another, with accompanying context, where present, provided by politics context annotations. As with other cultural forms, an individual may have more than one property or descriptor of this type, and it may be linked to political affiliations or directly to an organization which may or may not be primarily political. For further information about this property, see political affiliation.

has political affiliation (reported)
in dataset: The CWRC Ontology
range includes: political affiliation
range includes: political organization
range includes: religion
type: ObjectProperty
domain: Person
sub property of: has political affiliation
inverse of: political affiliation (reported) of
definition: Describes a person's reported political affiliation. As with other cultural forms, an individual may have more than one property or descriptor of this type. For further information about this property, see political affiliation.

has political affiliation (self-reported)
in dataset: The CWRC Ontology
range includes: political affiliation
range includes: political organization
range includes: religion
type: ObjectProperty
domain: Person
label: a une appartenance politique (autodéclarée) @fr
sub property of: has political affiliation
inverse of: political affiliation (self-reported) of
definition: Describes a person's self-reported political affiliation. As with other cultural forms, an individual may have more than one property or descriptor of this type. For further information about this property, see political affiliation.

has political involvement from
in dataset: The CWRC Ontology
domain includes: political affiliation
domain includes: political organization
type: ObjectProperty
range: Person
sub property of: political affiliation of

has political involvement in
in dataset: The CWRC Ontology
range includes: political affiliation
range includes: political organization
range includes: religion
type: ObjectProperty
domain: Person
sub property of: has political affiliation
inverse of: has political involvement from
definition: Indicates some level of political involvement.

has political membership from
in dataset: The CWRC Ontology
domain includes: political affiliation
domain includes: political organization
type: ObjectProperty
range: Person
sub property of: has political involvement from

has political membership in
in dataset: The CWRC Ontology
range includes: political affiliation
range includes: political organization
range includes: religion
type: ObjectProperty
domain: Person
sub property of: has political involvement in
inverse of: has political membership from
definition: Indicates some degree of sustained engagement with an organization such as a political group or literary movement. Does not necessarily denote formal membership, but rather points to clear evidence of a link with an organization without indication of more active participation: a person may have been a member of the sanitary movement or participated in a reading associated with a particular literary movement.

has possibly erotic relationship with
in dataset: The CWRC Ontology
type: ObjectProperty
type: SymmetricProperty
domain: Person
range: Person
sub property of: has intimate relationship with
definition: Describes an intimate relationship that may or may not be erotic in nature. This predicate seeks to redress the historical and ideological silence placed upon same sex relationships; it recognizes that biographical information concerning these relationships often is impossible to uncover. has possibly erotic relationship with registers the possibility of a sexual relationship, when, in the absence of biographical proof, it is impossible to claim such as fact. See has interpersonal relationship with, has erotic relationship with, has intimate relationship with.

has precision
in dataset: The CWRC Ontology
type: FunctionalProperty
type: ObjectProperty
comment: The description for this term is indebted to the Text Encoding Initiative's P5: Guidelines for Electronic Text Encoding and Interchange.
range: precision
definition: Associates a level of precision with a value. measurement, or identification.

has race or colour identity
in dataset: The CWRC Ontology
type: ObjectProperty
domain: Person
label: est de race our couleur @fr
range: race or colour
sub property of: has a cultural form
inverse of: race or colour identity of
definition: Décrit l'identité raciale d'une personne. Pour plus d'information sur cette propriété, voir race ou couleur. @fr
definition: This describes a person's identity with respect to race or colour, which may be self-reported or reported by another, with accompanying context, where present, provided by race or ethnicity context annotations. As with other cultural forms, an individual may have more than one property or descriptor of this type. For more information on this property see race or colour.

has race or colour identity (reported)
in dataset: The CWRC Ontology
type: ObjectProperty
domain: Person
label: race ou couleur (déclarée) @fr
range: race or colour
sub property of: has race or colour identity
inverse of: race or colour identity (reported) of
definition: Décrit l'appartenance raciale ou la couleur déclarées d'une personne. Pour plus d'informations Ã propre de cette propriété, voir race ou couleur. @fr
definition: Indicates a person's reported identity with respect to race or colour, with accompanying context, where present, provided by race or ethnicity context annotations. For further information about this property, see race or colour.

has race (self declared)
is replaced by: has national identity (self-reported)
in dataset: The CWRC Ontology
type: DeprecatedProperty
comment: Deprecated in favour of instance has national identity (self-reported).
comment: Désapprouver en faveur de l'instance de nationalité (autodéclarée). @fr
label: est de race (autodéclarée) @fr
range: race or colour
sub property of: personal property (self-reported)
deprecated: true
term status: deprecated
definition: This describes a person's self-reported identity with respect to race or colour.

has race or colour identity (self-reported)
in dataset: The CWRC Ontology
type: ObjectProperty
domain: Person
label: race ou couleur (autodéclarée) @fr
range: race or colour
sub property of: has race or colour identity
inverse of: race or colour identity (self-reported) of
definition: Décrit l'appartenance raciale ou la couleur autodéclarées d'une personne. Pour plus d'informations Ã propre de cette propriété, voir race ou couleur. @fr
definition: Indicates a person's self-reported identity with respect to race or colour, with accompanying context, where present, provided by race or ethnicity context annotations. For further information about this property, see race or colour.

has relative
in dataset: The CWRC Ontology
type: ObjectProperty
domain: Person
range: Person
sub property of: relates socially to
definition: Has a familial relationship to a person. hasRelative and its subproperties indicate social aspects of familial relations as opposed to biological ones; for example, has mother is not necessarily a consanguineal relationship - although both can be present. Family relationships are subproperties of social relationships. For more information, see About: Family. This property indicates either a general familial relationship or one that is complicated or not easily categorisable in traditional kinship terms.

has religious affiliation
in dataset: The CWRC Ontology
type: ObjectProperty
domain: Person
label: est de confession @fr
range: religion
sub property of: has a cultural form
inverse of: religious affiliation of
definition: Décrit la religion d'une personne. De même que pour les autres formes culturelles, une même personne peut cumuler plus d'une propriété ou description de ce type. Pour plus d'informations sur cette propriété, voir religion. @fr
definition: Indicates a person's religion or belief system, which may be self-reported or reported by another, with accompanying context, where present, provided by cultural form context annotations. As with other cultural forms, an individual may have more than one property or descriptor of this type. For further information about this property, see religion.

has religious affiliation (reported)
in dataset: The CWRC Ontology
type: ObjectProperty
domain: Person
label: religion (déclarée) @fr
range: religion
sub property of: has religious affiliation
inverse of: religious affiliation (reported) of
definition: Décrit indique la/les religion(s) ou le(s) système(s) de croyance proclamé(s) par une personne. Pour plus d'informations sur cette propriété, voir religion. @fr
definition: Indicates a person's reported religion or belief system, with accompanying context, where present, provided by cultural form context annotations. For further information about this property, see religion.

has religious affilication (self defined)
is replaced by: has religious affiliation (self-reported)
in dataset: The CWRC Ontology
type: DeprecatedProperty
comment: Deprecated in favour of instance has religious affiliation (self-reported).
comment: Désapprouver en faveur de l'instance religion (autodéclarée). @fr
label: religion (autodéclarée) @fr
range: religion
sub property of: personal property (self-reported)
deprecated: true
term status: deprecated

has religious affiliation (self-reported)
in dataset: The CWRC Ontology
type: ObjectProperty
domain: Person
label: religion (autodéclarée) @fr
range: religion
sub property of: has religious affiliation
inverse of: religious affiliation (self-reported) of
definition: Décrit indique la/les religion(s) ou le(s) système(s) de croyance autoproclamé(s) par une personne. Pour plus d'informations sur cette propriété, voir religion. @fr
definition: Indicates a person's self-reported religion or belief system, with accompanying context, where present, provided by cultural form context annotations. For further information about this property, see religion.

has relocatee
in dataset: The CWRC Ontology
domain includes: AdminPlaceConcept
domain includes: Feature
type: ObjectProperty
range: Person
sub property of: has inhabitant

has reproductive history
in dataset: The CWRC Ontology
type: ObjectProperty
domain: Person
range: reproductive history
sub property of: associated via health with
definition: Describes an aspect of a person's reproductive history. May relate to childlessness, birth control, adoption, abortion, difficulties with childbearing, loss of a child, whether biologically related, adopted, or otherwise considered kin, difficulties with child-bearing. See also the related property has children.

has role
in dataset: The CWRC Ontology
type: ObjectProperty
domain: event
label: a un rôle @fr
definition: Associates an event element to a role.

has sexual identity
in dataset: The CWRC Ontology
type: ObjectProperty
domain: Person
label: a une orientation sexuelle @fr
range: sexuality
sub property of: has a cultural form
inverse of: sexual identity of
definition: Describes a person's sexual identity, which may be self-reported or reported by another, with accompanying context, where present, provided by sexuality context. As with other cultural forms, an individual may have more than one property or descriptor of this type. For further information about this property, see sexuality.
definition: Décrit la sexualité d'une personne. Comme que pour les autres formes culturelles, une même personne peut cumuler plus d'une propriété ou description de ce type. Pour plus d'informations sur cette propriété, voir sexualité. @fr

has sexual identity (reported)
in dataset: The CWRC Ontology
type: ObjectProperty
domain: Person
label: a une orientation sexuelle (déclarée) @fr
range: sexuality
sub property of: has sexual identity
inverse of: sexual identity (reported) of
definition: Décrit la sexualité déclarée d'une personne. Pour plus d'information, voir sexualité et sexualité en contexte. @fr
definition: This describes a person's reported sexual identity, with accompanying context, where present, provided by sexuality context. For more information, see sexuality and sexuality context.

has sexual orientation (self declared)
is replaced by: has sexual identity (self-reported)
in dataset: The CWRC Ontology
type: DeprecatedProperty
comment: Deprecated in favour of instance has sexual identity (self-reported).
comment: Désapprouver en faveur de l'instance a une orientation sexuelle (autodéclarée). @fr
label: a une orientation sexuelle (autodéclarée) @fr
range: sexuality
sub property of: personal property (self-reported)
deprecated: true
term status: deprecated

has sexual identity (self-reported)
in dataset: The CWRC Ontology
type: ObjectProperty
domain: Person
label: a une orientation sexuelle (autodéclarée) @fr
range: sexuality
sub property of: has sexual identity
inverse of: sexual identity (self-reported) of
definition: Describes a person's self-reported sexual identity, with accompanying context, where present, provided by sexuality context. For more information, see sexuality and sexuality context.
definition: Décrit la sexualité autodéclarée d'une personne. Pour plus d'information, voir sexualité et sexualité en contexte. @fr

has sibling
in dataset: The CWRC Ontology
type: ObjectProperty
domain: Person
range: Person
sub property of: has relative
definition: Describes a relationship in which two or more individuals share the same parentage.

has sister
in dataset: The CWRC Ontology
type: ObjectProperty
domain: Person
range: Person
sub property of: has sibling
broader: sibling
definition: Relates a person to a female-identified sibling. Although the term typically refers to consanguineal relationships, it is often used to describe relationships beyond "blood ties".

has class identity
in dataset: The CWRC Ontology
type: ObjectProperty
domain: Person
label: a une classe sociale @fr
range: social class
sub property of: has a cultural form
inverse of: class identity of
definition: Describes a person's class identity, which may be self-reported or reported by another, with accompanying context, where present, provided by cultural form context. As with other cultural forms, an individual may have more than one property or descriptor of this type. For further information about this property, see social class.
definition: Décrit la classe sociale d'une personne. Comme pour les autres formes culturelles, une même personne peut cumuler plus d'une propriété ou description de ce type. Pour plus d'informations sur cette propriété, voir classe sociale. @fr

has class identity (reported)
in dataset: The CWRC Ontology
type: ObjectProperty
domain: Person
label: a classe sociale déclarée @fr
range: social class
sub property of: has class identity
inverse of: class identity (reported) of
definition: Describes a person's reported class identity, with accompanying context, where present, provided by cultural form context. For further information about this property, see social class.
definition: Décrit la classe social déclarée d'une personne. Pour plus d'informations sur cette propriété, voir classe sociale. @fr

has social class (self defined)
is replaced by: has class identity (self-reported)
in dataset: The CWRC Ontology
type: DeprecatedProperty
comment: Deprecated in favour of instance has class identity (self-reported).
comment: Désapprouver en faveur de l'instance a classe sociale autodéclarée. @fr
label: de classe sociale (autodéclarés) @fr
range: social class
sub property of: personal property (self-reported)
deprecated: true
term status: deprecated

has class identity (self-reported)
in dataset: The CWRC Ontology
type: ObjectProperty
domain: Person
label: a classe sociale autodéclarée @fr
range: social class
sub property of: has class identity
inverse of: class identity (self-reported) of
definition: Describes a person's self-reported class identity, with accompanying context, where present, provided by cultural form context. For further information about this property, see social class.
definition: Décrit la classe social autodéclarée d'une personne. Pour plus d'informations sur cette propriété, voir classe sociale. @fr

has son
in dataset: The CWRC Ontology
type: ObjectProperty
domain: Person
range: Person
sub property of: has child
broader: children
definition: Relates a person to a male-identified child, consanguineal or otherwise.

has sort order
in dataset: The CWRC Ontology
range includes: personal name
type: ObjectProperty
definition: Indicates the order in which the parts of a name occur.

has spatial relation to
in dataset: The CWRC Ontology
type: ObjectProperty
definition: Indicates an entity's connection to a geospatial location or to some other entity related to location.

has stepbrother
in dataset: The CWRC Ontology
type: ObjectProperty
domain: Person
range: Person
sub property of: has brother
broader: sibling
definition: Relates a person to a male-identified stepsibling, that is, a child of the person's stepparent.

has stepchild
in dataset: The CWRC Ontology
type: ObjectProperty
domain: Person
range: Person
sub property of: has child
definition: Relates a person to the child of that person's spouse, in contrast to what is commonly referred to as the "biological parent" of said child.
related: children

has stepdaughter
in dataset: The CWRC Ontology
type: ObjectProperty
domain: Person
range: Person
sub property of: has stepchild
definition: Relates a person to a female-identified child of that person's spouse, in contrast to what is commonly referred to as the "biological parent" of said child.
related: children

has stepfather
in dataset: The CWRC Ontology
type: ObjectProperty
domain: Person
range: Person
sub property of: has stepparent
broader: parent
definition: Relates a person to their stepfather, that is, a parent married to that person's so-called "biological parent", in contrast to a consanguineal relationship.

has stepmother
in dataset: The CWRC Ontology
type: ObjectProperty
domain: Person
range: Person
sub property of: has stepparent
inverse of: stepmother of
broader: parent
definition: Relates a person to their stepmother, that is, a parent married to that person's so-called "biological parent", in contrast to a consanguineal relationship.

has stepparent
in dataset: The CWRC Ontology
type: ObjectProperty
domain: Person
range: Person
sub property of: has parent
inverse of: has stepchild
broader: parent
definition: Relates a person to their stepparent, that is, a parent married to that person's so-called "biological parent", in contrast to a consanguineal relationship.

has stepsister
in dataset: The CWRC Ontology
type: ObjectProperty
domain: Person
range: Person
sub property of: has sister
broader: sibling
definition: Relates a person to a female-identified stepsibling, that is, a child of the person's stepparent.

has stepson
in dataset: The CWRC Ontology
type: ObjectProperty
domain: Person
range: Person
sub property of: has stepchild
definition: Relates a person to a male-identified child of that person's spouse, in contrast to what is commonly referred to as the "biological parent" of said child.
related: children

has student
in dataset: The CWRC Ontology
type: ObjectProperty
domain: educational organization
label: a un·e étudiant·e @fr
range: Person
definition: Indicates that the student was educated by the entity in question,âan instructor, an educational institution, or a particular type of schooling.
definition: Indique que l'étudiant·e a été éduqué·e par l'entité en question (instructeur·rice, établissement éducatif,ou type d'éducation particulière). @fr

has time certainty
in dataset: The CWRC Ontology
type: FunctionalProperty
type: ObjectProperty
range: certainty
sub property of: has certainty
definition: Indicates the degree of certainty or precision of the temporal value or values associated with a time-based phenomenon such as an event or birth date.

has traveller
in dataset: The CWRC Ontology
domain includes: AdminPlaceConcept
domain includes: Feature
type: ObjectProperty
range: Person
sub property of: has spatial relation to

has uncle
in dataset: The CWRC Ontology
type: ObjectProperty
domain: Person
range: Person
sub property of: has relative
broader: relatedTo
definition: Relates a person to the sister of their father or mother, but can also refer to any avuncular relationship and need not be restricted to a consanguineal relation.

has vistor
in dataset: The CWRC Ontology
domain includes: AdminPlaceConcept
domain includes: Feature
type: ObjectProperty
range: Person
sub property of: has traveller

has volunteer occupation
in dataset: The CWRC Ontology
type: ObjectProperty
domain: Person
range: occupation
sub property of: has occupation
inverse of: volunteer occupation of
definition: Indicates a regular role or activity that was voluntary rather than paid, including philanthropic activity.

has wife
in dataset: The CWRC Ontology
type: ObjectProperty
domain: Person
range: Person
sub property of: has partner
broader: spouse
definition: Relates a person to a female-identified partner in a marital relationship.

has writing relation to
in dataset: The CWRC Ontology
range includes: Work
range includes: AdminPlaceConcept
range includes: Feature
range includes: FormalOrganization
range includes: Person
type: ObjectProperty
domain: Person
definition: Indicates a relationship or assertion based on a writerâs literary works or an account of their literary career.

head of state
in dataset: The CWRC Ontology
type: occupation
type: Concept
alternative label: president of the usa
alternative label: prime minister
broader transitive: higher government
hidden label: presidents of the united states
hidden label: prime minister of the cape colony
in scheme: occupation

health association
in dataset: The CWRC Ontology
domain includes: Person
range includes: Work
range includes: AdminPlaceConcept
range includes: Feature
range includes: FormalOrganization
range includes: Person
subject-centric predicate: associated via health with
type: ObjectProperty
sub property of: biographical relationship

healthcare provider
in dataset: The CWRC Ontology
type: occupation
type: Concept
alternative label: contact healing
alternative label: dental assistant
alternative label: health service administrator
alternative label: health worker
alternative label: healthcare worker
alternative label: hospital aide
alternative label: hospital almoner
alternative label: hospital director
alternative label: hospital porter
alternative label: hospital worker
alternative label: inoculator
alternative label: medical administrator
alternative label: medical aide
alternative label: medical assistant
alternative label: medical officer
alternative label: medical worker
alternative label: medicine
hidden label: assistant in medical care
hidden label: contact healing
hidden label: medical coder
hidden label: medical pioneer
hidden label: support an infirmary
in scheme: occupation

Hermeticism
in dataset: The CWRC Ontology
type: religion
type: Concept
comment: La description de ce terme est basée sur celle de DBPedia. @fr
comment: The description for this term is indebted to DBpedia.
label: Hermétisme @fr
alternative label: Hermetic
alternative label: Hermetism
definition: "Hermeticism, also called Hermetism, is a religious, philosophical, and esoteric tradition based primarily upon writings attributed to Hermes Trismegistus ("Thrice Great"). These writings have greatly influenced the Western esoteric tradition and were considered to be of great importance during both the Renaissance and the Reformation. The tradition claims descent from a prisca theologia, a doctrine that affirms the existence of a single, true theology that is present in all religions and that was given by God to man in antiquity. Many writers, including Lactantius, Cyprian of Carthage,Augustine, Marsilio Ficino, Giovanni Pico della Mirandola, Giordano Bruno, Campanella, Sir Thomas Browne, and Ralph Waldo Emerson, considered Hermes Trismegistus to be a wise pagan prophet who foresaw the coming of Christianity. St. Thomas Aquinas reported that Trismegistus arrived at something akin to the doctrine of the Trinity. An account of how Hermes Trismegistus received the name "Thrice Great" is derived from the The Emerald Tablet of Hermes Trismegistus, wherein it is stated that he knew the three parts of the wisdom of the whole universe. The three parts of the wisdom are alchemy, astrology, and theurgy. The Poimandres, from which Marsilio Ficino formed his opinion, states that "They called him Trismegistus because he was the greatest philosopher and the greatest priest and the greatest king." The Suda (10th century) states that "He was called Trismegistus on account of his praise of the trinity, saying there is one divine nature in the trinity." Much of the importance of Hermeticism arises from its connection with the development of science during the time from 1300 to 1600 AD. The prominence that it gave to the idea of influencing or controlling nature led many scientists to look to magic and its allied arts (e.g., alchemy, astrology) which, it was thought, could put Nature to the test by means of experiments. Consequently, it was the practical aspects of Hermetic writings …
definition: «Hermétisme désigne deux courants de pensée : * une doctrine ésotérique fondée sur des écrits (les Hermetica) de l'époque gréco-romaine attribués Ã l'inspiration de Hermès Trismégiste. * son développement dans la doctrine des alchimistes au Moyen Ãge puis essentiellement Ã partir de la Renaissance. Antoine Faivre a suggéré d'employer deux termes distincts pour ces deux traditions de pensée. Ã côté du mot « hermétisme », servant Ã désigner le corps de doctrines des Hermetica ainsi que leurs gloses et exégèses, on peut employer le mot « hermésisme » pour désigner « un ensemble plus vaste de doctrines, de croyances et de pratiques, dont la nature s'est précisée Ã la Renaissance. Elles ne dépendent pas nécessairement de la tradition hermétique alexandrine, mais incluent aussi bien la kabbale chrétienne, le rosicrucisme, le paracelsisme, et d'une façon générale la plupart des formes que revêt l'ésotérisme occidental moderne ». Pour garder un minimum de cohérence, on ne saurait parler d'hermétisme en son sens second sans certaines conditions : affirmation de l'autorité d'Hermès ou d'Hermès Trismégiste ou de Thoth, ésotérisme (secret), inscription dans un courant historique précis (celui du Corpus Hermeticum, pour l'essentiel), tendance philosophique précise (centrée sur l'Un-Tout, la divinisation de l'esprit, les correspondances, l'alchimie mystique). L'hermétisme est une philosophie, une religion, un ésotérisme, ou une spiritualité en quête du salut, par l'esprit (comme le gnosticisme) mais supposant la connaissance analogique du cosmos. Le salut passe par la connaissance : se connaître, se reconnaître comme « étant fait de vie et de lumière », comme Dieu, en tant qu'intellect. Et cela constitue une contemplation, la vue du Bien, en sa « beauté impérissable, incompréhensible ».» (DBpedia, 2018) @fr
in scheme: religion

heterosexuality
in dataset: The CWRC Ontology
type: sexuality
type: Concept
label: hétérosexualité @fr
alternative label: heterosexual
definition: Heterosexuality indicates sexual attraction to the so-called "opposite sex," that is, sexual attraction between men and women. This understanding relies, like bisexual, on a binary understanding of sex and gender that also often conflates sex with gender. Adrienne Rich draws on Kathleen Gough in articulating an understanding of heterosexuality as compulsory for women within patriarchy. In her essay "The Straight Mind" (first published in 1980) Monique Wittig understands heterosexuality as a semiotic, linguistic, political, and ontological construct. It constitutes itself as a normative system through the oppression of women by men and the "necessity of the different/other at every level." The straight mind "creates the doctrine of the difference between sexes to justify this oppression."
definition: L'hétérosexualité indique l'attraction sexuelle pour le sexe prétendument «opposé», c'est-Ã -dire entre les hommes et les femmes. Cette compréhension du terme repose, comme pour la bisexualité, sur une interprétation binaire du sexe et du genre, qui confond habituellement les deux notions. S'appuyant sur Kathleen Gough, Adrienne Rich interprète l'hétérosexualité comme obligatoire pour les femmes dans un contexte patriarcal. Dans son article «La pensée straight» (publiée pour la première fois en 1980) Monique Wittig interprète l'hétérosexualité comme une construction sémiotique, linguistique, politique et ontologique. Elle se constitue comme un système normatif qui passe par l'oppression des femmes par les hommes et la «la nécessité de l'autre différent Ã tous les niveaux». La pensée straight «produit la doctrine de la différence entre les sexes pour justifier cette oppression». @fr
in scheme: sexuality

high certainty
in dataset: The CWRC Ontology
type: certainty
type: precision
label: forte probabilité @fr
definition: A predefined value of certainty that represents cases where where an assertion, description, identification, value, or measurement is considered of high quality. Equivalent to the "high" value for certainty or precision of the Text Encoding Initiative.
definition: Une valeur de probabilité prédéfinie utilisée dans le cas où un fait est considéré comme une information de haute qualité. @fr

High Church Party
in dataset: The CWRC Ontology
type: political affiliation
type: Concept
comment: La description de ce terme est basée sur celle de DBPedia. @fr
comment: The description for this term is indebted to DBpedia.
label: Haute Ãglise @fr
alternative label: High-Church party
definition: "The term "high church" refers to beliefs and practices of ecclesiology, liturgy, and theology, generally with an emphasis on formality and resistance to "modernisation". Although used in connection with various Christian traditions, the term originated in and has been principally associated with the Anglican/Episcopal tradition, where it describes Anglican churches using a number of ritual practices associated in the popular mind with Roman Catholicism. The opposite is low church. Contemporary media discussing Anglican churches tend to prefer evangelical to "low church", and Anglo-Catholic to "high church", though the terms do not exactly correspond. Other contemporary denominations that contain high church wings include some Lutheran, Presbyterian, and Methodist churches." (DBpedia, 2018)
definition: «Le mouvement Haute Ãglise (High Church) est un courant de l'anglicanisme né dans l'Ãglise d'Angleterre lors de la Restauration anglaise (1660-1688). Il désigne alors les fidèles qui militent pour l'observation rigide et précise des règles liturgiques sur la prière et le jeûne, et qui défendent la religion établie contre les tendances Ã la poursuite de la Réforme. Il tire son inspiration des politiques d'uniformisation religieuse qui avaient été mises en Åuvre par l'archevêque de Cantorbéry William Laud entre 1633 et 1640. Le mouvement Haute Ãglise s'oppose au courant latitudinaire, qui souhaite que l'Ãglise marque plus d'ouverture et de compréhension pour les non-conformistes. Par dérision, le mouvement latitudinaire sera qualifié de « Basse Ãglise ». Le livre de la prière commune est fortement associé Ã la tradition de la Haute Ãglise. Dans l'usage actuel, la Haute Ãglise se confond largement avec l'anglo-catholicisme, un mouvement déterminé Ã développer la liturgie et le dogme dans une direction voisine de celle de l'Ãglise catholique romaine. Ce courant est né au XIXe siècle avec le mouvement d'Oxford d'Edward Bouverie Pusey, John Henry Newman et John Keble. Cependant, il existe encore dans l'anglicanisme un courant « Haute Ãglise » qui ne se considère pas comme anglo-catholique. L'expression « Haute Ãglise » est parfois également employée pour qualifier des courants aux conceptions voisines dans d'autres confessions protestantes (notamment luthérienne, comme la Högkyrklighet en Suède).» (DBpedia, 2018) @fr
in scheme: political affiliation

High Toryism
in dataset: The CWRC Ontology
type: political affiliation
type: Concept
comment: The description for this term is indebted to DBpedia.
alternative label: High Tory
definition: "High Toryism is a term used in Britain, Canada, and elsewhere to refer to old traditionalist conservatism which is in line with the Toryism originating in the 17th century. High Tories and their worldview were sometimes at odds with the progressive elements of the Conservative Party in these countries at present. Historically, the late eighteenth-century conservatism derived from the Whig Edmund Burke and William Pitt the Younger marks a watershed from the "higher" or legitimist Toryism that was allied to Jacobitism. High Toryism has been described as neo-feudalist in its preference for a hierarchical organisation of society over utopian equality, as well for holding the traditional gentry as a higher cultural benchmark than the bourgeoisie and those who have attained their position through commerce. Economically, High Tories tend to prefer a paternalistic Tory corporatism over the neo-liberalism which took ahold in the 1980s." (DBpedia, 2018)
in scheme: political affiliation

higher government
in dataset: The CWRC Ontology
type: occupation
type: Concept
alternative label: cabinet minister
alternative label: chancellor of the exchequer
alternative label: civil lord of the admiralty
alternative label: colonial governor
alternative label: colonial secretary
alternative label: congressman
alternative label: director general of finance
alternative label: foreign secretary
alternative label: foreign service
alternative label: government minister
alternative label: governor of barbados
alternative label: governor of bombay
alternative label: governor of tasmania
alternative label: labour minister
alternative label: league of nations delegate
alternative label: legislator
alternative label: lieutenant governor of guernsey
alternative label: lord keeper
alternative label: lord keeper of the great seal of england
alternative label: lord lieutenant
alternative label: lord lieutenant of ireland
alternative label: master of the horse
alternative label: member of congress
alternative label: member of the house of lords
alternative label: minister of food
alternative label: parliamentary private secretary
alternative label: president of the united nations general assembly
alternative label: privy councillor
alternative label: regent
alternative label: royal adviser
alternative label: royal lieutenant
alternative label: royal representative
alternative label: secretary of state
alternative label: secretary of state for ireland
alternative label: secretary of state for war
alternative label: senator
alternative label: state governor
alternative label: statesman
alternative label: under secretary for the colonies
alternative label: vice chancellor
alternative label: warden of the mint
broader transitive: government
hidden label: ambassador and plenipotentiary
hidden label: bavarian minister
hidden label: high commissioner of south africa
hidden label: scottish education secretary
hidden label: served on the royal commission on capital punishment
hidden label: ulster king of arms
hidden label: vice president of the usa
in scheme: occupation

Hinduism
in dataset: The CWRC Ontology
type: religion
type: Concept
comment: La description de ce terme est basée sur celle de DBPedia. @fr
comment: The description for this term is indebted to the Getty Art & Architecture Thesaurus.
label: Hindoeïsme @nl
label: Hindou @fr
label: Hinduismo @es
label: hindouisme @fr
label: yin du jiao @zh-latn
label: yin tu chiao @zh-latn
label: yìn dù jià o @zh-latn
label: å°åº¦æ @zh-hant
alternative label: Hindoos
definition: "General term for the set of intellectual and philosophical tenets and highly diverse beliefs and practices that define the civilization, art, literature, society, and politics of the Indian subcontinent. Hinduism is not a common set of rigid beliefs, but varies significantly between different regions; it includes Shaivism, Vaishnavism, Srauta, and numerous other traditions. Among other practices and philosophies, Hinduism includes a wide spectrum of laws and prescriptions of "daily morality" based on karma, dharma, and societal norms. The highest divine powers are seen as complementary to one another and not exclusive. Hinduism does not have a particular founder or central authority. Hindu literature is rich and varied, with no one text considered uniquely authoritative. The Vedas, dating to the Vedic period (ca. 1200-500 BCE), are the earliest extant writings. Religious law books and epics such as the Ramayana and the Mahabharata have been and continue to be highly influential." (Getty, 2017)
definition: "Se refiere al conjunto de creencias y prácticas altamente diversas que generalmente denotan la civilización y cultura India de los dos mil últimos años. La religión influye fuertemente en el arte, la literatura, la política y al sociedad hinduista. Presenta la creencia y la práctica de ritos mágicos, cultos animales, creencia en demonios, cultos a deidades, incluyendo dioses locales y dioses centrales, misticismo, ascetismo y una apreciación y respeto por otras formas de cultos o creencias religiosas. La verdad de la religión no esta concebida como un término dogmático, sino que la verdad supera toda definición verbal. En vez de un sistema de doctrinas, el énfasis se pone en la manera correcta de vivir (dharma). Hay variaciones significativas entre diversas regiones. La mayoría de las formas de hinduismo enfatizan el concepto del reencarnación o de la transmigración; la liberación (moksha) desde el ciclo del samsara es la última meta espiritual del hindú. Brahma, Vishnu y Shiva son las deidades hindúes principales, juntos forman la tríada, el Trimurti. Existen muchos otros deidades de menor rango. El Hinduismo no tiene un fundador en particular o un iniciado, allí no hay una autoridad central. La literatura hindú es rica y variada, sin un texto considerado únicamente autoritario. El Vedas, fechando en el período de Vedic (ca. 1200-500 a. C), es la escritura más temprana existente. Los libros de ley y las epopeyas religiosas tales como el Ramayana y el Mahabharata han sido y continúan siendo altamente influyentes." (Getty, 2017) @es
definition: "Verwijst naar de reeks uiterst diverse geloven en gebruiken die in het algemeen verwijzen naar de Indiase beschaving en cultuur van de afgelopen tweeduizend jaar. De religie heeft een sterke invloed op de Indiase kunst, literatuur, maatschappij en politiek. Het hindoeïsme omvat diverse religieuze geloven en gebruiken en in plaats van andere goden, andere godsdiensten en andere religieuze concepten als fout of onverenigbaar te zien, worden de hoogste goddelijke machten gezien als elkaar aanvullend. De religieuze waarheid wordt niet gezien in dogmatische termen aangezien wordt geloofd dat de waarheid alle woordelijke definities overstijgt. In plaats van op een reeks doctrines ligt de nadruk op de juiste manier van leven (dharma). Er zijn aanzienlijke verschillen per regio. In de meeste vormen van het hindoeïsme ligt de nadruk op het concept van reïncarnatie of zielsverhuizing; de bevrijding (moksha) van de cyclus van samsara is het uiteindelijke spirituele doel van hindoes. Brahma, Visjnoe en Shiva zijn de belangrijkste hindoeïstische godheden en vormen gezamenlijk een drie-eenheid, de Trimurti. Verder is er een groot aantal lagere goden. Het hindoeïsme heeft geen specifieke oprichter of ontstaansmoment en er is geen centrale autoriteit. De hindoeïstische literatuur is erg rijk en gevarieerd en geen enkele specifieke tekst wordt als gezaghebbend beschouwd. De Veda's, die afkomstig zijn uit de Vedische periode (ca. 1200-500 v. Chr.), zijn de oudste overgebleven geschriften. Religieuze wetboeken en heldendichten zoals de Ramayana en de Mahabharata zijn altijd erg invloedrijk geweest." (Getty, 2017) @nl
definition: "ä»£è¡¨éå»å ©åå¹´ä¾å°åº¦ææèæåçä¸å¥æ¥µå¤æ¨£çä¿¡ä»°èå¯¦è¸æ¹å¼ãæ­¤å®æå°å°åº¦èè¡ãæå­¸ãç¤¾æèæ¿æ²»ææ¥µå¤§å½±é¿ãå°åº¦æå å«å¤å çå®æä¿¡ä»°åå¯¦è¸æ¹å¼ï¼å æ­¤ä¸æèªçºå ¶ä»çç¥æãå ¶ä»å½¢å¼çæ¬æåå®æè§æ¯é¯èª¤æè äºä¸ç¸å®¹ï¼åèèªçºæé«çç¥åæ¯å½¼æ­¤äºè£çãä»åç¸ä¿¡ççè¶ è¶ææè¨èªå®ç¾©ï¼å æ­¤ä¸ææ­¦æ·èªå®ä½è¬å®æççãéè¦çæ´»çæ­£ç¢ºæ¹å¼(æ³)ï¼èéä¸é£ä¸²çææ¢ãä¸åå®æä¹éå·®ç°çé ãå¤§é¨åçå°åº¦æå½¢å¼å¼·èª¿è¼ªè¿´è§å¿µï¼å¾çæ­»ç¾è¦ç­è¼ªè¿´ä¸­è§£è«æ¯å°åº¦æå¾æçµçå¿éç®æ¨ãå©ç¾ æ©ãæ¯æ¿å¥´ãæ¿å©æ¯å°åº¦æä¸»è¦çä¸åç¥æ(ä¸ç¸ç¥) ãéæå¾å¤å ¶ä»å°ç¥ãå°åº¦ææ²æç¢ºåçå»ºç«è åéå§æéï¼ä¹æ²æä¸­å¤®æ¬å¨ãå°åº¦ææå­¸è±å¯ä¸å¤æ¨£ï¼ä½æ²æåªä¸é¨ä½åè¢«èªçºæ¯æ¬å¨ãè¿½æº¯èªå éææ(è¥¿å å500å¹´å°è¥¿å 1200å¹´)çå éç¶æ¯ç¾å­ææ©çç¶å ¸ãå®ææ³å¾å ¸ç±åå²è©©å¦ãç¾ æ©è¶é£å²è©©ãåãæ©è¨¶å©ç¾ éãä»èæ¥µå ·å½±é¿åã" (Getty, 2017) @zh-hant
definition: «L'hindouisme (hindi : hindu dharm ; devanÄgarÄ« : à¤¹à¤¿à¤¨à¥à¤¦à¥ à¤§à¤°à¥à¤® ; «religion hindoue»), ou Sanatana Dharma (sanskrit IAST : sanÄtanadharma ; devanÄgarÄ« : à¤¸à¤¨à¤¾à¤¤à¤¨à¤§à¤°à¥à¤® ; «Loi Ãternelle»), est l'une des plus vieilles religions du monde encore pratiquées, qui n'a ni fondateur ni Ãglise. Avec près d'un milliard de fidèles dans 84 pays, c'est actuellement la troisième religion la plus pratiquée dans le monde après le christianisme et l'islam. Elle est issue du sous-continent indien qui reste son principal foyer de peuplement. La particularité de l'hindouisme est de n'avoir ni prophètes ni dogmes centraux. Cependant, les hindous contemporains croient en l'autorité du Veda, qui, selon la tradition, fut révélé aux hommes, grâce Ã la «vision» des Rishi. Le terme persan hindu (du sanskrit Sindhu) désignait au départ, pour les musulmans qui pénétrèrent en Inde, les habitants du bassin de l'Indus. L'hindouisme se présente comme un ensemble de concepts philosophiques issus d'une tradition remontant Ã la protohistoire indienne, la pratique hindouiste étant sans doute issue d'une tradition orale très ancienne, proche de l'animisme. On retient parfois une tripartition historique qui fait de l'hindouisme la dernière phase du développement des religions en Inde, après le védisme aryen (~1500 Ã 900 av. J.-C.) et le brahmanisme (~900 Ã 400 av. J.-C.). Au-delà du syncrétisme théologique, l'hindouisme d'avant les invasions islamiques et le colonialisme européen qui soumirent l'Inde Ã leur autorité était un vecteur pour toutes les sciences : le droit, la politique, l'architecture, l'astronomie, la philosophie, la médecine, etc., comme d'autres savoirs qui avaient en commun le substrat religieux.» (DBpedia, 2017) @fr
in scheme: religion

historian
in dataset: The CWRC Ontology
type: occupation
type: Concept
alternative label: architectural historian
alternative label: art historian
alternative label: family archivist
alternative label: family historian
alternative label: furniture historian
alternative label: historical researcher
alternative label: historical scholar
alternative label: irish historian
alternative label: local historian
alternative label: medievalist
alternative label: music historian
hidden label: historians
hidden label: historical expertise
in scheme: occupation

Home rule
in dataset: The CWRC Ontology
type: political affiliation
type: Concept
comment: La description de ce terme est basée sur celle de DBPedia. @fr
comment: The description for this term is indebted to DBpedia.
label: Home Rule @fr
alternative label: Home Rule movement
definition: "Home rule is the power of a constituent part (administrative division) of a state to exercise such of the state's powers of governance within its own administrative area that have been decentralized to it by the central government. In the United Kingdom, it traditionally referred to self-government, devolution or independence of its constituent nationsâinitially Ireland, and later Scotland, Wales, and Northern Ireland. In the United States and other countries organised as federations of states, the term usually refers to the process and mechanisms of self-government as exercised by municipalities, counties, or other units of local government at the level below that of a federal state (e.g., US state, in which context see special legislation). It can also refer to the similar system under which Greenland and the Faroe Islands are associated with Denmark. Home rule is not, however, comparable with federalism. Whereas states in a federal system of government (e.g., Canada, Federal Republic of Germany, Switzerland, Brazil, Ethiopia and the United States of America) have a guaranteed constitutional existence, a devolved home rule system of government is created by ordinary legislation and can be reformed, or even abolished, by repeal or amendment of that ordinary legislation. A state legislature may, for example, create home rule for a county or parish (or its townships), so that a county commission or board of supervisors may have jurisdiction over its unincorporated areas, including important issues like zoning. (Without this, a US county is simply an extension of state government.) The legislature can also establish or eliminate municipal corporations, which have home rule within town or city limits through the city council. The state government could also abolish counties/townships, or their governments, according to the state constitution and state laws." (DBpedia, 2018)
definition: «Le Home Rule est un projet visant Ã donner une autonomie interne Ã l'Irlande, tout en restant sous la tutelle de la couronne britannique. En 1870, Isaac Butt crée la Home Government Association pour la promotion de l'autonomie de l'île, et l'institution d'un parlement Ã Dublin, dans le cadre du Royaume-Uni ; en 1873 elle devient la Home Rule League. Cette démarche reprend le combat soutenu notamment par Daniel O'Connell.» (DBpedia, 2018) @fr
in scheme: political affiliation

homosexuality
in dataset: The CWRC Ontology
type: sexuality
type: Concept
label: homosexualité @fr
alternative label: homosexual
alternative label: male HOMOSEXUAL
definition: Homosexuality indicates sexual attraction to subjects of the same gender. Like bisexuality, it draws on a binary understanding of sex and gender that also often conflates sex with gender. Homosexual is often used as an umbrella term for lesbian and gay sexuality.
definition: L'homosexualité indique l'attraction sexuelle entre des sujets du même genre. Comme bisexuel, le terme repose sur une interprétation binaire et souvent indifférenciée du sexe et du genre. Homosexuel est souvent utilisé comme terme générique pour les sexualités lesbienne et gay. @fr
in scheme: sexuality

honorary degree
in dataset: The CWRC Ontology
type: credential
type: Concept
comment: La description de ce terme est basée sur celle de DBPedia. @fr
comment: The description for this term is indebted to DBpedia.
label: Doctorat honoris causa @fr
alternative label: honorary Doctorate of Divinity
alternative label: honorary MA
definition: "An honorary degree or a degree honoris causa (Latin: "for the sake of the honor") is an academic degree for which a university (or other degree-awarding institution) has waived the usual requirements, such as matriculation, residence, a dissertation and the passing of comprehensive examinations. The degree is typically a doctorate or, less commonly, a master's degree, and may be awarded to someone who has no prior connection with the academic institution or no previous postsecondary education. An example of identifying a recipient of this award is as follows: Doctorate in Business Administration (Hon. Causa). The degree is often conferred as a way of honouring a distinguished visitor's contributions to a specific field or to society in general. It is often given to graduation speakers at a university or college, and the university may derive benefits by association with the person in question. The degree is not recognized by employers as having the same stature as a corresponding earned doctorate degree and should not be represented as such. Rev. Theodore Hesburgh held the record for most honorary degrees, having been awarded 150 during his lifetime." (DBpedia, 2018)
definition: «Un doctorat honoris causa (du latin causa, qui exprime le but, précédé du génitif de honor, honoris, l'honneur : « pour l'honneur », honorifique) est un titre honorifique décerné par une université ou une faculté Ã une personnalité éminente. Un docteur honoris causa, parfois abrégé en Dr h. c., est le récipiendaire d'un doctorat honoris causa. Au Canada, on parle de doctorat honorifique.» (DBpedia, 2018) @fr
in scheme: credential

hospitality
in dataset: The CWRC Ontology
type: occupation
type: Concept
alternative label: alehouse keeper
alternative label: cafe manager
alternative label: club employee
alternative label: coffee house keeper
alternative label: guesthouse keeper
alternative label: hotel keeper
alternative label: hotel manager
alternative label: hotel proprietor
alternative label: hotel worker
alternative label: hotelier
alternative label: inn
alternative label: innkeeper
alternative label: lodging house keeper
alternative label: restaurant manager
alternative label: restaurant owner
alternative label: tavern keeper
hidden label: coffee house keeper
hidden label: hostel forewoman
hidden label: pot girl
in scheme: occupation

hostess
in dataset: The CWRC Ontology
type: occupation
type: Concept
alternative label: entertaining
alternative label: literary hostess
alternative label: nightclub hostess
alternative label: salonniere
alternative label: salonnière
alternative label: society hostess
hidden label: hostess for her father
in scheme: occupation

house painter
in dataset: The CWRC Ontology
type: occupation
type: Concept
in scheme: occupation

house sitter
in dataset: The CWRC Ontology
type: occupation
type: Concept
in scheme: occupation

housekeeper
in dataset: The CWRC Ontology
type: occupation
type: Concept
alternative label: household management
alternative label: housekeeping
alternative label: mistress of a household
alternative label: state housekeeper
in scheme: occupation

housework
in dataset: The CWRC Ontology
type: occupation
type: Concept
in scheme: occupation

housing movement
in dataset: The CWRC Ontology
type: political affiliation
type: Concept
comment: The description for this term is indebted to DBpedia.
label: mouvement pour le droit au logement @fr
alternative label: housing activism
alternative label: housing charity
broader transitive: social reform
definition: Advocacy or activism related to housing for the poor or otherwise disadvantaged.
definition: Militantisme et lutte en faveur du droit au logement pour les plus démunis et autres personnes défavorisées. Voir Droit au logement â Wikipédia @fr
in scheme: political affiliation
related: civil rights movement

Huguenot
in dataset: The CWRC Ontology
type: national heritage
type: religion
type: Concept
comment: La description de ce terme est basée sur celle de DBPedia. @fr
comment: The description for this term is indebted to DBpedia.
definition: "A Huguenot (/ËhjuËÉ¡ÉnÉt/, /ËhjuËÉ¡ÉnoÊ/ or /ËhjuËÉ¡ÉËnoÊ/; French: [yÉ¡(É)nõ]) is a designation for a French Protestant who follows the Reformed tradition. It was used frequently to describe members of the French Reformed Church until the beginning of the 19th century. The term traces back its origin to 16th century France. Historically, Huguenots were French Protestants inspired by the writings of John Calvin. Huguenots endorsed the Reformed tradition of Protestantism, as opposed to largely German Lutheran population in Alsace, Moselle, and around Montbéliard. Hans J. Hillerbrand in his Encyclopedia of Protestantism: 4-volume Set claims the Huguenot community reached as much as 10% of the French population on the eve of the St. Bartholomew's Day massacre, declining to 7-8% by the end of the 16th century, and further after heavy persecution began once again with the Revocation of the Edict of Nantes by Louis XIV of France. Huguenot numbers peaked near an estimated two million by 1562, concentrated mainly in the southern and western parts of France. As Huguenots gained influence and more openly displayed their faith, Catholic hostility grew, in spite of political concessions and edicts of toleration from the French crown. A series of religious conflicts followed, known as the French Wars of Religion, fought intermittently from 1562 to 1598. The wars finally ended with the granting of the Edict of Nantes, which granted the Huguenots substantial religious, political, and military autonomy. Huguenot rebellions in the 1620s prompted the abolishment of their political and military privileges; they retained the religious provisions of the Edict of Nantes until the rule of Louis XIV. Louis XIV gradually increased persecution of them until he issued the Edict of Fontainebleau (1685), ending any legal recognition of Protestantism in France, and forcing the Huguenots to convert or flee in a wave of violent dragonnades. Louis XIV claimed the French Huguenot population of 80…
definition: «Les huguenots sont les Français protestants pendant les guerres de Religion (seconde moitié du XVIe siècle), au cours desquelles ils ont été â sous ce nom â en conflit avec les catholiques. Environ 300 000 dâentre eux ont quitté la France Ã la suite des dragonnades et de la révocation de lâédit de Nantes le 18 octobre 1685. Ã partir du XVIIe siècle, les huguenots sont appelés religionnaires, car les actes royaux ne parlaient pas de protestantisme mais de « religion prétendue réformée ».» (DBpedia, 2018) @fr
in scheme: national heritage

human rights
in dataset: The CWRC Ontology
type: political affiliation
type: Concept
comment: The description for this term is indebted to DBpedia.
label: droits de l'homme @fr
alternative label: human rights activist
alternative label: humanitarian
definition: Advocacy or activism in support of human rights. Human rights - Wikipedia
definition: Militantisme et lutte en faveur des droits humains. Voir Droits de l'homme â Wikipédia @fr
in scheme: political affiliation

humanism
in dataset: The CWRC Ontology
type: political affiliation
type: Concept
comment: La description de ce terme est basée sur celle de DBPedia. @fr
comment: The description for this term is indebted to DBpedia.
label: Humanisme @fr
alternative label: humanist
definition: "Humanism is a philosophical and ethical stance that emphasises the value and agency of human beings, individually and collectively, and generally prefers critical thinking and evidence (rationalism, empiricism) over acceptance of dogma or superstition. The meaning of the term humanism has fluctuated according to the successive intellectual movements which have identified with it. The term was coined by theologian Friedrich Niethammer at the beginning of the 19th century. Generally, however, humanism refers to a perspective that affirms some notion of human freedom and progress. In modern times, humanist movements are typically aligned with secularism, and today humanism typically refers to a non-theistic life stance centred on human agency and looking to science rather than revelation from a supernatural source to understand the world." (DBpedia, 2017)
definition: «L'humanisme est un courant culturel européen, trouvant ses origines en Italie, principalement autour de la Toscane, qui s'est développé Ã la Renaissance. Renouant avec la civilisation gréco-romaine, les intellectuels de l'époque manifestent un vif appétit de savoir (philologie notamment). Considérant que l'Homme est en possession de capacités intellectuelles potentiellement illimitées, ils considèrent la quête du savoir et la maîtrise des diverses disciplines comme nécessaires au bon usage de ces facultés. Ils prônent la vulgarisation de tous les savoirs, dont religieux ; la parole divine doit être accessible Ã toute personne, quelles que soient ses origines ou sa langue (traduction de la Bible par Jacques Lefèvre d'Ãtaples en 1523). Ainsi, cet humanisme vise Ã diffuser plus clairement le patrimoine culturel. L'individu, correctement instruit, reste libre et pleinement responsable de ses actes dans la croyance de son choix. Les notions de liberté ou libre arbitre, de tolérance, d'indépendance, d'ouverture et de curiosité sont, de ce fait, indissociables de la théorie humaniste classique. Par extension, on désigne par «humaniste» toute pensée qui met au premier plan de ses préoccupations le développement des qualités essentielles de l'être humain. Une vaste catégorie de philosophies portant sur l'éthique affirme la dignité et la valeur de tous les individus, fondée sur la capacité de déterminer le bien et le mal par le recours Ã des qualités humaines universelles, en particulier la rationalité. L'humanisme implique un engagement Ã la recherche de la vérité et de la moralité par l'intermédiaire des moyens humains, en particulier les sciences, en solidarité avec l'humanité. En mettant l'accent sur la capacité d'auto-détermination, l'humanisme rejette la validité des justifications transcendantes de l'époque, alors éloignée des questions phénoménologiques du XXe siècle, jugées comme une dépendance Ã l'égard du su… @fr
in scheme: political affiliation

humanitarian work
in dataset: The CWRC Ontology
type: occupation
type: Concept
alternative label: international aid worker
hidden label: distribution of medical supplies
in scheme: occupation

hunter
in dataset: The CWRC Ontology
type: occupation
type: Concept
alternative label: fox hunter
alternative label: foxhunter
alternative label: hunting
alternative label: rabbit shooting
broader transitive: sports
hidden label: big game hunting
hidden label: fox hunting
hidden label: foxhunting
hidden label: master of hounds
in scheme: occupation

husband
in dataset: The CWRC Ontology
subject-centric predicate: has husband
type: ObjectProperty
range: Person
sub property of: partner

husband of
in dataset: The CWRC Ontology
type: ObjectProperty
domain: Person
label: mari de @fr
range: Person
sub property of: partner of
different from: Partnership
inverse of: has husband
broader: spouse

hypnotist
in dataset: The CWRC Ontology
type: occupation
type: Concept
alternative label: hypnotism
in scheme: occupation

identity
in dataset: The CWRC Ontology
type: DeprecatedProperty
type: Concept
comment: Deprecated from previous Orlando Ontology design.
comment: Désapprouver de l'ancienne ontology Orlando. @fr
domain: actor
range: Person
term status: deprecated
definition: The identity of the person who committed the act.

Igbo
in dataset: The CWRC Ontology
type: ethnicity
type: Concept
comment: La description de ce terme est basée sur celle de DBPedia. @fr
comment: The description for this term is indebted to DBpedia.
definition: "The Igbo people, also erroneously known as the "Ibo people" (because certain Europeans had difficulty making the /É¡Í¡b/ sound), are an indigenous linguistic and cultural people of southern Nigeria. Geographically, the Igbo homeland is divided into two unequal sections by the Niger Riverâ an eastern (which is the larger of the two) and a western section. Culturally and linguistically, the Niger River has provided an easy means of communication and unity amongst the Igbo natives on both sides, as well as promoted ancient trade and movement of peoples between Igboland and the rest of the world." (DBpedia, 2018)
definition: «Jeune femme igbo en tenue de cérémonielors d'un festival culturel Fichier:LocationIgboland.png Carte de répartition Les Igbos sont une ethnie habitant le sud - est du Nigéria. Ils constituent 18 % de la population du pays et donc, représentent ainsi le 3e groupe ethnique le plus important du pays.Ils parlent la langue igbo, une langue de type nigéro - congolais. Ce sont des agriculteurs majoritairement chrétiens, dont la société est basée sur un système de classes d'âges.» (DBpedia, 2018) @fr
in scheme: ethnicity

illustrator
in dataset: The CWRC Ontology
type: occupation
type: Concept
alternative label: advertisement illustrator
alternative label: illustrator of children's books
hidden label: creator of etchings to illustrate
in scheme: occupation

immunologist
in dataset: The CWRC Ontology
type: occupation
type: Concept
in scheme: occupation

imperialism
in dataset: The CWRC Ontology
type: political affiliation
type: Concept
comment: La description de ce terme est basée sur celle de DBPedia. @fr
comment: The description for this term is indebted to DBpedia.
label: Impérialisme @fr
alternative label: colonialist
alternative label: commonwealth supporter
alternative label: imperialist
definition: "Imperialism means "to extend a country's power through military and diplomacy". Its name originated from the Latin word imperium, which means to rule over large territories. Imperialism is "a policy of extending a country's power and influence through colonization, use of military force, or other means". It has also allowed for the rapid spread of technologies and ideas. The term imperialism has been applied to Western (and Japanese) political and economic dominance especially in Asia and Africa in the 19th and 20th centuries. Its precise meaning continues to be debated by scholars. Some writers, such as Edward Said, use the term more broadly to describe any system of domination and subordination organised with an imperial center and a periphery. Imperialism is defined as "A policy of extending a country's power and influence through diplomacy or military force." Imperialism is particularly focused on the control that one group, often a state power, has on another group of people. This is often through various forms of "othering" (see other) based on racial, religious, or cultural stereotypes. There are "formal" or "informal" imperialisms. "Formal imperialism" is defined as "physical control or full-fledged colonial rule". "Informal imperialism" is less direct; however, it is still a powerful form of dominance. The definition of imperialism has not been finalized for centuries and was confusedly seen to represent the policies of major powers, or simply, general-purpose aggressiveness. Further on, some writers used the term imperialism, in slightly more discriminating fashion, to mean all kinds of domination or control by a group of people over another. To clear out this confusion about the definition of imperialism one could speak of "formal" and "informal" imperialism, the first meaning physical control or "full-fledged colonial rule" while the second implied less direct rule though still containing perceivable kinds of dominance. Informal rule is generally less c…
definition: «L'impérialisme est une stratégie ou une doctrine politique de conquête, visant la formation d'un empire ou d'une domination. Pour John Atkinson Hobson, la nouveauté dans l'impérialisme de la fin du XIXe siècle et du début du XXe siècle, c'est qu'il n'est plus lié Ã l'idée d'un empire couvrant le monde connu, comme c'était le cas dans le cadre de la Pax Romana. Au contraire, Ã la suite de la montée du nationalisme au XIXe siècle, cet impérialisme donne lieu Ã une lutte entre empires concurrents (Empire allemand, Empire britannique, Empire russe, etc.). Au niveau économique, l'impérialisme est alors de nature protectionniste et s'oppose au libre-échange. Par ailleurs, ses liens avec certaines formes de capitalisme monopolistique sont mis en avant par de nombreux auteurs marxistes. De nos jours, ce terme est employé de façon large pour désigner tout rapport de domination établi par une nation ou pays sur un ou plusieurs autres pays.» (DBpedia, 2017) @fr
in scheme: political affiliation

in role
in dataset: The CWRC Ontology
type: DeprecatedProperty
type: Concept
comment: Deprecated from previous Orlando Ontology design.
comment: Désapprouver de l'ancienne ontologie Orlando. @fr
domain: actor
range: role
term status: deprecated
definition: The role taken on by this actor.

Independent Methodist Connexion
in dataset: The CWRC Ontology
type: religion
type: Concept
comment: The description for this term is indebted to DBpedia.
alternative label: Independent Methodist
broader transitive: Dissent (Protestant)
definition: "Their first chapels came into being in the north-west of England and met together for the first time in 1806 at Manchester. Annual Meetings and exchange of preachers constituted the only tangible link between the churches for many years. Of the early leading figures, the most prominent was Peter Phillips of Warrington; he is generally regarded as the denominationâs founding father. By trade he was a chairmaker, but as an unpaid minister and preacher he travelled a wide area of the country and was instrumental in the affiliation of many churches to the Connexion during a period of over 50 years. Though some of the early congregations used the title Independent Methodists, there were many other names: for example, Free Gospel Church, Christian Lay Church, Christian Brethren, Gospel Pilgrims and Quaker Methodists. It was not until 1898 that the Annual Meeting finally chose the name Independent Methodist." (DBpedia, 2018)
in scheme: religion

indexed by
in dataset: The CWRC Ontology
type: ObjectProperty
definition: Indicates an organization's use of this name form in its index.

Indian independence movement
in dataset: The CWRC Ontology
type: political affiliation
type: Concept
comment: La description de ce terme est basée sur celle de DBPedia. @fr
comment: The description for this term is indebted to DBpedia.
label: Mouvement pour l'indépendance de l'Inde @fr
alternative label: Indian independence
alternative label: Indian self-government
alternative label: indian nationalist
alternative label: pro-independence (indian)
broader transitive: human rights
definition: "The Indian Independence Movement encompassed activities and ideas aiming to end the East India Company rule (1757â1858) and the British Raj (1858â1947) in the Indian subcontinent. The Movement spanned a total of 190 years (1757-1947). The very first organised militant movements were in Bengal, but they later took movement in the then newly formed Indian National Congress with prominent moderate leaders seeking only their basic right to appear for Indian Civil Service examinations, as well as more rights, economic in nature, for the people of the soil. The early part of the 20th century saw a more radical approach towards political self-rule proposed by leaders such as the Lal, Bal, Pal and Aurobindo Ghosh, V. O. Chidambaram Pillai. The last stages of the self-rule struggle from the 1920s onwards saw Congress adopt Mohandas Karamchand Gandhi's policy of nonviolence and civil resistance, Muhammad Ali Jinnah's constitutional struggle for the rights of minorities in India, and several other campaigns. Activists Netaji Subhas Chandra Bose and Bhagat Singh preached armed revolution to achieve self-rule. Poets and writers such as Rabindranath Tagore, Subramaniya Bharathi, Allama Iqbal, Josh Malihabadi, Mohammad Ali Jouhar, Bankim Chandra Chattopadhyay, and Kazi Nazrul Islam used literature, poetry, and speech as a tool for political awareness. Feminists such as Sarojini Naidu and Begum Rokeya promoted the emancipation of Indian women and their participation in national politics. Babasaheb Ambedkar championed the cause of the disadvantaged sections of Indian society within the larger self-rule movement. The period of the Second World War saw the peak of the campaigns by the Quit India movement led by Mahatma Gandhi and the Indian National Army movement led by Netaji Subhas Chandra Bose. The Indian self-rule movement was a mass-based movement that encompassed various sections of society. It also underwent a process of constant ideological evolution. Although the basic ideol…
definition: «45xCe modèle est-il pertinent ? Cliquez pour en voir d'autres.Cet article ne cite pas suffisamment ses sources (mai 2015). Si vous disposez d'ouvrages ou d'articles de référence ou si vous connaissez des sites web de qualité traitant du thème abordé ici, merci de compléter l'article en donnant les références utiles Ã sa vérifiabilité et en les liant Ã la section «Notes et références» (modifier l'article, comment ajouter mes sources ?). Le mouvement pour l'indépendance de l'Inde recouvre un ensemble complexe englobant diverses campagnes nationales et régionales, des troubles et des tentatives inspirés d'une philosophie Ã la fois non-violente et militante, et a impliqué une gamme étendue d'organismes, de philosophies et de mouvements politiques indiens ayant eu pour but commun de mettre fin Ã l'autorité coloniale britannique aussi bien que celle d'autres administrations coloniales dans le sous-continent indien.» (DBpedia, 2017) @fr
in scheme: political affiliation
related: civil rights movement
related: social reform

Indian
in dataset: The CWRC Ontology
type: race or colour
type: Concept
comment: The description for this term is indebted to DBpedia.
definition: "Indian people or Indians are citizens of India, the second most populous nation containing 17.50% of the world's population. "Indian" refers to nationality, but not ethnicity or language. The Indian nationality consists of many regional ethno-linguistic groups, reflecting the rich and complex history of India. India hosts all major ethnic groups found in the Indian Subcontinent. The diaspora populations with Indian ancestry, as a result of emigration, are somewhat widespread most notably in the UAE, Southeast Asia, United Kingdom, North America, Australia, New Zealand, South Africa, the Caribbean, and Southern Europe. Population estimates vary from a conservative 12 million to 20 million diaspora." (DBpedia, 2017)
in scheme: race or colour

Indian unification
in dataset: The CWRC Ontology
type: political affiliation
type: Concept
comment: The description for this term is indebted to DBpedia.
alternative label: Indian national unity
definition: "At the time of Indian independence in 1947, India was divided into two sets of territories, one under the control of the British Empire, and the other over which the Crown had suzerainty, but which were under the control of their hereditary rulers. In addition, there were several colonial enclaves controlled by France and Portugal. The political integration of these territories into India was a declared objective of the Indian National Congress, and the Government of India pursued this over the next decade." (DBpedia, 2018)
in scheme: political affiliation

Indigenous (of the Americas)
in dataset: The CWRC Ontology
type: ethnicity
type: Concept
comment: La description de ce terme est basée sur celle de DBPedia. @fr
comment: The description for this term is indebted to DBpedia.
label: Indigenous/Amérindiens @fr
alternative label: Amer-Indians
definition: "The indigenous peoples of the Americas are the pre-Columbian peoples of the Americans and their descendants. Pueblos indígenas or indígenas (lit. "indigenous peoples") is a common term in Spanish-speaking countries, and pueblos nativos or nativos (lit. "native peoples" in the sense of descendants of non-immigrants) may also be heard, while aborigen (aborigine) is used in Argentina, and pueblos aborígenes (aboriginal peoples) is common in Chile. The term "Amerindian" (short for "'Indians' of the Americas)" is used in Quebec, The Guianas, and the English-speaking Caribbean. Indigenous peoples are commonly known in Canada as Aboriginal peoples, which includes not only First Nations and Arctic Inuit, but also the minority population of First Nations-European mixed-race Métis people who identify culturally and ethnically with indigenous peoplehood. This is contrasted, for instance, to the American Indian-European mixed-race mestizos of Hispanic America (caboclos in Brazil) who, with their larger population (in most Latin American countries constituting either outright majorities, pluralities, or at the least large minorities), identify largely as a new ethnic group distinct from both Europeans and Indigenous Americans, but still considering themselves a subset of the European-derived Hispanic peoplehood in culture and ethnicity. Indigenous peoples of the United States are commonly known as Native Americans or American Indians, and Alaska Natives. Application of the term "Indian" originated with Christopher Columbus, who, in his search for Asia, thought that he had arrived in the East Indies. Eventually, the Americas came to be known as the "West Indies", a name still used to refer to the islands of the Caribbean Sea. This led to the blanket term "Indies" and "Indians" (Spanish "indios") for the indigenous inhabitants, which implied some kind of racial or cultural unity among the indigenous peoples of the Americas. This unifying concept, codified in law, religion, an…
definition: «Les Amérindiens, Indiens d'Amérique, Indiens ou encore Américains natifs, comme revendiqué par certaines peuplades, sont les habitants d'Amérique avant la colonisation européenne des Amériques.»(DBpedia, 2017) @fr
in scheme: ethnicity

Indigenous (of the Americas)
in dataset: The CWRC Ontology
type: race or colour
type: Concept
comment: La description de ce terme est basée sur celle de DBPedia. @fr
comment: The description for this term is indebted to DBpedia.
alternative label: Native American
definition: "The indigenous peoples of the Americas are the pre-Columbian peoples of the Americans and their descendants. Pueblos indígenas or indígenas (lit. "indigenous peoples") is a common term in Spanish-speaking countries, and pueblos nativos or nativos (lit. "native peoples" in the sense of descendants of non-immigrants) may also be heard, while aborigen (aborigine) is used in Argentina, and pueblos aborígenes (aboriginal peoples) is common in Chile. The term "Amerindian" (short for "'Indians' of the Americas)" is used in Quebec, The Guianas, and the English-speaking Caribbean. Indigenous peoples are commonly known in Canada as Aboriginal peoples, which includes not only First Nations and Arctic Inuit, but also the minority population of First Nations-European mixed-race Métis people who identify culturally and ethnically with indigenous peoplehood. This is contrasted, for instance, to the American Indian-European mixed-race mestizos of Hispanic America (caboclos in Brazil) who, with their larger population (in most Latin American countries constituting either outright majorities, pluralities, or at the least large minorities), identify largely as a new ethnic group distinct from both Europeans and Indigenous Americans, but still considering themselves a subset of the European-derived Hispanic peoplehood in culture and ethnicity. Indigenous peoples of the United States are commonly known as Native Americans or American Indians, and Alaska Natives. Application of the term "Indian" originated with Christopher Columbus, who, in his search for Asia, thought that he had arrived in the East Indies. Eventually, the Americas came to be known as the "West Indies", a name still used to refer to the islands of the Caribbean Sea. This led to the blanket term "Indies" and "Indians" (Spanish "indios") for the indigenous inhabitants, which implied some kind of racial or cultural unity among the indigenous peoples of the Americas. This unifying concept, codified in law, religion, an…
definition: «Les Amérindiens, Indiens d'Amérique, Indiens ou encore Américains natifs, comme revendiqué par certaines peuplades, sont les habitants d'Amérique avant la colonisation européenne des Amériques.»(DBpedia, 2017) @fr
in scheme: race or colour

Indigenous rights movement
in dataset: The CWRC Ontology
type: political affiliation
type: Concept
comment: The description for this term is indebted to DBpedia.
label: droit des peuples autochtones @fr
alternative label: indigenous rights
broader transitive: civil rights movement
definition: Advocacy or activism in support of human rights. Indigenous rights - Wikipedia
definition: Militantisme et lutte en faveur des droits des peuples autochtones. Voir Droit des peuples autochtones â Wikipédia @fr
in scheme: political affiliation
related: Anti-imperialism
related: human rights

indigent
in dataset: The CWRC Ontology
type: social class
type: Concept
label: indigentâ¢eâ¢s @fr
alternative label: INDIGENT
alternative label: impoverished
alternative label: poverty
definition: Cette classe sociale inclut "les pauvres, les indigentâ¢eâ¢s, les chômeurâ¢euseâ¢s " dépendant des actions de charité ou des aides sociales. @fr
definition: This social class is "poor, destitute, unemployed," supported by charity, or on social security. (Brown, 2006)
in scheme: social class

individualism
in dataset: The CWRC Ontology
type: political affiliation
type: Concept
comment: La description de ce terme est basée sur celle de DBPedia. @fr
comment: The description for this term is indebted to DBpedia.
label: Individualisme @fr
alternative label: individualist
definition: "Individualism is the moral stance, political philosophy, ideology, or social outlook that emphasises the moral worth of the individual. Individualists promote the exercise of one's goals and desires and so value independence and self-reliance and advocate that interests of the individual should achieve precedence over the state or a social group, while opposing external interference upon one's own interests by society or institutions such as the government. Individualism is often defined in contrast to totalitarianism, collectivism and more corporate social forms. Individualism makes the individual its focus and so starts "with the fundamental premise that the human individual is of primary importance in the struggle for liberation." Classical Liberalism, existentialism, and anarchism are examples of movements that take the human individual as a central unit of analysis. Individualism thus involves "the right of the individual to freedom and self-realization". It has also been used as a term denoting "The quality of being an individual; individuality" related to possessing "An individual characteristic; a quirk." Individualism is thus also associated with artistic and bohemian interests and lifestyles where there is a tendency towards self-creation and experimentation as opposed to tradition or popular mass opinions and behaviors as so also with humanist philosophical positions and ethics." (DBpedia, 2017)
definition: «L'individualisme est une conception philosophique, politique, sociale et morale qui tend Ã privilégier les droits, les intérêts et la valeur de l'individu par rapport Ã ceux du groupe. Il prône l'autonomie individuelle face aux diverses institutions sociales et politiques (la famille, le clan, la corporation, la caste...) qui exercent sur lui de multiples pressions. Il ne faut pas confondre individualisme et égoïsme. Contrairement Ã la compréhension populaire, ce n'est que péjorativement que l'individualisme peut se rapprocher de l'égoïsme et se définir comme une tendance Ã ne vivre que pour soi. L'individualisme est apparu vers la fin du Moyen Ãge et s'est développé Ã partir de la Renaissance sous l'effet de multiples facteurs, tels que l'invention de l'imprimerie au XVe siècle, qui a favorisé l'activité individuelle de la lecture.» (DBpedia, 2017) @fr
in scheme: political affiliation

inhabited
in dataset: The CWRC Ontology
range includes: AdminPlaceConcept
range includes: Feature
type: ObjectProperty
domain: Person
sub property of: has spatial relation to
inverse of: has inhabitant
definition: Indicates that a person lived in this place.

instructor
in dataset: The CWRC Ontology
subject-centric predicate: has instructor
type: ObjectProperty
label: un instructeur·ice @fr
range: Person
sub property of: education relationship

insurance
in dataset: The CWRC Ontology
type: occupation
type: Concept
alternative label: insurance agent
alternative label: insurance broker
alternative label: insurance clerk
alternative label: insurance collector
alternative label: insurance inspector
alternative label: insurance manager
alternative label: insurance salesman
alternative label: insurance underwriter
in scheme: occupation

public intellectual
in dataset: The CWRC Ontology
type: occupation
type: Concept
alternative label: intellectual
alternative label: labour intellectual
alternative label: learned woman
hidden label: polymath
hidden label: rationalist
in scheme: occupation
related: academic

intelligence work
in dataset: The CWRC Ontology
type: occupation
type: Concept
alternative label: espionage worker
alternative label: intelligence
alternative label: intelligence agent
alternative label: intelligence expert
alternative label: intelligence officer
alternative label: secret agent
alternative label: spy
alternative label: spying
in scheme: occupation

internationalism
in dataset: The CWRC Ontology
type: political affiliation
type: Concept
comment: La description de ce terme est basée sur celle de DBPedia. @fr
comment: The description for this term is indebted to DBpedia.
label: Internationalisme institutionnel @fr
alternative label: internationalist
definition: "Internationalism is a political principle which advocates a greater political or economic cooperation among nations and peoples, and whose ideological roots can be traced to both socialism and liberalism. Supporters of this principle are referred to as internationalists, and generally believe that the people of the world should unite across national, political, cultural, racial, or class boundaries to advance their common interests, or that the governments of the world should cooperate because their mutual long-term interests are of greater importance than their short-term disputes. Internationalism is, in general, opposed to nationalism, jingoism or chauvinism, and war, and proponents can include supporters of any of the four socialist Internationals and organisations such as the United Nations or the World Federalist Movement." (DBpedia, 2017)
definition: «L'internationalisme institutionnel est un concept de la théorie des relations internationales, désignant un supranationalisme qui prône le développement de la coopération institutionnelle entre Ãtats-nations.» (DBpedia, 2017) @fr
in scheme: political affiliation

interpersonal relationship
is replaced by: has interpersonal relationship with
in dataset: The CWRC Ontology
type: DeprecatedProperty
comment: Deprecated in favour of instance has interpersonal relationship with.
comment: Désapprouver en faveur de l'instance a relation interpersonnelle avec. @fr
label: relation interpersonnelle @fr
sub property of: relates socially to
deprecated: true
term status: deprecated
definition: Indicates personal knowledge of someone, covering a broad spectrum of social relations ranging from friendship to enmities and casual associations: it can include a writer having coffee with Samuel Johnson on one notable day, without needing a historical record of whether they were necessarily friends, through to substantial longlasting relationships. See also has intimate relationship with, has erotic relationship with, has possibly erotic relationship with.

interpersonal relationship
in dataset: The CWRC Ontology
subject-centric predicate: has interpersonal relationship with
type: ObjectProperty
label: relation interpersonnelle @fr
sub property of: social relationship

interviewer
in dataset: The CWRC Ontology
type: occupation
type: Concept
in scheme: occupation

intimate relationship
in dataset: The CWRC Ontology
subject-centric predicate: has intimate relationship with
type: ObjectProperty
range: Person
sub property of: interpersonal relationship

inventor
in dataset: The CWRC Ontology
type: occupation
type: Concept
alternative label: inventing
alternative label: technological innovator
in scheme: occupation

investor
in dataset: The CWRC Ontology
type: occupation
type: Concept
alternative label: financial backer
alternative label: market speculator
alternative label: share holder
alternative label: speculator
alternative label: stock investor
alternative label: stockbroker
in scheme: occupation

Irish
in dataset: The CWRC Ontology
type: ethnicity
type: Concept
comment: La description de ce terme est basée sur celle de DBPedia. @fr
comment: The description for this term is indebted to DBpedia.
label: Irlandais @fr
alternative label: irish ancestry
broader transitive: European
definition: "The Irish people (Irish: Muintir na hÃireann or Na hÃireannaigh) are a nation and ethnic group native to the island of Ireland, who share a common Irish ancestry, identity and culture. Ireland has been inhabited for about 9,000 years according to archaeological studies (see Prehistoric Ireland). For most of Ireland's recorded history, the Irish have been primarily a Gaelic people (see Gaelic Ireland). Anglo-Normans conquered parts of Ireland in the 12th century, while England's 16th/17th century (re)conquest and colonization of Ireland brought a large number of English and Lowland Scots to parts of the island, especially the north. Today, Ireland is made up of the Republic of Ireland (an independent state), and the smaller Northern Ireland (a part of the United Kingdom)." (DBpedia, 2017)
definition: «Le peuple irlandais (en irlandais : Muintir na héireann, na héireannaigh ou na Gaeil) est un groupe ethnique d'Europe de l'Ouest originaire d'Irlande, une île de l'archipel des îles Britanniques. Les personnes d'appartenance ethnique irlandaise, vivant en dehors de ce pays, sont communes dans beaucoup de pays du monde occidental, particulièrement dans les pays anglophones. D'ailleurs, ce sont les Ãtats-Unis qui accueillent le plus grand nombre de personnes d'ascendance irlandaise avec environ la moitié de la population irlandaise mondiale, c'est-Ã -dire dix fois plus qu'en Irlande elle-même. Néanmoins, ce n'est qu'en République d'Irlande et en Irlande du Nord qu'ils forment la majorité de la population. Ã l'étranger, la langue Celte Irlandaise n'est pratiquement pas parlée, et cette langue s'efface surtout au profit de l'Anglais, en Amérique du Nord et en Océanie.» (DBpedia, 2017) @fr
in scheme: ethnicity

Irish Home Rule Movement
in dataset: The CWRC Ontology
contrary to: Irish unionism
type: political affiliation
type: Concept
comment: The description for this term is indebted to DBpedia.
label: mouvement Irish Home Rule @fr
alternative label: home ruler
alternative label: home ruler (ireland)
alternative label: irish home ruler
broader transitive: republicanism
definition: "The Irish Home Rule movement was a movement that agitated for self-government for Ireland within the United Kingdom of Great Britain and Ireland. It was the dominant political movement of Irish nationalism from 1870 to the end of World War I. Isaac Butt founded the Home Government Association in 1870. This was succeeded in 1873 by the Home Rule League, and in 1882 by the Irish Parliamentary Party. These organisations campaigned for home rule in the British House of Commons. Under the leadership of Charles Stewart Parnell, the movement came close to success when the Liberal government under William Ewart Gladstone introduced the First Home Rule Bill in 1886, but the bill was defeated in the House of Commons after a split in the Liberal Party. After Parnell's death, Gladstone introduced the Second Home Rule Bill in 1893; it passed the Commons but was defeated in the House of Lords. After the removal of the Lords' veto in 1911, the Third Home Rule Bill was introduced in 1912, leading to the Home Rule Crisis. On the outbreak of World War I it was enacted, but suspended until the conclusion of the war. Following the Easter Rising of 1916, public support shifted from the Home Rule movement to the more radical Sinn Féin party. In the 1918 General Election the Irish Parliamentary Party suffered a crushing defeat, only a handful of MP's surviving. This was effectively the death of the Home Rule movement. The elected Sinn Féin MPs had no interest in home rule, instead setting up their own legislature, Dáil Ãireann, and declaring the independence of Ireland as a republic. Britain passed a Fourth Home Rule Bill, the Government of Ireland Act 1920, aimed at creating separate parliaments for Northern Ireland and Southern Ireland. The former was established in 1921, and the state continues to this day, but the latter never functioned. Following the Treaty that ended the Anglo-Irish War, the 26 southern counties of Ireland gained independence as the Irish Free State." (DBpedia,…
in scheme: political affiliation
related: Irish nationalism
related: Irish republicanism

Irish nationalism
in dataset: The CWRC Ontology
type: political affiliation
type: Concept
comment: La description de ce terme est basée sur celle de DBPedia. @fr
comment: The description for this term is indebted to DBpedia.
label: Nationalisme irlandais @fr
alternative label: cultural nationalist
alternative label: irish nationalist
alternative label: irish patriotism
alternative label: parnellite
broader transitive: nationalism
definition: "Irish nationalism asserts that the Irish people are a nation. Since the partition of Ireland, the term generally refers to support for a united Ireland. Irish nationalists assert that rule from London has been to the detriment of Irish interests." (DBpedia, 2017)
definition: «Le nationalisme irlandais est né avec l'occupation précoce de l'île par les Anglais. Le nationalisme culturel irlandais vise Ã rétablir la culture gaélique des Irlandais en combattant, notamment, l'impérialisme culturel anglais. Il s'oppose historiquement aux privilèges accordés Ã l'aristocratie protestante, qui imposait le serment du test et interdisait aux catholiques de siéger au parlement.» (DBpedia, 2017) @fr
in scheme: political affiliation
related: Irish republicanism

Irish republicanism
in dataset: The CWRC Ontology
type: political affiliation
type: Concept
comment: La description de ce terme est basée sur celle de DBPedia. @fr
comment: The description for this term is indebted to DBpedia.
label: Républicanisme irlandais @fr
alternative label: anti-unionist
alternative label: irish independence
alternative label: irish republic
alternative label: irish republican
alternative label: irish republicanism
alternative label: irish resistance
alternative label: liberty for Ireland
broader transitive: republicanism
definition: "Irish republicanism (Irish: poblachtánachas Ãireannach) is an ideology based on the belief that all of Ireland should be an independent republic. The development of nationalist and democratic sentiment throughout Europe in the eighteenth and nineteenth centuries was reflected in Ireland in the emergence of republicanism, in opposition to British rule. This followed hundreds of years of British conquest and Irish resistance through rebellion. Discrimination against Catholics and Non-conformists, attempts by the British administration to suppress Irish culture, and the belief that Ireland was economically disadvantaged as a result of the Act of Union were among the specific factors leading to such opposition. The Society of United Irishmen, formed in the 1780s and led primarily by liberal Protestants, evolved into a revolutionary republican organisation, inspired by the American Revolution and allied with Revolutionary France. It launched the 1798 Rebellion with the help of French troops. The rebellion had some success, especially in County Wexford, before it was suppressed. A second rising in 1803, led by Robert Emmet, was quickly put down, and Emmet was hanged. The Young Ireland movement, formed in the 1830s, was initially a part of the Repeal Association of Daniel O'Connell, but broke with O'Connell on the issue of the legitimacy of the use of violence. Primarily a political and cultural organisation, some members of Young Ireland staged an abortive rising, the Young Irelander Rebellion of 1848. Its leaders were transported to Van Diemen's Land. Some of these escaped to the United States, where they linked up with other Irish exiles to form the Fenian Brotherhood. Together with the Irish Republican Brotherhood, founded in Ireland by James Stephens and others in 1858, they made up a movement commonly known as "Fenians" which was dedicated to the overthrow of British imperial rule in Ireland. They staged another rising, the Fenian Rising, in 1867, and a dynamite ca…
definition: «Le républicanisme irlandais est une idéologie politique opposée Ã la présence britannique en Irlande et prônant l'unification de l'île en une République égalitariste. Le fondateur du républicanisme irlandais est le protestant Theobald Wolfe Tone et son mouvement, les United Irishmen. Ã la fin du XVIIIe siècle, cette idée est portée Ã la fois par la bourgeoisie libérale protestante d'Irlande et par la paysannerie catholique. Après l'échec de la rébellion irlandaise de 1798, la bourgeoisie protestante devint réactionnaire et se rangea du côté anglais. Révolutionnaires et égalitaristes, inspirés par les révolutions française et américaine, les républicains irlandais se veulent aussi confessionnels, mythifiant l'ancienne union entre catholiques et protestants, sentiment symbolisé par le drapeau irlandais, union du vert des Irlandais et de l'orange des Orangistes. L'action armée tient une place importante dans la tradition républicaine irlandaise, son histoire s'émaillant de soulèvements et de groupes armés clandestins.» (DBpedia, 2017) @fr
in scheme: political affiliation
related: Irish nationalism

Irish unionism
in dataset: The CWRC Ontology
type: political affiliation
type: Concept
comment: La description de ce terme est basée sur celle de DBPedia. @fr
comment: The description for this term is indebted to DBpedia.
label: Unionisme en Irlande @fr
alternative label: anti-home rule
alternative label: anti-home ruler
alternative label: anti-irish
alternative label: anti-irish nationalist
alternative label: unionist
definition: "Unionism in Ireland is a political ideology that favours the continuation of some form of political union between the islands of Ireland and Great Britain. Since the partition of Ireland, unionism in Ireland has focused on maintaining and preserving the place of Northern Ireland within the United Kingdom. In this context, a distinction may be made between the unionism in the province of Ulster and unionism elsewhere in Ireland. Today in Northern Ireland, Unionist ideology is expressed in a number of different ways: through preferences for particular newspapers or sports team, participation in unionist culture and by voting for political candidates who espouse unionism. Irish nationalism is opposed to the ideology of unionism. Most unionists come from Protestant backgrounds; most nationalists come from a Roman Catholic background. Exceptions to these generalisations exist; there are Protestant nationalists and there are Catholic unionists." (DBpedia, 2017)
definition: «quot; Pour les articles homonymes, voir unionisme. L'unionisme en Irlande est une idéologie politique prônant le maintien d'une forme d'union politique entre la province d'Irlande du Nord et le Royaume-Uni.» (DBpedia, 2017) @fr
in scheme: political affiliation
related: Irish nationalism
related: Irish republicanism

ironmaster
in dataset: The CWRC Ontology
type: occupation
type: Concept
in scheme: occupation

ironmonger
in dataset: The CWRC Ontology
type: occupation
type: Concept
in scheme: occupation

Iroquois
in dataset: The CWRC Ontology
type: national heritage
type: Concept
comment: La description de ce terme est basée sur celle de DBPedia. @fr
comment: The description for this term is indebted to DBpedia.
definition: "The Iroquois (/ËÉªrÉkwÉÉª/ or /ËÉªrÉkwÉË/) or Haudenosaunee (/ËhoÊdÉnoÊËÊoÊni/) are a historically powerful and important northeast Native American confederacy. They were known during the colonial years to the French as the "Iroquois League," and later as the "Iroquois Confederacy," and to the English as the "Five Nations" (before 1722), and later as the "Six Nations," comprising the Mohawk, Onondaga, Oneida, Cayuga, Seneca, and Tuscarora peoples." (DBpedia, 2018)
definition: «Les Iroquois (ou Haudenosaunee) connus aussi par l'expression Cinq-Nations comprennent effectivement cinq et puis plus tard six nations amérindiennes de langues iroquoises vivant historiquement dans le nord de l'Ãtat de New York aux Ãtats-Unis, au sud du lac Ontario et du fleuve Saint-Laurent. La plupart des quelque 125 000 Iroquois vivent aujourd'hui en Ontario au Canada et dans l'Ãtat de New York. D'autres vivent au Wisconsin, au Québec et en Oklahoma. Seule une petite minorité des Iroquois parle aujourd'hui une des langues iroquoises dont notamment près de 1 500 locuteurs du mohawk dans le village Kahnawake, au sud de Montréal.» (DBpedia, 2018) @fr
in scheme: national heritage

Islamism
in dataset: The CWRC Ontology
type: religion
type: Concept
comment: La description de ce terme est basée sur celle de DBPedia. @fr
comment: The description for this term is indebted to the Getty Art & Architecture Thesaurus.
label: Islam @es
label: Islamismo @es
label: i ssu lan chiao @zh-latn
label: islam @fr
label: yi si lan jiao @zh-latn
label: yī sī lán jiÄo @zh-latn
label: ä¼æ¯è­æ @zh-hant
label: åæ @zh-hant
alternative label: Islamic
alternative label: Mahometans
broader transitive: Abrahamic religions
definition: "Refers to the religious beliefs and social practices founded in the seventh century by the Arabian Prophet Muhammad, held to be the last of a series of major prophets, which include, according to Islamic dogma, Adam, Noah, and Jesus. It later spread throughout the Middle East, Africa, Europe, and parts of Asia. It is characterized by the belief in the fundamental idea that a devotee 'surrenders' and submits his will to Allah, the prime creator and sustainer of the universe and all creation. In Islam, God is unique and has no partner or intermediary as in the Christian Trinity. Social service and the active alleviation of suffering in others is considered the only path to salvation and prayer and sacred ritual alone are inadequate forms of submission to Allah. The Qur'an (Koran), the sacred text of the religion, is a compilation of revelations from Allah believed to have been received by Muhammad." (Getty, 2017)
definition: "Se refiere a creencias religiosas y prácticas sociales fundadas en el siglo VII por el Profeta árabe Mahoma, supuestamente el último de una serie de grandes profetas, incluídos, de acuerdo al dogma Islámico, Adán, Noé y Jesús. Posteriormente se difundió a través del Medio Oriente, Ãfrica, Europa y parte de Asia. Se caracteriza por la creencia en la idea fundamental que un devoto se "rinde" y somete la voluntad de Alá, el principal creador y mantenedor del universo y toda creación. En el Islam, Dios es único y no tiene parentesco o intermediario como la trinidad cristiana. El servicio social y las actividades que alivian el sufrimiento de otros es considerado el único camino a la salvación y la oración y ritual sagrado a solas es una inadecuado forma de sumisión para Alá. El Coran (Koran), consagrado el texto de las religiones, es una compilación relevante de las creencias de Alá que fueron recibidas de Mahoma." (Getty, 2017) @es
definition: "Verwijst naar het samenstel van religieuze overtuigingen en sociale gebruiken dat in de 7de eeuw is ontstaan op basis van de leer van de Arabische profeet Mohammed, die wordt beschouwd als de laatste in een reeks van grote profeten; volgens de islamitische leer zijn dit onder anderen Adam, Noach en Jezus. De islam heeft zich later verspreid in het Midden-Oosten, Afrika, Europa en delen van Azië. De islam wordt gekenmerkt door het geloof in het fundamentele idee dat een gelovige zich 'overgeeft' en zich onderwerpt aan Allah, de schepper van het universum en de schepping als geheel. God is uniek en heeft geen partner of tussenpersoon zoals bij de christelijke drie-eenheid. Maatschappelijke dienstbaarheid en het actief verlichten van het lijden van anderen wordt beschouwd als de enige weg naar verlossing en gebeden en heilige rituelen zijn op zichzelf onvoldoende vormen van overgave aan Allah. De Qur'an (Koran), het heilige geschrift van de religie, is een verzameling onthullingen die, zo gelooft men, door Allah aan Mohammed zijn geopenbaard." (Getty, 2017) @nl
definition: "ç±é¿æä¼¯å ç¥ç©ç½é»å¾·æ¼ä¸ä¸ç´åµå»ºçå®æä¿¡ä»°èç¤¾æå¯¦è¸æ¹å¼ãæ ¹æä¼æ¯è­ææ¢ï¼ç©ç½é»å¾·æ¯ç¹¼äºç¶ãæªäºãè¶ç©å¾æå¾ä¸åä¸»è¦çå ç¥ãæ­¤æä¹å¾å»£å³ä¸­æ±ãéæ´²ãæ­æ´²ãåé¨ä»½äºæ´²ãåºæ¬ææ³çºä¿¡å¾äº¤åºèªå·±çæå¿çµ¦é¿æ(å®å®åææåµé ç©çæé«é ç©è èæ¯æè )ãå°±ä¼æ¯è­æèè¨ï¼ç¥æ¯ç¨ä¸ç¡äºçï¼ä¸å¹¶éå¦åºç£æä¸ä½ä¸é«çè§é»è¬æå¤¥ä¼´ææ¯åªä»ãç¤¾ææååç©æ¥µå¹«å©åè¦è è¢«èªçºæ¯éå¾æè´çå¯ä¸è·¯å¾ï¼è¥åªæç¥ç¦±åç¥èåå¼åä¸ç®å®å ¨å¥ç»äºé¿æãå¯è­ç¶æ¯æ­¤æçèå ¸ï¼è¨è¼ç©ç½é»å¾·å¾é¿æå¾ä¾çç¥ç¤ºã" (Getty, 2017) @zh-hant
definition: «L'islam (arabe : Ø§ÙØ¥Ø³ÙØ§Ù ) est une religion abrahamique s'appuyant sur le dogme du monothéisme absolu (l'adoration du Dieu unique sans lui attribuer aucun associé) et prenant sa source dans le Coran, considéré comme le recueil de la parole de Dieu (arabe : Ø§ÙÙÙ, Allah) révélée Ã Mahomet, proclamé par les adhérents de l'islam comme étant le dernier prophète de Dieu, au VIIe siècle en Arabie. Un adepte de l'islam est appelé un musulman. L'islam revendique pour fondement et enseignement principal le tawhid (monothéisme, unicité et indivisibilité), c'est-Ã -dire le monothéisme le plus épuré où le culte est voué exclusivement Ã Dieu, sans lui attribuer aucun fils. Les musulmans croient que Dieu est un et incomparable et que le but de l'existence est d'adorer Dieu. Les musulmans croient également que l'islam est la version complète et universelle d'une foi primordiale qui a été révélée Ã plusieurs reprises par le passé Ã travers les prophètes, incluant Adam, Noé, Abraham, Moïse et Jésus. Ainsi, elle se présente comme un retour sur les pas d'Abraham (appelé, en arabe, Ibrahim par les musulmans) du point de vue de la croyance, le Coran le définissant comme étant l'étalon-pied, la lieue de la Kaaba, le mille d'Abraham (milla ta Ibrahim), c'est-Ã -dire une soumission exclusive Ã la volonté d'Allah. Le Coran reconnaît l'origine divine de l'ensemble des livres sacrés du judaïsme et du christianisme, tout en estimant qu'ils seraient, dans leurs interprétations actuelles, le résultat d'une falsification partielle : le Suhuf-i-Ibrahim (les Feuillets d'Abraham), la Tawrat (le Pentateuque ou la Torah), le Zabur de David et Salomon (identifié au Livre des Psaumes) et l'Injil (l'Ãvangile). Outre le Coran, la majorité des musulmans se réfèrent Ã des transmissions de paroles, actes et approbations de Mahomet, récits appelés hadîths, pour l'établissement de règles juridiques (fiqh) permettant la compréhension et l'accomplisseme… @fr
in scheme: religion

isolationism
in dataset: The CWRC Ontology
type: political affiliation
type: Concept
comment: La description de ce terme est basée sur celle de DBPedia. @fr
comment: The description for this term is indebted to DBpedia.
label: isolationnisme @fr
definition: "Isolationism is the foreign policy position that a nations' interests is best served by keeping the affairs of other countries at a distance. One possible motivation for limiting international involvement is to avoid being drawn into dangerous and otherwise undesirable conflicts. There may also be a perceived benefit from avoiding international trade agreements or other mutual assistance pacts." (DBpedia, 2018)
definition: «L'isolationnisme est une doctrine de politique extérieure qui combine un non-interventionnisme militaire et une politique de patriotisme économique (protectionnisme).» (DBpedia, 2018) @fr
in scheme: political affiliation

Italian nationalism
in dataset: The CWRC Ontology
type: occupation
type: political affiliation
type: Concept
comment: The description for this term is indebted to DBpedia.
label: nationalisme Italien @fr
alternative label: Italian nationalist movement
alternative label: italian nationalist
alternative label: italian risorgimento
alternative label: mazzinian
broader transitive: nationalism
broader transitive: politics
definition: Défense pour l'unification de l'Italie en un même pays ou nationalisme italien. Voir Risorgimento â Wikipédia @fr
definition: Support for the unification of Italy as a single nation or of Italian nationalism. See Italian nationalism - Wikipedia; Italian unification - Wikipedia
in scheme: political affiliation

Italian unification
in dataset: The CWRC Ontology
type: political affiliation
type: Concept
comment: La description de ce terme est basée sur celle de DBPedia. @fr
comment: The description for this term is indebted to DBpedia.
label: Risorgimento @fr
definition: "Italian unification (Italian: Unificazione italiana), or the Risorgimento ([risordÊiËmento], meaning the Resurgence or revival), was the political and social movement that consolidated different states of the Italian peninsula into the single state of the Kingdom of Italy in the 19th century. Despite a lack of consensus on the exact dates for the beginning and end of this period, many historians and scholars agree that the process began in 1815 with the Congress of Vienna and the end of Napoleonic rule, and was completed in 1871 when Rome became the capital of the Kingdom of Italy. (Some of the terre irredente did not, however, join the Kingdom of Italy until after World War I with the Treaty of Saint-Germain. Some nationalists see the 3 November 1918 Armistice of Villa Giusti as the completion of unification.)" (DBpedia, 2018)
definition: «Le Risorgimento (mot italien signifiant « renaissance » ou en français « résurrection ») est la période de lâhistoire de l'Italie dans la seconde moitié du XIXe siècle au terme de laquelle les rois de la maison de Savoie unifient la péninsule italienne par l'annexion de la Lombardie, de Venise, du royaume des Deux-Siciles, du duché de Modène et Reggio, du grand-duché de Toscane, du duché de Parme et des Ãtats pontificaux au royaume de Sardaigne. Jusquâau milieu du XIXe siècle, on pouvait considérer que, selon la définition de Metternich, lâItalie nâétait rien de plus quâune « expression géographique ». Lâunification italienne est donc un événement majeur de lâhistoire de lâEurope dans la mesure où elle a transformé lâexpression géographique en réalité politique. Mais si tout le monde est dâaccord pour dire que lâunification a constitué un tournant dans les relations internationales, les interprétations divergent en revanche quand il sâagit de le replacer dans son contexte. Certains historiens voient dans cette naissance de lâItalie un phénomène spécifiquement italien, sans lien réel avec les conjonctures de lâépoque. Dâautres au contraire, estiment que lâunification italienne sâinscrit dans un processus commun, non seulement Ã toutes les nations dâEurope, mais encore Ã celles du monde entier : une Révolution universelle venue bouleverser les structures sociales que le temps rend nécessairement obsolètes. La première phase du Risorgimento (1848-1849) voit le développement de différents mouvements révolutionnaires et une guerre contre lâEmpire d'Autriche, mais se conclut par un retour au statu quo. La seconde phase 1859-1860 fait considérablement avancer le processus dâunification et se conclut par la proclamation du Royaume dâItalie le 17 mars 1861. Lâunification est ensuite achevée avec lâannexion de Rome, capitale de lâÃtat de lâÃglise, le 20 septembre 1870.» (DBpedia, 2018) @fr
in scheme: political affiliation

Jacobinism
in dataset: The CWRC Ontology
type: political affiliation
type: Concept
comment: La description de ce terme est basée sur celle de DBPedia. @fr
comment: The description for this term is indebted to DBpedia.
label: Jacobinisme @fr
alternative label: jacobin
alternative label: pro-Jacobin
broader transitive: revolutionary
definition: "A Jacobin was a member of the Jacobin Club, a revolutionary political movement that was the most famous political club during the French Revolution (1789â99). The club was so called from the Dominican convent where they originally met, in the Rue Saint-Jacques (Latin: Jacobus) in Paris. Today, Jacobin and Jacobinism are used in a variety of senses. Jacobin is sometimes used in Britain as a pejorative for radical, left-wing revolutionary politics, especially when it exhibits dogmatism and violent repression. In France, Jacobin now generally indicates a supporter of a centralized republican state and strong central government powers and/or supporters of extensive government intervention to transform society." (DBpedia, 2017)
definition: «Le jacobinisme est une doctrine politique qui défend la souveraineté populaire et l'indivisibilité de la République française. Il tient son nom du club des Jacobins, dont les membres s'étaient établis pendant la Révolution française dans l'ancien couvent des Jacobins Ã Paris. Le mot jacobinisme désigne aujourd'hui une doctrine qui tend Ã organiser le pouvoir de façon administrative (bureaucratie) et centralisée (centralisation) et Ã le faire exercer par une petite élite de techniciens (technocratie) qui étendent leur compétence Ã tous les échelons géographiques et Ã tous les domaines de la vie sociale afin de les rendre uniformes, ce qui en fait l'adversaire du régionalisme. L'usage moderne du mot jacobinisme est de quelque manière anachronique. En effet, le jacobinisme, pendant la révolution française, était une réaction aux enjeux particuliers de l'époque. Pour n'en retenir que la philosophie, on pourrait aussi entendre jacobinisme comme une doctrine opposée aux politiques communautaires, qui tendrait, par exemple, aux divisions internes. Comme mouvement historique, le jacobinisme peut s'apparenter au XVIIIe siècle en Autriche au joséphisme et au XXe siècle en URSS au centralisme bureaucratique.» (DBpedia, 2017) @fr
in scheme: political affiliation

Jacobism
is replaced by: Jacobinism
in dataset: The CWRC Ontology
type: Concept
comment: Deprecated in favour of instance Jacobinism.
comment: Désapprouver en faveur de l'instance Jacobinisme. @fr
comment: La description de ce terme est basée sur celle de DBPedia. @fr
comment: The description for this term is indebted to DBpedia.
label: Club des Jacobins @fr
deprecated: true
term status: deprecated
broader transitive: revolutionary
definition: "The Society of the Friends of the Constitution, after 1792 renamed Society of the Jacobins, Friends of Freedom and Equality (French: Société des Jacobins, amis de la liberté et de l'égalité), commonly known as the Jacobin Club (Club des Jacobins) or just collectively Jacobins, was the most famous and influential political club in the development of the French Revolution. Initially founded by anti-Royalist deputies from Brittany, the Club grew into a nationwide republican movement, with a membership estimated at a half million or more. The Jacobin Club was heterogeneous and included both prominent parliamentary factions of the early 1790s, the radical Mountain and the more moderate Girondists. In 1792â3, the Girondists (led by Brissot and including Thomas Paine) dominated the Jacobin Club and led the country. Believing that revolutionary France would not be accepted by its neighbours, they called for an aggressive foreign policy and forced war on Austria. The Girondists were the dominant faction when the Jacobins overthrew the monarchy and created the republic. When the Republic failed to deliver the unrealistic gains that had been expected, they lost popularity. The Girondists sought to curb fanatical revolutionary violence, and were therefore accused by the Mountain of being royalist sympathisers. The National Guard eventually switched its support from the Girondists to the Mountain, allowing the Mountain to stage a coup d'etat. In May 1793, led by Maximilien de Robespierre, the leaders of the Mountain faction succeeded in sidelining the Girondist faction and controlled the government until July 1794. Their time in government was characterized by radically progressive legislation imposed with very high levels of political violence. In June 1793, they approved the Constitution of Year 1 which introduced universal male suffrage for the first time in history. In September 1793, twenty-one prominent Girondists were guillotined, beginning the Reign of Terror. In O…
definition: «La Société des amis de la Constitution, plus connue ensuite sous le nom de club des Jacobins, est le plus célèbre des clubs de la Révolution française. «C'est ici que s'est préparée la Révolution, dit Georges Couthon en 1793, c'est ici qu'elle s'est faite, c'est ici que se sont préparés tous les grands événements». Appelé d'abord Club breton, le club tient son nom du couvent des Jacobins de la rue Saint-Honoré (Collège des Jacobins) où il s'est installé en 1789, dans une salle louée par le couvent de l'Annonciation, fondé entre 1611 et 1613 par Sébastien Michaëlis comme extension du Couvent des Jacobins de la rue Saint-Jacques (Jacobus en latin). Le Club des Jacobins est une société de pensée qui a constitué, pendant la Révolution française, Ã la fois un groupe de pression et un réseau d'une remarquable efficacité. L'action du club, essentielle dès le début de 1790, devient dominante entre 1792 et 1794. Ã cette époque, l'adjectif «jacobin» signifie partisan de la politique du Comité de salut public. Ã la fin de 1793, environ 6 000 sociétés de même type sont en correspondance avec lui dans toute la France. La chute de Robespierre marque la fin du grand rôle politique exercé par le club et entraîne sa dissolution en novembre 1794. Depuis cette époque, le nom et l'adjectif s'appliquent Ã un homme, une femme ou un courant politique hostile Ã toute idée d'affaiblissement et de démembrement de l'Ãtat.» (DBpedia, 2017) @fr
in scheme: political affiliation
related: Girondin

Jacobitism
in dataset: The CWRC Ontology
type: occupation
type: political affiliation
type: Concept
comment: La description de ce terme est basée sur celle de DBPedia. @fr
comment: The description for this term is indebted to DBpedia.
label: Jacobitisme @fr
alternative label: jacobite
alternative label: jacobite conspirator
alternative label: jacobites
broader transitive: politics
broader transitive: pro-Catholicism
definition: "Jacobitism (/ËdÊækÉbaÉªËtÉªzm/ JAK-É-beye-TIZ-Ém;Irish: Seacaibíteachas, Séamusachas, Scottish Gaelic: Seumasachas) was a political movement in Great Britain and Ireland that aimed to restore the Roman Catholic Stuart King James VII of Scotland, II of England and Ireland, and his heirs to the thrones of England, Scotland and Ireland. The movement took its name from Jacobus, the Renaissance Latin form of Iacomus, the original Latin form of James. Adherents rebelled against the British government on several occasions between 1688 and 1746. After James II was deposed in 1688 and replaced by his daughter Mary II, ruling jointly with her husband and first cousin (James's nephew) William III, the Stuarts lived in exile, occasionally attempting to regain the throne. The strongholds of Jacobitism were parts of the Scottish Highlands and the lowland north-east of Scotland, Ireland, and parts of Northern England (mostly within the counties of Northumberland and Lancashire). Significant support also existed in Wales and South-West England. The Jacobites believed that parliamentary interference with the line of succession to the English and Scottish thrones was illegal. Catholics also hoped the Stuarts would end recusancy. In Scotland, the Jacobite cause became intertwined with the last throes of the warrior clan system. The emblem of the Jacobites is the White Cockade. White Rose Day is celebrated on 10 June, the anniversary of the birth of the Old Pretender in 1688." (DBpedia, 2017)
definition: «Le «jacobitisme» historique est un mouvement politique proche des Tories entre 1688 et 1807, composé de ceux qui soutenaient la dynastie détrônée des Stuarts et considéraient comme usurpateurs tous les rois et les reines britanniques ayant régné pendant cette période. Soutenu par les monarchies catholiques françaises et espagnoles, il était surtout implanté en Irlande et dans les Highlands d'Ãcosse qui furent le théâtre de plusieurs révoltes soutenues par la France. Plus marginalement, le jacobitisme disposait également d'un certain nombre de partisans dans le nord de l'Angleterre et au Pays de Galles. En 1688, le roi Jacques II d'Angleterre et d'Irlande et VII d'Ãcosse (1633-1701) fut détrôné par un coup d'Ãtat, appelé par les historiens Glorieuse Révolution, mené par une armée hollandaise de 25 000 hommes, dont plus de 7 000 huguenots français. Le roi est chassé et une bonne partie de ses pouvoirs transmis au parlement, où les lois seront élaborées par le parti whig. Les royalistes britanniques qui lui étaient restés fidèles, de même qu'à ses successeurs, sont connus sous le nom de jacobites car le prénom du roi, en latin, est «Jacobus». Les historiens évaluent Ã 40 000 le nombre de réfugiés jacobites en France, qui ont émigré après la Glorieuse Révolution, dont environ 60 % étaient irlandais, 34 % anglais et 6 % écossais. Parmi eux, 40 % étaient de familles aristocratiques, dont un grand nombre d'officiers de l'armée du roi. En France, ils ont constitué la Cour jacobite de Saint-Germain en Laye et la puissante communauté des Irlandais de Nantes. Apparu plus tard, le jacobitisme dit «moderne» est un mouvement très marginal composé de ceux qui considèrent qu'étaient illégitimes tous les rois et les reines ayant régné sur les pays de l'Empire britannique et du Commonwealth après 1688, en particulier parce que ces souverains ont abdiqué une grande part de leur pouvoir en faveur du parlement. Les jacobites … @fr
in scheme: political affiliation

Jamaican
in dataset: The CWRC Ontology
type: ethnicity
type: Concept
comment: La description de ce terme est basée sur celle de DBPedia. @fr
comment: The description for this term is indebted to DBpedia.
label: Jamaïcains @fr
alternative label: Jamaican-born
definition: "Jamaicans are the citizens of Jamaica and their descendants in the Jamaican diaspora. Most Jamaicans are of African descent, with smaller minorities of Europeans, East Indians, Chinese, Mixed-Race, and others. The bulk of the Jamaican diaspora resides in Canada, United States, Panama and the United Kingdom and in the other Anglophone countries." (DBpedia, 2018)
definition: «Les Jamaïcains sont les citoyens de la Jamaïque et leurs descendants dans la diaspora jamaïcaine. La plupart des Jamaïcains sont dâascendance africaine, avec des minorités moins nombreuses dâEuropéens, dâIndiens de lâEst, de Chinois, de métis et dâautres. La majeure partie de la diaspora jamaïcaine réside au Canada, aux Ãtats-Unis, au Panama et au Royaume-Uni et dans d'autres pays anglophones.» (DBpedia, 2018) @fr
in scheme: ethnicity

Jansenism
in dataset: The CWRC Ontology
type: religion
type: Concept
comment: La description de ce terme est basée sur celle de DBPedia. @fr
comment: The description for this term is indebted to DBpedia.
label: Jansénisme @fr
definition: "Jansenism was a Catholic theological movement, primarily in France, that emphasized original sin, human depravity, the necessity of divine grace, and predestination. The movement originated from the posthumously published work of the Dutch theologian Cornelius Jansen, who died in 1638. It was first popularized by Jansen's friend Abbot Jean Duvergier de Hauranne, of Saint-Cyran-en-Brenne Abbey, and after Duvergier's death in 1643, was led by Antoine Arnauld. Through the 17th and into the 18th centuries, Jansenism was a distinct movement within the Catholic Church. The theological centre of the movement was the convent of Port-Royal Abbey, Paris, which was a haven for writers including Duvergier, Arnauld, Pierre Nicole, Blaise Pascal, and Jean Racine. Jansenism was opposed by many in the Catholic hierarchy, especially the Jesuits. Although the Jansenists identified themselves only as rigorous followers of Augustine of Hippo's teachings, Jesuits coined the term "Jansenism" to identify them as having Calvinist affinities. The apostolic constitution Cum occasione promulgated by Pope Innocent X in 1653, condemned five cardinal doctrines of Jansenism as heresyâespecially the relationship between human free will and efficacious grace, wherein the teachings of Augustine, as presented by the Jansenists, contradicted the teachings of the Jesuit School. Jansenist leaders endeavored to accommodate the pope's pronouncements while retaining their uniqueness, and enjoyed a measure of peace in the late 17th century under Pope Clement IX. However, further controversy led to the apostolic constitution Unigenitus Dei Filius, promulgated by Pope Clement XI in 1713, which marked the end of Catholic toleration of Jansenist doctrine." (DBpedia, 2018)
definition: «Le jansénisme est une doctrine théologique Ã l'origine d'un mouvement religieux, puis politique et philosophique, qui se développe aux XVIIe et XVIIIe siècles, principalement en France, en réaction Ã certaines évolutions de l'Ãglise catholique et Ã l'absolutisme royal. La définition même du jansénisme sâavère problématique, dans la mesure où les jansénistes ont rarement assumé cette appellation, se considérant seulement comme catholiques. Ceux-ci possèdent toutefois quelques traits caractéristiques, comme la volonté de sâen tenir strictement Ã la doctrine de saint Augustin sur la grâce, conçue comme la négation de la liberté humaine pour faire le bien et obtenir le salut. Cela ne serait possible selon eux que par le biais de la grâce divine. Les jansénistes se distinguent aussi par leur rigorisme spirituel et leur hostilité envers la compagnie de Jésus et sa casuistique, comme envers un pouvoir trop puissant du Saint-Siège. Dès la fin du XVIIe siècle, ce courant spirituel se double dâun aspect politique, les opposants Ã lâabsolutisme royal étant largement identifiés aux jansénistes. Le jansénisme naît au cÅur de la réforme catholique. Il doit son nom Ã lâévêque dâYpres, Cornelius Jansen, auteur de son texte fondateur lâAugustinus, publié en 1640. Cette Åuvre est lâaboutissement de débats sur la grâce remontant Ã plusieurs dizaines dâannées, coïncidant avec lâhostilité grandissante d'une partie du clergé catholique envers la compagnie de Jésus ; il prétend établir la position réelle d'Augustin sur le sujet, qui serait opposée Ã celle des jésuites, ceux-ci donnant une importance trop grande Ã la liberté humaine. LâAugustinus provoque de vifs débats, en particulier en France, où cinq propositions prétendument hérétiques sont extraites de lâouvrage par des docteurs hostiles Ã lâévêque dâYpres ; celles-ci sont condamnées en 1653 par le pape. Les défenseurs de Jansenius répliquent en distinguant « le droit et… @fr
in scheme: religion

jeweller
in dataset: The CWRC Ontology
type: occupation
type: Concept
broader transitive: skilled trade
in scheme: occupation

Jewish emancipation
in dataset: The CWRC Ontology
contrary to: antisemitism
type: political affiliation
type: Concept
comment: La description de ce terme est basée sur celle de DBPedia. @fr
comment: The description for this term is indebted to DBpedia.
label: Ãmancipation des Juifs @fr
broader transitive: civil rights movement
definition: "Jewish emancipation was the external (and internal) process in various nations in Europe of eliminating Jewish disabilities, e.g. Jewish quotas, to which Jewish people were then subject, and the recognition of Jews as entitled to equality and citizenship rights on a communal, not merely individual, basis. It included efforts within the community to integrate into their societies as citizens. It occurred gradually between the late 18th century and the early 20th century. Jewish emancipation followed the Age of Enlightenment and the concurrent Jewish enlightenment. Various nations repealed or superseded previous discriminatory laws applied specifically against Jews where they resided. Before the emancipation, most Jews were isolated in residential areas from the rest of the society; emancipation was a major goal of European Jews of that time, who worked within their communities to achieve integration in the majority societies and broader education. Many became active politically and culturally within wider European civil society as Jews gained full citizenship. They emigrated to countries offering better social and economic opportunities, such as the Russian Empire and France. Some European Jews turned to Socialism, others to Jewish nationalism: Zionism." (DBpedia, 2017)
definition: «L'émancipation des Juifs désigne le processus de libération des Juifs en Europe et dans le monde, qui leur a permis d'obtenir la citoyenneté et la pleine égalité de leurs droits avec leurs concitoyens. Si la France a été la première Ã attribuer la pleine égalité de droits aux Juifs par le vote de l'Assemblée constituante en 1791 au début de la Révolution française, il faut rappeler que le processus d'émancipation a débuté juridiquement avec l'Ãdit de tolérance de Joseph II d'Autriche (1781) qui accorde la liberté de culte aux Protestants comme aux Juifs, l'Ãdit de tolérance de Louis XVI (1787) et en Allemagne avec la conjonction de la philosophie des Lumières et de la Haskalah (dont le plus illustre représentant est Moïse Mendelssohn). L'émancipation se traduit par une série d'actes législatifs par laquelle les états ont reconnu la citoyenneté aux Juifs. En France, la Terreur a empêché un temps chrétiens et juifs de pratiquer leur religion, mais l'égalité de droits a été confirmée sous Napoléon Ier. Dans le reste de l'Europe, l'émancipation qui s'est faite au XIXe siècle, a conduit Ã la disparition au moins formelle des ghettos et Ã l'égalité des chances pour les Juifs, en Europe occidentale et en Amérique. LÃ où elle s'est heurtée Ã une plus grande opposition, dans l'Empire russe particulièrement, les Juifs se sont plus volontiers tournés vers les mouvements révolutionnaires ou le sionisme.» (DBpedia, 2017) @fr
in scheme: political affiliation

Jewish
in dataset: The CWRC Ontology
represented by: Jewish identity
type: ethnicity
type: Concept
comment: La description de ce terme est basée sur celle de DBPedia. @fr
comment: The description for this term is indebted to DBpedia.
label: Juif @fr
alternative label: Jew
alternative label: Jewry
alternative label: Jews
alternative label: Judaism
alternative label: a Jewish
alternative label: one-quarter Jewish
definition: "The Jews (/dÊuËz/; Hebrew: ×Ö°××Ö¼×Ö´×× ISO 259-3 Yehudim, Israeli pronunciation [jehuËdim]), also known as the Jewish people, are an ethnoreligious group originating from the Israelites, or Hebrews, of the Ancient Near East. Jewish ethnicity, nationhood and religion are strongly interrelated, as Judaism is the traditional faith of the Jewish nation, while its observance varies from strict observance to complete nonobservance. Jews originated as a national and religious group in the Middle East during the second millennium BCE, in the part of the Levant known as the Land of Israel. The Merneptah Stele appears to confirm the existence of a people of Israel, associated with the god El, somewhere in Canaan as far back as the 13th century BCE (Late Bronze Age). The Israelites, as an outgrowth of the Canaanite population, consolidated their hold with the emergence of the Kingdom of Israel, and the Kingdom of Judah. Some consider that these Canaanite sedentary Israelites melded with incoming nomadic groups known as 'Hebrews'. Though few sources in the Bible mention the exilic periods in detail, the experience of diaspora life, from the Ancient Egyptian rule over the Levant, to Assyrian Captivity and Exile, to Babylonian Captivity and Exile, to Seleucid Imperial rule, to the Roman occupation, and the historical relations between Israelites and their homeland, became a major feature of Jewish history, identity and memory. The worldwide Jewish population reached a peak of 16.7 million prior to World War II, but approximately 6 million Jews were systematically murdered during the Holocaust. Since then the population has slowly risen again, and as of 2015 was estimated at 14.3 million by the Berman Jewish DataBank, or less than 0.2% of the total world population (roughly one in every 514 people). According to the report, about 43% of all Jews reside in Israel (6.4 million), and 40% in the United States (5.7 million), with most of the remainder living in Europe (1.4 million) a…
definition: «Les Juifs (en hébreu : ×Ö°××Ö¼×Ö´×× / yehoudim, en grec ancien : á¼¸Î¿Ï Î´Î±á¿Î¿Î¹ / Ioudaĩoi, en latin : Iudaei, etc.) sont les membres d'un peuple lié Ã sa propre religion, le judaïsme, et au sens large du terme Ã une appartenance ethnique et religieuse. La tradition juive relie leur ascendance aux patriarches Abraham, Isaac et Jacob également appelé Israël. Ils peuplent la Judée et le royaume d'Israël, structurant leur quotidien autour de la Bible hébraïque, laquelle comprend les cinq Livres de la Torah attribués Ã Moïse, les Livres des prophètes ultérieurs et d'autres écrits. La Bible définit leurs croyances, leur histoire, leur identité nationale et légifère dans tous les domaines de leur vie. Ã la suite des aléas de leur histoire, les Juifs migrent ou sont déportés de la Judée et essaiment Ã travers le monde. La diaspora juive résulte principalement de la conjonction de deux facteurs, une volonté d'essaimage et la nécessité de fuir des persécutions. Tentant de conserver leur mode de vie ancestral au sein des populations avoisinantes dans lesquelles ils s'acculturent, ils développent des traditions religieuses, culinaires et des langues propres ainsi que d'autres traits spécifiques. Réciproquement, ils exercent un certain attrait sur leurs populations d'accueil et l'on enregistre dans l'Empire romain un nombre important de conversions au judaïsme. L'impact et la proportion de ces conversions font débat au sein des historiens. Leur histoire sur plus de deux millénaires en Europe est marquée par des persécutions qui culminent au xxe siècle avec la Shoah. Les grandes révolutions de l'ère moderne entraînent chez nombre d'entre eux une perte ou un abandon de tout ou partie des repères traditionnels. Plusieurs tentatives sont menées pour les redéfinir en tant qu'entité confessionnelle, nationale ou culturelle de sorte qu'en français, l'usage commun distingue entre les Juifs (avec une majuscule â les 'personnes descendan… @fr
in scheme: ethnicity

Jewish
in dataset: The CWRC Ontology
represented by: Jewish identity
type: geographic heritage
type: Concept
label: Juif @fr
definition: Indicates a subject's identification with or labelling as of Jewish heritage in relation to a place, which may or may not be Israel.
definition: Indique qu'un sujet s'identifie ou s'est vu assigner une identité juive par rapport Ã un endroit, qui peut ou non être Israël. @fr
in scheme: geographic heritage

Jewish identity
in dataset: The CWRC Ontology
represents: Jewish
represents: Judaism
type: textual label
type: Concept
label: identité Juif @fr
definition: A subclass of textual label, this discursive label reflects the ambiguity of Jewishness associated with different cultural forms. It provides a means of aggregating and searching multiple instances of "Jewish" (e.g. Jewish, Jewish) cultural identities.
definition: Une sous-classe d'étiquettes textuelles, cette étiquette discursive reflète l'ambiguité de la juidaïcité. Elle permet de compiler et de rechercher les multiples instances d'identités culturelles «juives» (par exemple Juif, Juif). @fr
in scheme: textual label

Jewish
in dataset: The CWRC Ontology
type: national heritage
type: Concept
comment: La description de ce terme est basée sur celle de DBPedia. @fr
comment: The description for this term is indebted to DBpedia.
label: Juif @fr
definition: "The Jews (/dÊuËz/; Hebrew: ×Ö°××Ö¼×Ö´×× ISO 259-3 Yehudim, Israeli pronunciation [jehuËdim]), also known as the Jewish people, are an ethnoreligious group originating from the Israelites, or Hebrews, of the Ancient Near East. Jewish ethnicity, nationhood and religion are strongly interrelated, as Judaism is the traditional faith of the Jewish nation, while its observance varies from strict observance to complete nonobservance." (DBpedia, 2018)
definition: «Les Juifs (en hébreu : ×Ö°××Ö¼×Ö´×× / yehoudim, en grec ancien : á¼¸Î¿Ï Î´Î±á¿Î¿Î¹ / Ioudaĩoi, en latin : Iudaei, etc.) sont les membres dâun peuple lié Ã sa propre religion, le judaïsme, et au sens large du terme Ã une appartenance ethnique et religieuse.» (DBpedia, 2018) @fr
in scheme: national heritage

Jewish
in dataset: The CWRC Ontology
represented by: Jewish identity
type: national identity
type: Concept
label: Juif @fr
definition: Indicates a subject's identification with or labelling as Jewish or Israeli as a national identity.
definition: Indique qu'un sujet s'identifie Ã ou s'est vu assigner une identité nationale juive ou israélienne. @fr
in scheme: national identity
related match: Zionism

Jewish
in dataset: The CWRC Ontology
type: race or colour
type: Concept
comment: La description de ce terme est basée sur celle de DBPedia. @fr
comment: The description for this term is indebted to DBpedia.
label: Juif @fr
alternative label: jew
definition: "The Jews (/dÊuËz/; Hebrew: ×Ö°××Ö¼×Ö´×× ISO 259-3 Yehudim, Israeli pronunciation [jehuËdim]), also known as the Jewish people, are an ethnoreligious group originating from the Israelites, or Hebrews, of the Ancient Near East. Jewish ethnicity, nationhood and religion are strongly interrelated, as Judaism is the traditional faith of the Jewish nation, while its observance varies from strict observance to complete nonobservance. Jews originated as a national and religious group in the Middle East during the second millennium BCE, in the part of the Levant known as the Land of Israel. The Merneptah Stele appears to confirm the existence of a people of Israel, associated with the god El, somewhere in Canaan as far back as the 13th century BCE (Late Bronze Age). The Israelites, as an outgrowth of the Canaanite population, consolidated their hold with the emergence of the Kingdom of Israel, and the Kingdom of Judah. Some consider that these Canaanite sedentary Israelites melded with incoming nomadic groups known as 'Hebrews'. Though few sources in the Bible mention the exilic periods in detail, the experience of diaspora life, from the Ancient Egyptian rule over the Levant, to Assyrian Captivity and Exile, to Babylonian Captivity and Exile, to Seleucid Imperial rule, to the Roman occupation, and the historical relations between Israelites and their homeland, became a major feature of Jewish history, identity and memory. The worldwide Jewish population reached a peak of 16.7 million prior to World War II, but approximately 6 million Jews were systematically murdered during the Holocaust. Since then the population has slowly risen again, and as of 2015 was estimated at 14.3 million by the Berman Jewish DataBank, or less than 0.2% of the total world population (roughly one in every 514 people). According to the report, about 43% of all Jews reside in Israel (6.4 million), and 40% in the United States (5.7 million), with most of the remainder living in Europe (1.4 million) a…
definition: «Les Juifs (en hébreu : ×Ö°××Ö¼×Ö´×× / yehoudim, en grec ancien : á¼¸Î¿Ï Î´Î±á¿Î¿Î¹ / Ioudaĩoi, en latin : Iudaei, etc.) sont les membres d'un peuple lié Ã sa propre religion, le judaïsme, et au sens large du terme Ã une appartenance ethnique et religieuse. La tradition juive relie leur ascendance aux patriarches Abraham, Isaac et Jacob également appelé Israël. Ils peuplent la Judée et le royaume d'Israël, structurant leur quotidien autour de la Bible hébraïque, laquelle comprend les cinq Livres de la Torah attribués Ã Moïse, les Livres des prophètes ultérieurs et d'autres écrits. La Bible définit leurs croyances, leur histoire, leur identité nationale et légifère dans tous les domaines de leur vie. Ã la suite des aléas de leur histoire, les Juifs migrent ou sont déportés de la Judée et essaiment Ã travers le monde. La diaspora juive résulte principalement de la conjonction de deux facteurs, une volonté d'essaimage et la nécessité de fuir des persécutions. Tentant de conserver leur mode de vie ancestral au sein des populations avoisinantes dans lesquelles ils s'acculturent, ils développent des traditions religieuses, culinaires et des langues propres ainsi que d'autres traits spécifiques. Réciproquement, ils exercent un certain attrait sur leurs populations d'accueil et l'on enregistre dans l'Empire romain un nombre important de conversions au judaïsme. L'impact et la proportion de ces conversions font débat au sein des historiens. Leur histoire sur plus de deux millénaires en Europe est marquée par des persécutions qui culminent au xxe siècle avec la Shoah. Les grandes révolutions de l'ère moderne entraînent chez nombre d'entre eux une perte ou un abandon de tout ou partie des repères traditionnels. Plusieurs tentatives sont menées pour les redéfinir en tant qu'entité confessionnelle, nationale ou culturelle de sorte qu'en français, l'usage commun distingue entre les Juifs (avec une majuscule â les «personnes descenda… @fr
in scheme: race or colour

Jewish
is replaced by: Judaism
in dataset: The CWRC Ontology
represented by: Jewish identity
type: Concept
comment: Deprecated in favour of instance Judaism.
comment: Désapprouver en faveur de l'instance Judaïsme. @fr
comment: La description de ce terme est basée sur celle de DBPedia. @fr
comment: The description for this term is indebted to the Getty Art & Architecture Thesaurus.
label: Jodendom @nl
label: Joods @nl
label: Judaísmo @es
label: Judaïsme @fr
label: you tai jiao @zh-latn
label: yu t'ai chiao @zh-latn
label: yóu tà i jiÄo @zh-latn
label: ç¶å¤ªæ @zh-hant
deprecated: true
term status: deprecated
broader transitive: Abrahamic religions
definition: "Refers to the monotheistic religion of the Jewish people, central to which is the belief that the ancient Israelites experienced God's presence in human events. Jews believe that the one God delivered the Israelites out of bondage in Egypt, revealed the structure of communal and individual life to them, and chose them to be a holy nation of people able to set an example for all humankind. The Hebrew Bible and Talmud are the two primary sources for Judaism's spiritual and ethical principles. The religion, which traces its origins to Abraham, places more emphasis on expressing beliefs through ritual rather than through abstract doctrine. The Sabbath, beginning at sunset on Friday and ending at sunset on Saturday, is the central religious observance; there is also an annual cycle of religious festivals and days of fasting. Judaism has had a diverse history of development over almost 4000 years, with a number of resulting branches in modern times, namely Orthodox, Conservative, and Reform." (Getty, 2017)
definition: "Se refiere a la religión monoteista del pueblo judío, para los cuales es central la creencia que los antiguos israelitas experimentaron la presencia de Dios en los eventos humanos. Los judíos creen que el Dios único salvó los israelistas de la esclavitud en Egipto, revelándoles la estructura de la vida comunal e individual y eligiéndolos para ser una nación sagrada de personas capaces de dar un ejemplo para toda la humanidad. La Biblia Hebrea y el Talmud son dos fuentes primarias de la espiritualidad judía y de los principios éticos.Los orígenes de la religión se remontan a los tiempos de Abraham, poniendo mayor énfasis en expresar la creencia con rituales más bien que con doctrinas abstractas. El Shabbat, que comienza con la puesta de sol del viernes y termina con la puesta de sol del sábado, es la observancia religiosa central; hay también un ciclo anual de fiestas religiosas y días de ayuno. El judaísmo ha tenido un desarrollo diverso a lo largo de la historia de casi 4.000 años, con un gran número de ramas resultantes en épocas modernas, concretamente ortodoxas, conservadoras, y reformistas." (Getty, 2017) @es
definition: "Verwijst naar de monotheïstische religie van het joodse volk, waarbij het geloof centraal staat dat de oude Israëlieten de aanwezigheid van God ervoeren in menselijke gebeurtenissen. Joden geloven dat één God de Israëlieten uit hun gevangenschap in Egypte heeft bevrijd, de structuur van een gemeenschappelijk en individueel leven aan hen heeft onthuld en hen heeft uitverkoren als een heilig volk dat als voorbeeld moest dienen voor de gehele mensheid. De Hebreeuwse bijbel en de Talmoed zijn de belangrijkste bronnen voor de spirituele en ethische principes van het jodendom. Deze religie, waarvan de oorsprong teruggaat naar de tijd van Abraham, legt meer de nadruk op het tot uitdrukking brengen van het geloof in de vorm van rituelen dan in de vorm van abstracte doctrines. De sabbat, die begint bij zonsondergang op vrijdag en eindigt bij zonsondergang op zaterdag, is een centraal element van de religie; er is ook een jaarlijkse cyclus van religieuze feestdagen en vastendagen. Het jodendom heeft een zeer uiteenlopende ontwikkelingsgeschiedenis die bijna 4000 jaar beslaat en is uitgemond in diverse stromingen: de orthodoxe, conservatieve en reformistische stroming." (Getty, 2017) @nl
definition: "ç¶å¤ªäººçä¸ç¥è«å®æï¼ç¸ä¿¡å¤ä»£ä»¥è²åäººæ¼äººé¡äºä»¶ä¸­é«é©å°ç¥çå­å¨ãç¶å¤ªäººç¸ä¿¡éå¯ä¸çç¥ä½¿ä»åè«é¢ååçå¥´å½¹ï¼åä»åæ­ç¤ºå ¬å ±ååäººçæ´»ççµæ§ï¼ä¸¦é¸æä»åçºèåå­æ°ï¼ä»¥çºå ¨äººé¡æ¨¹ç«æ¦æ¨£ããå¸ä¼¯ä¾èç¶(Hebrew Bible)ãèãå¡ç¾ç©å¾·(Talmud)ãçºç¶å¤ªæç²¾ç¥èéå¾·ååçå ©å¤§ä¾æºãç¶å¤ªææºæ¼äºä¼¯æç½ï¼è¼å¼·èª¿ä»¥åå¼èéæ½è±¡çææ¢è¡¨éä¿¡ä»°ãéµå¾ªä¿¡ä»°çéå¿çºå®æ¯æ¥ï¼å¾é±äºçæ¥è½éå§å°é±æ¥çæ¥åºçµæï¼å¦å¤æ¯å¹´éæå®æç¯æ ¶åé½ææ¥ãç¶å¤ªæç¶éå°è¿ååå¹´çç¼å±ï¼è¡çåºè¨±å¤ç¾ä»£çåæ¯ï¼å³æ­£çµ±æ´¾ç¶å¤ªæ(Orthodox)ãä¿å®æ´¾ç¶å¤ªæ(Conservative)ï¼èæ¹é©æ´¾ç¶å¤ªæ(Reform.)ã" (Getty, 2017) @zh-hant
definition: «Le judaïsme (du grec ÎÎ¿Ï Î´Î±ÏÏÎ¼ÏÏ, yiddish : ×××××©×§××× yiddishkeit, ladino : ×'×××××¡×× Djudaismo, allemand : Judenthum, hébreu : ×××××ª yahadout) est variablement défini comme «une forme de vie religieuse dont la caractéristique essentielle est la croyance Ã un Ãtre suprême, auteur â de quelque manière qu'on conçoive son action â de l'univers qu'il gouverne par sa providence», ou comme «la religion des Juifs, ainsi que la théologie, la loi et les traditions culturelles du peuple juif», ou comme «une religion [â¦], une culture â résultat ou fondement de la religion, mais ayant un devenir propre, [â¦] une sensibilité diffuse faite de quelques idées et souvenirs, de quelques coutumes et émotions, d'une solidarité avec les juifs persécutés en tant que juifs» ou comme «l'ensemble des rituels et des autres pratiques, des croyances et des valeurs, des loyautés historiques et politiques qui constituent l'allégeance au peuple d'Israël». Cette pluralité est tributaire d'une part de l'évolution du terme au cours de l'histoire, celui-ci désignant originellement l'ensemble des traits caractérisant le peuple juif, constitué des descendants des Israélites provenant de l'antique terre d'Israël et de ceux qui les ont rejoints par la conversion, et d'autre part de la différence de perception selon l'appartenance ou non au judaïsme. Il a souvent été représenté comme une «religion juive» antithétique de la religion chrétienne, alors que des Juifs le définissent aussi au-delà ou en dehors du fait religieux, certains philosophes, comme Daniel Boyarin ou Bernard-Henri Lévy, allant jusqu'à dire que la religion en tant que théologie édifiée par une croyance, des dogmes et une instance suprême, centrale et doctrinale «n'appartient pas Ã l'esprit du judaïsme».» (DBpedia, 2017) @fr
in scheme: religion

journalist
in dataset: The CWRC Ontology
type: occupation
type: Concept
alternative label: columnist
alternative label: crime reporter
alternative label: foreign correspondent
alternative label: free lance journalist
alternative label: journalism
alternative label: media journalist
alternative label: newspaper assistant
alternative label: newspaper correspondent
alternative label: parliamentary reporter
alternative label: reporter
alternative label: socialist journalist
alternative label: staff writer
alternative label: trade journalist
alternative label: war correspondent
alternative label: war reporter
alternative label: women's columnist
hidden label: clippings clerk
in scheme: occupation

Judaism
in dataset: The CWRC Ontology
represented by: Jewish identity
type: religion
type: Concept
comment: La description de ce terme est basée sur celle de DBPedia. @fr
comment: The description for this term is indebted to the Getty Art & Architecture Thesaurus.
label: Jodendom @nl
label: Joods @nl
label: Judaísmo @es
label: Judaïsme @fr
label: you tai jiao @zh-latn
label: yu t'ai chiao @zh-latn
label: yóu tà i jiÄo @zh-latn
label: ç¶å¤ªæ @zh-hant
alternative label: Jewish
alternative label: Orthodox Judaism
broader transitive: Abrahamic religions
definition: "Refers to the monotheistic religion of the Jewish people, central to which is the belief that the ancient Israelites experienced God's presence in human events. Jews believe that the one God delivered the Israelites out of bondage in Egypt, revealed the structure of communal and individual life to them, and chose them to be a holy nation of people able to set an example for all humankind. The Hebrew Bible and Talmud are the two primary sources for Judaism's spiritual and ethical principles. The religion, which traces its origins to Abraham, places more emphasis on expressing beliefs through ritual rather than through abstract doctrine. The Sabbath, beginning on sunset on Friday and ending at sunset on Saturday, is the central religious observance; there is also an annual cycle of religious festivals and days of fasting. Judaism has had a diverse history of development over almost 4000 years, with a number of resulting branches in modern times, namely Orthodox, Conservative, and Reform." (Getty, 2017)
definition: "Se refiere a la religión monoteista del pueblo judío, para los cuales es central la creencia que los antiguos israelitas experimentaron la presencia de Dios en los eventos humanos. Los judíos creen que el Dios único salvó los israelistas de la esclavitud en Egipto, revelándoles la estructura de la vida comunal e individual y eligiéndolos para ser una nación sagrada de personas capaces de dar un ejemplo para toda la humanidad. La Biblia Hebrea y el Talmud son dos fuentes primarias de la espiritualidad judía y de los principios éticos.Los orígenes de la religión se remontan a los tiempos de Abraham, poniendo mayor énfasis en expresar la creencia con rituales más bien que con doctrinas abstractas. El Shabbat, que comienza con la puesta de sol del viernes y termina con la puesta de sol del sábado, es la observancia religiosa central; hay también un ciclo anual de fiestas religiosas y días de ayuno. El judaísmo ha tenido un desarrollo diverso a lo largo de la historia de casi 4.000 años, con un gran número de ramas resultantes en épocas modernas, concretamente ortodoxas, conservadoras, y reformistas." (Getty, 2017) @es
definition: "Verwijst naar de monotheïstische religie van het joodse volk, waarbij het geloof centraal staat dat de oude Israëlieten de aanwezigheid van God ervoeren in menselijke gebeurtenissen. Joden geloven dat één God de Israëlieten uit hun gevangenschap in Egypte heeft bevrijd, de structuur van een gemeenschappelijk en individueel leven aan hen heeft onthuld en hen heeft uitverkoren als een heilig volk dat als voorbeeld moest dienen voor de gehele mensheid. De Hebreeuwse bijbel en de Talmoed zijn de belangrijkste bronnen voor de spirituele en ethische principes van het jodendom. Deze religie, waarvan de oorsprong teruggaat naar de tijd van Abraham, legt meer de nadruk op het tot uitdrukking brengen van het geloof in de vorm van rituelen dan in de vorm van abstracte doctrines. De sabbat, die begint bij zonsondergang op vrijdag en eindigt bij zonsondergang op zaterdag, is een centraal element van de religie; er is ook een jaarlijkse cyclus van religieuze feestdagen en vastendagen. Het jodendom heeft een zeer uiteenlopende ontwikkelingsgeschiedenis die bijna 4000 jaar beslaat en is uitgemond in diverse stromingen: de orthodoxe, conservatieve en reformistische stroming." (Getty, 2017) @nl
definition: "ç¶å¤ªäººçä¸ç¥è«å®æï¼ç¸ä¿¡å¤ä»£ä»¥è²åäººæ¼äººé¡äºä»¶ä¸­é«é©å°ç¥çå­å¨ãç¶å¤ªäººç¸ä¿¡éå¯ä¸çç¥ä½¿ä»åè«é¢ååçå¥´å½¹ï¼åä»åæ­ç¤ºå ¬å ±ååäººçæ´»ççµæ§ï¼ä¸¦é¸æä»åçºèåå­æ°ï¼ä»¥çºå ¨äººé¡æ¨¹ç«æ¦æ¨£ããå¸ä¼¯ä¾èç¶(Hebrew Bible)ãèãå¡ç¾ç©å¾·(Talmud)ãçºç¶å¤ªæç²¾ç¥èéå¾·ååçå ©å¤§ä¾æºãç¶å¤ªææºæ¼äºä¼¯æç½ï¼è¼å¼·èª¿ä»¥åå¼èéæ½è±¡çææ¢è¡¨éä¿¡ä»°ãéµå¾ªä¿¡ä»°çéå¿çºå®æ¯æ¥ï¼å¾é±äºçæ¥è½éå§å°é±æ¥çæ¥åºçµæï¼å¦å¤æ¯å¹´éæå®æç¯æ ¶åé½ææ¥ãç¶å¤ªæç¶éå°è¿ååå¹´çç¼å±ï¼è¡çåºè¨±å¤ç¾ä»£çåæ¯ï¼å³æ­£çµ±æ´¾ç¶å¤ªæ(Orthodox)ãä¿å®æ´¾ç¶å¤ªæ(Conservative)ï¼èæ¹é©æ´¾ç¶å¤ªæ(Reform.)ã" (Getty, 2017) @zh-hant
definition: «Pour l'Encyclopædia Britannica, le mot judaïsme recouvre la religion des Juifs, ainsi que la théologie, la loi et les traditions culturelles du peuple juif, constitué des descendants des Israélites provenant de l'antique terre d'Israël et des quelques minorités les ayant rejoints par la conversion et s'étant mélangées Ã eux au fil de leur diaspora de deux millénaires. Pour un juif orthodoxe comme Daniel Boyarin, le judaïsme est «l'ensemble des rituels et des autres pratiques, des croyances et des valeurs, des loyautés historiques et politiques qui constituent l'allégeance au peuple d'Israël», mais le judaïsme n'est ni une religion ni une foi, selon Boyarin. Ainsi Bernard-Henri Lévy affirme que «la tâche des Juifs comme tels est d'être irréligieux», dans la mesure où la religion, telle qu'on la conçoit en théologie, édifiée par une croyance, par des dogmes, par une instance suprême, centrale et doctrinale, n'appartient pas Ã l'esprit du judaïsme, selon lui. Le judaïsme comporte des éléments religieux, mais ne s'y limite pas puisqu'il contient des coutumes non spécifiquement religieuses â outre des codes de conduite, des lois, des rites â et qu'il fonde plus largement encore une «culture juive». Néanmoins, par convention, on parle habituellement du judaïsme comme d'une «religion», mais il ne faut pas l'entendre au sens strict, selon des historiens des religions comme Simon Claude Mimouni ou Daniel Boyarin, ou des philosophes comme Léo Strauss ou Bernard-Henri Lévy. Selon ses textes fondateurs, en particulier le Tanakh, la foi des anciens Israélites et de leurs descendants les Juifs, est fondée sur une alliance contractée entre Dieu et Abraham, qui a ensuite été renouvelée entre Dieu et Moïse. Les juifs fondent le judaïsme sur la religion abrahamique qui fleurira ensuite dans la Loi mosaïque (la Torah, les Nevi'im et les Ketouvim), collectivement désignés par l'acronyme Tanakh, dont le texte constitue la Miqra ou … @fr
in scheme: religion

judge
in dataset: The CWRC Ontology
type: occupation
type: Concept
alternative label: court official
alternative label: judge of probate
alternative label: puisne judge
hidden label: chief justice of the king's bench
hidden label: county court judgeship
hidden label: lord chief justice of ireland
in scheme: occupation

knight
in dataset: The CWRC Ontology
type: occupation
type: Concept
broader transitive: aristocrat
in scheme: occupation

labour movement
in dataset: The CWRC Ontology
contrary to: anti-trade-unionism
type: political affiliation
type: Concept
comment: La description de ce terme est basée sur celle de DBPedia. @fr
comment: The description for this term is indebted to DBpedia.
label: Mouvement ouvrier @fr
alternative label: Labour Party activist
alternative label: Labour party
alternative label: anti-sweated labour
alternative label: factory reformer
alternative label: industrial reformer
alternative label: labour
alternative label: labour activism
alternative label: labour activist
alternative label: labour advocate
alternative label: labour feminist
alternative label: labour organizer
alternative label: women's labour activist
definition: "The Labour movement or Labor movement (see spelling differences), or, respectively, labourism or laborism, are general terms for the collective organisation of working people developed to represent and campaign for better working conditions and treatment from their employers and, by the implementation of labour and employment laws, their governments. The standard unit of organisation is the trade union. In some countries, especially the United Kingdom and Australia, the labour movement is understood to include a formal political wing, usually as a political party known as a "labour party" or "workers' party". Many individuals and political groups otherwise considered to represent ruling classes may be part of and active in the labour movement. Contemporary labourism developed in response to the depredations of industrial capitalism at about the same time as socialism. However, while the goal of labourism was to protect and strengthen the interests of labour within capitalism, the goal of socialism was to replace the capitalist system entirely." (DBpedia, 2017)
definition: «Le terme de mouvement ouvrier désigne l'ensemble des mouvements et partis organisés, Ã partir de l'époque de la révolution industrielle, pour améliorer les conditions d'existence de la classe ouvrière. Cette définition inclut principalement le syndicalisme, mais aussi les partis politiques en étant issus ou s'en étant réclamés et plus largement les différentes formes d'action politique et sociale ayant représenté, ou estimé représenter, les intérêts de la classe ouvrière (coopératisme, mutualisme). Plus particulièrement, au XIXe siècle, la mouvance socialiste â qui adopte dans une partie des pays européens l'appellation de social-démocrate â se pose en représentant du mouvement ouvrier. La nature des liens entre syndicalisme et partis politiques est cependant variable selon les pays : au Royaume-Uni, la précocité du développement industriel a entraîné l'antériorité des syndicats sur le Parti travailliste. Après la scission de la mouvance socialiste au début du XXe siècle, les partis communistes et, prise au sens large, la mouvance communiste dans son ensemble, se sont présentés comme les représentants authentiques du mouvement ouvrier. Les anarchistes ont également pu revendiquer la représentation des intérêts du monde ouvrier, notamment via des phénomènes comme l'anarcho-syndicalisme.» (DBpedia, 2017) @fr
in scheme: political affiliation
related: social reform
related: socialism

labour union
in dataset: The CWRC Ontology
type: occupation
type: Concept
alternative label: general secretary of the empire press union
alternative label: trade union delegate
alternative label: trade union leader
alternative label: trade union organizer
alternative label: trade unionist
alternative label: union member
alternative label: union organizer
alternative label: union representative
in scheme: occupation

Lady Literate in the Arts
in dataset: The CWRC Ontology
type: credential
type: Concept
comment: La description de ce terme est basée sur celle de DBPedia. @fr
comment: The description for this term is indebted to DBpedia.
label: Lady Literate in Arts @fr
alternative label: L.L.A. (Lady Literate in the Arts)
definition: "A Lady Literate in Arts (LLA) qualification was offered by the University of St Andrews in Scotland for more than a decade before women were allowed to graduate in the same way as men, and it became popular as a kind of external degree for women who had studied through correspondence, or by attendance at non-university classes. Until 1892 women were not admitted to Scottish universities and the LLA was the nearest qualification to a degree which was open to women in the country, although the University of Edinburgh offered certificates recognising achievement in classes organised by the Edinburgh Association for the University Education of Women, and in Glasgow Queen Margaret College was offering a university-equivalent education and awards. To obtain an LLA candidates had to pass examinations at a university-approved centre, which might be in Scotland or outwith the country. Even after 1892, the LLA continued to be popular with women who wanted to study for an arts degree without needing to attend one particular institution for three or four years. Thousands of women received an LLA before it was discontinued in the 1930s. William Angus Knight (1836â1916), Professor of Moral Philosophy at St Andrews between 1876 and 1903, was a supporter of female education and the main force behind the university's introduction of the LLA degree. Helen Bannerman, the children's writer, and suffragette Margaret Nevinson both had LLAs, as did the wartime nursing "heroine", Violetta Thurstan." (DBpedia, 2018)
definition: «La qualification de Lady Literate in Arts (« Dame Instruite ès Arts ») ou LLA était dispensé par l'Université de St Andrews, en Ãcosse, plus d'une dizaine d'années avant que les femmes soient acceptées dans les études supérieures de la même manière que les hommes. Il devint populaire comme une forme de diplôme Ã distance pour des femmes étudiant par correspondance ou suivant des cours non-universitaires. Jusqu'en 1892, les femmes n'étaient pas admises dans les universités écossaises et le LLA était la qualification la plus proche d'un diplôme qu'une femme pouvait obtenir dans le pays, bien que l'Université d'Edimbourg dispensait des certificats de réussite Ã des cours organisés par la Edinburgh Association for the University Education of Women (en) et le Collège Queen Margaret de Glasgow offrait une éducation de niveau universitaire avec des distinctions. Pour obtenir un LLA, les candidates devaient passer des examens dans un centre approuvé par l'Université, qui puovait être en Ãcosse ou Ã l'extérieur du pays. Même après 1982, le LLA continuait d'être populaire auprès des femmes qui voulaient étudier pour un diplôme d'art sans avoir Ã suivre les cours d'une institution particulière pour trois ou quatre ans. Des milliers de femmes reçurent un LLA avant qu'il soit abandonné dans les années 30. William Angus Knight (en) (1836-1916), professeur de philosophie morale Ã St Andrews entre 1876 et 1903, était un défenseur de l'éducation des femmes et un des pionniers derrière la création du LLA. L'auteur de livre pour enfants Helen Bannerman (en) et la suffragette et écrivaine réaliste Margaret Nevinson ont toutes les deux reçu un LLA.» (DBpedia, 2018) @fr
in scheme: credential

land reform
in dataset: The CWRC Ontology
type: political affiliation
type: Concept
comment: The description for this term is indebted to DBpedia.
alternative label: Irish land nationalization
definition: "Land reform (also agrarian reform, though that can have a broader meaning) involves the changing of laws, regulations or customs regarding land ownership. Land reform may consist of a government-initiated or government-backed property redistribution, generally of agricultural land. Land reform can, therefore, refer to transfer of ownership from the more powerful to the less powerful, such as from a relatively small number of wealthy (or noble) owners with extensive land holdings (e.g., plantations, large ranches, or agribusiness plots) to individual ownership by those who work the land. Such transfers of ownership may be with or without compensation; compensation may vary from token amounts to the full value of the land." (DBpedia, 2017)
in scheme: political affiliation

Latitudinarianism
in dataset: The CWRC Ontology
type: religion
type: Concept
comment: The description for this term is indebted to DBpedia.
alternative label: Latitudinarian
alternative label: latudinarian
broader transitive: Protestantism
definition: "Latitudinarian was initially a pejorative term applied to a group of 17th-century English theologians who believed in conforming to official Church of England practices but who felt that matters of doctrine, liturgical practice, and ecclesiastical organization were of relatively little importance. Good examples of the latitudinarian philosophy were found among the Cambridge Platonists and Sir Thomas Browne in his Religio Medici. Additionally, the term has been ascribed to ministers of the Scottish Episcopal Church in Scotland who were educated at the Episcopal sympathizing universities at Aberdeen and St Andrews and that broadly subscribed to their moderate Anglican English counterparts. Today, latitudinarianism should not be confused with ecumenical movements, which seek to draw all Christian churches together, rather than to de-emphasize practical doctrine. The term has taken on a more general meaning, indicating a personal philosophy which includes tolerance of other views, particularly (but not necessarily) on religious matters. In the Roman Catholic Church, latitudinarianism was condemned in the 19th century document Quanta cura; Pope Pius IX felt that, with its emphasis on religious liberty and freedom to discard traditional Christian doctrines and dogmas, this attitude threatened to undermine the church. Latitudinarianism is still criticized within the Catholic Church under the epithet of Cafeteria Catholic. It has been perceived as a disingenuous claim to be Roman Catholic while ignoring, being indifferent towards, or denying Catholic dogma and praxis." (DBpedia, 2018)
in scheme: religion

laundry worker
in dataset: The CWRC Ontology
type: occupation
type: Concept
alternative label: laundress
alternative label: laundry manager
alternative label: washerwoman
in scheme: occupation

law degree
in dataset: The CWRC Ontology
type: credential
type: Concept
comment: The description for this term is indebted to DBpedia.
alternative label: degree in law
broader transitive: professional degree
definition: "A law degree is an academic degree conferred for studies in law. Such degrees are generally preparation for legal careers; but while their curricula may be reviewed by legal authority, they do not themselves confer a license. A legal license is granted (typically by examination) and exercised locally; while the law degree can have local, international, and world-wide aspects- e.g., in Britain the Legal Practice Course is required to become a British solicitor or the Bar Professional Training Course (BPTC) to become a barrister." (DBpedia, 2018)
in scheme: credential

law enforcement
in dataset: The CWRC Ontology
type: occupation
type: Concept
alternative label: chief constable
alternative label: mounted police
alternative label: police commissioner
alternative label: police officer
alternative label: sheriff
alternative label: town constable
hidden label: high sheriff
hidden label: high sheriff of county cork
hidden label: high sheriff of hertfordshire
hidden label: high sheriff of kent
hidden label: high sheriff of yorkshire
hidden label: high sherriff of county
hidden label: sherif of westmorland
hidden label: sheriff depute
hidden label: under sheriff of suffolk
in scheme: occupation

lawyer
in dataset: The CWRC Ontology
type: occupation
type: Concept
alternative label: apprentice attorney
alternative label: attorney
alternative label: barrister
alternative label: chancery barrister
alternative label: solicitor
broader transitive: legal work
hidden label: patents lawyer
in scheme: occupation

leather worker
in dataset: The CWRC Ontology
type: occupation
type: Concept
alternative label: leatherworker
alternative label: saddler
alternative label: tanner
alternative label: worker in leather
broader transitive: craftsperson
hidden label: saddler, shoemaker
in scheme: occupation

left-wing
in dataset: The CWRC Ontology
type: political affiliation
type: Concept
comment: La description de ce terme est basée sur celle de DBPedia. @fr
comment: The description for this term is indebted to DBpedia.
label: Gauche (politique) @fr
alternative label: anti-conservative
alternative label: leftist
definition: "Left-wing politics supports social equality and egalitarianism, often in opposition to social hierarchy and social inequality. It typically involves a concern for those in society whom its adherents perceive as disadvantaged relative to others (prioritarianism), as well as a belief that there are unjustified inequalities that need to be reduced or abolished (by advocating for social justice). The term left wing can also refer to "the radical, reforming, or socialist section of a political party or system". The political terms Left and Right were coined during the French Revolution (1789â1799), referring to the seating arrangement in the Estates General: those who sat on the left generally opposed the monarchy and supported the revolution, including the creation of a republic and secularization, while those on the right were supportive of the traditional institutions of the Old Regime. Use of the term "Left" became more prominent after the restoration of the French monarchy in 1815 when it was applied to the "Independents". The word "wing" was appended to Left and Right in the late 19th century, usually with disparaging intent, and "left-wing" was applied to those who were unorthodox in their religious or political views. The term was later applied to a number of movements, especially republicanism during the French Revolution in the 18th century, followed by socialism, communism, anarchism, and social democracy in the 19th and 20th centuries. Since then, the term left-wing has been applied to a broad range of movements including civil rights movements, feminist movements, anti-war movements, and environmental movements, as well as a wide range of parties. According to author Barry Clark, "Leftists [...] claim that human development flourishes when individuals engage in cooperative, mutually respectful relations that can thrive only when excessive differences in status, power, and wealth are eliminated." " (DBpedia, 2017)
definition: «En politique, l'usage consiste Ã diviser les partis politiques en catégories générales qui formalisent une division bipartisane : la droite et la gauche, auxquelles on peut ajouter le centre. Dans l'ensemble du champ politique, les forces politiques sont triples : droite, gauche et forces révolutionnaires (extrême-gauche) hors partis. La notion de gauche et celle de droite en politique est une construction progressive entre la fin du XVIIIe siècle et le début du XXe siècle. La gauche désigne la partie gauche de l'hémicycle d'une assemblée parlementaire et les personnes et partis qui y siègent habituellement. De ce fait, la notion de gauche (comme celle de droite) ne possède pas un contenu idéologique fixe et a priori : par exemple, l'orléanisme est Ã gauche du légitimisme, le bourgeois libéral est Ã gauche du bourgeois monarchiste, et ce qui était Ã gauche Ã une époque se retrouve souvent Ã droite Ã une autre époque, ainsi le bourgeois libéral est aujourd'hui généralement Ã droite, alors qu'il est de gauche du temps de Benjamin Constant. De nos jours, les partis de gauche se rassemblent généralement dans la promotion d'idéaux progressistes et d'égalité, la critique de l'ordre social et le souci d'une plus grande justice sociale. Elle comprend la social-démocratie, le radicalisme, le socialisme, le communisme et certains courants de l'anarchisme.Le terme n'est pas utilisé que pour les partis, on utilise parfois le terme de gauche syndicale ou plus rarement de gauche associative.» (DBpedia, 2017) @fr
in scheme: political affiliation

legal work
in dataset: The CWRC Ontology
type: occupation
type: Concept
alternative label: clerk of the court
alternative label: law clerk
alternative label: lawyer's clerk
alternative label: legal adviser
alternative label: legal advisor
alternative label: legal aid worker
alternative label: legal assistant
alternative label: legal clerk
alternative label: legal expert
alternative label: legal scholar
alternative label: solicitor's clerk
in scheme: occupation

leisure relationship
in dataset: The CWRC Ontology
range includes: Work
range includes: AdminPlaceConcept
range includes: Feature
range includes: FormalOrganization
range includes: Person
subject-centric predicate: relates by leisure to
type: ObjectProperty
domain: Person
sub property of: social relationship

lesbianism
in dataset: The CWRC Ontology
type: sexuality
type: Concept
label: lesbianisme @fr
alternative label: lesbian
definition: Le lesbianisme indique l'attraction sexuelle entre les femmes. Cependant, certaines intellectuelles lesbiennes féministes soulignent l'aspect réducteur d'une telle définition. S'appuyant sur Kathleen Gough, Adrienne Rich interprète l'hétérosexualité comme obligatoire pour les femmes dans un contexte patriarcal, et évoque un continuum lesbien, les «diverses expériences spécifiques aux femmesâau cours de leur existence ou Ã travers l'Histoireâ et non simplement le fait qu'une femme a eu ou a consciemment désiré avoir des expériences sexuelles avec une autre femme» (Rich, 1983). Dans un contexte hétéronormatif, le lesbianisme ne relève donc pas seulement de la sexualité mais implique aussi des questions politiques complexes. @fr
definition: Lesbianism indicates the sexual attraction of women to other women. Yet, lesbian feminist thinkers underline that this common definition is reductive. Drawing on Kathleen Gough and within an understanding of heterosexuality as compulsory for women within patriarchy, Adrienne Rich describes a lesbian continuum, the "rangeâthrough each woman's life and throughout historyâof woman-identified experiences, not simply the fact that a woman has had or consciously desired genital sexual experience with another woman" (Rich, 1983). In a heteronormative context, lesbianism is not only a question of sexuality but also has complex political implications.
in scheme: sexuality

lesbian feminism
in dataset: The CWRC Ontology
type: political affiliation
type: Concept
comment: The description for this term is indebted to DBpedia.
alternative label: lesbian feminist
broader transitive: feminism
definition: "Lesbian feminism is a cultural movement and critical perspective, most influential in the 1970s and early 1980s (primarily in North America and Western Europe), that encourages women to direct their energies toward other women rather than men, and often advocates lesbianism as the logical result of feminism. Some key thinkers and activists are Charlotte Bunch, Rita Mae Brown, Adrienne Rich, Audre Lorde, Marilyn Frye, Mary Daly, Sheila Jeffreys, Barbara Smith, Pat Parker, Margaret Sloan-Hunter, Cheryl Clarke, Gloria Anzaldua, Cherrie Moraga, and Monique Wittig (although the latter is more commonly associated with the emergence of queer theory). Lesbian feminism came together in the early 1970s out of dissatisfaction with second-wave feminism and the gay liberation movement. In the words of lesbian feminist Sheila Jeffreys, "Lesbian feminism emerged as a result of two developments: lesbians within the WLM (Women's Liberation Movement) began to create a new, distinctively feminist lesbian politics, and lesbians in the GLF (Gay Liberation Front) left to join up with their sisters". According to Judy Rebick, a leading Canadian journalist and political activist for feminism, lesbians were and always have been at the heart of the women's movement, while their issues were invisible in the same movement. Lesbian feminism of color emerged as a response to lesbian feminism thought that failed to incorporate the issues of class and race as sources of oppression along with heterosexuality." (DBpedia, 2018)
in scheme: political affiliation

liaison officer
in dataset: The CWRC Ontology
type: occupation
type: Concept
hidden label: liaison officer, correspondent to cairo
in scheme: occupation

Liberal Unionist Party
in dataset: The CWRC Ontology
contrary to: Irish Home Rule Movement
type: political affiliation
type: Concept
comment: La description de ce terme est basée sur celle de DBPedia. @fr
comment: The description for this term is indebted to DBpedia.
label: Parti libéral unioniste @fr
alternative label: liberal unionist
broader transitive: liberalism
definition: "The Liberal Unionist Party was a British political party that was formed in 1886 by a faction that broke away from the Liberal Party. Led by Lord Hartington (later the Duke of Devonshire) and Joseph Chamberlain, the party formed a political alliance with the Conservative Party in opposition to Irish Home Rule. The two parties formed the ten-year-long, coalition Unionist Government 1895â1905 but kept separate political funds and their own party organisations until a complete merger was agreed in May 1912." (DBpedia, 2017)
definition: Le Liberal Unionist Party est un parti politique britannique qui se sépara du Parti libéral en 1886. Dirigé par Spencer Cavendish (Lord Hartington, et plus tard duc du Devonshire) et Joseph Chamberlain, le parti a formé une alliance politique avec le Parti conservateur dans l'opposition Ã l'Home Rule de l'Irlande. Les deux partis ont formé un gouvernement de coalition en 1895, mais gardèrent un fonctionnement séparés jusqu'à une fusion complète en mai 1912. * Portail de la politique britannique" Portail de la politique britannique" (DBpedia, 2017) @fr
in scheme: political affiliation

liberalism
in dataset: The CWRC Ontology
type: political affiliation
type: Concept
comment: La description de ce terme est basée sur celle de DBPedia. @fr
comment: The description for this term is indebted to DBpedia.
label: Libéralisme @fr
alternative label: British Liberalism
alternative label: liberal
alternative label: radical liberal
definition: "Liberalism is a political philosophy or worldview founded on ideas of liberty and equality. Whereas classical liberalism emphasises the role of liberty, social liberalism stresses the importance of equality. Liberals espouse a wide array of views depending on their understanding of these principles, but generally they support ideas and programmes such as freedom of speech, freedom of the press, freedom of religion, free markets, civil rights, democratic societies, secular governments, gender equality, and international cooperation. Liberalism first became a distinct political movement during the Age of Enlightenment, when it became popular among philosophers and economists in the Western world. Liberalism rejected the prevailing social and political norms of hereditary privilege, state religion, absolute monarchy, and the Divine Right of Kings. The 17th-century philosopher John Locke is often credited with founding liberalism as a distinct philosophical tradition. Locke argued that each man has a natural right to life, liberty, and property, while adding that governments must not violate these rights based on the social contract. Liberals opposed traditional conservatism and sought to replace absolutism in government with representative democracy and the rule of law. Prominent revolutionaries in the Glorious Revolution, the American Revolution, and the French Revolution used liberal philosophy to justify the armed overthrow of what they saw as tyrannical rule. Liberalism started to spread rapidly especially after the French Revolution. The 19th century saw liberal governments established in nations across Europe, South America, and North America. In this period, the dominant ideological opponent of classical liberalism was conservatism, but liberalism later survived major ideological challenges from new opponents, such as fascism and communism. During the 20th century, liberal ideas spread even further as liberal democracies found themselves on the winning side in …
definition: «Le libéralisme est une doctrine de philosophie politique qui affirme la liberté comme principe politique suprême ainsi que son corollaire de responsabilité individuelle, et revendique la limitation du pouvoir du souverain. Le mot libéralisme fait son apparition au début du XIXe siècle. Les racines du libéralisme sont plus anciennes. L'opposition Ã l'absolutisme du souverain s'est développée dans l'Europe des Lumières (XVIIIe siècle), mais aussi auparavant par la scolastique de l'Ãcole de Salamanque (XVIe siècle) faisant obligation morale au souverain de respecter les droits fondamentaux de chaque être humain au motif de sa nature de créature de Dieu, ou plus anciennement par les chartes médiévales (telles la Magna Carta) introduisant des droits fondamentaux dont le respect est exigé du souverain, ou encore par certains pans de la philosophie thomiste, eux-mêmes précédés par le principe de justice naturelle d'Aristote. La date des débuts formels du libéralisme ou de ses composantes politiques, économiques ou religieuses diffère selon les auteurs. De nombreux auteurs font commencer le libéralisme avec la Lettre sur la tolérance de John Locke (1689) qui complète les racines préexistantes. Le libéralisme repose sur l'idée que chaque être humain possède des droits fondamentaux naturels précédant toute association et qu'aucun pouvoir n'a le droit de violer. En conséquence, les libéraux veulent limiter les obligations sociales imposées par le pouvoir et plus généralement le système social, telles que la morale, au profit du libre choix et de l'intérêt de chaque individu indépendamment des autres. La question de l'articulation entre «libéralisme économique» et «libéralisme politique» reçoit des réponses variées. Le libéralisme prône la liberté d'expression des individus. Dans le domaine économique, il défend notamment l'initiative privée, la libre concurrence et son corollaire l'économie de marché ; dans le do… @fr
in scheme: political affiliation

Libertarianism
in dataset: The CWRC Ontology
type: political affiliation
type: Concept
comment: La description de ce terme est basée sur celle de DBPedia. @fr
comment: The description for this term is indebted to DBpedia.
label: Libertarianisme @fr
alternative label: libertarian
alternative label: religious libertarian
definition: "Libertarianism (Latin: liber, "free") is a collection of political philosophies that uphold liberty. Libertarians seek to maximize autonomy and freedom of choice, emphasising political freedom, voluntary association, and the primacy of individual judgment. Libertarians generally share a skepticism of authority; however, they diverge on the scope of their opposition to existing political and economic systems. Various schools of libertarian thought offer a range of views regarding the legitimate functions of state and private power, often calling to restrict or to dissolve coercive social institutions. Some libertarians advocate laissez-faire capitalism and strong private property rights, such as in land, infrastructure, and natural resources. Others, notably libertarian socialists, seek to abolish capitalism and private ownership of the means of production in favor of their common or cooperative ownership and management. An additional line of division is between minarchists and anarchists. While minarchists think that a minimal centralized government is necessary, anarchists propose to completely eliminate the state." (DBpedia, 2017)
definition: «Le libertarianisme, aussi appelé libertarisme (Ã ne pas confondre avec libertarisme de gauche et Libertaire) est une philosophie politique qui conçoit la société juste comme une société dont les institutions respectent et protègent la liberté de chaque individu d'exercer son plein droit de propriété sur lui-même et les droits de propriété qu'il a légitimement acquis sur des objets extérieurs. Issue du libéralisme elle prône donc, au sein d'un système de propriété et de marché universel, la liberté individuelle en tant que droit naturel. La liberté est conçue par le libertarianisme comme une valeur fondamentale des rapports sociaux, des échanges économiques et du système politique. Les libertariens se fondent sur le principe de non-agression qui affirme que nul ne peut prendre l'initiative de la force physique contre un individu, sa personne, sa liberté ou sa propriété. De fait, ses partisans, les libertariens, sont favorables Ã une réduction voire Ã la disparition de l'Ãtat (antiétatisme) en tant que système fondé sur la coercition, au profit d'une coopération libre et volontaire entre les individus, avec un Ãtat limité Ã des fonctions régaliennes. Robert Nozick (1938-2002), Murray Rothbard (1926-1995) et Charles Murray (1943-) font partie des principaux auteurs nourrissant cette doctrine.» (DBpedia, 2017) @fr
in scheme: political affiliation

libertinism
in dataset: The CWRC Ontology
type: sexuality
type: Concept
label: libertinage @fr
definition: Le libertinage réfère Ã un type d'identité sexuelle (souvent pour des hommes) utilisé pour décrire un sujet adhérant aux idées et pratiques hédonistes. @fr
definition: Libertinism refers to a type of sexual identity (often tied to men) used to describe a subject who subscribes to hedonistic sexual politics.
in scheme: sexuality

librarian
in dataset: The CWRC Ontology
type: occupation
type: Concept
alternative label: cataloguer
alternative label: county librarian
hidden label: director of the camps library
hidden label: keeper of the bodleian library
hidden label: royal academy's librarian
hidden label: vice president of the london library
in scheme: occupation

life scientist
in dataset: The CWRC Ontology
type: occupation
type: Concept
alternative label: anatomist
alternative label: bacteriologist
alternative label: physiologist
broader transitive: scientist
in scheme: occupation

linguist
in dataset: The CWRC Ontology
type: occupation
type: Concept
alternative label: grammarian
alternative label: linguistic reader
alternative label: linguistic researcher
in scheme: occupation
related: academic

language known
in dataset: The CWRC Ontology
subject-centric predicate: language known
type: ObjectProperty
domain: Person
label: maîtrise une langue @fr
range: language
sub property of: cultural form

language known of
in dataset: The CWRC Ontology
type: ObjectProperty
domain: language
range: Person
sub property of: cultural form of

language known (reported)
in dataset: The CWRC Ontology
subject-centric predicate: language known (reported)
type: ObjectProperty
domain: Person
label: maîtrise une langue (déclaré) @fr
range: language
sub property of: language known

language known (reported) of
in dataset: The CWRC Ontology
type: ObjectProperty
domain: language
range: Person
sub property of: language known of

language known (self-reported)
in dataset: The CWRC Ontology
subject-centric predicate: language known (self-reported)
type: ObjectProperty
domain: Person
label: maîtrise une langue (autodéclaré) @fr
range: language
sub property of: language known

language known (self-reported) of
in dataset: The CWRC Ontology
type: ObjectProperty
domain: language
range: Person
sub property of: language known of

has literal form
in dataset: The CWRC Ontology
type: DeprecatedProperty
type: Concept
comment: Deprecated, with no current equivalence.
comment: Désapprouver sans équivalence. @fr
label: a une forme littérale @fr
range: textual label
deprecated: true
term status: deprecated

literary agent
in dataset: The CWRC Ontology
type: occupation
type: Concept
alternative label: amateur literary agent
alternative label: literary advisor
in scheme: occupation

literary assistant
in dataset: The CWRC Ontology
type: occupation
type: Concept
alternative label: writer's assistant
in scheme: occupation

literary conservationist
in dataset: The CWRC Ontology
type: occupation
type: Concept
alternative label: literary conservation
broader transitive: conservationist
in scheme: occupation

literary executor
in dataset: The CWRC Ontology
type: occupation
type: Concept
alternative label: literary executrix
in scheme: occupation

literary forger
in dataset: The CWRC Ontology
type: occupation
type: Concept
in scheme: occupation

literary group participant
in dataset: The CWRC Ontology
type: occupation
type: Concept
hidden label: chair of literary society
hidden label: dramatic society president
hidden label: running writers' group
in scheme: occupation

literary prize adjudicator
in dataset: The CWRC Ontology
type: occupation
type: Concept
alternative label: adjudicator of literary award
alternative label: chair of literary prize panel
alternative label: judge of literary award
alternative label: judge of literary prize
alternative label: literary adjudicator
alternative label: literary awards judge
alternative label: literary judge
alternative label: literary prize judge
broader transitive: adjudicator
hidden label: judge for literary prize
hidden label: judge; literary competition
hidden label: literary award judge
hidden label: literary competition judge
in scheme: occupation

literary scholar
in dataset: The CWRC Ontology
type: occupation
type: Concept
alternative label: folklorist
alternative label: literary historian
alternative label: literary research
alternative label: literary researcher
alternative label: literary theorist
alternative label: philologist
in scheme: occupation

lithographer
in dataset: The CWRC Ontology
type: occupation
type: Concept
broader transitive: skilled trade
in scheme: occupation

litigant
in dataset: The CWRC Ontology
type: occupation
type: Concept
in scheme: occupation

lobbyist
in dataset: The CWRC Ontology
type: occupation
type: Concept
alternative label: political lobbyist
broader transitive: politics
hidden label: international political lobbyist
in scheme: occupation

local government
in dataset: The CWRC Ontology
type: occupation
type: Concept
alternative label: alderman
alternative label: city councillor
alternative label: city counsellor
alternative label: council member
alternative label: councillor
alternative label: local councillor
alternative label: local government magnate
alternative label: local government official
alternative label: local politician
alternative label: town corporator
broader transitive: government
hidden label: assistant director of education in the london county council
hidden label: lieutenant of the tower of london
hidden label: london county councillor
hidden label: member of the bury st edmunds borough council
hidden label: radicalist member of the london school board
hidden label: recorder of newcastle under lyme
hidden label: town corporator or councillor
in scheme: occupation

location Of
in dataset: The CWRC Ontology
type: ObjectProperty
range: Thing
inverse of: has location
definition: Things that are or were at this location at some point in time.

logger
in dataset: The CWRC Ontology
type: occupation
type: Concept
in scheme: occupation

Lollards
is replaced by: Lollardy
in dataset: The CWRC Ontology
type: Concept
comment: Deprecated in favour of instance Lollardy.
comment: Désapprouver en faveur de l'instance Lollardy. @fr
comment: La description de ce terme est basée sur celle de DBPedia. @fr
deprecated: true
term status: deprecated
broader transitive: Roman Catholic
definition: "Lollardy (Lollardry, Lollardism) was a political and religious movement that existed from the mid-14th century to the English Reformation. It was initially led by John Wycliffe, a prominent theologian who was dismissed from the University of Oxford in 1381 for criticism of the Church, especially in his doctrine on the Eucharist. The Lollards' demands were primarily for reform of Western Christianity." (DBpedia, 2017)
definition: «Les Lollards sont les membres ou sympathisants d'un mouvement de contestation religieuse et sociale apparu en Angleterre au XIVe siècle. â John Ball » (DBpedia, 2017) @fr
in scheme: religion

Lollardy
in dataset: The CWRC Ontology
type: religion
type: Concept
comment: La description de ce terme est basée sur celle de DBPedia. @fr
comment: The description for this term is indebted to DBpedia.
broader transitive: Roman Catholicism
definition: "Lollardy (Lollardry, Lollardism) was a political and religious movement that existed from the mid-14th century to the English Reformation. It was initially led by John Wycliffe, a prominent theologian who was dismissed from the University of Oxford in 1381 for criticism of the Church, especially in his doctrine on the Eucharist. The Lollards' demands were primarily for reform of Western Christianity." (DBpedia, 2017)
definition: «Les Lollards sont les membres ou sympathisants d'un mouvement de contestation religieuse et sociale apparu en Angleterre au XIVe siècle. â John Ball» (DBpedia, 2017) @fr
in scheme: religion

lord chamberlain
in dataset: The CWRC Ontology
type: occupation
type: Concept
broader transitive: higher government
in scheme: occupation

lord chancellor
in dataset: The CWRC Ontology
type: occupation
type: Concept
in scheme: occupation

low certainty
in dataset: The CWRC Ontology
type: certainty
type: precision
label: faible probabilité @fr
definition: A predefined value of certainty that represents cases where where an assertion, description, identification, value, or measurement is considered of low quality. Equivalent to the "medium" value for certainty or precision of the Text Encoding Initiative.
definition: Une valeur de probabilité prédéfinie utilisée dans le cas où un fait est considéré comme une information de basse qualité. @fr

lower-middle class
in dataset: The CWRC Ontology
type: social class
type: Concept
label: classe moyenne inférieure @fr
alternative label: LOWER-MIDDLECLASS
broader transitive: middle class
definition: Cette classe inclut "les employéâ¢eâ¢s, le personnel de bureau, les instituteurâ¢iceâ¢s et les gouvernantes. Il faut toutefois rappeler que certains des instituteurâ¢iceâ¢s entrent dans la catégorie des Professions (Mr. Chips dans le film du même nom (1939)) ainsi que les femmes qui ouvrent et dirigent les écoles. @fr
definition: Employees, clerical workers, teachers, governesses. Note, however, that some teachers go into Professions (Mr. Chips from the 1939 film of that name) and women starting schools and then managing them also go into Professions.
in scheme: social class

machineWork
in dataset: The CWRC Ontology
type: occupation
type: Concept
alternative label: fitter
alternative label: mechanician
in scheme: occupation

made alteration
in dataset: The CWRC Ontology
type: ObjectProperty
domain: natural person
range: change set
inverse of: altered by
definition: Links an change set to a natural person

magistrate
in dataset: The CWRC Ontology
type: occupation
type: Concept
alternative label: judicial officer
alternative label: justice of the peace
broader transitive: government official
in scheme: occupation

maid of honour
in dataset: The CWRC Ontology
type: occupation
type: Concept
in scheme: occupation

male
in dataset: The CWRC Ontology
type: textual label
comment: Deprecated with no current equivalence.
comment: Désapprouver sans équivalence. @fr
deprecated: true
one of: man/male
one of: Male
term status: deprecated
in scheme: textual label

Male
is replaced by: man/male
in dataset: The CWRC Ontology
type: Thing
type: Concept
comment: Deprecated in favour of instance man/male.
comment: Désapprouver en faveur de l'instance homme/mâle. @fr
label: Mâle @fr
deprecated: true
term status: deprecated

Malthusianism
in dataset: The CWRC Ontology
type: political affiliation
type: Concept
comment: La description de ce terme est basée sur celle de DBPedia. @fr
comment: The description for this term is indebted to DBpedia.
label: Malthusianisme @fr
alternative label: neo-Malthusianism
definition: "Malthusianism is a school of ideas derived from the political/economic thought of the Reverend Thomas Robert Malthus, as laid out in his 1798 writings, An Essay on the Principle of Population, which describes how unchecked population growth is exponential while the growth of the food supply was expected to be arithmetical. Malthus believed there were two types of "checks" that could then reduce the population, returning it to a more sustainable level. He believed there were "preventive checks" such as moral restraints (abstinence, delayed marriage until finances become balanced), and restricting marriage against persons suffering poverty or defects. Malthus believed in "positive checks", which lead to 'premature' death: disease, starvation, war, resulting in what is called a Malthusian catastrophe. The catastrophe would return population to a lower, more "sustainable", level. The term has been applied in different ways over the last two hundred years, and has been linked to a variety of other political and social movements, but almost always refers to advocates of population control. Neo-Malthusianism generally refers to people with the same basic concerns as Malthus, who advocate population control programs, to ensure resources for current and future populations. In Britain the term Malthusian can also refer more specifically to arguments made in favour of preventive birth control, hence organizations such as the Malthusian League. Neo-Malthusians seem to differ from Malthus's theories mainly in their enthusiasm for contraception. Malthus, a devout Christian, believed that "self-control" (abstinence) was preferable to artificial birth control. In some editions of his essay, Malthus did allow that abstinence was unlikely to be effective on a wide scale, thus advocating the use of artificial means of birth control as a solution to population "pressure". Modern "neo-Malthusians" are generally more concerned than Malthus was, with environmental degradation and catastr…
definition: «Le malthusianisme est une politique prônant la restriction démographique, inspirée par les travaux de l'économiste britannique Thomas Malthus (1766â1834). Le terme est utilisé pour la première fois par Pierre-Joseph Proudhon en 1849. Ã l'origine doctrine hostile Ã l'accroissement de la population d'un territoire ou d'un Ãtat et préconisant la restriction volontaire de la natalité, le mot « malthusianisme » désigne aussi par extension toute attitude réservée devant la vie et le développement.» (DBpedia, 2018) @fr
in scheme: political affiliation

man
in dataset: The CWRC Ontology
represented by: man
type: gender
type: Concept
label: homme @fr
alternative label: male
definition: Indicates identification with or labelling as the gender man, and who is often but not necessarily understood to be sexed male. Where terms associated with this label are applied to younger individuals, âboyâ is understood to apply for âmanâ.
definition: Indique l'identification ou l'assignation au genre masculin, et qui est souvent mais non nécessairement de sexe masculin. @fr
in scheme: gender

man
in dataset: The CWRC Ontology
represents: cis man/cis male
represents: man
represents: trans man/trans male
type: textual label
type: Concept
label: homme @fr
definition: A subclass of textual label, this discursive label reflects the ambiguity of manhood, masculinity, or maleness as associated with different cultural forms. It provides a means of aggregating and searching multiple instances of "man" (e.g. man, cis man/cis male) cultural identities. Where associated terms are applied to younger individuals, gendered variants, such as âboyâ for âmanâ, are understood to apply.
definition: Une sous-classe d'étiquettes textuelles, cette étiquette discursive reflète l'ambiguité de la masculinité, ou de la virilité. Elle permet de compiler et de rechercher les multiples instances d'identités culturelles «masculines» (par exemple homme, homme cisgenre). @fr
in scheme: textual label

manager
in dataset: The CWRC Ontology
type: occupation
type: Concept
alternative label: factory manager
alternative label: factory supervisor
alternative label: managed
alternative label: office manager
alternative label: supervisor
hidden label: shipping company manager
hidden label: supervising
hidden label: vice president of beauty without cruelty
in scheme: occupation

managerial
in dataset: The CWRC Ontology
type: social class
type: Concept
label: cadre @fr
alternative label: MANAGERIAL
definition: Cette classe réfère Ã ceux dont «la situation sociale est dûe Ã l'administration d'une structure dans laquelle ils n'investissent pas leurs propres fonds, par exemple les salariés du service civique, les banquiers, les administrateurs d'hôpitaux.» (Brown, 2006) @fr
definition: This class refers to those whose "station in life comes from the fact that they are running something but not putting their money into it, for instance salaried civil service, bankers, or hospital administrators." (Brown, 2006)
in scheme: social class

manservant
in dataset: The CWRC Ontology
type: occupation
type: Concept
alternative label: butler
alternative label: chauffeur
alternative label: doorman
alternative label: footman
alternative label: groom
broader transitive: servant
in scheme: occupation

manual labourer
in dataset: The CWRC Ontology
type: occupation
type: Concept
alternative label: day labourer
alternative label: field labourer
alternative label: labourer
alternative label: manual worker
in scheme: occupation

manufacturer
in dataset: The CWRC Ontology
type: occupation
type: Concept
alternative label: co operative manufacturer
alternative label: cutler
alternative label: lime manufacturer
alternative label: manufacturer of machinery
alternative label: smallware manufacturing
alternative label: tobacco manufacturer
hidden label: jet ornament manufacturer
hidden label: manufacturer of fancy goods
in scheme: occupation

Maoism
in dataset: The CWRC Ontology
type: political affiliation
type: Concept
comment: La description de ce terme est basée sur celle de DBPedia. @fr
comment: The description for this term is indebted to DBpedia.
label: Maoïsme @fr
alternative label: chinese communism
definition: "Mao Zedong Thought (simplified Chinese: æ¯æ³½ä¸ææ³; traditional Chinese: æ¯æ¾¤æ±ææ³; pinyin: Máo ZédÅng SÄ«xiÇng), or Maoism, is a political theory derived from the teachings of the Chinese political leader Mao Zedong (1893â1976). Its followers, known as Maoists, consider it an anti-Revisionist form of MarxismâLeninism. Developed from the 1950s until the Deng Xiaoping reforms in the 1970s, it was widely applied as the guiding political and military ideology of the Communist Party of China (CPC), and as theory guiding revolutionary movements around the world. The essential difference between Maoism and other forms of Marxism is that Mao claimed that peasants should be the essential revolutionary class in China, because, contrary to their industrial working "comrades," they were more suited to establishing a successful revolution and socialist society in China." (DBpedia, 2017)
definition: «Le maoïsme (en chinois : æ¯æ³½ä¸ææ³, pinyin : Máo ZédÅng sÄ«xiÇng, «pensée Mao-Zedong») est un courant du communisme développé au XXe siècle par Mao Zedong, chef du Parti communiste chinois, qui arrive au pouvoir en Chine en 1949, au terme d'une longue guerre civile contre le Guomindang. Comme Lénine dit avoir adapté les théories de Karl Marx Ã la Russie, Mao déclare adapter les théories de Marx et de Lénine Ã la situation politique et économique de la Chine du XXe siècle. Au sortir de la Seconde Guerre mondiale, Mao affirme vouloir émanciper la population chinoise Ã la fois de l'impérialisme occidental et du confucianisme. Au moment de la rupture sino-soviétique, Mao se réclame d'une lecture «anti-révisionniste» du marxisme-léninisme et refuse de suivre un processus parallèle Ã la déstalinisation, poussant la Chine encore plus loin sur la voie du quadrillage total de la société par le Parti et du culte de sa personnalité. Le maoïsme, même si la tendance pro-soviétique reste largement majoritaire au sein du communisme mondial, commence alors Ã la concurrencer, et de multiples groupes Ã travers le monde se réclament de Mao et de sa vision tiers-mondiste et «anti-impérialiste». L'Albanie d'Enver Hoxha devient même un pays satellite de la Chine. Après la mort de Mao en 1976, le maoïsme est, en République populaire de Chine, progressivement vidé de sa substance idéologique même si le PCC continue de se réclamer officiellement de la «pensée Mao-Zedong». En revanche, des groupes maoïstes, d'importance très inégale, continuent d'exister Ã travers le monde, notamment des groupes armés de l'Inde, du Népal et d'Amérique latine. En Occident, le maoïsme intellectuel a fait long feu, ses adeptes (dont le philosophe Jean-Paul Sartre) ayant dans leur immense majorité changé d'opinions après la mort de Mao ; il est considéré par les historiens d'aujourd'hui comme une idéologie totalitaire comparable au stalinisme.» (DB… @fr
in scheme: political affiliation

mapping
in dataset: The CWRC Ontology
type: occupation
type: Concept
alternative label: cartographer
alternative label: topographer
in scheme: occupation

marriage law reform
in dataset: The CWRC Ontology
type: political affiliation
type: Concept
comment: The description for this term is indebted to DBpedia.
label: réforme du mariage @fr
alternative label: custody rights
alternative label: divorce reform activist
alternative label: divorce reformer
alternative label: marriage law reformer
alternative label: marriage reformer
alternative label: married women's property supporter
alternative label: maternal wage activist
alternative label: pro-divorce
broader transitive: social reform
definition: Advocacy or activism related to the reform of laws related to marriage and divorce, including education, marital rape, wages for housework and childrearing, property law, child custody, and civil rights.
definition: Militantisme ou activisme lié aux réformes des lois concernant le mariage et le divorce, comprenant l'éducation, le viol conjugal, la répartition des tâches domestiques et de l'éducation des enfants, la propriété, la garde des enfants et les droits civiques. @fr
in scheme: political affiliation

martyr
in dataset: The CWRC Ontology
type: occupation
type: Concept
in scheme: occupation

Marxism
in dataset: The CWRC Ontology
type: political affiliation
type: Concept
comment: La description de ce terme est basée sur celle de DBPedia. @fr
comment: The description for this term is indebted to DBpedia.
label: Marxisme @fr
alternative label: marxist
definition: "Marxism is a method of socioeconomic analysis that analyzes class relations and societal conflict using a materialist interpretation of historical development and a dialectical view of social transformation. It originates from the mid-to-late 19th century works of German philosophers Karl Marx and Friedrich Engels. Marxist methodology originally used a method of economic and sociopolitical inquiry known as historical materialism to analyze and critique the development of capitalism and the role of class struggle in systemic economic change. According to Marxist perspective, class conflict within capitalism arises due to intensifying contradictions between the highly productive mechanized and socialized production performed by the proletariat, and the private ownership and appropriation of the surplus product (profit) by a small minority of the population who are private owners called the bourgeoisie. As the contradiction becomes apparent to the proletariat through the alienation of labor, social unrest between the two antagonistic classes will intensify, until it culminates in social revolution. The eventual long-term outcome of this revolution would be the establishment of socialism â a socioeconomic system based on social ownership of the means of production, distribution based on one's contribution, and production organized directly for use. As the productive forces and technology continued to advance, Marx hypothesized that socialism would eventually give way to a communist stage of social development, which would be a classless, stateless, humane society erected on common ownership and the principle of "From each according to his ability, to each according to his needs". Marxism has since developed into different branches and schools of thought, and there is now no single definitive Marxist theory. Different Marxian schools place a greater emphasis on certain aspects of classical Marxism while de-emphasising or rejecting other aspects, and sometimes combine Ma…
definition: «Le marxisme est un courant de pensée politique, sociologique et économique fondé sur les idées de Karl Marx (et dans une moindre mesure de Friedrich Engels) et de ses continuateurs. Politiquement, le marxisme repose sur la participation au mouvement réel de la lutte des classes, afin d'arriver Ã une société sans classes en tant qu'alternative au capitalisme. En effet, Karl Marx considère que «l'émancipation des travailleurs doit être l'Åuvre des travailleurs eux-mêmes».» (DBpedia, 2017) @fr
in scheme: political affiliation
related: revolutionary

mason
in dataset: The CWRC Ontology
type: occupation
type: Concept
alternative label: stonemason
broader transitive: skilled trade
in scheme: occupation

master or mistress of the revels
in dataset: The CWRC Ontology
type: occupation
type: Concept
alternative label: master of the revels
alternative label: mistress of the revels
hidden label: master of the revels in ireland
in scheme: occupation
related: government
related: theatre work

master's degree
in dataset: The CWRC Ontology
type: credential
type: Concept
comment: La description de ce terme est basée sur celle de DBPedia. @fr
comment: The description for this term is indebted to DBpedia.
label: Master (diplôme ou grade universitaire) @fr
alternative label: MA
alternative label: MA (a first degree in Scotland)
alternative label: MA degree
alternative label: MA in Canadian Literature
alternative label: MA in Classics
alternative label: MA in English
alternative label: MA in English literature
alternative label: MA in English.
alternative label: MA in philosophy and literature
alternative label: MA in psychology
alternative label: MLitt
alternative label: MPhil in Medieval Literature
alternative label: MSc
alternative label: Master's degree
alternative label: Masters Degree
alternative label: master's degree in Public Health
broader transitive: postgraduate degree
definition: "A master's degree (from Latin magister) is a second-cycle academic degree awarded by universities upon completion of a course of study demonstrating mastery or a high-order overview of a specific field of study or area of professional practice. A master's degree normally requires previous study at the bachelor's level, either as a separate degree or as part of an integrated course. Within the area studied, master's graduates are expected to possess advanced knowledge of a specialized body of theoretical and applied topics; high order skills in analysis, critical evaluation, or professional application; and the ability to solve complex problems and think rigorously and independently." (DBpedia, 2018)
definition: «Le terme master signifie « maître » en anglais. Ã cause de l'influence de l'anglais dans l'enseignement supérieur, un certain nombre de pays non-anglophones ont introduit dans leur langue le mot master ou master's degree pour renommer des grades ou diplômes préexistant ou bien pour nommer de nouveaux diplômes. Ceci s'est fait parfois en conservant le terme « maîtrise » comme intitulé d'autres diplômes. Peuvent donc coexister, comme en France, un diplôme dénommé « master » et un diplôme dénommé « maîtrise ». Les grades ou diplômes dont le nom est une traduction de « maître » ou « maîtrise » sont traités dans l'article maîtrise.» (DBpedia, 2018) @fr
in scheme: credential

mathematics
in dataset: The CWRC Ontology
type: occupation
type: Concept
alternative label: amateur mathematician
alternative label: mathematical interests
alternative label: mathematician
broader transitive: scientist
in scheme: occupation

matron
in dataset: The CWRC Ontology
type: occupation
type: Concept
alternative label: house mother
alternative label: housemother
alternative label: school matron
alternative label: workhouse matron
in scheme: occupation

mayor
in dataset: The CWRC Ontology
type: occupation
type: Concept
alternative label: lady mayoress
alternative label: lord mayor
broader transitive: politics
hidden label: lord mayor of london
hidden label: mayor of cork
hidden label: mayor of norwich
hidden label: mayor of their home town
in scheme: occupation

medical degree
in dataset: The CWRC Ontology
type: credential
type: Concept
comment: The description for this term is indebted to DBpedia.
broader transitive: professional degree
definition: "A medical degree is a vocational, or even technical, degree awarded for studies in fields associated with medicine and surgery. A study conducted in 2011 that involved more than 1000 medical schools throughout the world indicated on average, 64 university exams, 130 series exams, and 174 assignments are completed over the course of 5.5 years. Students need more than 85% marks in prerequisite courses in order to get enrolled for the aptitude test for these degree programs. They then have to pass the test with 85% to 90% marks, which is high compared with all the other bachelor's degree programs. The World Health Organization has granted international recognition to certain widely offered conventional medical degrees. Degrees recognized internationally by the AVICENNA Directory for medicine/International Medical Education Directory." (DBpedia, 2018)
in scheme: credential

medical doctor
in dataset: The CWRC Ontology
type: occupation
type: Concept
alternative label: cardiologist
alternative label: doctor
alternative label: eye and ear specialist
alternative label: eye surgeon
alternative label: gastric surgeon
alternative label: general practitioner
alternative label: gynaecologist
alternative label: homeopathic doctor
alternative label: immunologist
alternative label: medical practice
alternative label: medical practitioner
alternative label: obstetrician
alternative label: orthopaedic surgeon
alternative label: physician
alternative label: royal physician
alternative label: surgeon
alternative label: surgeon general
alternative label: surgery
broader transitive: healthcare provider
hidden label: physician, surgeon
in scheme: occupation

medium certainty
in dataset: The CWRC Ontology
type: certainty
type: precision
label: probabilité moyenne @fr
definition: A predefined value of certainty that represents cases where where an assertion, description, identification, value, or measurement is considered of medium quality. Equivalent to the "medium" value for certainty or precision of the Text Encoding Initiative.
definition: Une valeur de probabilité prédéfinie utilisée dans le cas où un fait est considéré comme une information de qualité moyenne. @fr

member of parliament
in dataset: The CWRC Ontology
type: occupation
type: Concept
alternative label: mp
broader transitive: higher government
broader transitive: politics
hidden label: conservative mp
hidden label: labour mp
hidden label: liberal member of parliament
hidden label: liberal mp
hidden label: member of parliament and politician
hidden label: member of parliament for nottingham
hidden label: members of parliament
in scheme: occupation

mental health professional
in dataset: The CWRC Ontology
type: occupation
type: Concept
alternative label: asylum director
alternative label: child psychologist
alternative label: freudian
alternative label: freudian psychoanalyst
alternative label: mental health worker
alternative label: psychiatist
alternative label: psychiatrist
alternative label: psychologist
alternative label: psychotherapist
alternative label: pyschoanalyst
alternative label: therapist
in scheme: occupation

mentor
in dataset: The CWRC Ontology
type: occupation
type: Concept
in scheme: occupation

mercer
in dataset: The CWRC Ontology
type: occupation
type: Concept
in scheme: occupation

merchant
in dataset: The CWRC Ontology
type: occupation
type: Concept
alternative label: arms dealer
alternative label: art dealer
alternative label: book dealer
alternative label: cattle dealer
alternative label: china merchant
alternative label: cloth merchant
alternative label: coal merchant
alternative label: corn dealer
alternative label: corn merchant
alternative label: cosmetics merchant
alternative label: cotton merchant
alternative label: dealer
alternative label: dealer in stamps
alternative label: hardware merchant
alternative label: importer
alternative label: international exporter
alternative label: leather merchant
alternative label: linen merchant
alternative label: merchant adventurer
alternative label: merchant in furs
alternative label: merchant's apprentice
alternative label: potato merchant
alternative label: shipping agent
alternative label: silk merchant
alternative label: sugar merchant
alternative label: timber merchant
alternative label: tradesman
alternative label: wine merchant
hidden label: exported textiles to the west indies
hidden label: merchant in liverpool
in scheme: occupation

merchant taylor
in dataset: The CWRC Ontology
type: occupation
type: Concept
broader transitive: tailor
in scheme: occupation

metal work
in dataset: The CWRC Ontology
type: occupation
type: Concept
alternative label: brass worker
alternative label: iron manufacturer
alternative label: metal manufacturer
alternative label: sheet metal worker
alternative label: silver manufacturer
alternative label: steel worker
in scheme: occupation

metallurgy
in dataset: The CWRC Ontology
type: occupation
type: Concept
alternative label: assayer
alternative label: metallurgist
in scheme: occupation

meteorologist
in dataset: The CWRC Ontology
type: occupation
type: Concept
in scheme: occupation

Methodism
in dataset: The CWRC Ontology
type: religion
type: Concept
label: Ãglise méthodiste @fr
alternative label: Methodist Church
broader transitive: Dissent (Protestant)
definition: "Or United Methodists, an English Nonconformist community formed in 1907 by the union of the Methodist New Connexion (1797), the Bible Christians (1815), and the United Methodist Free Churches (1857). The act of parliament which enabled this amalgamation received the royal assent on the 26th of July 1907, and authorized the union "to deal with real and personal property belonging to the said three churches or denominations, to provide for the vesting of the said property in trust for the United Church so formed and for the assimilation of the trusts thereof, and for other purposes." The union was completed on the 16th of September 1907 in Wesley's Chapel, City Road, London." (Encyclopedia Britannica, 1911)
definition: Issu d'un schisme avec l'Ãglise anglicane, le méthodisme est un courant du protestantisme regroupant de nombreuses Ãglises d'orientations diverses, mais trouvant leur inspiration dans la prédication de John Wesley au XVIIIe siècle. Aujourd'hui, 80 millions de personnes se revendiquent méthodistes. Historiquement, le méthodisme est l'initiateur et le grand propagateur du Réveil qui va se propager Ã travers le monde, touchant des millions de personnes et revitalisant profondément le protestantisme. @fr
in scheme: religion

Methodist Episcopalian
in dataset: The CWRC Ontology
type: religion
type: Concept
comment: The description for this term is indebted to DBpedia.
broader transitive: Methodism
definition: "The Methodist Episcopal Church (MEC) was the first Methodist denomination founded in the United States. In the early 19th century, it was the largest Protestant denomination in the U.S. The Methodist Episcopal Church existed from 1784 until 1939, when it merged with the Methodist Episcopal Church, South and the Methodist Protestant Church to form the Methodist Church. In 1968, the Methodist Church merged with the Evangelical United Brethren Church to form the present-day United Methodist Church." (DBpedia, 2018)
in scheme: religion

middle
in dataset: The CWRC Ontology
type: birth position
type: Concept
label: cadet·te @fr
definition: Indicates that the subject is the middle child in the family.
definition: Indique que la personne n'est ni l'enfant le plus jeune ni le plus âgé de la famille. @fr
in scheme: birth position

middle class
in dataset: The CWRC Ontology
type: social class
type: Concept
label: classe moyenne @fr
alternative label: bourgeois
alternative label: middle
alternative label: middle classes
alternative label: middle ranks
alternative label: middle-class
alternative label: middling ranks
alternative label: middling sort
definition: "The middle class is a class of people in the middle of a social hierarchy. In Weberian socio-economic terms, the middle class is the broad group of people in contemporary society who fall socio-economically between the working class and upper class. The common measures of what constitutes middle class vary significantly among cultures. A sizable and healthy middle-class can be viewed as a characteristic of a healthy society." (DBpedia, 2018)
definition: «La classe sociale dite « classe moyenne » rassemble un ensemble de populations hétérogènes. Sur une échelle basée principalement sur le niveau de vie, la classe moyenne se situe « au-dessus » des classes pauvres (ou classe ouvrière) et « en dessous » des classes aisées (on parle aussi de classe supérieure ou élite, principalement le patronat et les cadres supérieurs). La question de sa définition exacte reste délicate et explique que l'on parle aussi des « classes moyennes » au pluriel avec une classe moyenne inférieure et une classe moyenne supérieure. Les critères majeurs de définition étant le niveau de vie, autrement dit les revenus mais cela peut également s'élargir au patrimoine, et l'appartenance ressentie Ã un statut social, il est patent que la notion varie suivant les pays et dans le temps.» (DBpedia, 2018) @fr
in scheme: social class

midwife
in dataset: The CWRC Ontology
type: occupation
type: Concept
alternative label: midwifery organizer
broader transitive: healthcare provider
in scheme: occupation

emigrated from
in dataset: The CWRC Ontology
range includes: AdminPlaceConcept
range includes: Feature
type: ObjectProperty
domain: Person
sub property of: inhabited
inverse of: has emigrant
definition: Indicates that a person migrated from this place.

immigrated to
in dataset: The CWRC Ontology
range includes: AdminPlaceConcept
range includes: Feature
type: ObjectProperty
domain: Person
sub property of: inhabited
sub property of: travelled to
inverse of: has immigrant
definition: Indicates that a person immigrated to this place.

migration
in dataset: The CWRC Ontology
range includes: AdminPlaceConcept
range includes: Feature
subject-centric predicate: immigrated to
type: ObjectProperty
sub property of: habitation
sub property of: travel

militarism
in dataset: The CWRC Ontology
type: political affiliation
type: Concept
comment: La description de ce terme est basée sur celle de DBPedia. @fr
comment: The description for this term is indebted to DBpedia.
label: militarisme @fr
alternative label: militarist
definition: "Militarism is the belief or desire of a government or people that a country should maintain a strong military capability and be prepared to use it aggressively to defend or promote national interests; examples of militarist states include North Korea, Nazi Germany, United States of America and Soviet Russia. It may also imply the glorification of the military and of the ideals of a professional military class and the "predominance of the armed forces in the administration or policy of the state" (see also: stratocracy and military junta). Militarism has been a significant element of the imperialist or expansionist ideologies of several nations throughout history. Prominent examples include the Ancient Assyrian Empire, the Greek city state of Sparta, the Roman Empire, the Aztec nation, the Kingdom of Prussia, the Habsburg/Habsburg-Lorraine Monarchies, the British Empire, the Ottoman Empire, the Empire of Japan, the Russian Soviet Federative Socialist Republic (which would later become part of the Soviet Union), the Italian Empire during the reign of Benito Mussolini, Nazi Germany, Israel, United States of America, and the French empire under Napoleon. After World War II, militarism appeared in many of the post-colonial nations of Asia (i.e. North Korea, Pakistan, Burma and Thailand) and Africa (i.e. Liberia, Nigeria and Uganda)." (DBpedia, 2018)
definition: «Le militarisme est une idéologie politique, ou du moins un courant de pensée, qui prône la primauté de la force militaire dans les relations interétatiques et dans l'organisation intraétatique. Il a connu de nombreuses incarnations au cours de l'Histoire. Ses tenants affirment que l'armée est le meilleur instrument au service de la nation.» (DBpedia, 2018) @fr
in scheme: political affiliation

military
in dataset: The CWRC Ontology
type: occupation
type: Concept
alternative label: artillery gunner
alternative label: artillery officer
alternative label: captain of militia
alternative label: colonel
alternative label: deputy lieutenant
alternative label: lieutenant
alternative label: lieutenant general
alternative label: major general
alternative label: military communications
alternative label: military driver
alternative label: military escort
alternative label: military leadership
alternative label: military officer
alternative label: militia captain
alternative label: para military officer
alternative label: quartermaster
alternative label: soldier
alternative label: war hero
hidden label: aide de camp
hidden label: air raid defence provider
hidden label: air raid shelter marshal
hidden label: camouflage worker
hidden label: captain (later admiral)
hidden label: commander of a highland regiment
hidden label: half pay officer
hidden label: non commissioned officer
hidden label: recruiting officer
hidden label: second lieutenant
hidden label: solider
hidden label: territorial soldier
in scheme: occupation

millenarianism
in dataset: The CWRC Ontology
type: religion
type: Concept
type: Organization
comment: La description de ce terme est basée sur celle de DBPedia. @fr
comment: The description for this term is indebted to DBpedia.
label: millénarisme, ou chiliasme @fr
alternative label: milleniarian
definition: "Millenarianism (also millenarism), from Latin mÄ«llÄnÄrius "containing a thousand", is the belief by a religious, social, or political group or movement in a coming major transformation of society, after which all things will be changed. Millenarianism is a concept or theme that exists in many cultures and religions." (DBpedia, 2017)
definition: «Le millénarisme, ou chiliasme (ou encore, mais de façon erronée, chialisme), est une doctrine religieuse qui soutient l'idée d'un règne terrestre du Messie, après que celui-ci aura chassé l'Antéchrist et préalablement au Jugement dernier.Cette pensée est présente dans certains courants du judaïsme, dans l'Apocalypse de Jean, dans les écrits des Pères apostoliques et dans l'islam sunnite et chiite.Toujours par extension, le mot peut servir Ã désigner dans le langage courant des types de pensée non plus religieuses mais politiques.» (DBpedia, 2017) @fr
in scheme: religion

miller
in dataset: The CWRC Ontology
type: occupation
type: Concept
in scheme: occupation

milliner
in dataset: The CWRC Ontology
type: occupation
type: Concept
alternative label: milliner's apprentice
alternative label: milliner's assistant
in scheme: occupation

miner
in dataset: The CWRC Ontology
type: occupation
type: Concept
alternative label: coalminer
alternative label: colliery manager
in scheme: occupation

mining
in dataset: The CWRC Ontology
type: occupation
type: Concept
alternative label: mine agent
alternative label: mine work
hidden label: mining entrepreneur
in scheme: occupation

miscarriage
in dataset: The CWRC Ontology
type: reproductive history
type: Concept
alternative label: miscarried
definition: Related to a miscarriage of a pregnancy.
in scheme: reproductive history

miser
in dataset: The CWRC Ontology
type: occupation
type: Concept
in scheme: occupation

missionary work
in dataset: The CWRC Ontology
type: occupation
type: Concept
alternative label: missionaries
alternative label: missionary
alternative label: missionary administrator
alternative label: missionary supporter
alternative label: missionary worker
broader transitive: religious
hidden label: founded a church missionary society auxiliary
hidden label: supporter of missionary activity
in scheme: occupation

mistress
in dataset: The CWRC Ontology
type: occupation
type: Concept
in scheme: occupation
related: sex worker

mixed-race
in dataset: The CWRC Ontology
represented by: white identity
type: race or colour
type: Concept
comment: La description de ce terme est basée sur celle de DBPedia. @fr
comment: The description for this term is indebted to DBpedia.
label: métis @fr
alternative label: coloured (mixed-race)
alternative label: mixed
alternative label: mixed white and black (or, in her own word, colored)
alternative label: mixed-blood
alternative label: racially mixed
alternative label: red mulatto
broader: SkinColorSimpleWhite
definition: "Multiracial is defined as made up of or relating to people of many races. Many terms exist for people of various multiracial backgrounds. While some of the terms used in the past are considered insulting and offensive, there are many socially acceptable modern terms that multiracial people identify with. These include mixed-race, biracial, multiracial, métis, mestizo, pardo and mixed. Individuals of multiracial backgrounds make up a significant portion of the population in many parts of the world. In North America, studies have found that the multiracial population is continuing to grow. Because of a decline in racial discrimination, multiracial people no longer feel the need to hide their heritage. In many countries of Latin America and the Caribbean, mixed-race people make up the majority of the population. Other areas where multiracial people make up a sizable portion of the population are the United Kingdom, the Middle East, parts of Africa and Asia, New Zealand, and Fiji." (DBpedia, 2017)
definition: «Le terme métis (du mot latin mixtīcius ou mixtus qui signifie «mélangé»/«mêlé») est employé, dans le langage courant, pour désigner des personnes nées de parents aux origines géographiques ou aux phénotypes différents. Le métissage humain est appelé créolisation aux Antilles, Ã La Réunion, Ã l'île Maurice, en Guyane ou au Brésil. Le métissage peut être aussi entendu comme un processus culturel (linguistique, artistiqueâ¦). La pertinence analytique de la notion est contestée par des chercheurs en sciences sociales car elle supposerait qu'il existe des «entités pures», ou des races, distinctes au sein de l'espèce humaine.«Au Canada,»Métis (avec majuscule) désigne un peuple autochtone habitant principalement le centre du pays, descendant des femmes cries, ojibwés, saulteaux et de colons pour la plupart français.» (Wikipedia, 2017) @fr
in scheme: race or colour

model
in dataset: The CWRC Ontology
type: occupation
type: Concept
alternative label: artist's model
alternative label: artists' model
alternative label: fashion model
in scheme: occupation

Mohawk
in dataset: The CWRC Ontology
type: national heritage
type: Concept
comment: La description de ce terme est basée sur celle de DBPedia. @fr
comment: The description for this term is indebted to DBpedia.
label: Mohawks @fr
definition: "The Mohawk people (who identify as Kanien'kehá:ka) are the most easterly tribe of the Haudenosaunee, or Iroquois Confederacy. The name means "People of the Flint Place." They are an Iroquoian-speaking indigenous people of North America. The Mohawk were historically based in the Mohawk Valley in present-day upstate New York west of the Hudson River; their territory ranged north to the St. Lawrence River, southern Quebec and eastern Ontario; south to greater New Jersey and into Pennsylvania; eastward to the Green Mountains of Vermont; and westward to the border with the Iroquoian Oneida Nation's traditional homeland territory. As one of the five original members of the Iroquois League, the Mohawk were known as the Keepers of the Eastern Door. For hundreds of years, they guarded the Iroquois" (DBpedia, 2018)
definition: «Les Kanien'kehá:ka, autrefois dénommés Agniers en français mais aujourd'hui plus connus sous le nom anglais de Mohawks, sont l'une des Six-Nations iroquoises, lesquelles sont, dâouest en est : les Tuscaroras, les Sénécas (Tsonnontouans), les Cayugas (Goyogoins), les Onondagas (Onontagués), les Oneidas (Onnéiouts) et les Mohawks (Agniers).» @fr
in scheme: national heritage

Mohawk
in dataset: The CWRC Ontology
type: national identity
type: Concept
label: mohawk @fr
definition: Indicates a subject's identification with or labelling as Mohawk as a national identity.
definition: Indique qu'un sujet s'identifie Ã ou s'est vu assigner une identité nationale mohawk. @fr
in scheme: national identity

monarch
in dataset: The CWRC Ontology
type: occupation
type: Concept
alternative label: king
alternative label: queen
broader transitive: higher government
in scheme: occupation

monarchism
in dataset: The CWRC Ontology
type: occupation
type: political affiliation
type: Concept
comment: La description de ce terme est basée sur celle de DBPedia. @fr
comment: The description for this term is indebted to DBpedia.
label: Monarchisme @fr
alternative label: constitutional monarchist
alternative label: monarchist
alternative label: royalist
broader transitive: politics
definition: "Monarchism is the advocacy of a monarch or monarchical rule. A monarchist is an individual who supports this form of government, independent of any specific monarch; one who espouses a particular monarch is a royalist. Conversely, the opposition to monarchical rule is sometimes referred to as republicanism. Depending on the country, a monarchist may advocate for the rule of the person who sits on the throne, a pretender, or someone who would otherwise occupy the throne but has been deposed." (DBpedia, 2017)
definition: «Le monarchisme est une doctrine politique qui prône la monarchie, c'est-Ã -dire une forme de gouvernement dans laquelle une seule personne fonde l'autorité de l'Ãtat. Le mode de désignation du monarque n'est pas nécessairement héréditaire : il peut dans de rares cas être élu, comme les empereurs du Saint-Empire romain germanique, les doges de la République de Venise ou (encore actuellement) les Papes de l'Ãglise catholique romaine. Cependant, les mots monarque et monarchisme sont presque toujours utilisés Ã la place de ceux de roi et royalisme, en particulier dans les textes de ceux qui critiquaient la royauté sous l'Ancien Régime. On parle aussi, avec le présidentialisme, de monarchie républicaine.» (DBpedia, 2017) @fr
hidden label: active royalists
hidden label: royalist politician
in scheme: political affiliation

monism
in dataset: The CWRC Ontology
type: religion
type: Concept
comment: La description de ce terme est basée sur celle de DBPedia. @fr
comment: The description for this term is indebted to DBpedia.
label: monisme @fr
alternative label: Monist
broader transitive: Protestantism
definition: "Monism is the view that attributes oneness or singleness (Greek:Î¼ÏÎ½Î¿Ï) to a concept (e.g., existence). Substance monism is the philosophical view that a variety of existing things can be explained in terms of a single reality or substance. Another definition states that all existing things go back to a source that is distinct from them (e.g., in Neoplatonism everything is derived from The One). This is often termed priority monism, and is the view that only one thing is ontologically basic or prior to everything else. Another distinction is the difference between substance and existence monism, or stuff monism and thing monism. Substance monism posits that only one kind of stuff (e.g., matter or mind) exists, although many things may be made out of this stuff. Existence monism posits that, strictly speaking, there exists only a single thing (e.g., the universe), which can only be artificially and arbitrarily divided into many things." (DBpedia, 2018)
definition: «Le monisme est une conception métaphysique. C'est une doctrine défendant la thèse selon laquelle tout ce qui existe â l'univers, le cosmos, le monde â est essentiellement un tout unique, donc notamment constitué d'une seule substance. Le monisme s'oppose Ã toutes les philosophies dualistes, qui séparent monde matériel ou physique et monde psychique ou spirituel. Ainsi, le monisme s'oppose au dualisme platonicien ou cartésien.» (DBpedia, 2018) @fr
in scheme: religion

Moravian
in dataset: The CWRC Ontology
type: religion
type: Concept
comment: La description de ce terme est basée sur celle de DBPedia. @fr
comment: The description for this term is indebted to DBpedia.
label: Frères moraves @fr
definition: "The Moravian Church (Latin: Unitas Fratrum, meaning Unity of the Brethren; Czech: Jednota bratrská or Moravští bratÅi), in German known as Herrnhuter Brüdergemeine (meaning Brethren's Congregation from Herrnhut, the place of the church's renewal in the 18th century), is one of the oldest Protestant denominations in the world, with its heritage dating back to the Bohemian Reformation in the fifteenth century. The name by which the Church is commonly known comes from the original exiles who fled to Saxony in 1722 from Moravia to escape religious persecution, but its heritage began in 1457 in Bohemia and its crown lands (Moravia and Silesia), then an autonomous kingdom within the Holy Roman Empire (today the Czech Republic). The modern Unitas Fratrum, with about 750,000 members worldwide, continues to draw on traditions established during the eighteenth century. The Moravians continue their long tradition of missionary work, for example in the Caribbean. This is reflected in their broad global distribution. The Church places a high value on ecumenism, personal piety, missions and music. The Churchâs emblem is the Lamb of God (Agnus Dei) with the flag of victory, surrounded by the Latin inscription: Vicit agnus noster, eum sequamur (English: "Our Lamb has conquered, let us follow Him")." (DBpedia, 2018)
definition: «Les Frères moraves sont une branche du protestantisme issue de Moravie, apparentée aux Frères Tchèques et rassemblée aujourd'hui dans la communion Unitas Fratrum.» (DBpedia, 2018) @fr
in scheme: religion

mother
in dataset: The CWRC Ontology
subject-centric predicate: has mother
type: ObjectProperty
range: Person
sub property of: parent

mother of
in dataset: The CWRC Ontology
type: ObjectProperty
domain: Person
label: mère de @fr
range: Person
sub property of: parent of
inverse of: has mother
broader: children

mountaineering
in dataset: The CWRC Ontology
type: occupation
type: Concept
alternative label: climbing
alternative label: mountain climber
alternative label: mountaineer
broader transitive: sports
hidden label: climber or mountaineer
in scheme: occupation

multiculturalism
in dataset: The CWRC Ontology
type: political affiliation
type: Concept
comment: La description de ce terme est basée sur celle de DBPedia. @fr
comment: The description for this term is indebted to DBpedia.
label: Multiculturalisme @fr
alternative label: multiculturalist
definition: "Multiculturalism describes the existence, acceptance, and/or promotion of multiple cultural traditions within a single jurisdiction, usually considered in terms of the culture associated with an aboriginal ethnic group and foreigner ethnic groups. This can happen when a jurisdiction is created or expanded by amalgamating areas with two or more different cultures (e.g. French Canada and English Canada) or through immigration from different jurisdictions around the world (e.g. Australia, Canada, United States, United Kingdom, and many other countries). Multicultural ideologies and policies vary widely, ranging from the advocacy of equal respect to the various cultures in a society, to a policy of promoting the maintenance of cultural diversity, to policies in which people of various ethnic and religious groups are addressed by the authorities as defined by the group to which they belong. Multiculturalism that promotes maintaining the distinctiveness of multiple cultures is often contrasted to other settlement policies such as social integration, cultural assimilation, and racial segregation. Multiculturalism has been described as a "salad bowl" and "cultural mosaic". Two different and seemingly inconsistent strategies have developed through different government policies and strategies. The first focuses on interaction and communication between different cultures; this approach is also often known as interculturalism. The second centers on diversity and cultural uniqueness which can sometimes result in intercultural competition over jobs among other things and may lead to ethnic conflict. Cultural isolation can protect the uniqueness of the local culture of a nation or area and also contribute to global cultural diversity. A common aspect of many policies following the second approach is that they avoid presenting any specific ethnic, religious, or cultural community values as central." (DBpedia, 2017)
definition: Le multiculturalisme est un terme sujet Ã diverses interprétations. Il peut simplement désigner la coexistence de différentes cultures (ethniques, religieuses, etc.) au sein d'un même ensemble (pays, par exemple). Il peut aussi désigner différentes politiques volontaristes : * anti-discriminatoires, visant Ã assurer un statut social égal aux membres des diverses cultures ; * communautaires, permettant l'existence de statuts (légaux, administratifsâ¦) spécifiques aux membres de telle ou telle communauté culturelle ; * identitaires, visant Ã favoriser l'expression des particularités des diverses cultures ; * et aujourd'hui le multiculturalisme se" centre sur le thème religieux (pluralisme). Multiculturalisme s'oppose Ã interculturalisme. Dans une société interculturelle les immigrés ou leurs descendants participent Ã l'ensemble des activités de la société d'accueil. Une intégration culturelle réussie nécessite l'abandon d'une partie de la culture d'origine qui ne serait pas compatible avec les valeurs de la société d'accueil." (DBpedia, 2017) @fr
in scheme: political affiliation

multiracialism
in dataset: The CWRC Ontology
type: political affiliation
type: Concept
comment: The description for this term is indebted to DBpedia.
label: multiracialisme @fr
alternative label: multi-racialist
definition: "Multiracialism is a concept or ideology that promotes a society composed of various races, while accepting and respecting different cultural backgrounds. It is a society that consists of a diverse mix of people, whether it be relative to their ethnicity, language, culture, religion, or traditions." (DBpedia, 2017)
in scheme: political affiliation

munitions worker
in dataset: The CWRC Ontology
type: occupation
type: Concept
broader transitive: war work
in scheme: occupation

music
in dataset: The CWRC Ontology
type: occupation
type: Concept
alternative label: amateur pianist
alternative label: celloist
alternative label: choirmaster
alternative label: choirmistress
alternative label: church choirmaster
alternative label: composer
alternative label: concert pianist
alternative label: cornet
alternative label: jazz musician
alternative label: musician
alternative label: organist
alternative label: pianist
alternative label: piano tuner
alternative label: violinist
hidden label: cathedral chorister
hidden label: musician, composer
hidden label: playing the piano
in scheme: occupation
related: performer

musicologist
in dataset: The CWRC Ontology
type: occupation
type: Concept
in scheme: occupation

mysticism
in dataset: The CWRC Ontology
type: religion
type: Concept
comment: La description de ce terme est basée sur celle de DBPedia. @fr
comment: The description for this term is indebted to DBpedia.
label: mystique @fr
alternative label: mystic
definition: "Mysticism is popularly known as becoming one with God or the Absolute, but may refer to any kind of ecstasy or altered state of consciousness which is given a religious or spiritual meaning. It may also refer to the attainment of insight in ultimate or hidden truths, and to human transformation supported by various practices and experiences. The term "mysticism" has Ancient Greek origins with various historically determined meanings. Derived from the Greek word Î¼Ï Ï, meaning "to conceal", mysticism referred to the biblical liturgical, spiritual, and contemplative dimensions of early and medieval Christianity. During the early modern period, the definition of mysticism grew to include a broad range of beliefs and ideologies related to "extraordinary experiences and states of mind". In modern times, "mysticism" has acquired a limited definition, with broad applications, as meaning the aim at the "union with the Absolute, the Infinite, or God". This limited definition has been applied to a wide range of religious traditions and practices, valuing "mystical experience" as a key element of mysticism. Since the 1960s scholars have debated the merits of perennial and constructionist approaches in the scientific research of "mystical experiences". The perennial position is now "largely dismissed by scholars," most scholars using a contextual approach, which takes the cultural and historical context into consideration. Broadly defined, mysticism can be found in all religious traditions, from indigenous religions and folk religions like shamanism, to organised religions like the Abrahamic faiths and Indian religions, and modern spirituality, New Age and New Religious Movements." (DBpedia, 2018)
definition: «La mystique ou le mysticisme est ce qui a trait aux mystères, aux choses cachées ou secrètes. Le terme relève principalement du domaine religieux, et sert Ã qualifier ou Ã désigner des expériences spirituelles de l'ordre du contact ou de la communication avec une réalité transcendante non discernable par le sens commun. « Mystique » vient de l'adjectif grec Î¼Ï ÏÏÎ¹ÎºÏÏ (mustikos). C'est un mot de la même famille que le verbe Î¼Ï Î­Ï (muéô) qui signifie « initier, enseigner », et que le nom Î¼Ï ÏÏÎ®ÏÎ¹Î¿Î½ (mustérion) qui a donné « mystère ». Bien qu'il remonte Ã l'Antiquité, le terme mystique n'est employé comme substantif, c'est-Ã -dire comme nom pour désigner « la mystique », que depuis le XVIIe siècle. Avant cela, il n'existe que comme adjectif : est mystique ce qui relève de la connaissance du mystère ou d'un mystère. La notion de mystique a été développée dans le christianisme en rapport avec une conception biblique et plus particulièrement paulinienne du mystère selon laquelle ce dernier s'identifie avec la révélation de Dieu en Jésus-Christ. Avec le sens que l'adjectif mystique reçoit de cette conception du mystère, c'est le christianisme dans son ensemble qui peut être considéré comme mystique. Le christianisme apparaît dans un contexte gréco-romain marqué par la présence de nombreux cultes Ã mystères dont la dimension initiatique trouve des échos dans l'initiation chrétienne par les sacrements (mystérion en grec) et dans la catéchèse « mystagogiques » des premiers temps du christianisme. Par ailleurs, la théologie des Pères de l'Ãglise relève largement des options de la philosophie néoplatonicienne dans laquelle la connaissance de Dieu est apophatique. Le traité De la théologie mystique rédigé en grec au VIe siècle par le pseudo-Denys l'Aréopagite s'inscrit dans cette tradition. Ã partir du XIIe siècle, il a une influence considérable sur les auteurs latins. Au XVe siècle, des débats su… @fr
in scheme: religion

name
in dataset: The CWRC Ontology
subject-centric predicate: has name
type: ObjectProperty
sub property of: biographical relationship

name of
in dataset: The CWRC Ontology
type: ObjectProperty
inverse of: has name

name part of
in dataset: The CWRC Ontology
domain includes: personal name
type: ObjectProperty
inverse of: has name part

national heritage
in dataset: The CWRC Ontology
subject-centric predicate: has national heritage
type: ObjectProperty
domain: Person
label: héritage national @fr
range: national heritage
sub property of: has a cultural form

national heritage of
in dataset: The CWRC Ontology
type: ObjectProperty
domain: national heritage
range: Person
sub property of: cultural form of

national heritage (reported)
in dataset: The CWRC Ontology
subject-centric predicate: has national heritage (reported)
type: ObjectProperty
domain: Person
label: héritage national (déclarée) @fr
range: national heritage
sub property of: national heritage

national heritage (reported) of
in dataset: The CWRC Ontology
type: ObjectProperty
domain: national heritage
range: Person
sub property of: national heritage of

national heritage (self-reported)
in dataset: The CWRC Ontology
subject-centric predicate: has national heritage (self-reported)
type: ObjectProperty
domain: Person
label: héritage national (autodéclarée) @fr
range: national heritage
sub property of: national heritage

national heritage (self-reported) of
in dataset: The CWRC Ontology
type: ObjectProperty
domain: national heritage
range: Person
sub property of: national heritage of

nationalism
in dataset: The CWRC Ontology
type: political affiliation
type: Concept
comment: La description de ce terme est basée sur celle de DBPedia. @fr
comment: The description for this term is indebted to DBpedia.
label: Nationalisme @fr
definition: "Nationalism is a shared group feeling in the significance of a geographical and sometimes demographic region seeking independence for its culture or ethnicity that holds that group together. This can be expressed as a belief or political ideology that involves an individual identifying with or becoming attached to one's nation. Nationalism involves national identity, by contrast with the related concept of patriotism, which involves the social conditioning and personal behaviours that support a state's decisions and actions. From a political or sociological perspective, there are two main perspectives on the origins and basis of nationalism. One is the primordialist perspective that describes nationalism as a reflection of the ancient and perceived evolutionary tendency of humans to organize into distinct groupings based on an affinity of birth. The other is the modernist perspective that describes nationalism as a recent phenomenon that requires the structural conditions of modern society in order to exist. An alternative perspective to both of these lineages comes out of engaged theory, and argues that while the form of nationalism is modern, the content and subjective reach of nationalism depends upon "primordial" sentiments. There are various definitions for what constitutes a nation, however, which leads to several different strands of nationalism. It can be a belief that citizenship in a state should be limited to one ethnic, cultural, religious, or identity group, or that multinationality in a single state should necessarily comprise the right to express and exercise national identity even by minorities.The adoption of national identity in terms of historical development has commonly been the result of a response by influential groups unsatisfied with traditional identities due to inconsistency between their defined social order and the experience of that social order by its members, resulting in a situation of anomie that nationalists seek to resolve. This …
definition: «Le nationalisme est un principe politique, né Ã la fin du XVIIIe siècle, tendant Ã légitimer l'existence d'un Ãtat-nation pour chaque peuple (initialement par opposition Ã la royauté, régime politique qui en France sera ensuite nommé Ancien Régime). Ce principe politique s'est progressivement imposé en Europe au cours du XIXe siècle et au début du XXe siècle. Les historiens ne présentent pas ce nationalisme, en général, comme une idéologie, car il est peu et mal argumenté ou justifié par des intellectuels. Depuis son avènement il est en revanche facilement présenté comme une évidence dans la vie politique et sociale. Ce terme désigne aussi des mouvements politiques déclarant vouloir exalter une nation sous toutes ses formes (Ãtat, culture, religion, traditions, préférence nationale pour l'emploi...), par opposition aux autres nations et populations. Cette deuxième variante du mouvement s'est développée Ã partir de la fin du XIXe siècle, vers 1870 : chauvine et xénophobe, elle trouvait alors ses militants principalement dans la petite bourgeoisie. Le nationalisme apparaît aussi, Ã partir du milieu du XIXe siècle, comme un sentiment national plus ou moins répandu et exalté au sein de la population d'un pays, et s'invitant (surtout au XXe siècle) au sein de multiples doctrines ou idéologies politiques, allant du communisme (par exemple le concept de Patriotisme anti-impérialiste de Mao Zedong) et du fascisme (concept de Totalitarisme anticapitaliste de Benito Mussolini) jusqu'aux démocraties parlementaires, en passant par la Troisième Internationale léniniste. Ainsi il a souvent servi de justification aux épurations ethniques du XXe siècle, peut-être parce que le sentiment national est devenu «puissamment mobilisateur», comme l'avaient compris dès le printemps des peuples de 1848 certains conseillers de dynasties européennes. On distingue en général trois formes principales de nationalisme, le nationalisme ethnique, ou… @fr
in scheme: political affiliation
related: patriotism

national identity
in dataset: The CWRC Ontology
subject-centric predicate: has national identity
type: ObjectProperty
domain: Person
label: nationalité @fr
range: national identity
sub property of: cultural form

national identity of
in dataset: The CWRC Ontology
type: ObjectProperty
domain: national identity
range: Person
sub property of: cultural form of

national identity (reported)
in dataset: The CWRC Ontology
subject-centric predicate: has national identity (reported)
type: ObjectProperty
domain: Person
label: nationalité (déclarée) @fr
range: national identity
sub property of: national identity

national identity (reported) of
in dataset: The CWRC Ontology
type: ObjectProperty
domain: national identity
range: Person
sub property of: national identity of

national identity (self-reported)
in dataset: The CWRC Ontology
subject-centric predicate: has national identity (self-reported)
type: ObjectProperty
domain: Person
label: nationalité (autodéclarée) @fr
range: national identity
sub property of: national identity

national identity (self-reported) of
in dataset: The CWRC Ontology
type: ObjectProperty
domain: national identity
range: Person
sub property of: national identity of

natively known language
in dataset: The CWRC Ontology
subject-centric predicate: natively known language
type: ObjectProperty
domain: Person
label: langue native @fr
range: language
sub property of: language known

natively known language of
in dataset: The CWRC Ontology
type: ObjectProperty
domain: language
range: Person
sub property of: language known of

natively known language (reported)
in dataset: The CWRC Ontology
subject-centric predicate: natively known language (reported)
type: ObjectProperty
domain: Person
label: langue native (déclarée) @fr
range: language
sub property of: natively known language

natively known language (reported) of
in dataset: The CWRC Ontology
type: ObjectProperty
domain: language
range: Person
sub property of: natively known language of

natively known language (self-reported)
in dataset: The CWRC Ontology
subject-centric predicate: natively known language (self-reported)
type: ObjectProperty
domain: Person
label: langue native (autodéclarée) @fr
range: language
sub property of: natively known language

natively known language (self-reported) of
in dataset: The CWRC Ontology
type: ObjectProperty
domain: language
range: Person
sub property of: natively known language of

Natural Religion
in dataset: The CWRC Ontology
type: religion
type: Concept
comment: The description for this term is indebted to DBpedia.
definition: "Natural religion most frequently means the "religion of nature", in which God, the soul, spirits, and all objects of the supernatural are considered as part of nature and not separate from it. Conversely, it is also used in philosophy, specifically Roman Catholic philosophy, to describe some aspects of religion that are knowable apart from divine revelation (see Deism). Most authors consider natural religion as not only the foundation of monotheistic religions such as Judaism, Christianity, and Islam but also distinct from them. Natural religion is found universally among all peoples, often in such forms of shamanism and animism. They are still practiced in many parts of the world. The religions of Native American societies for example are considered natural religions." (DBpedia, 2018)
in scheme: religion

naturalist
in dataset: The CWRC Ontology
type: occupation
type: Concept
in scheme: occupation

naval rating
in dataset: The CWRC Ontology
type: occupation
type: Concept
alternative label: admiral
alternative label: first lord of the admiralty
alternative label: home guard officer
alternative label: lieutenant royal marines
alternative label: merchant navy captain
alternative label: naval administrator
alternative label: naval architect
alternative label: naval captain
alternative label: naval censor
alternative label: naval chaplain
alternative label: naval engineer
alternative label: naval officer
alternative label: naval official
alternative label: naval surgeon
alternative label: navy commissioner
alternative label: navy officer
alternative label: rear admiral
alternative label: vice admiral
hidden label: assistant naval surgeon
hidden label: commander in chief of the portuguese navy
hidden label: united states navy
hidden label: us naval commander
hidden label: us navy
in scheme: occupation

Nazism
in dataset: The CWRC Ontology
contrary to: anti-antisemitism
type: political affiliation
type: Concept
comment: La description de ce terme est basée sur celle de DBPedia. @fr
comment: The description for this term is indebted to DBpedia.
label: Nazisme @fr
alternative label: nazi
alternative label: pro-nazi
definition: "National Socialism (German: Nationalsozialismus), more commonly known as Nazism (/ËnÉËtsÉªzÉm, Ënæ-/), is the ideology and practice associated with the 20th-century German Nazi Party and Nazi state, as well as other far-right groups. Usually characterized as a form of fascism that incorporates scientific racism and antisemitism, Nazism developed out of the influences of Pan-Germanism, the Völkisch German nationalist movement and the anti-communist Freikorps paramilitary groups that emerged during the Weimar Republic after German defeat in World War I. Nazism subscribed to theories of racial hierarchy and Social Darwinism, identifying Germans as part of what Nazis regarded as an Aryan or Nordic master race. It aimed to overcome social divisions and create a homogeneous society, unified on the basis of "racial purity" (Volksgemeinschaft). The Nazis aimed to unite all Germans living in historically German territory, as well as gain additional lands for German expansion under the doctrine of Lebensraum, while excluding those deemed either to be community aliens or belonging to an "inferior" race. The term "National Socialism" arose out of attempts to create a nationalist redefinition of "socialism", as an alternative to both international socialism and free market capitalism. Nazism rejected the Marxist concept of class struggle, opposed cosmopolitan internationalism, and sought to convince all parts of a new German society to subordinate their personal interests to the "common good" and to accept the priority of political interests in economic organisation. The Nazi Party was founded as the Pan-German nationalist and antisemitic German Workers' Party on 5 January 1919. By the early 1920s, Adolf Hitler assumed control of the organisation and renamed it the National Socialist German Workers' Party (Nationalsozialistische Deutsche Arbeiterpartei, NSDAP) to broaden its appeal. The National Socialist Program, adopted in 1920, called for a united Greater Germany that woul…
definition: «Le national-socialisme (en allemand : Nationalsozialismus), plus couramment désigné en français sous l'abréviation nazisme, est l'idéologie politique du Parti national-socialiste des travailleurs allemands (NSDAP), parti politique d'extrême droite fondé en Allemagne en 1920 et dirigé par Adolf Hitler. Cette idéologie théorise une hiérarchie au sein d'une espèce humaine divisée en «races», au sommet de laquelle elle place la «race aryenne». Le nazisme est le seul type de fascisme incorporant Ã la fois racisme biologique et antisémitisme. Par extension, le terme nazisme désigne le régime politique inspiré de cette idéologie, dictature totalitaire et expansionniste dirigée par Adolf Hitler de 1933 Ã 1945 et connue sous les noms de Troisième Reich et d'Allemagne nazie. En tant que sujet de science politique, les définitions du nazisme varient selon les historiens. En particulier, reste ouverte la question de savoir si le nazisme ne fut que l'une des formes du fascisme ou, parce qu'ayant fait du racisme une doctrine d'Ãtat, le nazisme doit être considéré comme un phénomène historique unique. En effet, l'antisémitisme officiel du régime nazi, dès 1933, l'élimination des personnes handicapées et la persécution des opposants politiques, des Juifs, des homosexuels, des Roms, etc., se concrétisèrent par la mise en place, dès 1933, des premiers camps de concentration en Allemagne. Cette politique ne fit que s'amplifier du début de la Seconde Guerre mondiale, qui vit la création des camps d'extermination nazis, jusqu'à la défaite militaire du nazisme en 1945. Ainsi près de six millions de personnes, dont une majorité de Juifs, périrent dans les camps de concentration et d'extermination nazi ou par la Shoah par balles (voir Shoah). Le régime nazi, censé «durer mille ans», en dura douze et laissa l'Allemagne en ruine.» (DBpedia, 2017) @fr
in scheme: political affiliation
related: antisemitism
related: fascism

needlework
in dataset: The CWRC Ontology
type: occupation
type: Concept
alternative label: embroiderer
alternative label: knitting
alternative label: needlewoman
alternative label: needlework artist
in scheme: occupation
related: domestic work

neo-conservatism
in dataset: The CWRC Ontology
type: political affiliation
type: Concept
comment: La description de ce terme est basée sur celle de DBPedia. @fr
comment: The description for this term is indebted to DBpedia.
label: Néo-conservatisme @fr
alternative label: neo-Conservative
broader transitive: conservatism
definition: "Neoconservatism (commonly shortened to neocon) is a political movement born in the United States during the 1960s among conservative leaning Democrats who became disenchanted with the party's foreign policy. Many of its adherents became politically famous during the Republican presidential administrations of the 1970s, 1980s, 1990s and 2000s. Neoconservatives peaked in influence during the administration of George W. Bush, when they played a major role in promoting and planning the 2003 invasion of Iraq. Prominent neoconservatives in the George W. Bush administration included Paul Wolfowitz, John Bolton, Elliott Abrams, Richard Perle, and Paul Bremer. Senior officials Vice President Dick Cheney and Secretary of Defense Donald Rumsfeld, while not identifying as neoconservatives, listened closely to neoconservative advisers regarding foreign policy, especially the defense of Israel and the promotion of democracy in the Middle East. The term "neoconservative" refers to those who made the ideological journey from the anti-Stalinist Left to the camp of American conservatism. Neoconservatives typically advocate the promotion of democracy and promotion of American national interest in international affairs, including by means of military force, and are known for espousing disdain for communism and for political radicalism. The movement had its intellectual roots in the Jewish monthly review magazine Commentary, published by the American Jewish Committee. They spoke out against the New Left and in that way helped define the movement. C. Bradley Thompson, a professor at Clemson University, claims that most influential neoconservatives refer explicitly to the theoretical ideas in the philosophy of Leo Strauss (1899â1973),though in doing so they may draw upon meaning that Strauss himself did not endorse." (DBpedia, 2017)
definition: «Le néo-conservatisme ou néoconservatisme est un courant de pensée politique d'origine américaine apparu Ã la fin du XXe siècle. Il s'agit d'une conception qui a émergé aux Ãtats-Unis par opposition au relativisme culturel et Ã la contre-culture de la Nouvelle gauche («New Left») des années 1960. Cette philosophie a influencé les politiques menées par George W. Bush, signifiant un réalignement de la politique américaine, et le passage de quelques libéraux sociaux Ã la droite du spectre politique, d'où le terme qui fait référence aux «nouveaux» conservateurs. Ã l'origine, le terme néo-conservateur était utilisé pour critiquer les sociaux-libéraux qui sont passés du côté du Parti républicain. Michael Harrington, un social-démocrate, a forgé l'usage du mot néo-conservateur en 1973 dans Dissent, un magazine sur les politiques de protection sociale. Selon E. J. Dionne, le néo-conservatisme est né sur le principe que le social-libéralisme a échoué. Le premier théoricien néo-conservateur Ã avoir adopté ce mot et qui est considéré comme le fondateur de cette idéologie est Irving Kristol et père de William Kristol, fondateur du think-tank «néo-conservateur» Project for the New American Century. Irving Kristol a été un militant trotskyste actif pendant sa jeunesse et a exposé ses vues néoconservatrices en 1979 dans l'article Confessions of a True, Self-Confessed 'Neoconservative'. Les idées de Kristol sont influentes depuis les années 1950 quand il a cofondé et édité le magazine Encounter. Un autre idéologue de ce mouvement était Norman Podhoretz, éditeur au magazine Commentary de 1960 Ã 1995. En 1982, Podhoretz se désignait déjà comme un néo-conservateur dans un article du New York Times Magazine intitulé The Neoconservative Anguish over Reagan's Foreign Policy. La doctrine Reagan était considérée comme anticommuniste et en opposition avec l'influence mondiale de l'URSS. Elle était au centre de la politique Ã… @fr
in scheme: political affiliation

Neo-thomism
in dataset: The CWRC Ontology
type: religion
type: Concept
comment: La description de ce terme est basée sur celle de DBPedia. @fr
comment: The description for this term is indebted to DBpedia.
label: néothomisme @fr
broader transitive: Roman Catholicism
definition: "Neo-Scholasticism (also known as neo-scholastic Thomism or neo-Thomism because of the great influence of the writings of St. Thomas Aquinas on the movement), is a revival and development of medieval scholasticism in Roman Catholic theology and philosophy which began in the second half of the 19th century." (DBpedia, 2017)
definition: «Â«Courant de pensée philosophico-théologique de type thomiste, développé Ã partir XIXe siècle pour répondre aux objections posées au christianisme catholique par la modernité.»(DBpedia, 2017) @fr
in scheme: religion

nephew
in dataset: The CWRC Ontology
subject-centric predicate: has nephew
type: ObjectProperty
range: Person
sub property of: relative

nephew of
in dataset: The CWRC Ontology
type: ObjectProperty
domain: Person
label: neveu de @fr
range: Person
sub property of: relative of
inverse of: has nephew
broader: relatedTo

new dealer
in dataset: The CWRC Ontology
type: political affiliation
type: Concept
comment: The description for this term is indebted to DBpedia.
label: défenseur du New Deal @fr
definition: Défenseurs de la politique du New Deal. Voir New Deal â Wikipédia @fr
definition: Supporter of New Deal policies. See New Deal - Wikipedia
in scheme: political affiliation

New Thought
in dataset: The CWRC Ontology
type: religion
type: Concept
comment: La description de ce terme est basée sur celle de DBPedia. @fr
comment: The description for this term is indebted to DBpedia.
label: Nouvelle Pensée @fr
definition: "The New Thought movement is a philosophical movement which developed in the United States in the 19th century, following the teachings of Phineas Quimby. There are numerous smaller groups, most of which are incorporated in the International New Thought Alliance. The concept of New Thought (sometimes known as "Higher Thought") promotes the ideas that Infinite Intelligence, or God, is everywhere, spirit is the totality of real things, true human selfhood is divine, divine thought is a force for good, sickness originates in the mind, and "right thinking" has a healing effect. Although New Thought is neither monolithic nor doctrinaire, in general, modern-day adherents of New Thought believe that God or Infinite Intelligence is "supreme, universal, and everlasting", that divinity dwells within each person, that all people are spiritual beings, that "the highest spiritual principle [is] loving one another unconditionally... and teaching and healing one another", and that "our mental states are carried forward into manifestation and become our experience in daily living". The New Thought movement originated in the early 19th century, and survives to the current day in the form of a loosely allied group of religious denominations, authors, philosophers, and individuals who share a set of beliefs concerning metaphysics, positive thinking, the law of attraction, healing, life force, creative visualization, and personal power. The teachings of Christian Science are similar to and partially based on Quimby's teachings, as its founder, Mary Baker Eddy, was a student of Quimby's." (DBpedia, 2018)
definition: «La Nouvelle Pensée (New Thought), parfois également appelée Penser Nouveau, est un courant de pensée philosophique et religieux qui s'est développé dans la seconde moitié du XIXe siècle aux Ãtats-Unis et existe encore de nos jours. Ce courant, Ã ne pas confondre avec le New Age, couvre un ensemble d'organisations, de philosophes et de théologiens partageant une série de croyances métaphysiques.» (DBpedia, 2018) @fr
in scheme: religion

New Unionism
in dataset: The CWRC Ontology
type: political affiliation
type: Concept
comment: The description for this term is indebted to DBpedia.
alternative label: New Trade Unionism
definition: "New Unionism is a term which has been used twice in the history of the labour movement, both times involving moves to broaden the trade union agenda. Ben Tillett was a prominent leader of the London Dock strike of 1889. He formed the Dock, Wharf, Riverside and General Labourers' Union in 1889, which had support from skilled workers. Its 30,000 members won an advance in wages and working conditions." (DBpedia, 2018)
in scheme: political affiliation

niece
in dataset: The CWRC Ontology
subject-centric predicate: has niece
type: ObjectProperty
range: Person
sub property of: relative

niece of
in dataset: The CWRC Ontology
type: ObjectProperty
domain: Person
label: nièce de @fr
range: Person
sub property of: relative of
inverse of: has niece
broader: relatedTo

nihilism
in dataset: The CWRC Ontology
type: political affiliation
type: Concept
comment: La description de ce terme est basée sur celle de DBPedia. @fr
comment: The description for this term is indebted to DBpedia.
label: Nihilisme @fr
alternative label: nihilist
definition: "Nihilism is a philosophical doctrine that suggests the lack of belief in one or more reputedly meaningful aspects of life. Most commonly, nihilism is presented in the form of existential nihilism, which argues that life is without objective meaning, purpose, or intrinsic value. Moral nihilists assert that morality does not inherently exist, and that any established moral values are abstractly contrived. Nihilism can also take epistemological, ontological, or metaphysical forms, meaning respectively that, in some aspect, knowledge is not possible, or that reality does not actually exist. The term is sometimes used in association with anomie to explain the general mood of despair at a perceived pointlessness of existence that one may develop upon realising there are no necessary norms, rules, or laws. Movements such as Futurism and deconstruction, among others, have been identified by commentators as "nihilistic". Nihilism is also a characteristic that has been ascribed to time periods: for example, Jean Baudrillard and others have called postmodernity a nihilistic epoch, and some Christian theologians and figures of religious authority have asserted that postmodernity and many aspects of modernity represent a rejection of theism, and that such rejection of their theistic doctrine entails nihilism." (DBpedia, 2017)
definition: «Le nihilisme (du latin nihil, «rien») est une doctrine ou attitude, fondée sur la négation de toutes valeurs, croyances ou réalités substantielles. Souvent associé au pessimisme ou au scepticisme radical, le nihilisme nie ou émet des doutes, quant aux causalités, intentionnalités et normativités de l'existence. Cette notion est applicable Ã différents domaines : politique, littéraire, religieux et philosophique. Un mouvement révolutionnaire nihiliste et anarchiste apparut en Russie dans la seconde moitié du XIXe siècle. Il rejetait l'autorité de l'Ãtat, de l'Ãglise orthodoxe et de la famille et revendiquait une organisation de la société basée sur le rationalisme et le matérialisme. Il aboutit vers 1870 au terrorisme radical.» (DBpedia, 2017) @fr
in scheme: political affiliation

nobility
in dataset: The CWRC Ontology
type: social class
type: Concept
label: noblesse @fr
alternative label: NOBILITY
alternative label: royal
alternative label: royal descent
alternative label: royal, but not expected to become queen
alternative label: royalty
definition: Ce groupe réfère aux «personnes qui possèdent un titre, ou dont un membre de la famille proche possède un titre (telle que Lady Mary Wortley Montagu, Lord Byron, ou Nancy Mitford)». @fr
definition: This group refers to "those holding a title or of close family relation to someone holding a title (such as Lady Mary Wortley Montagu, Lord Byron, or Nancy Mitford)". (Brown, 2006)
in scheme: social class

non-erotic relationship
in dataset: The CWRC Ontology
subject-centric predicate: has non-erotic relationship with
type: ObjectProperty
range: Person
sub property of: intimate relationship

nonjurors movement
in dataset: The CWRC Ontology
type: political affiliation
type: Concept
comment: The description for this term is indebted to DBpedia.
label: mouvement du clergé réfractaire @fr
alternative label: Non-jurors
alternative label: nonjurors
broader transitive: Jacobitism
definition: "The nonjuring schism was a split in the Anglican churches of England, Scotland and Ireland in the aftermath of the Glorious Revolution of 1688, over whether William III and Mary II could legally be recognised as sovereigns. The word "nonjuring" means "not swearing [an oath]", from the Latin word iuro or juro meaning "to swear an oath". Many of the Anglican clergy felt legally bound by their previous oaths of allegiance to James II and, though they could accept William as regent, they could not accept him as king. It was not necessarily a split on matters of religious doctrine, but more of a political issue and a matter of conscience, though most of the nonjurors were high church Anglicans. Thus, latitudinarian Anglicans were handed control of the Church of England, while Presbyterians took control of the Church of Scotland. The nonjurors thus were nominally Jacobite, although they generally did not actively support the Jacobite rebellions in 1715 or 1745." (DBpedia, 2017)
in scheme: political affiliation

Norman
in dataset: The CWRC Ontology
type: national heritage
type: Concept
comment: La description de ce terme est basée sur celle de DBPedia. @fr
comment: The description for this term is indebted to DBpedia.
label: Normand @fr
definition: "The Normans (Norman: Nourmands; French: Normands; Latin: Normanni) were the people who in the 10th and 11th centuries gave their name to Normandy, a region in France. They were descended from Norse ("Norman" comes from "Norseman") raiders and pirates from Denmark, Iceland and Norway who, under their leader Rollo, agreed to swear fealty to King Charles III of West Francia. Through generations of assimilation and mixing with the native Frankish and Gallo-Roman populations, their descendants would gradually adopt the Carolingian-based cultures of West Francia, ultimately resulting in their own assimilation into the Romance society. The distinct cultural and ethnic identity of the Normans emerged initially in the first half of the 10th century, and it continued to evolve over the succeeding centuries. The Norman dynasty had a major political, cultural and military impact on medieval Europe and even the Near East. The Normans were famed for their martial spirit and eventually for their Christian piety, becoming exponents of the Catholic orthodoxy into which they assimilated. They adopted the Gallo-Romance language of the Frankish land they settled, their dialect becoming known as Norman, Normaund or Norman French, an important literary language. The Duchy of Normandy, which they formed by treaty with the French crown, was a great fief of medieval France, and under Richard I of Normandy was forged into a cohesive and formidable principality in feudal tenure. The Normans are noted both for their culture, such as their unique Romanesque architecture and musical traditions, and for their significant military accomplishments and innovations. Norman adventurers founded the Kingdom of Sicily under Roger II after conquering southern Italy from the Saracens and Byzantines, and an expedition on behalf of their duke, William the Conqueror, led to the Norman conquest of England at the Battle of Hastings in 1066. Norman cultural and military influence spread from these new European …
definition: «Les Normands sont actuellement les habitants de la Normandie, mais le terme désigne aussi historiquement les habitants du duché de Normandie. Autrefois, le mot de Normands était employé pour qualifier les Vikings. C'est pourquoi son étymologie s'explique par le francique ou le scandinave et signifie littéralement « Hommes du nord »Â» (DBpedia, 2018) @fr
in scheme: national heritage

numismatist
in dataset: The CWRC Ontology
type: occupation
type: Concept
in scheme: occupation

nun
in dataset: The CWRC Ontology
type: occupation
type: Concept
alternative label: prioress
in scheme: occupation

nursing
in dataset: The CWRC Ontology
type: occupation
type: Concept
alternative label: carer
alternative label: nurse
alternative label: nursing aide
alternative label: nursing organizer
alternative label: nursing supervisor
alternative label: vad
alternative label: vad worker
broader transitive: healthcare provider
hidden label: fn helped found the east london nursing society.
hidden label: in 1877 she nursed george odger, the first parliamentary labour candidate, during his fatal illness.
hidden label: nurses
in scheme: occupation

Obeah
in dataset: The CWRC Ontology
type: religion
type: Concept
comment: La description de ce terme est basée sur celle de DBPedia. @fr
comment: The description for this term is indebted to DBpedia.
definition: "Obeah (sometimes spelled Obi, Obea, or Obia) is a term used in the West Indies to refer to folk magic, sorcery, and religious practices developed among West African slaves, specifically of Igbo origin. All s Obeah is similar to other Afro-American religions including Palo, Vodou, Santería, and Hoodoo. Obeah is practiced in Jamaica, The Bahamas, Barbados, Belize, Dominica, Grenada, Guyana, Suriname, Trinidad and Tobago and other Caribbean nations. Obeah is associated with both benign and malignant magic, charms, luck, and with mysticism in general. In some Caribbean nations, Obeah refers to folk religions of the African diaspora. In some cases, aspects of these folk religions have survived through syncretism with Christian symbolism and practice introduced by European colonials and slave owners. Casual observation may conclude that Christian symbolism is incorporated into Obeah worship, but in fact may represent clandestine worship and religious protest. During slavery, Obeah was directed against the European slave masters. However, with the end of slavery, Obeah became considered taboo, and the term has pejorative associations." (DBpedia, 2018)
definition: «Obeah (ou appelé également Obi) est un mot d'origine africaine désignant la magie occulte. Le maître spirituel de la religion Obeah est appelé « l'homme Obeah », il est considéré comme un soigneur ou un conseiller (informateur). Il est celui qui aide les personnes possédées par les esprits ou qui ne trouvent pas de remède Ã leur maladie. C'est un esprit qui se manifeste également sous l'apparence d'une femme. Il peut vivre dans certaines eaux selon la tradition des descendants d'esclaves notamment Ã la Martinique. Ceux qui savent l'invoquer en lui offrant du lait, du sucre, du sel, de l'eau pimentée et bien d'autres potions peuvent obtenir des guérissons miraculeuses peu importe la maladie. Son action est quasiment instantanée selon ce que rapportent les pratiquants de son culte. Toutefois, il est extrêmement rare de trouver des initiés connaissant aujourd'hui ces lieux et on trouve encore moins d'adeptes capables de l'appeler du fond de la mer car un non renvoi dans les règles peut-être fatal pour l'opérant. Il a été rapporté dans les écrits de Peter Swontey en 1876 qu'on trouvait généralement dans les mers où il résidait des créateurs semblables Ã des "lézards" d'une allure très particulière. Il est dit que celui qui les péchait risquait sa vie et la récupération des maladies enfouies. Tout cela fait en tout cas partie du folklore des îles et ne saurait constituer une quelconque religion. * Portail des religions et croyances Portail des religions et croyances» (DBpedia, 2018) @fr
in scheme: religion

occultism
in dataset: The CWRC Ontology
type: occupation
type: religion
type: Concept
label: occultism/theosophism
label: occultisme @fr
alternative label: Occultist
alternative label: Tarot card believer
alternative label: Theosophist
alternative label: Theosophy
alternative label: astrologer
alternative label: character reader
alternative label: fortune teller
alternative label: magician
alternative label: medium
alternative label: spiritualism
alternative label: spiritualist
definition: "Any religious or philosophic ideology based on mystical insight into the nature of God and/or divine truth. This insight is attained only through direct experience of the divine. The term is sometimes used to specifically refer to the principles of the Theosophical Society founded in New York in 1875 by Madame Blavatsky and H. S. Olcott which incorporated aspects of Buddhism and Brahmanism." (Getty, 2017)
definition: L'occultisme désigne l'ensemble des arts et sciences occultes (alchimie, astrologie, magie, divination, médecine occulte) touchant aux secrets de la nature, Ã ce qui est non visible. L'expression « sciences occultes » remonterait au titre d'un livre d'Eusèbe de Salverte, en 1829 (Des sciences occultes). Le mot « occultisme » en français ferait son apparition en 1842. Dès 1884 l'occultiste Joséphin Péladan entend par « occultisme » : « l'ensemble des sciences occultes ». En anglais, occultism date de 1881. Le néo-occultisme traite avec Papus des « facultés occultes de l'Homme » et des « forces invisibles de la Nature ». @fr
hidden label: mediumship
hidden label: member of the council of the society for psychical research
hidden label: vice president of the college of psychic studies
in scheme: occupation
in scheme: religion

occupation
in dataset: The CWRC Ontology
subject-centric predicate: has occupation
type: ObjectProperty
range: occupation
sub property of: occupation relationship

occupation income
in dataset: The CWRC Ontology
subject-centric predicate: has occupation income
type: ObjectProperty
range: Literal
sub property of: occupation relationship

occupation income of
in dataset: The CWRC Ontology
type: ObjectProperty
range: Person

occupation of
in dataset: The CWRC Ontology
type: ObjectProperty
domain: occupation
range: Person

occupation relationship
in dataset: The CWRC Ontology
range includes: Work
range includes: AdminPlaceConcept
range includes: Feature
range includes: FormalOrganization
range includes: Person
subject-centric predicate: relates by occupation to
type: ObjectProperty
sub property of: biographical relationship

only child
in dataset: The CWRC Ontology
type: birth position
type: Concept
label: enfant unique @fr
definition: Indicates that the subject is the only child in the family.
definition: Indique que la personne est l'unique enfant de la famille. @fr
in scheme: birth position

opposition politics
in dataset: The CWRC Ontology
type: political affiliation
type: Concept
comment: La description de ce terme est basée sur celle de DBPedia. @fr
comment: The description for this term is indebted to DBpedia.
label: opposition (politique) @fr
alternative label: Opposition
definition: "In politics, the opposition comprises one or more political parties or other organized groups that are opposed to the government (or, in American English, the administration), party or group in political control of a city, region, state or country. It is the party that goes against another party. The degree of opposition varies according to political conditions - for example, across authoritarian and liberal systems where opposition may be repressed or welcomed." (DBpedia, 2018)
definition: «En politique, l'opposition désigne l'ensemble des mouvements qui contestent les décisions des détenteurs du pouvoir. Dans un régime représentatif, l'opposition parlementaire est l'ensemble des partis qui ne forment pas la majorité parlementaire. Dans le système anglo-saxon, en particulier dans le système de Westminster, lâopposition officielle est constituée par le premier parti dâopposition au parlement. * Portail de la politique Portail de la politique» (DBpedia, 2018) @fr
in scheme: political affiliation

optician
in dataset: The CWRC Ontology
type: occupation
type: Concept
alternative label: ophthalmic optician
in scheme: occupation

orderly
in dataset: The CWRC Ontology
type: occupation
type: Concept
alternative label: hospital ward orderly
in scheme: occupation

Members of the Orlando Project
in dataset: The CWRC Ontology
type: Concept
type: Group
label: Les membres du projet Orlando @fr
definition: La collective de tous les auteurs du Projet Orlando. @fr
definition: The collective of all persons having written entries for The Orlando Project.
name: Members of the Orlando Project.

orphanage work
in dataset: The CWRC Ontology
type: occupation
type: Concept
alternative label: orphanage manager
alternative label: orphanage principal
alternative label: orphanage worker
broader transitive: social work
in scheme: occupation

pacifism
in dataset: The CWRC Ontology
type: political affiliation
type: Concept
comment: La description de ce terme est basée sur celle de DBPedia. @fr
comment: The description for this term is indebted to DBpedia.
label: Pacifisme @fr
alternative label: pacifist
alternative label: pacifist supporter
alternative label: peace campaigner
alternative label: peace movement
alternative label: socialist pacifist
definition: "Pacifism is opposition to war, militarism, or violence. The word pacifism was coined by the French peace campaigner Ãmile Arnaud (1864â1921) and adopted by other peace activists at the tenth Universal Peace Congress in Glasgow in 1901. A related term is ahimsa (to do no harm), which is a core philosophy in Buddhism, Jainism, and Hinduism. While modern connotations are recent, having been explicated since the 19th century, ancient references abound. In Christianity, Jesus Christ's injunction to "love your enemies" and asking for forgiveness for his crucifiers "for they know not what they do" have been interpreted as calling for pacifism. In modern times, interest was revived by Leo Tolstoy in his late works, particularly in The Kingdom of God Is Within You. Mohandas Gandhi (1869â1948) propounded the practice of steadfast nonviolent opposition which he called "satyagraha", instrumental in its role in the Indian Independence Movement. Its effectiveness served as inspiration to Martin Luther King Jr., James Lawson, James Bevel, Thich Nhat Hanh and many others in the Civil Rights Movement. Pacifism was widely associated with the much publicized image of Tiananmen Square Protests of 1989 with the "Tank Man", where one protester stood in nonviolent opposition to a column of tanks." (DBpedia, 2017)
definition: «Le pacifisme possède deux acceptions possibles incluant l'action des partisans de la paix, ou une doctrine de la non-violence. Bien que reliés, les deux concepts se distinguent du point de vue de la théorie et de la pratique. Le pacifisme est la doctrine et l'action des partisans de la paix ou du rétablissement de la paix. Les socialistes d'avant 1914 (Jean Jaurès), les Zimmerwaldiens durant la Première Guerre mondiale, les opposants aux guerres coloniales ou les partisans de la paix professent un pacifisme qui n'est pas toujours assimilable Ã la non-violence. La vision du pacifisme associé Ã une personne refusant le recours Ã toutes formes de violence est par contre beaucoup plus répandue. La doctrine de la non-violence voit de nombreux courants philosophiques bannir le recours Ã toute forme de violence en vertu d'un pacifisme radical. Vision portée par de nombreux mouvements et courants de pensée Ã vocation générale (courants de pensée humaniste, plusieurs tendances inspirées de l'hindouisme, courants chrétiens, etc.).» (DBpedia, 2017) @fr
in scheme: political affiliation
related: anti-conscriptionism
related: anti-war movement

pacifist
in dataset: The CWRC Ontology
type: occupation
type: Concept
alternative label: conscientious objector
broader transitive: politics
hidden label: worker for pacifism and the league of nations union
in scheme: occupation
related: pacifism

Pagan
is replaced by: Paganism
in dataset: The CWRC Ontology
type: Concept
comment: Deprecated in favour of instance Paganism.
comment: Désapprouver en faveur de l'instance Paganisme. @fr
label: païen (ou payen) @fr
deprecated: true
term status: deprecated
broader transitive: occultism
definition: "Paganism is a term that developed among the Christian community of southern Europe during late antiquity to describe religions other than their own, Judaism, or Islamâthe three Abrahamic religions. Throughout Christendom, it continued to be used, typically in a derogatory sense. In the 19th century, it was re-adopted as a self-descriptor by members of various artistic groups inspired by the ancient world. In the 20th century, it came to be applied as a self-description by practitioners of contemporary pagan, or neo-pagan, religious movements. There has been much scholarly argument as to the origin of the term paganism. Paganism has also been understood by some[who?] to include any non-Abrahamic religions, but this is generally[who?] seen as insulting by adherents of those religions. While paganism is often considered to exclude monotheism and to express a worldview that is pantheistic, polytheistic, or animistic, there are some monotheistic pagans. Once monotheistic religions, such as Christianity and Islam, started to become more prominent (in processes known as Christianization and Islamization), names to encompass polytheistic worshipers started to develop; some of these include Hellene, pagan, and heathen, and at times these names were used as slurs. Modern knowledge of old pagan religions comes from several sources, including: anthropological field research records, the evidence of archaeological artifacts, and the historical accounts of ancient writers regarding cultures known to the classical world. Before the rise of monotheistic religions, most people practiced some type of polytheism. Many of these religions started to die out, and eventually they became extinct. In some cases, elements of polytheistic belief systems continued to exist in folklore. Paganism would later be studied during the Renaissance and Romantic era. Forms of these religions, influenced by various historical pagan beliefs of pre-modern Europe, exist today and are known as contemporary …
definition: «Paganisme est un terme générique employé depuis le VIe siècle par des chrétiens pour désigner la religion de ceux qui ne sont ni chrétiens, ni juifs, ni musulmans. Il remonte au latin paganus (païen). Au VIe siècle, ce mot pouvait servir Ã désigner les habitants des campagnes par opposition Ã ceux des villes ou bien les civils par opposition aux militaires. D'abord employé comme sobriquet populaire par des chrétiens pour désigner ceux qui ne sont pas baptisés, le terme a ensuite été adopté dans la littérature chrétienne. Même s'il y désigne toujours ceux qui ne sont pas chrétiens, son acception y est cependant ambiguë. Il est parfois employé de façon péjorative pour désigner ceux qui sont tenus pour être des ignorants, parfois de façon neutre pour désigner les philosophes grecs, parfois encore pour désigner des chrétiens jugés mal convertis ou tièdes dans leur foi. Ã partir de 370, des lois impériales regroupées au Ve siècle dans le code théodosien emploient le terme paganus pour désigner ceux qui pratiquent la magie, ceux qui sont considérés comme superstitieux ou dans l'erreur. Le terme a depuis conservé une connotation péjorative. De nombreux Pères de l'Ãglise ayant écrit «contre les païens», le paganisme a eu une première existence sous forme de fiction littéraire, comme s'il s'agissait de la religion de ceux qui ne sont pas chrétiens. Le paganisme tel qu'il a été exposé par les Pères de l'Ãglise n'était cependant pas Ã proprement parler une religion, il s'agit plutôt de l'ensemble sans homogénéité des positions philosophiques et des croyances rejetées par les Pères de l'Ãglise. Le paganisme est ainsi, dans l'antiquité tardive, une attitude combattue par des chrétiens puis par les autorités, mais elle n'est revendiquée par personne. C'est surtout Ã l'époque moderne, avec l'essor de l'histoire des religions que le paganisme commence Ã être perçu et étudié comme une religion parmi d'autres. L… @fr
in scheme: religion

Paganism
in dataset: The CWRC Ontology
type: religion
type: Concept
comment: La description de ce terme est basée sur celle de DBPedia. @fr
comment: The description for this term is indebted to DBpedia.
label: Paganisme @fr
alternative label: pagan (Greek)
definition: "Paganism is a term that developed among the Christian community of southern Europe during late antiquity to describe religions other than their own, Judaism, or Islamâthe three Abrahamic religions. Throughout Christendom, it continued to be used, typically in a derogatory sense. In the 19th century, it was re-adopted as a self-descriptor by members of various artistic groups inspired by the ancient world. In the 20th century, it came to be applied as a self-description by practitioners of contemporary pagan, or neo-pagan, religious movements. There has been much scholarly argument as to the origin of the term paganism. Paganism has also been understood by some to include any non-Abrahamic religions, but this is generally[who?] seen as insulting by adherents of those religions. While paganism is often considered to exclude monotheism and to express a worldview that is pantheistic, polytheistic, or animistic, there are some monotheistic pagans. Once monotheistic religions, such as Christianity and Islam, started to become more prominent (in processes known as Christianization and Islamization), names to encompass polytheistic worshipers started to develop; some of these include Hellene, pagan, and heathen, and at times these names were used as slurs. Modern knowledge of old pagan religions comes from several sources, including: anthropological field research records, the evidence of archaeological artifacts, and the historical accounts of ancient writers regarding cultures known to the classical world. Before the rise of monotheistic religions, most people practiced some type of polytheism. Many of these religions started to die out, and eventually they became extinct. In some cases, elements of polytheistic belief systems continued to exist in folklore. Paganism would later be studied during the Renaissance and Romantic era. Forms of these religions, influenced by various historical pagan beliefs of pre-modern Europe, exist today and are known as contemporary or mod…
definition: «Paganisme est un terme générique employé depuis le VIe siècle par des chrétiens pour désigner la religion de ceux qui ne sont ni chrétiens, ni juifs, ni musulmans. Il remonte au latin paganus (païen). Au VIe siècle, ce mot pouvait servir Ã désigner les habitants des campagnes par opposition Ã ceux des villes ou bien les civils par opposition aux militaires. D'abord employé comme sobriquet populaire par des chrétiens pour désigner ceux qui ne sont pas baptisés, le terme a ensuite été adopté dans la littérature chrétienne. Même s'il y désigne toujours ceux qui ne sont pas chrétiens, son acception y est cependant ambiguë. Il est parfois employé de façon péjorative pour désigner ceux qui sont tenus pour être des ignorants, parfois de façon neutre pour désigner les philosophes grecs, parfois encore pour désigner des chrétiens jugés mal convertis ou tièdes dans leur foi. Ã partir de 370, des lois impériales regroupées au Ve siècle dans le code théodosien emploient le terme paganus pour désigner ceux qui pratiquent la magie, ceux qui sont considérés comme superstitieux ou dans l'erreur. Le terme a depuis conservé une connotation péjorative. De nombreux Pères de l'Ãglise ayant écrit «contre les païens», le paganisme a eu une première existence sous forme de fiction littéraire, comme s'il s'agissait de la religion de ceux qui ne sont pas chrétiens. Le paganisme tel qu'il a été exposé par les Pères de l'Ãglise n'était cependant pas Ã proprement parler une religion, il s'agit plutôt de l'ensemble sans homogénéité des positions philosophiques et des croyances rejetées par les Pères de l'Ãglise. Le paganisme est ainsi, dans l'antiquité tardive, une attitude combattue par des chrétiens puis par les autorités, mais elle n'est revendiquée par personne. C'est surtout Ã l'époque moderne, avec l'essor de l'histoire des religions que le paganisme commence Ã être perçu et étudié comme une religion parmi d'autres. L… @fr
in scheme: religion

paid occupation
in dataset: The CWRC Ontology
subject-centric predicate: has paid occupation
type: ObjectProperty
range: occupation
sub property of: occupation

paid occupation of
in dataset: The CWRC Ontology
type: ObjectProperty
domain: occupation
range: Person
sub property of: occupation of

pantheism
in dataset: The CWRC Ontology
type: religion
type: Concept
comment: La description de ce terme est basée sur celle de DBPedia. @fr
comment: The description for this term is indebted to DBpedia.
label: panthéisme @fr
definition: "Pantheism is the belief that all of reality is identical with divinity, or that everything composes an all-encompassing, immanent god. Pantheists thus do not believe in a distinct personal or anthropomorphic god. In the West, pantheism was formalized as a separate theology and philosophy based on the work of the 17th-century philosopher Baruch Spinoza (also known as Benedict Spinoza), whose book Ethics was an answer to Descartes' famous dualist theory that the body and spirit are separate. Although the term pantheism was not coined until after his death, Spinoza is regarded as its most celebrated advocate. His work, Ethics was the major source from which Western pantheism spread. Pantheistic concepts may date back thousands of years, and some religions in the East continue to contain pantheistic elements." (DBpedia, 2017)
definition: «Le panthéisme est une doctrine philosophique selon laquelle Dieu est tout. Elle se distingue du monothéisme en considérant que Dieu n'est pas un être personnel distinct du monde, mais qu'il est l'intégralité du monde, cette conception est appelée l'immanence par opposition au principe de transcendance du Dieu créateur monothéiste. Ce mot vient du grec ancien pan (Ïá½°Î½) : «tout» et theos (Î¸ÎµÏÏ) («dieu»). Il apparaît pour la première fois en 1720 dans le Pantheisticon de John Toland, ou plus tôt chez Joseph Raphson, en 1697 quand il oppose les panthéistes aux athées et aux matérialistes et les définit comme des penseurs qui affirment qu'il existe une seule substance qui est matérielle et intelligente et qui a tout créé de sa propre substance . Dans la philosophie occidentale, et notamment depuis Spinoza, le sens qui est donné Ã ce mot tout est en général identique Ã celui associé Ã la Nature, au sens le plus général de ce terme, autrement dit, de «tout ce qui existe». Le panthéisme est un naturalisme de la divinité de la Nature. Le naturalisme, au sens propre, peut être défini comme une doctrine athée qui ne reconnaît d'autres principes que les lois ou forces de la Nature. Le panthéisme s'identifie ainsi, sous ce rapport, Ã un naturalisme déiste déterministe en cela qu'il est lié au concept de nécessité. Il ne doit pas être confondu avec le panenthéisme nommé «acosmique» par Hegel (tout est en Dieu) qui est quant une doctrine issue du panthéisme. Il entretient certains rapports avec les courants monistes qui tentent de résoudre les deux termes d'une dualité en faisant sortir l'un des deux termes de cette dualité de l'un des deux termes en opposition.» (DBpedia, 2017) @fr
in scheme: religion

parent
in dataset: The CWRC Ontology
subject-centric predicate: has parent
type: ObjectProperty
range: Person
sub property of: relative

parent of
in dataset: The CWRC Ontology
type: ObjectProperty
domain: Person
label: parent de @fr
range: Person
sub property of: relative of
inverse of: has parent

parish work
in dataset: The CWRC Ontology
type: occupation
type: Concept
alternative label: parish worker
broader transitive: religious
hidden label: management of her husband's parish
in scheme: occupation

parliamentarianism
in dataset: The CWRC Ontology
type: political affiliation
type: Concept
comment: The description for this term is indebted to DBpedia.
label: parlementarisme @fr
alternative label: parliamentarian
alternative label: pro-parliamentarian
definition: Advocacy for parliamentary systems in government. See: Parliamentary system - Wikipedia
definition: Plaidoyer pour les systèmes gouvernementaux parlementaires. Voir Régime parlementaire â Wikipédia @fr
in scheme: political affiliation

parliamentary reform
in dataset: The CWRC Ontology
type: political affiliation
type: Concept
comment: The description for this term is indebted to DBpedia.
label: réforme parlementaire @fr
alternative label: parliamentary reformer
alternative label: pro-reform
definition: Défense de la réforme parlementaire au Royaume-Uni. Voir Representation of the People Act 1918 â Wikipédia et Reform Act 1832 â Wikipédia @fr
definition: Support for reform of the parliamentary system of the United Kingdom. See Reform Bills - Wikipedia; Category:Representation of the People Acts - Wikipedia; Electoral reform - Wikipedia
in scheme: political affiliation

Parsi
in dataset: The CWRC Ontology
type: ethnicity
type: Concept
comment: La description de ce terme est basée sur celle de DBPedia. @fr
comment: The description for this term is indebted to DBpedia.
definition: "Parsi /ËpÉËrsiË/ (or Parsee) is one of two Zoroastrian communities (the other being Iranis) primarily located in South Asia. According to the Qissa-i Sanjan, Parsis migrated from Greater Iran to Gujarat and Sindh between the 8th and 10th century CE to avoid the persecution of Zoroastrians following the Muslim conquest of Persia. The word Ù¾Ø§Ø±Ø³ÛØ§Ù, pronounced "Parsian", i.e. "Parsi" in the Persian language literally means Persian. Persian is the official language of modern Iran, which was formerly known as Persia, and the Persian language's endonym is Farsi, an arabization of the word Parsi." (DBpedia, 2018)
definition: «Les PÄrsis, Parsis ou Parses (de PÄrashika, peuple de Perse, actuel Iran ; gujarÄtÄ« : àªªàª¾àª°àª¸à«) sont les adeptes du parsisme, confession dérivée du zoroastrisme. Ils constituent l'une des deux communautés zoroastriennes (l'autre étant celle des Iranis) ayant quitté le monde iranien pour s'installer principalement en Inde. Ã la suite de la conquête de la Perse par les musulmans qui venaient de subjuguer la Palestine, la Syrie et l'Irak, une partie de la population s'enfuit vers l'est et s'installa en Inde.» (DBpedia, 2018) @fr
in scheme: ethnicity

participant of
in dataset: The CWRC Ontology
type: ObjectProperty
domain: Person
range: event
inverse of: has participant
definition: The event that the Person is associated with.

partner
in dataset: The CWRC Ontology
subject-centric predicate: has partner
type: ObjectProperty
range: Person
sub property of: intimate relationship
sub property of: relative

partner of
in dataset: The CWRC Ontology
type: ObjectProperty
domain: Person
label: conjoint de @fr
range: Person
sub property of: has intimate relationship with
sub property of: relative of
different from: Partnership
inverse of: has partner

paternalism
in dataset: The CWRC Ontology
type: political affiliation
type: Concept
comment: La description de ce terme est basée sur celle de DBPedia. @fr
comment: The description for this term is indebted to DBpedia.
label: paternalisme @fr
alternative label: paternalist
definition: "Paternalism is behavior by an organization or state that limits some person or group's liberty or autonomy for what is presumed to be that person's or group's own good. Paternalism can also imply that the behavior is against or regardless of the will of a person, or also that the behavior expresses an attitude of superiority. The word paternalism is from the Latin pater âfatherâ via the adjective paternus âfatherlyâ; paternalism should be though distinguished from patriarchy. Some, such as John Stuart Mill, think paternalism to be appropriate towards children: "It is, perhaps, hardly necessary to say that this doctrine is meant to apply only to human beings in the maturity of their faculties. We are not speaking of children, or of young persons below the age which the law may fix as that of manhood or womanhood." Paternalism towards adults is sometimes thought to treat them as if they were children." (DBpedia, 2018)
definition: «Le paternalisme est une doctrine politique qui définit comme moralement souhaitable qu'un agent privé ou public puisse décider Ã la place d'un autre pour son bien propre. Cette doctrine s'oppose au libéralisme. Par exemple, quand lâÃtat ou un employeur (comme IBM) interdisait aux agents de fumer ou de boire sur les lieux de travail bien qu'aucune loi n'existe encore sur le sujet, il menait une politique paternaliste. Le point de vue libéral serait qu'on ne doit pas chercher Ã faire le bien d'un individu contre son gré, mais le libéralisme va rarement jusqu'à réclamer la mise en vente libre des drogues dures, ce qui indique quelques nuances. Le nom de paternalisme désigne cette tendance Ã se conduire comme un père envers des personnes même majeures, sur lesquelles on exerce ou souhaite exercer une autorité. Cette attitude peut être volontaire, comme involontaire et inconsciente. Le terme est utilisé dans des domaines comme l'économie, la morale ou la politique. On parle alors de paternalisme économique, moral, politique, social etc. L'attitude paternaliste peut être perçue comme infantilisant ceux qu'elle vise, en particulier pour les personnes n'ayant pas intériorisé les notions d'auto-discipline, ni d'autorité. Ã l'inverse, le fait de considérer celles-ci a priori comme infantiles induira, volontairement ou non, une tendance paternaliste envers elles.» (DBpedia, 2018) @fr
in scheme: political affiliation

patriot
in dataset: The CWRC Ontology
type: occupation
type: Concept
hidden label: irish patriot, nationalist,
in scheme: occupation

patriotism
in dataset: The CWRC Ontology
type: political affiliation
type: Concept
comment: La description de ce terme est basée sur celle de DBPedia. @fr
comment: The description for this term is indebted to DBpedia.
label: Patriotisme @fr
alternative label: patriot
alternative label: patriotic
definition: "Patriotism is an emotional attachment to a nation which an individual recognizes as their homeland. This attachment, also known as national feeling or national pride, can be viewed in terms of different features relating to one's own nation, including ethnic, cultural, political, or historical aspects. It encompasses a set of concepts closely related to those of nationalism. An excess of patriotism in the defense of a nation is called chauvinism; another related term is jingoism. The English term patriot is first attested in the Elizabethan era, via Middle French from Late Latin (6th century) patriota, meaning "countryman", ultimately from Greek ÏÎ±ÏÏÎ¹ÏÏÎ·Ï (patriÅtÄs), meaning "from the same country", from ÏÎ±ÏÏÎ¯Ï (patris), meaning "fatherland". The abstract noun patriotism appears in the early 18th century." (DBpedia, 2017)
definition: «Le patriotisme désigne le dévouement d'un individu envers son pays qu'il reconnait comme étant sa patrie.» (DBpedia, 2017) @fr
in scheme: political affiliation

patron
in dataset: The CWRC Ontology
type: occupation
type: Concept
alternative label: literary patron
alternative label: patron of actors
alternative label: patron of literature
alternative label: patron of science
alternative label: patron of the arts
alternative label: theatre patron
broader transitive: philanthropist
hidden label: charity patron
in scheme: occupation

pawnbroker
in dataset: The CWRC Ontology
type: occupation
type: Concept
in scheme: occupation

Pentecostalism
in dataset: The CWRC Ontology
type: religion
type: Concept
comment: La description de ce terme est basée sur celle de DBPedia. @fr
comment: The description for this term is indebted to DBpedia.
label: Pentecôtisme @fr
alternative label: Pentecostal Evangelists
broader transitive: Protestantism
definition: "Pentecostalism or Classical Pentecostalism is a renewal movement within Protestant Christianity that places special emphasis on a direct personal experience of God through the baptism with the Holy Spirit. The term Pentecostal is derived from Pentecost, the Greek name for the Jewish Feast of Weeks. For Christians, this event commemorates the descent of the Holy Spirit upon the followers of Jesus Christ, as described in the second chapter of the Book of Acts. Like other forms of evangelical Protestantism, Pentecostalism adheres to the inerrancy of scripture and the necessity of accepting Christ as personal Lord and Savior. It is distinguished by belief in the baptism in the Holy Spirit that enables a Christian to live a Spirit-filled and empowered life. This empowerment includes the use of spiritual gifts such as speaking in tongues and divine healingâtwo other defining characteristics of Pentecostalism. Because of their commitment to biblical authority, spiritual gifts, and the miraculous, Pentecostals tend to see their movement as reflecting the same kind of spiritual power and teachings that were found in the Apostolic Age of the early church. For this reason, some Pentecostals also use the term Apostolic or Full Gospel to describe their movement. Pentecostalism emerged in the early 20th century among radical adherents of the Holiness movement who were energized by revivalism and expectation for the imminent Second Coming of Christ. Believing that they were living in the end times, they expected God to spiritually renew the Christian Church thereby bringing to pass the restoration of spiritual gifts and the evangelization of the world. In 1900, Charles Parham, an American evangelist and faith healer, began teaching that speaking in tongues was the Bible evidence of Spirit baptism. The three-year-long Azusa Street Revival, founded and led by William J. Seymour in Los Angeles, California, resulted in the spread of Pentecostalism throughout the United States and the…
definition: «Le pentecôtisme, appelé aussi mouvement de Pentecôte, est un courant chrétien évangélique issu d'un réveil démarré par les pasteurs américains Charles Fox Parham et William Joseph Seymour aux USA en 1906. Ce mouvement se caractérise par l'importance donnée Ã la Bible, Ã la nouvelle naissance, au baptême du Saint-Esprit, aux dons du Saint-Esprit, au baptême adulte en tant que témoignage volontaire, un esprit missionnaire, un engagement moral de vie ainsi que par lâautonomie locale des églises, la séparation de lâÃglise et de lâÃtat. Selon les chiffres du Pew Research Center, en 2011, le mouvement recense 279 millions de croyants. Le pentecôtisme est similaire au mouvement charismatique, mais sâest développé plus tôt (du moins aux Ãtats-Unis) et sâest séparé du courant principal de lâÃglise. Les chrétiens charismatiques, du moins dans les premiers temps de leurs mouvements, tendaient Ã rester dans leurs dénominations respectives.» (DBpedia, 2018) @fr
in scheme: religion

performer
in dataset: The CWRC Ontology
type: occupation
type: Concept
alternative label: acted
alternative label: acting
alternative label: actor
alternative label: actors
alternative label: actress
alternative label: cabaret star
alternative label: comedienne
alternative label: entertainer
alternative label: impersonator
alternative label: mime
alternative label: perform
alternative label: stage performer
alternative label: understudy
in scheme: occupation

persona of
type: ObjectProperty
domain: persona
label: persona de @fr
range: natural person
inverse of: has persona

personal property
in dataset: The CWRC Ontology
type: DeprecatedProperty
comment: Deprecated, with no current equivalence.
comment: Désapprouver sans équivalence. @fr
label: propriété personnelle @fr
deprecated: true
term status: deprecated
definition: A property that is ascribed to a person.
definition: Une propriété qui est attribuée Ã une personne. @fr

personal property (self-reported)
is replaced by: personal property self-reported
in dataset: The CWRC Ontology
type: DeprecatedProperty
comment: Deprecated in favour of instance personal property self-reported.
comment: Désapprouver en faveur de l'instance propriété personnelle autodéclarée. @fr
label: propriété de la personne (autodéclarée) @fr
sub property of: personal property
deprecated: true
term status: deprecated

personal property self-reported
in dataset: The CWRC Ontology
type: DeprecatedProperty
comment: Deprecated, with no current equivalence.
comment: Désapprouver sans équivalence. @fr
label: propriété personnelle autodéclarée @fr
sub property of: personal property
deprecated: true
term status: deprecated
definition: This is a personal property that is self-reported.
definition: Une propriété personnelle autodéclarée. @fr

pharmacist
in dataset: The CWRC Ontology
type: occupation
type: Concept
alternative label: apothecary
alternative label: dispensary assistant
alternative label: dispenser
alternative label: druggist
alternative label: pill dispenser
hidden label: apothecary, druggist
in scheme: occupation

philanthropic visitor
in dataset: The CWRC Ontology
type: occupation
type: Concept
alternative label: benevolent visitor
alternative label: charitable visiting
alternative label: charitable visitor
alternative label: charity visitor
alternative label: colonial health visitor
alternative label: district visitor
alternative label: domestic visitor
alternative label: health visitor
alternative label: hospital visitor
alternative label: military visitor
alternative label: parish visitor
alternative label: poor visitor
alternative label: prison visitor
alternative label: school visitor
alternative label: sick visitor
alternative label: slum visitor
alternative label: social visitor
alternative label: visiting pensioners and war widows
alternative label: visiting prisons and orphanages
alternative label: visiting the poor
alternative label: visitor of the poor
alternative label: workhouse visitor
hidden label: visited the prisoners
hidden label: visiting imprisoned catholics
hidden label: visitor of the poor
hidden label: workhouse superintendent
in scheme: occupation

philanthropist
in dataset: The CWRC Ontology
type: occupation
type: Concept
alternative label: active philanthropist
alternative label: benefactor
alternative label: benefactor of school
alternative label: church donor
alternative label: donor to university
alternative label: educational philanthropist
alternative label: patron of charities
alternative label: philanthopic activity
alternative label: philanthropic educationalist
alternative label: philanthropy
alternative label: private benefactor
hidden label: patron, philanthropist
in scheme: occupation

philosopher
in dataset: The CWRC Ontology
type: occupation
type: Concept
alternative label: academic philosopher
alternative label: amateur philosopher
alternative label: philosophy
in scheme: occupation
related: academic

Philosophical Radicals
in dataset: The CWRC Ontology
type: political affiliation
type: Concept
comment: The description for this term is indebted to DBpedia.
alternative label: Philosophic Radicals
definition: "The Philosophical Radicals was a philosophically-minded group of English political radicals in the nineteenth century inspired by Jeremy Bentham (1748â1832) and James Mill (1773â1836). Individuals within this group included Francis Place (1771â1854), George Grote (1794â1871), Joseph Parkes (1796â1865), John Arthur Roebuck (1802â1879), Charles Buller (1806â1848), John Stuart Mill (1806â1873), Edward John Trelawny (1792â1881), and William Molesworth (1810â1855). Several became Radical members of Parliament, and the group as a whole attempted to use the Westminster Review to exert influence on public opinion. They rejected any philosophical or legal naturalism and furthered Jeremy Bentham's utilitarian philosophy. Utilitarianism as a moral philosophy argues that maximizing happiness should be the moral standard by which our actions should be measured. It thereby stands in contrast to the rationalistic ethics of Immanuel Kant as well as to the convictions of idealism, amongst others." (DBpedia, 2018)
in scheme: political affiliation

photography
in dataset: The CWRC Ontology
type: occupation
type: Concept
alternative label: photographer
alternative label: photographer's assistant
in scheme: occupation

physiognomist
in dataset: The CWRC Ontology
type: occupation
type: Concept
alternative label: phrenologist
hidden label: physiognomy parlour
in scheme: occupation

pilot
in dataset: The CWRC Ontology
type: occupation
type: Concept
in scheme: occupation

plumber
in dataset: The CWRC Ontology
type: occupation
type: Concept
broader transitive: skilled trade
in scheme: occupation

Plymouth Brethren
in dataset: The CWRC Ontology
type: religion
type: Concept
comment: La description de ce terme est basée sur celle de DBPedia. @fr
comment: The description for this term is indebted to DBpedia.
label: Assemblées de Frères @fr
label: Frères de Schwarzenau @fr
broader transitive: Dissent (Protestant)
broader transitive: millenarianism
definition: "The Plymouth Brethren are a conservative, low church, nonconformist, Evangelical Christian movement whose history can be traced to Dublin, Ireland in the late 1820s, originating from Anglicanism. Among other beliefs, the group emphasises sola scriptura, the belief that the Bible is the supreme authority for church doctrine and practice over and above "the [mere] tradition of men" (Mark 7:8). Brethren generally see themselves not as a denomination but as a network, or even as a collection of overlapping networks, of like-minded independent churches. (The Brethren would generally prefer that their gatherings be referred to as "assemblies" rather than "churches" but, in the interests of simplicity, this article uses both terms interchangeably.) The movement refused for many years to take any denominational name to itself, a stance that some still maintain. The title "The Brethren," however, is one that many of their number are comfortable with, in that the Bible designates all believers as "brethren". ("[O]ne is your Master, even Christ; and all ye are brethren." Matthew 23:8)" (DBpedia, 2017)
definition: «Le courant des Assemblées de Frères ou Plymouth Brethren ou encore Frères de Plymouth constitue l'une des branches du protestantisme évangélique. Ce mouvement est né Ã Dublin et en Grande-Bretagne vers 1830 et a connu une importante scission en 1848 qui a abouti Ã distinguer un courant «ouvert» d'une part, les «Open Brethren», et un courant «exclusif» d'autre part, appelé aussi «darbyste». La branche la plus «étroite» a suivi John Nelson Darby et la branche plus ouverte des leaders comme George Müller et Henry Craik. Ces deux courants se sont développés dans le monde et notamment en France pour faire partie des cinq principales dénominations évangéliques sur quarante-trois significatives.» (DBpedia, 2017) @fr
in scheme: religion

poet laureate
in dataset: The CWRC Ontology
type: occupation
type: Concept
in scheme: occupation

Polish nationalism
in dataset: The CWRC Ontology
type: political affiliation
type: Concept
comment: The description for this term is indebted to DBpedia.
label: nationalisme polonais @fr
alternative label: polish nationalist
broader transitive: nationalism
definition: "Polish nationalism is the nationalism that asserts that Poles are a Polish nation, and promotes the cultural unity of Poles. Norman Davies, in the context of Polish nationalism, defined nationalism in general as "a doctrine ... to create a nation by arousing people's awareness of their nationality, and to mobilize their feelings into a vehicle for political action". The old Polish protonationalism of the Polish-Lithuanian Commonwealth based on the Polish-Lithuanian identity was multi-ethnic and multi-religious. The nationalist ideology developed soon after the Partitions was initially free of "ethnic nationalism" of any kind. It was a Romantic movement for the restoration of the Polish sovereign state. Polish Romantic nationalism was described by Maurycy Mochnacki as "the essence of the nation" no longer defined by borders but by ideas, feelings, and thoughts resulting from the past. The birth of modern nationalism under foreign rule coincided with the November Uprising of 1830 and the subsequent Spring of Nations. However, the defeat suffered by the Poles also broke the Polish revolutionary spirit. Many intellectuals turned to social Darwinism of Herbert Spencer, blaming the Romantic philosophy for the loss of their property, mass destruction, and ultimately the loss of the nation. With the advent of Positivism between 1860 and 1890 Polish nationalism became an elitist cause. Because the partitioning powers could not have identified themselves with the Polish nation, therefore the ideology became more restrictive in terms of ethnicity and religion." (DBpedia, 2017)
in scheme: political affiliation

political affiliation
in dataset: The CWRC Ontology
range includes: political affiliation
range includes: political organization
range includes: religion
subject-centric predicate: has political affiliation
type: ObjectProperty
label: une appartenance politique @fr
sub property of: cultural form

political affiliation of
in dataset: The CWRC Ontology
domain includes: political affiliation
domain includes: political organization
type: ObjectProperty
range: Person
sub property of: cultural form of

political affiliation (reported)
in dataset: The CWRC Ontology
range includes: political affiliation
range includes: political organization
range includes: religion
subject-centric predicate: has political affiliation (reported)
type: ObjectProperty
domain: Person
sub property of: political affiliation

political affiliation (reported) of
in dataset: The CWRC Ontology
domain includes: political affiliation
domain includes: political organization
type: ObjectProperty
range: Person
sub property of: political affiliation of

political affiliation (self-reported)
in dataset: The CWRC Ontology
range includes: political affiliation
range includes: political organization
range includes: religion
subject-centric predicate: has political affiliation (self-reported)
type: ObjectProperty
domain: Person
label: une appartenance politique (autodéclarée) @fr
sub property of: political affiliation

political affiliation (self-reported) of
in dataset: The CWRC Ontology
domain includes: political affiliation
domain includes: political organization
type: ObjectProperty
range: Person
sub property of: political affiliation of

politicalHost
in dataset: The CWRC Ontology
type: occupation
type: Concept
alternative label: political host
alternative label: political hostess
hidden label: official hostess at the government house
in scheme: occupation

political involvement in
in dataset: The CWRC Ontology
range includes: political affiliation
range includes: political organization
range includes: religion
subject-centric predicate: has political involvement in
type: ObjectProperty
domain: Person
sub property of: political affiliation

political membership in
in dataset: The CWRC Ontology
range includes: political affiliation
range includes: political organization
range includes: religion
subject-centric predicate: has political membership in
type: ObjectProperty
domain: Person
sub property of: political involvement in

political relationship
in dataset: The CWRC Ontology
range includes: Work
range includes: AdminPlaceConcept
range includes: Feature
range includes: FormalOrganization
range includes: Person
subject-centric predicate: relates by politics to
type: ObjectProperty
sub property of: biographical relationship

political science
in dataset: The CWRC Ontology
type: occupation
type: Concept
alternative label: political scientist
alternative label: political theorist
in scheme: occupation
related: politics

political speaker
in dataset: The CWRC Ontology
type: occupation
type: Concept
alternative label: speaker (parliamentary)
alternative label: speaker of the house of commons
alternative label: speaker of the house of lords
alternative label: speaker of the legislature
broader transitive: politics
broader transitive: public speaker
hidden label: speaker of the senate of northern ireland
in scheme: occupation

politics
in dataset: The CWRC Ontology
type: occupation
type: Concept
alternative label: closet politician
alternative label: election observer
alternative label: left wing politics
alternative label: parliamentary candidate
alternative label: patriot politician
alternative label: political advisor
alternative label: political agent
alternative label: political campaigner
alternative label: political canvasser
alternative label: political conspirator
alternative label: political officer
alternative label: political organizer
alternative label: political organizing
alternative label: political party delegate
alternative label: political party worker
alternative label: political secretary
alternative label: politician
alternative label: public health campaigner
alternative label: republican
alternative label: whig leader
alternative label: whig party supporter
hidden label: advocate of catholic emancipation in the irish parliament
hidden label: american loyalist
hidden label: chief adviser on arab affairs
hidden label: conservative backer of empire
hidden label: politicians
hidden label: president of the british women's temperance league
hidden label: president of the progressive league
hidden label: supporter of the ministry
in scheme: occupation

pollster
in dataset: The CWRC Ontology
type: occupation
type: Concept
in scheme: occupation

poor advocacy
in dataset: The CWRC Ontology
type: political affiliation
type: Concept
comment: The description for this term is indebted to DBpedia.
label: défense des pauvres @fr
alternative label: advocate for the poor
broader transitive: social reform
definition: Advocacy for the poor.
definition: Militantisme en faveur des pauvres. @fr
in scheme: political affiliation

poor law reform
in dataset: The CWRC Ontology
type: political affiliation
type: Concept
comment: The description for this term is indebted to DBpedia.
label: réforme de la Poor Law @fr
alternative label: Poor Law reform
broader transitive: social reform
definition: "From the reign of Elizabeth I until the passage of the Poor Law Amendment Act in 1834 relief of the poor in England was administered on the basis of a Poor Law enacted in 1601. From the start of the nineteenth century the basic concept of providing poor relief was criticised as misguided by leading political economists and in southern agricultural counties the burden of poor-rates was felt to be excessive (especially where poor-rates were used to supplement low wages (the "allowance" or Speenhamland system)). Opposition to the Elizabethan Poor Law led to a Royal Commission on poor relief, which recommended that poor relief could not in the short term be abolished; however it should be curtailed, and administered on such terms that none but the desperate would claim it. Relief should only be administered in workhouses, whose inhabitants were to be confined, "classified" (men, women, boys, girls) and segregated. The Poor Law Amendment Act allowed these changes to be implemented by a Poor Law Commission largely unaccountable to Parliament. The Act was passed by large majorities in Parliament, but the regime it was intended to bring about was denounced by its critics as (variously) un-Christian, un-English, unconstitutional, and impracticable for the great manufacturing districts of Northern England. The Act itself did not introduce the regime, but introduced a framework by which it might easily be brought in. Opposition to the New Poor Law strictly speaking was resistance to the introduction of the New Poor Law administrative framework; this was chiefly encountered in the industrial North in 1837â9 and overcome after a few riots by a judicious mixture of legal threats and deployment of the military. Opposition to the New Poor Law in the looser sense of resistance to (and criticism of) key features of the regime recommended by the Royal Commission persisted and eventually became orthodoxy: for example outdoor relief was never abolished in much of the industrial North. …
in scheme: political affiliation

pornographer
in dataset: The CWRC Ontology
type: occupation
type: Concept
in scheme: occupation

possibly erotic relationship
in dataset: The CWRC Ontology
subject-centric predicate: has possibly erotic relationship with
type: ObjectProperty
range: Person
sub property of: intimate relationship

post-secondary school
in dataset: The CWRC Ontology
subject-centric predicate: attends post-secondary school
type: ObjectProperty
sub property of: school attended

postal worker
in dataset: The CWRC Ontology
type: occupation
type: Concept
alternative label: assistant postmistress
alternative label: letter carrier
alternative label: letter sorter
alternative label: post office clerk
alternative label: post office worker
alternative label: postmaster
alternative label: postmaster general
alternative label: postmistress
hidden label: junior assistant to the postmistress
in scheme: occupation

postgraduate degree
in dataset: The CWRC Ontology
type: credential
type: Concept
alternative label: Agrégation
alternative label: DSc
alternative label: Postgraduate Diploma in Writing for the Stage
alternative label: post-graduate degree in theatre
alternative label: postgraduate degree in teaching
definition: Postgraduate degree.
in scheme: credential

pottery
in dataset: The CWRC Ontology
type: occupation
type: Concept
alternative label: pottery manufacturer
broader transitive: skilled trade
in scheme: occupation

precision of
in dataset: The CWRC Ontology
type: InverseFunctionalProperty
type: ObjectProperty
domain: precision
inverse of: has precision
definition: Links a level of precision to a source

preferred by
in dataset: The CWRC Ontology
type: ObjectProperty
definition: Indicates the authority or institution by which the name form is preferred.

preferred name
in dataset: The CWRC Ontology
subject-centric predicate: preferred by
type: ObjectProperty

Presbyterianism
in dataset: The CWRC Ontology
type: religion
type: Concept
comment: La description de ce terme est basée sur celle de DBPedia. @fr
comment: The description for this term is indebted to the Getty Art & Architecture Thesaurus.
label: Prebyteriaan @nl
label: Presbiterianismo @es
label: Presbytarianisme @fr
label: Presbyterianisme @nl
label: chang lao tsung @zh-latn
label: zhang lao zong @zh-latn
label: zhÇng lÇo zÅng @zh-latn
label: é·èå¶ @zh-hant
label: é·èå® @zh-hant
label: é·èææ @zh-hant
alternative label: Free Church of Scotland
alternative label: Presbyterian Church
broader transitive: Dissent (Protestant)
definition: "Een van de belangrijkste protestantse groeperingen die voortkwamen uit de 16de-eeuwse Reformatie. In het algemeen hebben moderne presbyteriaanse kerken hun oorsprong in de calvinistische kerken op de Britse eilanden, waarvan de Europese tegenhangers bekend zijn geworden onder de meer algemene naam 'gereformeerden'. De term 'presbyteriaans' verwijst ook naar een collegiaal type kerkbestuur onder leiding van pastors en leken die ouderlingen of presbyters worden genoemd. Strikt genomen maken alle presbyteriaanse kerken deel uit van de gereformeerde of calvinistische traditie, maar zijn niet alle gereformeerde kerken presbyteriaans in hun bestuursvorm." (Getty, 2017) @nl
definition: "One of the main Protestant groups that arose out of the 16th-century Reformation. Generally speaking, modern Presbyterian churches trace their origins to the Calvinist churches of the British Isles, the European counterparts of which came to be known by the more inclusive name of Reformed. The term presbyterian also denotes a collegiate type of church government led by pastors and lay leaders called elders or presbyters. Strictly speaking, all Presbyterian churches are a part of the Reformed, or Calvinist, tradition, although not all Reformed churches are presbyterian in their form of government." (Getty, 2017)
definition: "Uno de los principales grupos protestantes que surgió de la Reforma del siglo XVI. Hablando en general, las Iglesias Presbiterianas modernas señalan sus orígenes en las iglesias calvinistas de las Islas Británicas, la contraparte Europea la que fue conocida por el nombre más global de "Reformada". El término presbiterianismo también denota un tipo colegiado de gobierno de iglesia liderado por el pastor y lideres laicos llamados ancianos o presbiteros. Estrictamente hablando, todas las iglesias presbiterianas son parte de la Iglesia .El término presbiterianismo también denota un tipo colegiado de gobierno de iglesia liderado por el pastor y lideres laicos llamados ancianos o presbiteros. Estrictamente hablando, todas las iglesias presbiterianas son parte de la Reforma o Calvinismo, tradición, aunque no todas las iglesias Reformadas son presbiterianas en su gubernamentalidad." (Getty, 2017) @es
definition: "èªåå ­ä¸ç´å®ææ¹é©èèµ·çä¸»è¦æ°æåé«çä¸æ´¾ãä¸è¬èªªä¾ï¼ç¾ä»£çé·èææå¯è¿½æº¯è³ä¸åé¡ç¾¤å³¶çåç¾æ(Calvinis)ææ´¾ï¼å ¶å¨æ­æ´²çå°æææ´¾åè¢«ç¨±çºè¼å ·æ¶µèæ§çæ­¸æ­£æ´¾(Reformed)ãé·èææä¸è©ï¼äº¦è¡¨ç¤ºå ¶ç®¡çæ¹å¼å¦åå¤§å­¸ï¼ç±ç¨±ä½é·èææå£«çç§å¸«åä¿¡å¾é å°ãå´æ ¼ä¾èªªï¼ææé·èææççºæ­¸æ­£æ´¾æåç¾æææ´¾å³çµ±çä¸é¨åï¼ä½ä¸¦éæææ­¸æ­£ææçç®¡çæ¹å¼çå¦åé·èææä¸è¬ã" (Getty, 2017) @zh-hant
definition: «Le presbytérianisme est une forme du protestantisme liée Ã l'Ãcosse.» (DBpedia, 2017) @fr
in scheme: religion

primary school
in dataset: The CWRC Ontology
subject-centric predicate: attends primary school
type: ObjectProperty
sub property of: school attended

printing
in dataset: The CWRC Ontology
type: occupation
type: Concept
alternative label: printer
alternative label: printing press manager
hidden label: in printing
hidden label: printing and bookselling businesses
in scheme: occupation

prison reform
in dataset: The CWRC Ontology
type: political affiliation
type: Concept
comment: The description for this term is indebted to DBpedia.
label: réforme pénitentiaire @fr
broader transitive: social reform
definition: "Prison reform is the attempt to improve conditions inside prisons, establish a more effective penal system, or implement alternatives to incarceration." (DBpedia, 2017)
in scheme: political affiliation

prisoner
in dataset: The CWRC Ontology
type: occupation
type: Concept
alternative label: political prisoner
alternative label: prisoner of war
hidden label: was imprisoned
in scheme: occupation

pro-American
in dataset: The CWRC Ontology
type: political affiliation
type: Concept
label: pro-américain @fr
definition: A pro-American or "Americanophile" stance favours the policies, actions, or culture of the United States of America.
definition: Le proaméricanisme ou posture "américanophile" défend la politique, les actions ou la culture des Ãtats-Unis d'Amérique. @fr
in scheme: political affiliation
related: nationalism

pro-Boer War
in dataset: The CWRC Ontology
type: political affiliation
type: Concept
comment: The description for this term is indebted to DBpedia.
label: pro-guerre des Boers @fr
alternative label: pro-Boer
definition: Défenseurs de la première ou de la seconde guerre des Boers. Voir Première guerre des Boers â Wikipédia et Seconde guerre des Boers â Wikipédia @fr
definition: Support of the First or Second Boer War. See First Boer War - Wikipedia; Second Boer War - Wikipedia
in scheme: political affiliation

pro-Catholicism
in dataset: The CWRC Ontology
type: political affiliation
type: Concept
comment: The description for this term is indebted to DBpedia.
label: procatholicisme @fr
alternative label: catholic
alternative label: non-compounder
alternative label: pro-Catholic
alternative label: roman catholic
definition: Favouring the political re-establishment of Catholicism as a component of the state or the extension of civil rights to Catholics. See Category:Catholicism-related controversies - Wikipedia
definition: Lutte en faveur de la réintégration du catholicisme au sein de l'Ãtat ou de l'extension des droits civiques des catholiques. Voir Catégorie:Controverse en religion â Wikipédia @fr
in scheme: political affiliation
related: Roman Catholicism

pro-choice
in dataset: The CWRC Ontology
type: political affiliation
type: Concept
comment: La description de ce terme est basée sur celle de DBPedia. @fr
comment: The description for this term is indebted to DBpedia.
label: Mouvement pro-choix @fr
definition: "Abortion-rights movements advocate for legal access to induced abortion services. The issue of induced abortion remains divisive in public life, with recurring arguments to liberalize or to restrict access to legal abortion services. Abortion-rights supporters themselves are frequently divided as to the types of abortion services that should be available and to the circumstances, for example different periods in the pregnancy such as late term abortions, in which access may be restricted." (DBpedia, 2017)
definition: «quot; Pour l'article homonyme, voir ProChoix. Le mouvement pro-choix (en anglais pro-choice, c'est-Ã -dire «pour le choix») désigne en Amérique du Nord l'ensemble des mouvements qui défendent l'idée politique et éthique que les femmes devraient avoir le contrôle de leur grossesse et de leur fertilité. S'y ajoutent notamment la liberté sexuelle, le droit au recours Ã l'avortement légal et encadré, et le libre choix de la contraception. On l'oppose dans ce contexte aux mouvements pro-vie, pour lesquels la liberté des femmes ne peut pas être utilisée comme argument pour contester le droit Ã la vie de l'embryon. Par extension, on utilise pro-choix pour évoquer tous les mouvements de défense des libertés individuelles, telles que la liberté de culte et l'euthanasie. Ce terme provient d'une justification des actes en fonction de leurs modalités d'exécution (choisi/imposé).» (DBpedia, 2017) @fr
in scheme: political affiliation
related: feminism

pro-European
in dataset: The CWRC Ontology
type: political affiliation
type: Concept
comment: The description for this term is indebted to DBpedia.
label: europhile @fr
definition: Défense de l'existence, des lois et de l'influence de l'Union Européenne. Voir Europhilie â Wikipédia @fr
definition: Supportive of the existence, policies, or influence of the European Union. See Pro-Europeanism - Wikipedia
in scheme: political affiliation

pro-slavery
in dataset: The CWRC Ontology
contrary to: anti-racism
contrary to: black anti-oppression movement
type: political affiliation
type: Concept
comment: The description for this term is indebted to DBpedia.
label: pro-esclavagisme @fr
broader transitive: racism
definition: "Proslavery is an ideology that perceives slavery as a positive good." (DBpedia, 2017)
in scheme: political affiliation

producer
in dataset: The CWRC Ontology
type: occupation
type: Concept
alternative label: produced
hidden label: produced and appeared
hidden label: producing
in scheme: occupation

professional
in dataset: The CWRC Ontology
type: social class
type: Concept
label: professionelle @fr
alternative label: PROFESSIONAL
alternative label: professional class
alternative label: professional classes
definition: Doctors, lawyers, guild members, and those of high calling such as members of the clergy (Church of England) belong to this class. It implies social respect and intellectual requirements. Examples are Ann Hunter, who was married to a surgeon, and Virginia Woolf, daughter of an intellectual. (Brown, 2006)
definition: Les docteur/res, avocat/es, membres de guilde, et les hautes appellations comme les membres du clergé (Ãglise d'Angleterre) appartiennent Ã cette classe. Ces professions sont respectées socialement et requièrent des qualités intellectuelles. Ann Hunter, mariée Ã un chirurgien, et Virginia Woolf, fille d'intellectuel, en sont des exemples. @fr
in scheme: social class
note: Overlaps with the upper-middle class class.

professional degree
in dataset: The CWRC Ontology
type: credential
type: Concept
comment: The description for this term is indebted to DBpedia.
alternative label: Doctor of Divinity degree
alternative label: Doctor of Medicine
alternative label: MB medical degree
alternative label: MD
alternative label: MD degree
alternative label: Master Mariner's Certificate
definition: "A professional degree, sometimes known as a first professional degree, is a degree that prepares someone to work in a particular profession, often meeting the academic requirements for licensure or accreditation. Professional degrees may be either graduate or undergraduate entry, depending on the profession concerned and the country, and may be classified as bachelor's, master's or doctoral degrees. For a variety of reasons, professional degrees may bear the name of a different level of qualification from their classification on qualifications frameworks, e.g. some UK professional degrees are named bachelor's but are at master's level, while some Australian and Canadian professional degrees have the name "doctor" but are classified as master's or bachelor's degrees." (DBpedia, 2018)
in scheme: credential

professor
in dataset: The CWRC Ontology
type: occupation
type: Concept
alternative label: assistant lecturer
alternative label: emeritus professor
alternative label: law lecturer
alternative label: lecturer
alternative label: lecturer in modern languages
alternative label: professor of archaeology
alternative label: professor of divinity
alternative label: professor of english
alternative label: professor of english language and literature
alternative label: professor of entomology
alternative label: professor of fine arts
alternative label: professor of pathology
alternative label: professor of poetry
alternative label: professor of political economy
alternative label: professor of psychology
alternative label: professor of singing
alternative label: university professor
broader transitive: academic
hidden label: an active lecturer
hidden label: british council lecturer
hidden label: chichele professor of modern history
hidden label: lecture
hidden label: lucasian professor of mathematics
hidden label: professor of poetry at oxford
hidden label: regius professor of divinity
hidden label: taught at oxford, then at cambridge
hidden label: university teacher of english
in scheme: occupation

promiscuity
in dataset: The CWRC Ontology
type: sexuality
type: Concept
label: promiscuité @fr
alternative label: promiscuous
definition: La promiscuité indique l'activité sexuelle avec des partenaires multiples de façon décomplexée et indifférenciée, en opposition aux pratiques sexuelles socialement acceptées. La promiscuité est différemment interprétée pour les femmes et les hommes dans la plupart des contextes historiques et culturelles, étant étroitement liée au contrôle de la sexualité féminine et de la reproduction. Elle inclut le libertinage, une forme de sexualité hédoniste fréquemment attribuée Ã ou adoptée par des hommes. @fr
definition: Promiscuity indicates sex with multiple partners in a casual or indiscriminate fashion and in opposition to socially sanctioned sexual behaviour. Promiscuity is differently constructed for women and men in most historical and cultural contexts, being closely connected to the control of female sexuality and reproduction. It includes libertinism, a form of hedonistic sexual politics frequently ascribed to or adopted by men.
in scheme: sexuality

propagandist
in dataset: The CWRC Ontology
type: occupation
type: Concept
alternative label: war propagandist
broader transitive: politics
broader transitive: writer
hidden label: to spread pro british propaganda
in scheme: occupation

land agent
in dataset: The CWRC Ontology
type: occupation
type: Concept
alternative label: estate agent
alternative label: estate management
alternative label: estate manager
alternative label: land steward
alternative label: plantation manager
alternative label: property agent
alternative label: rent collector
hidden label: managing the estates
in scheme: occupation

property law reform
in dataset: The CWRC Ontology
type: political affiliation
type: Concept
comment: The description for this term is indebted to DBpedia.
label: réforme des droits Ã la propriété @fr
alternative label: illegitimacy reformer
alternative label: land reform
alternative label: land reformer
alternative label: property reform
definition: Défense des réformes législatives sur les biens fonciers et immobiliers. Voir Droit des biens en France â Wikipédia @fr
definition: Support for reform of the laws regarding real or personal property. See Property law - Wikipedia
in scheme: political affiliation
related: social reform

property owner
in dataset: The CWRC Ontology
type: occupation
type: Concept
alternative label: hereditary land owner
alternative label: landlady
alternative label: landlord
alternative label: landowner
alternative label: plantation owner
alternative label: shipbuilding owner
alternative label: shipyard owner
alternative label: squire
hidden label: emergency landlady
hidden label: landlady/proprietor
hidden label: owned land of his own
hidden label: sugar estate owner
in scheme: occupation

prophet
in dataset: The CWRC Ontology
type: occupation
type: Concept
broader transitive: religious
in scheme: occupation

prospector
in dataset: The CWRC Ontology
type: occupation
type: Concept
broader transitive: mining
in scheme: occupation

Protestant rule
in dataset: The CWRC Ontology
type: political affiliation
type: Concept
comment: The description for this term is indebted to DBpedia.
label: gouvernement protestant @fr
alternative label: protestant
alternative label: protestantism
definition: Défenseur du gouvernement protestant au Royaume-Uni. Voir Réforme anglaise â Wikipédia @fr
definition: Support for protestant rule in the United Kingdom. See English Reformation - Wikipedia
in scheme: political affiliation

Protestantism
in dataset: The CWRC Ontology
type: religion
type: Concept
comment: La description de ce terme est basée sur celle de DBPedia. @fr
comment: The description for this term is indebted to the Getty Art & Architecture Thesaurus.
label: hsin chiao @zh-latn
label: protestant @nl
label: protestantisme @fr
label: protestantismo @es
label: xin jiao @zh-latn
label: xīn jiÄo @zh-latn
label: æç¾ å® @zh-hant
label: æ°æ @zh-hant
alternative label: provincial English Protestantism
broader transitive: Christianity
definition: "De algemene term voor typen christelijk geloof die zijn ontstaan tijdens de Reformatie. Hoewel de vroegste vormen van protestantisme werden beoefend door de volgelingen van Luther, Calvijn en Zwingli, wordt de term tegenwoordig gebruikt voor de meeste overtuigingen die niet rooms-katholiek of orthodox zijn. Protestanten willen dichter bij de geloofsstijl van de vroege kerk staan, die volgens hen in de katholieke praktijk overschaduwd is geraakt. De term is afkomstig van het woord 'protestari', wat niet alleen 'protesteren' betekent, maar ook 'belijden'. Enkele algemene kenmerken van het protestantisme zijn: rechtvaardiging door het geloof alleen, de berusting van alle gezag bij de Bijbel en de leer dat alle gelovigen zelf hun zonden aan God kunnen belijden, waarbij het aanhoren van de biecht niet alleen aan priesters is voorbehouden." (Getty, 2017) @nl
definition: "El término general para tipos de fe cristiana originadas a partir de la Reforma. Aunque las formas tempranas del protestantismo fueron aquellas que obedecían a Lutero, Calvino y Zwinglio, el término ahora incluye la mayoría de las denominaciones no Romanas o no Ortodoxas. El caracter común de los protestantes incluye la justificación de la fe por la fe, la autoridad de la sagrada escritura y el sacerdocio de todos los fieles, por el que cada creyente puede oir la confesión de los pecados, no siendo exclusivo del clero. protestantes quieren estar cerca al estilo de fe de la primera Iglesia el cual sienten ha sido opacado en las prácticas católicas. El término deriva desde la palabra "protestari" que significa no sólo protestar sino que reconocer o confesar. Característica común." (Getty, 2017) @es
definition: "The general term for types of Christian faith originating from the Reformation. Although the early forms of Protestantism were those who followed Luther, Calvin, and Zwingli, the term now includes most non-Roman Catholic or non-Orthodox denominations. Protestants want to be closer to the style of faith of the early Church which they feel has been obscured in Catholic practices. The term derives from the word 'protestari' which means not only to protest but to avow or confess. Common characteristics of Protestantism include the justification by faith alone, the authority of scripture, and the priesthood of all believers, in which not only the clergy are able to hear the confession of sin." (Getty, 2017)
definition: "æ³ç¨±æºèªå®ææ¹é©çåå¼åºç£ä¿¡ä»°ãéç¶æ©æçæ°æå½¢å¼æ¯æéµå¾ªè·¯å¾·(Luther)ãåç¾æ(Calvin)ï¼ä»¥åè¨æº«å©(Zwingli)çæ´¾å¥ï¼ä½ç¾å¨æ°æéåè©å½å å«äºå¤§é¨åéç¾ é¦¬å¤©ä¸»ææéæ­£æçæ´¾å¥ãæ°æå¾å¸æè½æ´æ¥è¿æ©æææä¿¡ä»°ï¼èªçºå¤©ä¸»æå°ä¹è®å¾æ¦æ¾é£è§£ãæ¬è©å½è¡çèª"protestari"ï¼ä¸å æææè­°ï¼æ´è¦å¦ç½ææºæãæ°æçå¸¸è¦ç¹è²å æ¬å ç´ä¿¡èç¨±ç¾©ãç¶å ¸çæ¬å¨æ§ãä¿¡å¾çç§å¸«ï¼æä»¥ä¸æ¯åªæç§å¸«æè½è½åèªç½ªæºæã" (Getty, 2017) @zh-hant
definition: «Le protestantisme est l'une des principales branches du christianisme avec le catholicisme et l'orthodoxie. Entendu largement, le protestantisme est l'ensemble des groupements «issus, directement ou non, de la Réforme et qui rejettent l'autorité du pape». Selon cette perspective, le protestantisme englobe des mouvements variés allant des luthériens passant par les évangéliques, jusqu'aux quakers.» (DBpedia, 2017) @fr
in scheme: religion

Proto-Zionism
in dataset: The CWRC Ontology
type: religion
type: Concept
comment: The description for this term is indebted to DBpedia.
alternative label: proto-Zionist
definition: "Proto-Zionism (or Forerunner of Zionism; Hebrew: ×Ö°×Ö·×©Ö°×¨Öµ× ××¦××× ××ª, pronounced: Mevasrei ha-Tzionut) is a term attributed to the ideas of a group of men deeply affected by the idea of modern nationalism spread in Europe in the 19th century as they sought to establish a Jewish homeland in Israel. The central activity of these men was between the years 1860 to 1874, before the Zionist movement established practical (1881) and political Zionism (1896). It is for this reason that they are called precursors of Zionism. But while the 17th century raised the overall idea of "restoring the Jews to Israel naturally by settlement and political action" by Jews and non Jews, ideas therein in terms of an ultimate goal were missing. These ideas also did not unite people to action and relied on the national project and the State (the Jewish nation). Therefore, the figures behind these ideas are not considered as Heralds of Zionism. This group of men considered as proto-Zionists includes Rabbi Judah Bibas (1789-1852), Rabbi Judah ben Solomon Hai Alkalai (1798â1878), Rabbi Zvi Hirsch Kalischer (1795â1874), and philosopher Moses Hess (1812â1875)." (DBpedia, 2018)
in scheme: religion

public reader
in dataset: The CWRC Ontology
type: occupation
type: Concept
alternative label: dramatic readings
alternative label: performance reader
alternative label: poetry reader
alternative label: poetry reading
alternative label: poetry readings
alternative label: poetry recital
alternative label: reader
alternative label: reader in public
alternative label: reader of poetry
alternative label: recitalist
alternative label: recitateur
alternative label: reciter
broader transitive: public speaker
hidden label: gave readings
hidden label: public reading
hidden label: reader aloud
in scheme: occupation

public speaker
in dataset: The CWRC Ontology
type: occupation
type: Concept
alternative label: orator
alternative label: political speaker
alternative label: public lecturer
alternative label: public speaking
alternative label: speaking tour
broader transitive: performer
hidden label: renowned orator
in scheme: occupation

publishing
in dataset: The CWRC Ontology
type: occupation
type: Concept
alternative label: assistant in publishing
alternative label: journal assistant
alternative label: magazine director
alternative label: publisher
alternative label: publisher's reader
alternative label: reader of manuscripts
hidden label: director of time and tide
hidden label: member of the editorial advisory committee
hidden label: publisher and bookseller
hidden label: publisherapos;s reader
in scheme: occupation

Punjabi
in dataset: The CWRC Ontology
type: ethnicity
type: Concept
comment: La description de ce terme est basée sur celle de DBPedia. @fr
comment: The description for this term is indebted to DBpedia.
label: Pendjabis @fr
definition: "The Punjabis (Punjabi: Ù¾ÙØ¬Ø§Ø¨Û, à¨ªà©°à¨à¨¾à¨¬à©, à¤ªà¤à¤à¤¾à¤¬à¥), or Punjabi people, are an Indo-Aryan ethnic group originating from the Punjab region, found in Pakistan and northern India. Punjab literally means the land of five waters (Persian: panj ("five") Äb ("waters"). The name of the region was introduced by the Turko-Persian conquerors of India and more formally popularised during the Mughal Empire. Punjab is often referred to as the breadbasket in both Pakistan and India. The coalescence of the various tribes, castes and the inhabitants of the Punjab into a broader common "Punjabi" identity initiated from the onset of the 18th century CE. Prior to that the sense and perception of a common "Punjabi" ethno-cultural identity and community did not exist, even though the majority of the various communities of the Punjab had long shared linguistic, cultural and racial commonalities. Traditionally, Punjabi identity is primarily linguistic, geographical and cultural. Its identity is independent of historical origin or religion, and refers to those who reside in the Punjab region, or associate with its population, and those who consider the Punjabi language their mother tongue. Integration and assimilation are important parts of Punjabi culture, since Punjabi identity is not based solely on tribal connections. More or less all Punjabis share the same cultural background. Historically, the Punjabi people were a heterogeneous group and were subdivided into a number of clans called biradari (literally meaning "brotherhood") or tribes, with each person bound to a clan. However, Punjabi identity also included those who did not belong to any of the historical tribes. With the passage of time tribal structures are coming to an end and are being replaced with a more cohesive and holistic society, as community building and group cohesiveness form the new pillars of Punjabi society." (DBpedia, 2018)
definition: Les Pendjabis (en pendjabi : Ù¾ÙØ¬Ø§Ø¨Û / à¨ªà©°à¨à¨¾à¨¬à©) sont un groupe ethnolinguistique associé Ã la région du Pendjab, parlant le pendjabi, une langue indo-aryenne. Pendjab signifie littéralement « terre des cinq eaux » (du persan : panj (« cinq »), Äb (« eaux »)). Cette région a été mentionnée chez les Grecs sous le nom de Pentapotamie20, qui fut traduit plus tard en persan par les conquérants turco-persans21 de l'Asie du Sud et qui seront plus connus durant l'Empire moghol. Le Pendjab est souvent qualifié de grenier Ã blé du Pakistan et de l'Inde. La coalescence de diverses tribus, castes et des habitants du Pendjab en une identité pendjabie plus large a commencé au début du xviiie siècle. Avant cela, le sentiment et l'idée d'une identité et d'une communauté ethnoculturelles pendjabies n'existaient pas, même si une majorité des communautés du Pendjab partageaient depuis longtemps des points communs linguistiques, culturels et ethniques. Traditionnellement, l'identité pendjabie est principalement linguistique, géographique et culturelle. Son identité est indépendante de l'origine historique ou de la région, et désigne ceux qui résident dans la région du Pendjab, ou se sentent associés avec ses habitants, et ceux qui considèrent le pendjabi comme leur langue maternelle. L'intégration et l'assimilation sont des éléments importants de la culture pendjabie, puisque l'identité pendjabie n'est pas basée uniquement sur des liens tribaux. Tous les Pendjabis partagent plus ou moins un même socle culturel.(DBpedia, 2018) @fr
in scheme: ethnicity

Puritanism
in dataset: The CWRC Ontology
type: religion
type: Concept
comment: La description de ce terme est basée sur celle de DBPedia. @fr
comment: The description for this term is indebted to DBpedia.
label: puritanisme @fr
broader transitive: Dissent (Protestant)
definition: "The Puritans were a group of English Reformed Protestants in the 16th and 17th centuries who sought to "purify" the Church of England from its "Catholic" practices, maintaining that the Church of England was only partially reformed." (DBpedia, 2018)
definition: «Le mot puritanisme a deux acceptions: * l'une ancienne désignant un courant religieux du calvinisme qui désirait « purifier » l'Ãglise d'Angleterre du catholicisme Ã partir de 1559 et en Nouvelle-Angleterre Ã partir de 1630. Selon Alexis de Tocqueville, il s'agit tout autant d'une théorie politique que d'une doctrine religieuse. * dans l'autre assertion moderne, plus générale, le mot puritanisme désigne une pudeur excessive, un refus des plaisirs, antonyme de l'hédonisme.» (DBpedia, 2018) @fr
in scheme: religion

Quakerism
in dataset: The CWRC Ontology
type: religion
type: Concept
comment: La description de ce terme est basée sur celle de DBPedia. @fr
comment: The description for this term is indebted to DBpedia.
label: quaker @fr
alternative label: Friends, Society of
alternative label: Society of Friends
broader transitive: Dissent (Protestant)
definition: "Het Religieus Genootschap der Vrienden, beter bekend als quakers, verouderd Nederlands kwakers, vormt een groep ondogmatische gelovigen, die zijn wortels vindt in de christelijke traditie. Het leven en de overgeleverde uitspraken van Jezus vormen een belangrijke inspiratiebron." (DBpedia, 2017) @nl
definition: "Quakers (or Friends) are members of a group of religious Christian movements which is known as the Religious Society of Friends in Europe, Australia, New Zealand and parts of North America; and known as the Friends Church in Africa, Asia, South America and parts of the US. The movements were originally, and are still predominantly based on Christianity. Members of the movements profess the priesthood of all believers, a doctrine derived from the First Epistle of Peter. They include those with evangelical, holiness, liberal, and traditional Quaker understandings of Christianity. To differing extents, the different movements that make up the Religious Society of Friends/Friends Church avoid creeds and hierarchical structures. In 2007, there were approximately 359,000 adult Quakers." (DBpedia, 2017)
definition: «La Société religieuse des Amis est un mouvement religieux fondé en Angleterre au XVIIe siècle par des dissidents de l'Ãglise anglicane. Les membres de ce mouvement sont communément connus sous le nom de quakers () mais ils se nomment entre eux «Amis» et «Amies». Le mouvement est souvent nommé simplement Société des Amis et le surnom de «quaker» apparaît le plus souvent dans la dénomination officielle, sous la forme Société religieuse des Amis (quakers). Les historiens s'accordent Ã désigner George Fox comme le principal fondateur ou le plus important meneur des débuts du mouvement. Depuis sa création en Angleterre, le mouvement s'est d'abord répandu dans les pays de colonisation anglo-saxonne. Au XXe siècle, des missionnaires quakers ont propagé leur religion en Amérique latine et en Afrique. Aujourd'hui, les quakers déclarent être au nombre d'environ 350 000 dans le monde. La Société des Amis se différencie de la plupart des autres groupes issus du christianisme par l'absence de credo et de toute structure hiérarchique. Pour les quakers, la croyance religieuse appartient Ã la sphère personnelle et chacun est libre de ses convictions. Le concept de «lumière intérieure» (inner light) est cependant partagé par la plupart d'entre eux, quelle que soit la signification donnée Ã ces mots. De nombreux quakers reconnaissent le christianisme mais ne ressentent pas leur foi comme entrant dans les catégories chrétiennes traditionnelles. On trouve aujourd'hui dans la Société des Amis des pratiques très diverses, y compris un large courant évangélique.» (DBpedia, 2017) @fr
in scheme: religion

Quaker
is replaced by: Quakerism
in dataset: The CWRC Ontology
type: Concept
comment: Deprecated in favour of instance Quakerism.
comment: Désapprouver en faveur de l'instance quaker. @fr
comment: La description de ce terme est basée sur celle de DBPedia. @fr
label: quaker @fr
deprecated: true
term status: deprecated
broader transitive: Anglicanism
broader transitive: Dissenters
definition: "Het Religieus Genootschap der Vrienden, beter bekend als quakers, verouderd Nederlands kwakers, vormt een groep ondogmatische gelovigen, die zijn wortels vindt in de christelijke traditie. Het leven en de overgeleverde uitspraken van Jezus vormen een belangrijke inspiratiebron." (DBpedia, 2017) @nl
definition: "Quakers (or Friends) are members of a group of religious Christian movements which is known as the Religious Society of Friends in Europe, Australia, New Zealand and parts of North America; and known as the Friends Church in Africa, Asia, South America and parts of the US. The movements were originally, and are still predominantly based on Christianity. Members of the movements profess the priesthood of all believers, a doctrine derived from the First Epistle of Peter. They include those with evangelical, holiness, liberal, and traditional Quaker understandings of Christianity. To differing extents, the different movements that make up the Religious Society of Friends/Friends Church avoid creeds and hierarchical structures. In 2007, there were approximately 359,000 adult Quakers." (DBpedia, 2017)
definition: «La Société religieuse des Amis est un mouvement religieux fondé en Angleterre au XVIIe siècle par des dissidents de l'Ãglise anglicane. Les membres de ce mouvement sont communément connus sous le nom de quakers () mais ils se nomment entre eux «Amis» et «Amies». Le mouvement est souvent nommé simplement Société des Amis et le surnom de «quaker» apparaît le plus souvent dans la dénomination officielle, sous la forme Société religieuse des Amis (quakers). Les historiens s'accordent Ã désigner George Fox comme le principal fondateur ou le plus important meneur des débuts du mouvement. Depuis sa création en Angleterre, le mouvement s'est d'abord répandu dans les pays de colonisation anglo-saxonne. Au XXe siècle, des missionnaires quakers ont propagé leur religion en Amérique latine et en Afrique. Aujourd'hui, les quakers déclarent être au nombre d'environ 350 000 dans le monde. La Société des Amis se différencie de la plupart des autres groupes issus du christianisme par l'absence de credo et de toute structure hiérarchique. Pour les quakers, la croyance religieuse appartient Ã la sphère personnelle et chacun est libre de ses convictions. Le concept de «lumière intérieure» (inner light) est cependant partagé par la plupart d'entre eux, quelle que soit la signification donnée Ã ces mots. De nombreux quakers reconnaissent le christianisme mais ne ressentent pas leur foi comme entrant dans les catégories chrétiennes traditionnelles. On trouve aujourd'hui dans la Société des Amis des pratiques très diverses, y compris un large courant évangélique.» (DBpedia, 2017) @fr
in scheme: religion

queer identity
in dataset: The CWRC Ontology
represents: genderqueer
type: textual label
type: Concept
definition: A subclass of textual label, this discursive label reflects the ambiguity of queerness associated with different cultural forms. It provides a means of aggregating and searching multiple instances of "Queer" (e.g. genderqueer) cultural identities.
in scheme: textual label

race or colour identity
in dataset: The CWRC Ontology
subject-centric predicate: has race or colour identity
type: ObjectProperty
domain: Person
label: est de race our couleur @fr
range: race or colour
sub property of: cultural form

race or colour identity of
in dataset: The CWRC Ontology
type: ObjectProperty
domain: race or colour
range: Person
sub property of: cultural form of

race or colour identity (reported)
in dataset: The CWRC Ontology
subject-centric predicate: has race or colour identity (reported)
type: ObjectProperty
domain: Person
label: race ou couleur (déclarée) @fr
range: race or colour
sub property of: race or colour identity

race or colour identity (reported) of
in dataset: The CWRC Ontology
type: ObjectProperty
domain: race or colour
range: Person
sub property of: race or colour identity of

race or colour identity (self-reported)
in dataset: The CWRC Ontology
subject-centric predicate: has race or colour identity (self-reported)
type: ObjectProperty
domain: Person
label: race ou couleur (autodéclarée) @fr
range: race or colour
sub property of: race or colour identity

race or colour identity (self-reported) of
in dataset: The CWRC Ontology
type: ObjectProperty
domain: race or colour
range: Person
sub property of: race or colour identity of

racial equality
in dataset: The CWRC Ontology
contrary to: racism
type: political affiliation
type: Concept
comment: The description for this term is indebted to DBpedia.
label: équité raciale @fr
alternative label: activist for racial equality
alternative label: race equality
alternative label: racial equality activist
alternative label: racial integration
alternative label: racial integrationist
definition: "Racial equality is an equal regard to all races. It can refer to a belief in biological equality of all human races, and it can also refer to social equality for people of different races. Racial equality is a stated goal of most current political movements. The divergence of any particular society from a state of racial equality is often contested by members of that society of different races. In today's society, there is more diversity and more integration among races. However, attaining equality has been difficult for African Americans, Asians, and Latinos, especially in schools." (DBpedia, 2017)
in scheme: political affiliation

racism
in dataset: The CWRC Ontology
contrary to: abolitionism
contrary to: black anti-oppression movement
type: political affiliation
type: Concept
comment: La description de ce terme est basée sur celle de DBPedia. @fr
comment: The description for this term is indebted to DBpedia.
label: Racisme @fr
alternative label: racist
definition: "Racism is a product of the complex interaction in a given society of a race-based worldview with prejudice, stereotyping, and discrimination. Racism can be present in social actions, practices, or political systems (e.g., apartheid) that support the expression of prejudice or aversion in discriminatory practices. The ideology underlying racist practices often includes the idea that humans can be subdivided into distinct groups that are different in their social behavior and innate capacities and that can be ranked as inferior or superior. Racist ideology can become manifest in many aspects of social life. Associated social actions may include xenophobia, otherness, segregation, hierarchical ranking, supremacism, and related social phenomena. While race and ethnicity are considered to be separate in contemporary social science, the two terms have a long history of equivalence in popular usage and older social science literature. "Ethnicity" is often used in a sense close to one traditionally attributed to "race": the division of human groups based on qualities assumed to be essential or innate to the group (e.g. shared ancestry or shared behavior). Racism and racial discrimination are often used to describe discrimination on an ethnic or cultural basis, independent of whether these differences are described as racial. According to a United Nations convention, there is no distinction between the terms "racial" and "ethnic" discrimination. The UN convention further concludes that superiority based on racial differentiation is scientifically false, morally condemnable, socially unjust and dangerous, and there is no justification for racial discrimination, anywhere, in theory or in practice. Today, the use of the term "racism" does not easily fall under a single definition. It is usually found in, but usage is not limited to, law, the social and behavioral sciences, humanities, and popular culture." (DBpedia, 2017)
definition: «Le racisme est une idéologie qui, partant du postulat de l'existence de races au sein de l'espèce humaine, considère que certaines catégories de personnes sont intrinsèquement supérieures Ã d'autres. Cette idéologie peut entraîner une attitude d'hostilité ou de sympathie systématique Ã l'égard d'une catégorie déterminée de personnes. Cette hostilité envers une autre appartenance culturelle et ethnique se traduit par des formes de xénophobie ou d'ethnocentrisme. Certaines formes d'expression du racisme, comme les injures racistes, la diffamation raciale, la discrimination, sont considérées comme des délits dans un certain nombre de pays. Les idéologies racistes ont servi de fondement Ã des doctrines politiques conduisant Ã pratiquer des discriminations raciales, des ségrégations ethniques et Ã commettre des injustices et des violences, allant jusqu'au génocide. Le Petit Larousse définit aussi le racisme comme «une attitude d'hostilité répétée voire systématique Ã l'égard d'une catégorie déterminée de personnes».» (DBpedia, 2017) @fr
in scheme: political affiliation

radicalism
in dataset: The CWRC Ontology
type: occupation
type: political affiliation
type: Concept
comment: The description for this term is indebted to DBpedia.
label: radicalisme @fr
alternative label: political radical
alternative label: radical
alternative label: radical dissident
alternative label: working class radical
broader transitive: politics
definition: "The term political radicalism (or simply, in political science, radicalism) denotes political principles focused on altering social structures through revolutionary means and changing value systems in fundamental ways. Derived from the Latin radix (root), the denotation of radical has changed since its eighteenth-century coinage to comprehend the entire political spectrumâyet retains the "change at the root" connotation fundamental to revolutionary societal change. Historically, radicalism has referred exclusively to the radical left (under the single category of far-left politics) and rarely incorporating far-right politics, though these may have revolutionary elements; the prominent exception is in the United States where some consider radicalism to include both political extremes of the radical left and the radical right. In traditional labels of the spectrum of political thought, the opposite of radical on the "right" of the political spectrum is termed reactionary. The nineteenth-century Cyclopaedia of Political Science (1881, 1889) reports that "radicalism is characterized less by its principles than by the manner of their application". Conservatives often used the term radical pejoratively, whereas contemporary left radicals used the term conservative derogatorily; thus contemporary denotations of radical, radicalism, and political radicalism comprehend far left (hard left, radical left), and far right (hard right, radical right). The Encyclopædia Britannica records the first political usage of radical as ascribed to the British Whig Party parliamentarian Charles James Fox, who, in 1797, proposed a "radical reform" of the electoral system, franchise to provide universal manhood suffrage, thereby, idiomatically establishing radical to denote supporters of the reformation of the British Parliament. Throughout the nineteenth century, the term was combined with political notions and doctrines, thus working class radicalism, middle class-, philosophic-, democrat…
in scheme: political affiliation

radio industry
in dataset: The CWRC Ontology
type: occupation
type: Concept
alternative label: educational radio producer
alternative label: educational radio programmer
alternative label: radio announcer
alternative label: radio broadcaster
alternative label: radio performer
alternative label: radio producer
broader transitive: broadcaster
hidden label: recorded programmes assistant
in scheme: occupation

radio operator
in dataset: The CWRC Ontology
type: occupation
type: Concept
in scheme: occupation

railway work
in dataset: The CWRC Ontology
type: occupation
type: Concept
alternative label: railway clerk
alternative label: railway guard
alternative label: railway promoter
alternative label: railway worker
alternative label: station master
alternative label: stationmaster
broader transitive: transportation work
hidden label: worked for the nigerian railway
in scheme: occupation

range includes
in dataset: The CWRC Ontology
type: ObjectProperty
domain: Thing
range: Thing
definition: Specifies a particular class type that is acceptable to use for a relation's range.

Rational Dissenter
is replaced by: Dissenting Christianity
in dataset: The CWRC Ontology
type: Concept
comment: Deprecated in favour of instance Dissenting Christianity.
comment: Désapprouver en faveur de l'instance Dissidence anglaise. @fr
deprecated: true
term status: deprecated
broader transitive: Dissenters
definition: "An 18th-century, group much closer to the Anglicanism of their day than other Dissenting sects; however, they believed that state religions impinged on the freedom of conscience. They were fiercely opposed to the hierarchical structure of the Established Church and the financial ties between it and the government."(DBpedia, 2017)
in scheme: religion

rationalism
in dataset: The CWRC Ontology
type: political affiliation
type: Concept
comment: La description de ce terme est basée sur celle de DBPedia. @fr
comment: The description for this term is indebted to DBpedia.
label: Rationalisme @fr
alternative label: rationalist
definition: "In epistemology, rationalism is the view that "regards reason as the chief source and test of knowledge" or "any view appealing to reason as a source of knowledge or justification". More formally, rationalism is defined as a methodology or a theory "in which the criterion of the truth is not sensory but intellectual and deductive". In an old controversy, rationalism was opposed to empiricism, where the rationalists believed that reality has an intrinsically logical structure. Because of this, the rationalists argued that certain truths exist and that the intellect can directly grasp these truths. That is to say, rationalists asserted that certain rational principles exist in logic, mathematics, ethics, and metaphysics that are so fundamentally true that denying them causes one to fall into contradiction. The rationalists had such a high confidence in reason that empirical proof and physical evidence were regarded as unnecessary to ascertain certain truths â in other words, "there are significant ways in which our concepts and knowledge are gained independently of sense experience". Different degrees of emphasis on this method or theory lead to a range of rationalist standpoints, from the moderate position "that reason has precedence over other ways of acquiring knowledge" to the more extreme position that reason is "the unique path to knowledge". Given a pre-modern understanding of reason, rationalism is identical to philosophy, the Socratic life of inquiry, or the zetetic (skeptical) clear interpretation of authority (open to the underlying or essential cause of things as they appear to our sense of certainty). In recent decades, Leo Strauss sought to revive "Classical Political Rationalism" as a discipline that understands the task of reasoning, not as foundational, but as maieutic. In politics, Rationalism, since the Enlightenment, historically emphasised a "politics of reason" centered upon rational choice, utilitarianism, secularism, and irreligion â the latte…
definition: «Le rationalisme est la doctrine qui pose la raison discursive comme seule source possible de toute connaissance réelle. Autrement dit, le réel ne serait connaissable qu'en vertu d'une explication par la raison déterminante, suffisante et nécessaire. Ainsi, le rationalisme s'entend de toute doctrine qui attribue Ã la seule raison humaine la capacité de connaître et d'établir la vérité. Dans son acception classique, il s'agit de postuler que le raisonnement consiste Ã déterminer que certains effets résultent de certaines causes, uniquement Ã partir de principes logiques ; Ã la manière dont les théorèmes mathématiques résultent des hypothèses admises au départ. De plus, et en particulier, les principes logiques eux-mêmes utilisés dans le raisonnement ont été connus par déduction.» (DBpedia, 2017) @fr
in scheme: political affiliation

reading
in dataset: The CWRC Ontology
type: occupation
type: Concept
hidden label: poetry lover
in scheme: occupation

rebel
in dataset: The CWRC Ontology
type: occupation
type: Concept
alternative label: freedom fighter
alternative label: revolutionary
alternative label: saboteur
broader transitive: activist
hidden label: reformist or revolutionary
in scheme: occupation

red cross
in dataset: The CWRC Ontology
type: occupation
type: Concept
alternative label: red cross aide
alternative label: red cross representative
alternative label: red cross worker
broader transitive: healthcare provider
in scheme: occupation

reformer
in dataset: The CWRC Ontology
type: occupation
type: Concept
alternative label: agricultural reformer
alternative label: army reformer
alternative label: divorce law reformer
alternative label: educational reformer
alternative label: health care reformer
alternative label: housing reformer
alternative label: land improver
alternative label: language reformer
alternative label: law reformer
alternative label: liturgical reformer
alternative label: medical reformer
alternative label: penal reformer
alternative label: political reformer
alternative label: prison reformer
alternative label: publishing reformer
alternative label: religious reformer
alternative label: sanitary reformer
alternative label: sex reformer
alternative label: social reformer
in scheme: occupation
related: politics
related: social work

refugee
in dataset: The CWRC Ontology
type: occupation
type: Concept
in scheme: occupation

refugee work
in dataset: The CWRC Ontology
type: occupation
type: Concept
alternative label: refugee worker
broader transitive: social work
in scheme: occupation

regional government
in dataset: The CWRC Ontology
type: occupation
type: Concept
alternative label: county councillor
alternative label: deputy lord lieutenant
alternative label: deputy recorder of northamptonshire
broader transitive: government
hidden label: assistant secretary for education in northamptonshire
hidden label: deputy lieutenant of dunbartonshire
hidden label: director general of the tapu land registry
hidden label: governor of massachusetts
hidden label: high sheriff for county antrim
hidden label: lord president of the council of the marches of wales
hidden label: magistrate for the county of middlesex
hidden label: secretary for education in oxfordshire
in scheme: occupation

reincarnation
in dataset: The CWRC Ontology
type: religion
type: Concept
comment: La description de ce terme est basée sur celle de DBPedia. @fr
comment: The description for this term is indebted to DBpedia.
label: réincarnation @fr
alternative label: believer in reincarnation
alternative label: reincarnationist
broader transitive: spiritualism
definition: "Reincarnation is the philosophical or religious concept that an aspect of a living being starts a new life in a different physical body or form after each biological death. It is also called rebirth or transmigration, and is a part of the Saá¹sÄra doctrine of cyclic existence. It is a central tenet of all major Indian religions, namely Buddhism, Hinduism, Jainism, and Sikhism. The idea of reincarnation is found in many ancient cultures, and a belief in rebirth was held by such historic figures as Pythagoras, Plato, and Socrates. It is also a common belief of various ancient and modern religions such as Spiritism, Theosophy, and Eckankar and is found as well in many tribal societies around the world, in places such as Australia, East Asia, Siberia, and South America. Although the majority of sects within the Abrahamic religions of Judaism, Christianity, and Islam do not believe that individuals reincarnate, particular groups within these religions do refer to reincarnation; these groups include the mainstream historical and contemporary followers of Kabbalah, the Cathars, Alawites, the Druze, and the Rosicrucians. The historical relations between these sects and the beliefs about reincarnation that were characteristic of Neoplatonism, Orphism, Hermeticism, Manicheanism, and Gnosticism of the Roman era as well as the Indian religions have been the subject of recent scholarly research. In recent decades, many Europeans and North Americans have developed an interest in reincarnation. Contemporary films, books, and popular songs frequently mention reincarnation." (DBpedia, 2018)
definition: «La réincarnation (retour dans la chair) désigne un processus de survivance après la mort par lequel un certain principe immatériel et individuel (« âme », « substance vitale », « conscience individuelle », « énergie », voire « esprit ») accomplirait des passages de vies successives dans différents corps (humains, animaux ou végétaux, selon les théories). Ã la mort du corps physique, l'« âme » quitte ce dernier pour habiter, après une nouvelle naissance, un autre corps. Elle a été assimilée Ã travers la littérature Ã la transmigration des âmes, aux concepts de métempsycose, de métensomatose, de palingénésie ainsi qu'à l'Ãternel retour. On la retrouve dans diverses religions et philosophies depuis l'antiquité, sans qu'elle ne rencontre, dans aucune d'elles, une unanimité théologique ou dogmatique. Dès la fin du XIXe siècle, la réincarnation a été popularisée en Occident par divers courants ésotériques et spirites. Le psychiatre canadien Ian Stevenson est « internationalement connu » pour avoir tenté de prouver scientifiquement la réincarnation, bien que les résultats de ses recherches soient contestés.» (DBpedia, 2018) @fr
in scheme: religion

relates by birth to
in dataset: The CWRC Ontology
range includes: Work
range includes: AdminPlaceConcept
range includes: Feature
range includes: FormalOrganization
range includes: Person
type: ObjectProperty
type: SymmetricProperty
domain: Person
sub property of: has biographical relation to
definition: A connection between persons and other persons or entities related to birth.

relates by cultural form to
in dataset: The CWRC Ontology
range includes: Work
range includes: AdminPlaceConcept
range includes: Feature
range includes: FormalOrganization
range includes: Person
type: ObjectProperty
type: SymmetricProperty
domain: Person
sub property of: has biographical relation to

relates by death to
in dataset: The CWRC Ontology
range includes: Work
range includes: AdminPlaceConcept
range includes: Feature
range includes: FormalOrganization
range includes: Person
type: ObjectProperty
type: SymmetricProperty
domain: Person
sub property of: has biographical relation to
definition: A connection between persons and other persons or entities related to death.

relates by education to
in dataset: The CWRC Ontology
range includes: Work
range includes: AdminPlaceConcept
range includes: Feature
range includes: FormalOrganization
range includes: Person
type: ObjectProperty
type: SymmetricProperty
domain: Person
sub property of: has biographical relation to
definition: A connection between persons and other persons or entities related to education.

relates by leisure to
in dataset: The CWRC Ontology
range includes: Work
range includes: AdminPlaceConcept
range includes: Feature
range includes: FormalOrganization
range includes: Person
type: ObjectProperty
type: SymmetricProperty
domain: Person
sub property of: relates socially to
definition: Any relationship between persons and another type of entity such as another person, or an organization, place, or text, often in the context of cultural and social activities, including hobbies and sports.

relates by occupation to
in dataset: The CWRC Ontology
range includes: Work
range includes: AdminPlaceConcept
range includes: Feature
range includes: FormalOrganization
range includes: Person
type: ObjectProperty
type: SymmetricProperty
domain: Person
sub property of: has biographical relation to
definition: A connection between persons and other persons or entities related to occupation or employment.

relates by politics to
in dataset: The CWRC Ontology
range includes: Work
range includes: AdminPlaceConcept
range includes: Feature
range includes: FormalOrganization
range includes: Person
type: ObjectProperty
type: SymmetricProperty
domain: Person
sub property of: has biographical relation to
definition: A connection between persons and other persons or entities related to politics.

relates economically to
in dataset: The CWRC Ontology
range includes: Work
range includes: AdminPlaceConcept
range includes: Feature
range includes: FormalOrganization
range includes: Person
type: ObjectProperty
type: SymmetricProperty
domain: Person
sub property of: has biographical relation to
definition: Any relationship between persons and other persons or entities related to information about economic standing, such as income, inheritance, property, or poverty.

relates socially to
in dataset: The CWRC Ontology
range includes: Work
range includes: AdminPlaceConcept
range includes: Feature
range includes: FormalOrganization
range includes: Person
type: ObjectProperty
domain: Person
sub property of: has biographical relation to

relates spatially to
is replaced by: has spatial relation to
in dataset: The CWRC Ontology
type: DeprecatedProperty
comment: Deprecated in favour of instance has spatial relation to.
comment: Désapprouver en faveur de l'instance . @fr
deprecated: true
term status: deprecated
definition: Indicates an entity's connection to a geospatial location.

relative
in dataset: The CWRC Ontology
subject-centric predicate: has relative
type: ObjectProperty
range: Person
sub property of: social relationship

relative of
in dataset: The CWRC Ontology
type: ObjectProperty
domain: Person
label: liens de famille @fr
range: Person
sub property of: relates socially to
inverse of: has relative

relief work
in dataset: The CWRC Ontology
type: occupation
type: Concept
alternative label: famine relief
alternative label: jewish relief work
alternative label: relief worker
alternative label: war relief
broader transitive: social work
hidden label: co organizer of relief efforts
hidden label: found the women's defence relief corps
hidden label: founded a society for the relief of indigent old age
hidden label: international relief worker
hidden label: organized war relief
hidden label: receive evacuees
hidden label: war relief aid
in scheme: occupation

religious affiliation
in dataset: The CWRC Ontology
subject-centric predicate: has religious affiliation
type: ObjectProperty
domain: Person
range: religion
sub property of: cultural form

religious affiliation of
in dataset: The CWRC Ontology
type: ObjectProperty
domain: religion
range: Person
sub property of: cultural form of

religious affiliation (reported)
in dataset: The CWRC Ontology
subject-centric predicate: has religious affiliation (reported)
type: ObjectProperty
domain: Person
label: religion (déclarée) @fr
range: religion
sub property of: religious affiliation

religious affiliation (reported) of
in dataset: The CWRC Ontology
type: ObjectProperty
domain: religion
range: Person
sub property of: religious affiliation of

religious affiliation (self-reported)
in dataset: The CWRC Ontology
subject-centric predicate: has religious affiliation (self-reported)
type: ObjectProperty
domain: Person
label: religion (autodéclarée) @fr
range: religion
sub property of: religious affiliation

religious affiliation (self-reported) of
in dataset: The CWRC Ontology
type: ObjectProperty
domain: religion
range: Person
sub property of: religious affiliation of

religious
in dataset: The CWRC Ontology
type: occupation
type: Concept
alternative label: anchoress
alternative label: church elder
alternative label: church worker
alternative label: evangelical leader
alternative label: garrison chaplain
alternative label: lay sister
alternative label: member of religious order
alternative label: methodist convert
alternative label: methodist lay preacher
alternative label: monk
alternative label: permanent curate
alternative label: pilgrim
alternative label: prayer
alternative label: prayer leader
alternative label: precentor
alternative label: principal clerk of session
alternative label: religious administrator
alternative label: religious leader
alternative label: religious manager
alternative label: religious observance
alternative label: religious organizer
alternative label: religious publicist
alternative label: religious revivalist
alternative label: royal chaplain
alternative label: spiritual counsellor
hidden label: chancellor and prebendary of hereford cathedral
hidden label: lay leader, or parnas
hidden label: preaching and religious organising activities
in scheme: occupation

religiousOfficial
in dataset: The CWRC Ontology
type: occupation
type: Concept
alternative label: anglican bishop
alternative label: anglican clergyman
alternative label: anglican priest
alternative label: archbishop
alternative label: archbishop of canterbury
alternative label: archdeacon
alternative label: assistant minister of religion
alternative label: bishop
alternative label: canon
alternative label: cardinal
alternative label: chaplain
alternative label: chief rabbi
alternative label: clergyman
alternative label: clergymen
alternative label: clergyperson
alternative label: curate
alternative label: deacon
alternative label: dissenting minister
alternative label: episcopalian preacher
alternative label: jesuit priest
alternative label: minister
alternative label: minister of religion
alternative label: official (of religion)
alternative label: preacher
alternative label: prebendary
alternative label: presbyterian minister
alternative label: priest
alternative label: private almoner
alternative label: quaker minister
alternative label: rector
alternative label: reverend
alternative label: synagogue official
alternative label: vicar
broader transitive: religious
hidden label: archbishop of armagh and primate of all ireland
hidden label: chaplain of the lock hospital
hidden label: dean of wells
hidden label: english bishop of natal
hidden label: ministers
hidden label: prebendary (a kind of canon or church official)
hidden label: rev.
hidden label: trained for the priesthood
in scheme: occupation

religious studies
in dataset: The CWRC Ontology
type: occupation
type: Concept
alternative label: biblical scholar
alternative label: hindu scholar
alternative label: theologian
in scheme: occupation

moved to
in dataset: The CWRC Ontology
range includes: AdminPlaceConcept
range includes: Feature
type: ObjectProperty
domain: Person
sub property of: inhabited
inverse of: has relocatee
definition: Indicates that a person moved to this place.

relocation
in dataset: The CWRC Ontology
range includes: AdminPlaceConcept
range includes: Feature
subject-centric predicate: moved to
type: ObjectProperty
sub property of: habitation

represented by
in dataset: The CWRC Ontology
type: ObjectProperty
range: textual label
inverse of: represents
definition: Relates ambiguous or overloaded terms, classed as textual label to two or more particularly contested and related concepts. Often used for cultural form; for instance ISO 3166-2:GB-ENG and English are both represented by English identity.

represents
in dataset: The CWRC Ontology
type: ObjectProperty
domain: textual label
definition: Relates a concept to ambiguous or overloaded terms, classed as textual label, that designate multivalent and frequently contested concepts. For instance, English identity is a textual label that represents both ISO 3166-2:GB-ENG and English.

reproductive history
in dataset: The CWRC Ontology
subject-centric predicate: has reproductive history
type: ObjectProperty
range: reproductive history
sub property of: health association

republicanism
in dataset: The CWRC Ontology
type: political affiliation
type: Concept
comment: La description de ce terme est basée sur celle de DBPedia. @fr
comment: The description for this term is indebted to DBpedia.
label: Républicanisme @fr
definition: "Republicanism is an ideology of being a citizen in a state as a republic under which the people hold popular sovereignty. Many countries are "republics" in the sense that they are not monarchies. However, this article covers only the ideology of republicanism. The word, "republic", derives from the Latin, res publica, which referred to the system of government that emerged in the 6th century BCE following the expulsion of the kings from Rome by Lucius Junius Brutus and Collatinus. This form of government collapsed in the latter part of the 1st century BCE, giving way to what was a monarchy in form, if not in name. Republics revived subsequently, with, for example, Renaissance Florence or early modern Britain. The concept of a republic became a powerful force in Britain's North American colonies where it led to the American Revolution. In Europe it gained enormous influence through the French Revolution." (DBpedia, 2017)
definition: «Le républicanisme est une idéologie politique selon laquelle l'objectif d'un Ãtat et le sens de son existence, comme de ses décisions, doivent être le bien commun (en latin, res publica : «la chose publique»). Selon le républicanisme, les détenteurs du pouvoir doivent être nommés par d'autres moyens que l'hérédité, c'est-Ã -dire être élus par le peuple ou par une partie de celui-ci. La notion de souveraineté populaire découle donc en partie de cette idéologie, mais elle ne lui est pas nécessairement attachée. La notion de «république» remonte Ã l'Antiquité grecque et romaine, et l'idéologie républicaine moderne a pris des formes légèrement différentes selon qu'elle a été développée aux Ãtats-Unis, en France ou en Irlande. Ã l'époque moderne, le républicanisme s'oppose Ã d'autres idéologies politiques telles que le monarchisme, l'autoritarisme ou le despotisme. Dans les débats contemporains, c'est principalement au libéralisme politique qu'il s'oppose.» (DBpedia, 2017) @fr
in scheme: political affiliation

rescue work
in dataset: The CWRC Ontology
type: occupation
type: Concept
alternative label: life saving
alternative label: mountain rescue
hidden label: mountain rescue leader
in scheme: occupation

researcher
in dataset: The CWRC Ontology
type: occupation
type: Concept
alternative label: research
alternative label: research assistant
alternative label: scholarship
alternative label: social researcher
in scheme: occupation
related: academic
related: public intellectual
related: scientist

retail
in dataset: The CWRC Ontology
type: occupation
type: Concept
alternative label: bookseller
alternative label: bookshop assistant
alternative label: bookshop manager
alternative label: bookshop worker
alternative label: bookstore clerk
alternative label: cashier
alternative label: department store clerk
alternative label: greengrocer
alternative label: market seller
alternative label: newsagent
alternative label: retail selling
alternative label: retail worker
alternative label: shop assistant
alternative label: shop manager
alternative label: shop work
alternative label: shopkeeper
alternative label: shopkeeper/entrepeneur
alternative label: storekeeper
alternative label: working in a bookshop
hidden label: bookshop partner
hidden label: manager of bookshop
hidden label: print seller
hidden label: tobacconist
hidden label: worked with him at running a children's bookshop
in scheme: occupation

reviewer
in dataset: The CWRC Ontology
type: occupation
type: Concept
alternative label: book reviewer
alternative label: film reviewer
alternative label: wrote reviews
broader transitive: writer
hidden label: reviewed books
in scheme: occupation

revolutionary
in dataset: The CWRC Ontology
type: political affiliation
type: Concept
comment: The description for this term is indebted to DBpedia.
label: révolutionnaire @fr
alternative label: pro-revolutionary
definition: "A revolutionary is a person who either actively participates in, or advocates revolution. Also, when used as an adjective, the term revolutionary refers to something that has a major, sudden impact on society or on some aspect of human endeavor." (DBpedia, 2017)
in scheme: political affiliation

riding
in dataset: The CWRC Ontology
type: occupation
type: Concept
broader transitive: sports
hidden label: rode side saddle
in scheme: occupation

Romani
in dataset: The CWRC Ontology
type: ethnicity
type: Concept
comment: La description de ce terme est basée sur celle de DBPedia. @fr
comment: The description for this term is indebted to DBpedia.
label: rom @fr
alternative label: Roma
alternative label: gipsy
alternative label: gypsies
alternative label: gypsy
definition: "The Romani (also spelled Romany; /ËroÊmÉni/, /ËrÉ-/), or Roma, are a traditionally nomadic ethnic group, living mostly in Europe and the Americas and originating from the northern regions of the Indian subcontinent, presumably from where the states Rajasthan, Haryana, and Punjab exist today. The Romani are widely known among English-speaking people by the exonym "Gypsies" (or "Gipsies"), which some people consider pejorative due to its connotations of illegality and irregularity."(DBpedia, 2017)
definition: «Les Roms (parfois écrit Rroms, également désignés en français sous les noms de Tziganes, Gitans, Bohémiens, Manouches ou Romanichels selon les pays d'où ils sont supposés venir notamment, par les appellations d'origine scientifique Kalés ou Sintis, ou encore gens du voyage par confusion ou vision fantasmée, l'immense majorité étant sédentaire) forment un ensemble de populations établies dans divers pays du monde et se considérant comme formant un seul peuple, en raison de leur origine et de leur culture communes. Originaires de la péninsule indienne, avec des langues initiales qu'on croit originaires du nord-ouest du sous-continent indien, ce peuple, constitué de minorités vivant entre l'Inde et l'Atlantique, puis sur le continent américain, est connu par diverses dénominations exonymes locales. Rom se propose comme une appellation endonyme unique, signifiant «homme accompli et marié au sein de la communauté» en langue romani. Présentes en Europe dès le xie siècle, les populations roms de tous les pays formeraient ensemble, au xxie siècle, selon une étude faite en 1994 pour le conseil de l'Europe, la minorité 'la plus importante en termes numériques.» (DBpedia, 2017) @fr
in scheme: ethnicity

Rosicrucianism
in dataset: The CWRC Ontology
type: religion
type: Concept
comment: La description de ce terme est basée sur celle de DBPedia. @fr
comment: The description for this term is indebted to DBpedia.
label: Rose-Croix @fr
alternative label: Rosicrucian
broader transitive: occultism
definition: "Rosicrucianism can refer to one of several things: * As a cultural movement, also referred to by historian Dame Frances Yates as the Rosicrucian Enlightenment, it arose in Europe in the early 17th century after the publication of the Rosicrucian Manifestos, which purported to announce the existence of a hitherto unknown esoteric order to the world and made seeking its knowledge attractive to many. * As the mysterious doctrine of the aforementioned order, it is allegedly "built on esoteric truths of the ancient past", which "concealed from the average man, provide insight into nature, the physical universe and the spiritual realm." The Manifestos do not elaborate extensively on the matter but clearly combine references to the Kabbalah, Hermeticism and the imagery of Christianity. The Rosicrucian Manifestos heralded a "Universal Reformation of Mankind", through a science allegedly kept secret for decades until the intellectual climate might receive it. Controversies have arisen on whether they were a hoax, whether the "order of the Rosy Cross" existed as described in the Manifestos, or whether the whole thing was a metaphor disguising a movement that really existed, but in a different form. In 1616, Johann Valentin Andreae famously designated it as a "ludibrium". By promising a spiritual transformation at a time of great turmoil, the Manifestos tempted many figures to seek esoteric knowledge. Seventeenth-century occult philosophers such as Michael Maier, Robert Fludd and Thomas Vaughan interested themselves in the Rosicrucian world view. According to historian David Stevenson, it was influential to Freemasonry as it was emerging in Scotland. In later centuries, many esoteric societies have claimed to derive from the original Rosicrucians. Rosicrucianism is symbolized by the Rosy Cross or Rose Cross." (DBpedia, 2018)
definition: «La Rose-Croix est un ordre hermétiste chrétien légendaire dont les premières mentions remontent au début du XVIIe siècle en Allemagne. L'existence de l'ordre, et celle de son fondateur Christian Rosenkreutz, sont sujettes Ã controverse. Quoi qu'il en soit, Ã partir du XVIIIe siècle et jusqu'à aujourd'hui, de nombreux mouvements se sont réclamés de l'ordre de la Rose-Croix, ou se sont référés Ã la « tradition rosicrucienne » ou Ã l'« héritage de Christian Rosenkreutz ». Leurs membres sont appelés « les rosicruciens ». Le terme « Rose-Croix » désigne, dans leur langage, un état de perfection spirituelle et morale. Comme archétype de société secrète, immémoriale et toute-puissante, les rose-croix apparaissent dans la littérature « ésotérisante », souvent comme successeurs des chevaliers du Graal et des Templiers. Ã la fin des années 1990, une campagne de lutte contre les sectes en France conduit les commissions parlementaires Ã citer dans leurs rapports les mouvements rosicruciens et apparentés. La pertinence de ce classement a cependant été remise en cause par différents acteurs de la lutte contre les dérives sectaires. La liste de sectes émise est rendue caduque par une circulaire ministérielle et certains mouvements sont complètement réhabilités.» (DBpedia, 2018) @fr
in scheme: religion

rural unskilled
in dataset: The CWRC Ontology
type: social class
type: Concept
label: ouvrière agricole @fr
alternative label: RURAL-UNSKILLED
definition: Cette classe renvoie aux travailleurs/euses agricoles, généralement des hommes, et concerne des périodes historiques plus reculées. Elle inclut aussi les fermiers/ères migrants/es. @fr
definition: This class generally indicates farm laborers, mostly male and in earlier periods, and includes migrant farm workers. (Brown, 2006)
in scheme: social class

Sabbatarianism
in dataset: The CWRC Ontology
type: political affiliation
type: Concept
comment: The description for this term is indebted to DBpedia.
label: Sabbatarianisme @fr
definition: "Sabbatarianism is a movement within Protestantism whose proponents advocate that certain observances, specifically enumerated in a code of behavior or law, are required for Christians to properly observe the Sabbath or Sabbath principles. Its historical origins lie in Puritan Sabbatarianism, which delineated precepts for keeping Sunday holy in observance of Sabbath commandment principles. This observance of Sunday is the purest form of first-day Sabbatarianism, a movement which diminished and largely disappeared in the 18th century, though traces and influences remain today. Today, seventh-day Sabbatarianism is the most prominent type, a movement that generally embraces a literal reading of the Sabbath commandment that provides for both worship and rest on the seventh day of the week. Seventh-day Baptists leave most other Sabbath considerations of observance to individual conscience. The Seventh-day Adventist Church and Church of God (Seventh Day) have similar views, but maintain the original, scriptural duration as Friday sunset through Saturday sunset. Non-Sabbatarianism is the view opposing all Sabbatarianism, declaring Christians to be free of mandates to follow such specific observances. It upholds the principle in Christian church doctrine that the church is not bound by such law or code, but is free to set in place and time such observances as uphold Sabbath principles according to its doctrine: to establish a day of rest, or not, and to establish a day of worship, or not, whether on Saturday or on Sunday or on some other day. It includes all Catholics and Orthodox, and most Protestant denominations." (DBpedia, 2017)
in scheme: political affiliation
related: Roman Catholicism

sailor
in dataset: The CWRC Ontology
type: occupation
type: Concept
alternative label: competitive sailor
alternative label: deckhand
alternative label: ferryman
alternative label: midshipman
alternative label: purser
alternative label: sailing
alternative label: seaman
alternative label: ship's carpenter
alternative label: ship's officer
alternative label: ship's purser
in scheme: occupation

saint
in dataset: The CWRC Ontology
type: occupation
type: Concept
broader transitive: religious
in scheme: occupation

salesperson
in dataset: The CWRC Ontology
type: occupation
type: Concept
alternative label: costermonger
alternative label: door to door salesperson
alternative label: newsagent
alternative label: paper salesman
alternative label: pedlar
alternative label: piano salesman
alternative label: real estate agent
alternative label: real estate salesman
alternative label: sales director
alternative label: sales manager
alternative label: sales staff
alternative label: salesgirl
alternative label: salesman
alternative label: saleswoman
alternative label: stationer
alternative label: street seller
alternative label: ticket seller
alternative label: wine seller
hidden label: door to door salesman
hidden label: fairground salesman
hidden label: newspaper dealer
hidden label: newspaper deliverer
hidden label: sausage seller
in scheme: occupation

salter
in dataset: The CWRC Ontology
type: occupation
type: Concept
alternative label: salt-worker
in scheme: occupation

sanitary movement
in dataset: The CWRC Ontology
type: political affiliation
type: Concept
comment: The description for this term is indebted to DBpedia.
label: mouvement pour l'assainissement @fr
definition: Promotion of sanitary practices and conditions, often directed at the poor or the reform of urban sanitation, through charitable or political activities. See Sanitation - Wikipedia
definition: Sensibilisation sur les conditions et pratiques sanitaires, généralement pour les plus pauvres, ou réforme de l'hygiène publiques Ã travers Ã travers des oeuvres de charité ou d'action politique. Voir Assainissement â Wikipédia. @fr
in scheme: political affiliation
related: urban reform

Saxon
in dataset: The CWRC Ontology
type: national identity
type: Concept
definition: Indicates a subject's identification with or labelling as Saxon as a national identity. See Saxons - Wikipedia.
definition: Indique qu'un sujet s'identifie Ã ou s'est vu assigner une identité nationale saxonne. Voir Saxons â Wikipédia. @fr
in scheme: national identity

school attended
in dataset: The CWRC Ontology
subject-centric predicate: attends
type: ObjectProperty
range: educational organization
sub property of: education relationship

scientist
in dataset: The CWRC Ontology
type: occupation
type: Concept
alternative label: amateur scientist
alternative label: lab demonstrator
alternative label: laboratory assistant
alternative label: laboratory worker
alternative label: natural scientist
alternative label: scientific assistant
hidden label: amateur scientist, botanist
hidden label: astronomical assistant
hidden label: lab assistant
hidden label: scientific interests
hidden label: scientist, particularly well known for his work in genetics
in scheme: occupation
related: academic

Scottish
in dataset: The CWRC Ontology
type: ethnicity
type: Concept
comment: La description de ce terme est basée sur celle de DBPedia. @fr
comment: The description for this term is indebted to DBpedia.
label: Ãcossais @fr
alternative label: highland
broader transitive: European
definition: "The Scottish people (Scots: Scots Fowk, Scottish Gaelic: Albannaich), or Scots, are a nation and socially defined ethnic group resident in Scotland. Historically, they emerged from an amalgamation of two groupsâthe Picts and Gaelsâwho founded the Kingdom of Scotland (or Alba) in the 9th century, and thought to have been ethnolinguistically Celts. Later, the neighbouring Cumbrian Britons, who also spoke a Celtic language, as well as Germanic-speaking Anglo-Saxons and Norse, were incorporated into the Scottish nation." (DBpedia, 2018)
definition: Les Ãcossais correspondent au peuple et Ã la nation qui occupent l'Ãcosse. Ils sont les descendants des anciens Pictes, Gaëls, avec des apports de Bretons insulaires, d'Angles, de Saxons et de Normands (Vikings norrois, danois et plus tard les Normands de France).(DBpedia, 2018) @fr
in scheme: ethnicity

Scottish nationalism
in dataset: The CWRC Ontology
type: political affiliation
type: Concept
comment: La description de ce terme est basée sur celle de DBPedia. @fr
comment: The description for this term is indebted to DBpedia.
label: Nationalisme écossais @fr
alternative label: scots nationalist
alternative label: scottish nationalist
broader transitive: nationalism
definition: "Scottish nationalism promotes the idea that the Scottish people form a cohesive nation and national identity and is closely linked to the cause of Scottish home rule and Scottish independence: the ideology of the Scottish National Party (the party forming the Scottish Government). It is often described as a form of civic nationalism rather than ethnic nationalism. The Acts of Union merged the independent kingdoms of Scotland and England into Great Britain in 1707, but a separate legal system and distinct Scottish institutions continued to exist. Linguistic independence was an important part of the twentieth century Scottish Renaissance, associated with the nationalist impetus provided by Hugh MacDiarmid." (DBpedia, 2017)
definition: «Le nationalisme écossais moderne naît dans l'entre-deux-guerres, même si des éléments nationalistes sont depuis plusieurs siècles au cÅur de l'identité écossaise. L'article examine le contexte historique et politique qui a vu l'éclosion d'un nationalisme politique en Ãcosse, depuis la création du SNP (Scottish National Party) en 1934 jusqu'à la mise en place d'un régime de dévolution Ã l'Ãcosse Ã partir de 1999.» (DBpedia, 2017) @fr
in scheme: political affiliation

Scottish
in dataset: The CWRC Ontology
type: race or colour
type: Concept
comment: The description for this term is indebted to DBpedia.
alternative label: Scotch
alternative label: Scots
definition: "The Scottish people (Scots: Scots Fowk, Scottish Gaelic: Albannaich), or Scots, are a nation and socially defined ethnic group resident in Scotland. Historically, they emerged from an amalgamation of two groupsâthe Picts and Gaelsâwho founded the Kingdom of Scotland (or Alba) in the 9th century, and thought to have been ethnolinguistically Celts. Later, the neighbouring Cumbrian Britons, who also spoke a Celtic language, as well as Germanic-speaking Anglo-Saxons and Norse, were incorporated into the Scottish nation." (DBpedia, 2018)
in scheme: race or colour

sea captain
in dataset: The CWRC Ontology
type: occupation
type: Concept
alternative label: ferryboat captain
alternative label: ship's captain
alternative label: whaling captain
broader transitive: captain
broader transitive: sailor
in scheme: occupation

secondary school
in dataset: The CWRC Ontology
subject-centric predicate: attends secondary school
type: ObjectProperty
sub property of: school attended

secondary school diploma
in dataset: The CWRC Ontology
type: credential
type: Concept
alternative label: Chancellor's Diploma
alternative label: Higher School Certificate
definition: Credential signifying completion of secondary schooling.
in scheme: credential

secularism
in dataset: The CWRC Ontology
type: political affiliation
type: Concept
comment: La description de ce terme est basée sur celle de DBPedia. @fr
comment: The description for this term is indebted to DBpedia.
label: Laïcité @fr
alternative label: secularist
definition: "Secularism is the principle of the separation of government institutions and persons mandated to represent the state from religious institutions and religious dignitaries. One manifestation of secularism is asserting the right to be free from religious rule and teachings, or, in a state declared to be neutral on matters of belief, from the imposition by government of religion or religious practices upon its people. Another manifestation of secularism is the view that public activities and decisions, especially political ones, should be uninfluenced by religious beliefs and/or practices. Secularism draws its intellectual roots from Greek and Roman philosophers such as Epicurus and Marcus Aurelius; from Enlightenment thinkers such as John Locke, Denis Diderot, Voltaire, Baruch Spinoza, James Madison, Thomas Jefferson, and Thomas Paine; and from more recent freethinkers and atheists such as Robert Ingersoll and Bertrand Russell. The purposes and arguments in support of secularism vary widely. In European laicism, it has been argued that secularism is a movement towards modernization, and away from traditional religious values (also known as secularization). This type of secularism, on a social or philosophical level, has often occurred while maintaining an official state church or other state support of religion. In the United States, some argue that has served to a greater extent to protect religion and the religious from governmental interference, while secularism on a social level is less prevalent. Within countries as well, differing political movements support secularism for varying reasons." (DBpedia, 2017)
definition: «La laïcité ou le sécularisme est le «principe de séparation dans l'Ãtat de la société civile et de la société religieuse» et «d'impartialité ou de neutralité de l'Ãtat Ã l'égard des confessions religieuses». Le mot désigne par extension le caractère des «institutions, publiques ou privées, qui sont indépendantes du clergé et des églises». La laïcité s'oppose Ã la reconnaissance d'une religion d'Ãtat. Toutefois, le principe de séparation entre l'Ãtat et les religions peut trouver des applications différentes selon les pays.» (DBpedia, 2017) @fr
in scheme: political affiliation

Seekers
in dataset: The CWRC Ontology
type: religion
type: Concept
comment: The description for this term is indebted to DBpedia.
broader transitive: Dissent (Protestant)
definition: "The Seekers, or Legatine-Arians as they were sometimes known, were an English Protestant dissenting group that emerged around the 1620s, probably inspired by the preaching of three brothers â Walter, Thomas, and Bartholomew Legate. Seekers considered all organised churches of their day corrupt and preferred to wait for God's revelation. Many of them subsequently joined the Religious Society of Friends (Quakers)." (DBpedia, 2018)
in scheme: religion

separatism
in dataset: The CWRC Ontology
type: political affiliation
type: Concept
comment: La description de ce terme est basée sur celle de DBPedia. @fr
comment: The description for this term is indebted to DBpedia.
label: indépendantisme @fr
alternative label: Separatist
definition: "A common definition of separatism is that it is the advocacy of a state of cultural, ethnic, tribal, religious, racial, governmental or gender separation from the larger group. While it often refers to full political secession, separatist groups may seek nothing more than greater autonomy. While some critics may equate separatism with religious segregation, racist segregation, or sexist segregation, most separatists argue that separation by choice is not the same as government-enforced segregation and may serve useful purposes. There is some academic debate about this definition, and in particular how it relates to secessionism, as has been discussed online. Separatist groups practice a form of identity politics, "political activity and theorizing founded in the shared experiences of injustice of members of certain social groups." Such groups believe attempts at integration with dominant groups compromise their identity and ability to pursue greater self-determination. However, economic and political factors usually are critical in creating strong separatist movements as opposed to less ambitious identity movements." (DBpedia, 2018)
definition: «L'indépendantisme, l'aspiration Ã l'indépendance, est utilisé dans le cadre politique pour désigner la revendication pour une collectivité Ã ne pas être « soumis Ã l'autorité d'un autre organe ou d'une autre collectivité ». Il correspond donc Ã des mouvements politique, généralement d'inspiration nationaliste, visant Ã obtenir l'indépendance politique d'un territoire et pouvant être représenté par des partis politiques organisés, ou simplement naître d'un vaste mouvement d'opinion, qui s'organise ensuite en mouvements structurés. Les motivations de l'indépendantisme peuvent avoir des racines politiques, ethniques, historiques ou religieuses, aucune motivation n'excluant les autres. Le mouvement de décolonisation survenu au XXe siècle est caractérisé par l'aboutissement d'un ensemble de mouvements d'indépendance. Ã la différence de l'autonomisme, l'indépendantisme vise Ã la sécession d'un Ãtat, d'une province ou d'un territoire par rapport au pays auquel il appartient. Les revendications indépendantistes peuvent évoluer vers l'autonomisme, comme dans le cas de la Ligue du Nord en Italie : Ã l'inverse, des revendications autonomistes peuvent se radicaliser et évoluer vers l'indépendantisme. L'indépendantisme est également appelé Ã tort séparatisme. La nuance s'établissant au niveau de l'objectif et du moyen. Pour l'indépendantiste le but est l'indépendance, tandis que la séparation tout comme la sécession n'est qu'un passage obligé pour l'atteindre. Les revendications indépendantistes peuvent éventuellement s'exprimer par diverses formes de violence, incluant le terrorisme, et aboutir Ã des conflits armés d'envergure, comme dans le cas d'une guerre d'indépendance - guerre d'Indochine, guerre d'Algérie, guerres de Yougoslavie - mais également dans le cadre d'un processus politique non violent, comme dans le cas de la Tchécoslovaquie, séparée pour devenir la République tchèque et la Slovaquie, ou bien dans le cas de… @fr
in scheme: political affiliation

Sephardic Jewish
in dataset: The CWRC Ontology
type: ethnicity
type: Concept
comment: La description de ce terme est basée sur celle de DBPedia. @fr
comment: The description for this term is indebted to DBpedia.
label: Juif séfarade @fr
broader transitive: Jewish
definition: "Sephardi Jews, also known as Sephardic Jews or simply Sephardim (Hebrew: ×¡Ö°×¤Ö¸×¨Ö·×Ö´Ö¼××, Modern Hebrew: Sfaraddim, Tiberian: SÉpÌÄraddîm; also ×Ö°××Ö¼×Öµ× ×¡Ö°×¤Ö¸×¨Ö·× Y'hudey Spharad, lit. "The Jews of Spain"), are a Jewish ethnic division whose ethnogenesis and emergence as a distinct community of Jews coalesced in the Iberian Peninsula around the start of the 2nd millennium (i.e., about the year 1000). They established communities throughout Spain and Portugal, where they traditionally resided, evolving what would become their distinctive characteristics and diasporic identity." (DBpedia, 2017)
definition: «Les Séfarades (parfois orthographié Sépharades) constituent une branche du judaïsme qui suit le judaïsme liturgique espagnol et portugais (en particulier dans la prononciation des mots des prières). Certains ont contribué aux sciences et techniques en al-Andalus comme Maïmonide, Abraham ibn Ezra, Juda Halevi, Nahmanide, Salomon ibn Gabirol et Moïse de Léon. Par extension, le terme «Séfarade» désigne aussi souvent les Juifs non ashkénazes qui ont souvent adopté le rite séfarade au contact des Juifs issus de l'émigration consécutive Ã l'expulsion des Juifs d'Espagne.» (DBpedia, 2017) @fr
in scheme: ethnicity

Sephardic Jewish
in dataset: The CWRC Ontology
type: national identity
type: Concept
label: Séfarade @fr
broader transitive: Jewish
definition: Indicates a subject's identification with or labelling as Sephardic Jewish as a national identity.
definition: Indique qu'un sujet s'identifie Ã ou s'est vu assigner une identité nationale sérafade. @fr
in scheme: national identity

servant
in dataset: The CWRC Ontology
type: occupation
type: Concept
in scheme: occupation

servant
in dataset: The CWRC Ontology
type: social class
type: Concept
label: domestique @fr
alternative label: SERVANTS
definition: Domestic servants typically live in the home with the family or institution that employs them, although the lowest class of servants might work only casually and hence not receive room and board. This type of labour, very common before the twentieth century, is distinct from that of service positions such as shop assistants, flight attendants, and restaurant workers. (Brown, 2006)
definition: Les domestiques vivent normalement au sein du foyer de la famille ou de l'institution qui les emploie, même si ceux des classes les plus inférieures n'y travaillent que ponctuellement et ne reçoivent donc ni toit ni pension. Ce type d'emploi, très répandu avant le 20ème siècle, est différent des postes rattachés au tertiaire tels que vendeur/se, personnel de cabine ou serveur/se. @fr
in scheme: social class

server
in dataset: The CWRC Ontology
type: occupation
type: Concept
alternative label: cafe manager
alternative label: food server
alternative label: summer waitress
alternative label: waiter
alternative label: waitress
hidden label: receptionist barmaid
in scheme: occupation

settlement work
in dataset: The CWRC Ontology
type: occupation
type: Concept
alternative label: settlement worker
broader transitive: politics
broader transitive: social work
in scheme: occupation

settler
in dataset: The CWRC Ontology
type: occupation
type: Concept
alternative label: colonial settler
alternative label: emigrant
alternative label: immigrant
alternative label: pioneer
hidden label: huguenot immigrant
hidden label: managing trading posts
in scheme: occupation

sex worker
in dataset: The CWRC Ontology
type: occupation
type: Concept
alternative label: courtesan
alternative label: prostitute
in scheme: occupation

sexual reform
in dataset: The CWRC Ontology
type: political affiliation
type: Concept
comment: The description for this term is indebted to DBpedia.
label: révolution sexuelle @fr
alternative label: sex-trade activist
alternative label: sex-trade reformer
alternative label: sexual liberationist
alternative label: sexual libertarian
alternative label: sexual reformer
definition: Advocacy or activism related to the reform of attitudes, practices, and laws related to sex, including autonomy, age of consent, trafficking, and sex work.
definition: Militantisme ou lutte pour le changement des attitutdes, des praitques et des lois liées Ã l'activité sexuelle, incluant l'autonomie, la maturité sexuelle, les trafics et les travailleurs du sexe. @fr
in scheme: political affiliation
related: feminism
related: pro-choice
related: social purity

sexual identity
in dataset: The CWRC Ontology
subject-centric predicate: has sexual identity
type: ObjectProperty
domain: Person
label: une orientation sexuelle @fr
range: sexuality
sub property of: cultural form

bisexuality
is replaced by: bisexuality
in dataset: The CWRC Ontology
type: Concept
comment: Deprecated in favour of instance bisexuality.
comment: Désapprouver en faveur de l'instance bisexualité. @fr
label: bisexualité @fr
deprecated: true
term status: deprecated
alternative label: bisexual
definition: Bisexuality indicates sexual attraction to both genders. In terms of binary understandings of sex or gender, bisexuality is often defined as being sexually attracted to "both sexes".
definition: La bisexualité réfère Ã l'attraction sexuelle pour les deux genres. En terme d'acceptation binaire du sexe ou du genre, la bisexualité est souvent définie comme attraction sexuelle pour les «deux sexes». @fr
in scheme: sexuality

celibacy
is replaced by: celibacy
in dataset: The CWRC Ontology
type: Concept
comment: Deprecated in favour of instance celibacy.
comment: Désapprouver en faveur de l'instance célibat. @fr
label: célibat @fr
deprecated: true
term status: deprecated
alternative label: celibate
definition: Celibacy indicates abstention from sex, and can stem from personal choice, religious prescriptions, or with religious occupations such as being a nun or priest. Celibacy is not the be confused with asexuality, which describes a lack of interest in sex or sexual attraction to other subjects.
definition: Le célibat indique l'abstinence sexuelle, et peut être dû Ã un choix personnel, Ã des impératifs religieux ou des professions cléricales comme religieuse ou prêtre. Le célibat ne doit pas être confondu avec l'asexualité, qui décrit une absence d'intérêt pour les pratiques sexuelles ou d'attirance sexuelle pour d'autres personnes. @fr
in scheme: sexuality

frigidity
is replaced by: frigidity
in dataset: The CWRC Ontology
type: Concept
comment: Deprecated in favour of instance frigidity.
comment: Désapprouver en faveur de l'instance frigidité. @fr
label: frigidité @fr
deprecated: true
term status: deprecated
alternative label: frigid
definition: Frigidity labels a female subject as sexually withdrawn or unenthusiastic (read: non-consenting) in relation to the sexual advance, usually of men within a heterosexual framework, and suggests a lack of pleasure from sexual activities. Unlike asexual and celibate, this term is often ascribed to women, as opposed to self-referential. The term "frigid" was coined in the 1920s by sexologists (Sex and Society, Vol. 1, 285). Its use in discourse surrounding female sexuality is waning.
definition: La frigidité est attribuée aux femmes qui se montrent distantes ou peu enthousiastes (comprendre non consentantes) face aux avances sexuelles, le plus souvent de la part d'hommes dans un cadre hétéronormé, et suggère un manque de plaisir associé aux pratiques sexuelles. Contrairement Ã l'asexualité et au célibat, ce terme est souvent assigné Ã des femmes, et n'est donc pas autoréférentiel. Le terme «frigide» a été formulé dans les années 20 par des sexologues (Sex and Society, Vol. 1, 285). Son usage est en déclin dans les discours Ã propos de la sexualité féminine. @fr
in scheme: sexuality

libertinism
is replaced by: libertinism
in dataset: The CWRC Ontology
type: Concept
comment: Deprecated in favour of instance libertinism.
comment: Désapprouver en faveur de l'instance libertinage. @fr
label: libertinage @fr
deprecated: true
term status: deprecated
definition: Le libertinage réfère Ã un type d'identité sexuelle (souvent pour des hommes) utilisé pour décrire un sujet adhérant aux idées et pratiques hédonistes. @fr
definition: Libertinism refers to a type of sexual identity (often tied to men) used to describe a subject who subscribes to hedonistic sexual politics.
in scheme: sexuality

sexual identity of
in dataset: The CWRC Ontology
type: ObjectProperty
domain: sexuality
range: Person
sub property of: cultural form of

promiscuity
is replaced by: promiscuity
in dataset: The CWRC Ontology
type: Concept
comment: Deprecated in favour of instance promiscuity.
comment: Désapprouver en faveur de l'instance promiscuité. @fr
label: promiscuité @fr
deprecated: true
term status: deprecated
alternative label: promiscuous
definition: La promiscuité indique l'activité sexuelle avec des partenaires multiples de façon décomplexée et indifférenciée, en opposition aux pratiques sexuelles socialement acceptées. La promiscuité est différemment interprétée pour les femmes et les hommes dans la plupart des contextes historiques et culturelles, étant étroitement liée au contrôle de la sexualité féminine et de la reproduction. Elle inclut le libertinage, une forme de sexualité hédoniste fréquemment attribuée Ã ou adoptée par des hommes. @fr
definition: Promiscuity indicates sex with multiple partners in a casual or indiscriminate fashion and in opposition to socially sanctioned sexual behaviour. Promiscuity is differently constructed for women and men in most historical and cultural contexts, being closely connected to the control of female sexuality and reproduction. It includes libertinism, a form of hedonistic sexual politics frequently ascribed to or adopted by men.
in scheme: sexuality

sexual identity (reported)
in dataset: The CWRC Ontology
subject-centric predicate: has sexual identity (reported)
type: ObjectProperty
domain: Person
label: une orientation sexuelle (déclarée) @fr
range: sexuality
sub property of: sexual identity

sexual identity (reported) of
in dataset: The CWRC Ontology
type: ObjectProperty
domain: sexuality
range: Person
sub property of: sexual identity of

sexual identity (self-reported)
in dataset: The CWRC Ontology
subject-centric predicate: has sexual identity (self-reported)
type: ObjectProperty
domain: Person
label: une orientation sexuelle (autodéclarée) @fr
range: sexuality
sub property of: sexual identity

sexual identity (self-reported) of
in dataset: The CWRC Ontology
type: ObjectProperty
domain: sexuality
range: Person
sub property of: sexual identity of

Shinto
in dataset: The CWRC Ontology
type: religion
type: Concept
comment: La description de ce terme est basée sur celle de DBPedia. @fr
comment: The description for this term is indebted to DBpedia.
label: Shintoïsme @fr
definition: "Shinto (ç¥é ShintÅ), also called kami-no-michi, is a Japanese religion. It focuses on ritual practices to be carried out diligently, to establish a connection between present-day Japan and its ancient past. Shinto practices were first recorded and codified in the written historical records of the Kojiki and Nihon Shoki in the 8th century. Still, these earliest Japanese writings do not refer to a unified "Shinto religion", but rather to a collection of native beliefs and mythology. Shinto today is a term that applies to the religion of public shrines devoted to the worship of a multitude of gods (kami), suited to various purposes such as war memorials and harvest festivals, and applies as well to various sectarian organizations. Practitioners express their diverse beliefs through a standard language and practice, adopting a similar style in dress and ritual, dating from around the time of the Nara and Heian periods (8th to 12th centuries AD). The word Shinto ("way of the gods") was adopted, originally as JindÅ or ShindÅ, from the written Chinese Shendao (ç¥é, pinyin: shén dà o), combining two kanji: "shin" (ç¥), meaning "spirit" or kami; and "tÅ" (é), meaning a philosophical path or study (from the Chinese word dà o). The oldest recorded usage of the word Shindo is from the second half of the 6th century. Kami are defined in English as "spirits", "essences" or "gods", referring to the energy generating the phenomena. Since Japanese language does not distinguish between singular and plural, kami refers to the divinity, or sacred essence, that manifests in multiple forms: rocks, trees, rivers, animals, places, and even people can be said to possess the nature of kami. Kami and people are not separate; they exist within the same world and share its interrelated complexity. Shinto is the largest religion in Japan, practiced by nearly 80% of the population, yet only a small percentage of these identify themselves as "Shintoists" in surveys. This is because "Shinto" has …
definition: «Le shinto (ç¥é, shintÅ, littéralement « la voie des dieux » ou « la voie du divin ») ou shintoïsme (/ÊintÉism/) est un ensemble de croyances datant de l'histoire ancienne du Japon, parfois reconnu comme religion. Elle mélange des éléments polythéistes et animistes. Il s'agit de la plus ancienne religion connue du Japon et particulièrement liée Ã sa mythologie. Le terme « shintÅ », lecture sino-japonaise, ou kami no michi, est apparu pour différencier cette vieille religion du bouddhisme « importé » de Chine au Japon au VIe siècle. Ses pratiquants seraient aujourd'hui plus de cent millions au Japon. Dans la mesure où il s'agit plus d'une culture propre Ã un pays que d'une religion concrète (on ne peut pas se convertir; on naît au Japon, on naît shinto), et qu'il n'y a aucun dogme écrit, le suffixe -isme peut être alors considéré comme illégitime voire incorrect. Ainsi, le terme shinto est préféré de manière générale[travail inédit ?].» (DBpedia, 2018) @fr
in scheme: religion

shipping
in dataset: The CWRC Ontology
type: occupation
type: Concept
alternative label: ship owner
alternative label: shipper
alternative label: shipping merchant
alternative label: shipping owner
broader transitive: transportation work
in scheme: occupation

shopkeepers
in dataset: The CWRC Ontology
type: social class
type: Concept
label: commerçants @fr
alternative label: SHOPKEEPERS
definition: Habituellement attribué Ã quelqu'un qui «possède et tient un bar ou une boutique», mais dont l'activité est plus réduite que celle d'un entrepreneur ou d'un industriel. @fr
definition: Typically applied to someone who "owns and runs a pub or shop," but not on the scale of an entrepreneur or industrialist. (Brown, 2006)
in scheme: social class

sibling
in dataset: The CWRC Ontology
subject-centric predicate: has sibling
type: ObjectProperty
range: Person
sub property of: relative

sibling of
in dataset: The CWRC Ontology
type: ObjectProperty
domain: Person
label: frères et soeurs de @fr
range: Person
sub property of: relative of
inverse of: has sibling

singer
in dataset: The CWRC Ontology
type: occupation
type: Concept
alternative label: amateur singer
alternative label: concert singer
alternative label: opera singer
in scheme: occupation

sister
in dataset: The CWRC Ontology
subject-centric predicate: has sister
type: ObjectProperty
range: Person
sub property of: sibling

sister of
in dataset: The CWRC Ontology
type: ObjectProperty
domain: Person
label: soeur de @fr
range: Person
sub property of: sibling of
inverse of: has sister

artisan
in dataset: The CWRC Ontology
type: social class
type: Concept
label: artisane qualifiée @fr
alternative label: SKILLEDCRAFTPERSON-ARTISAN
definition: Celle classe inclut des métiers tels que tailleur/euse, orfèvre, cordonnier/ère, chapelier/ère et couturier/ère. @fr
definition: This class includes such trades as "goldsmith, tailor, shoemaker, milliner, and dressmaker." (Brown, 2006)
in scheme: social class

skilled trade
in dataset: The CWRC Ontology
type: occupation
type: Concept
alternative label: moulder
in scheme: occupation

skinner
in dataset: The CWRC Ontology
type: occupation
type: Concept
broader transitive: leather worker
in scheme: occupation

Slav
in dataset: The CWRC Ontology
type: ethnicity
type: Concept
comment: La description de ce terme est basée sur celle de DBPedia. @fr
comment: The description for this term is indebted to DBpedia.
label: Slave @fr
alternative label: Slavic
definition: "Slavs are the largest Indo-European ethno-linguistic group in Europe. They are native to Central Europe, Eastern Europe, Southeast Europe, Northeastern Europe, North Asia and Central Asia. Slavs speak Indo-European Slavic languages. From the early 6th century they spread to inhabit most of Central and Eastern Europe and Southeast Europe. States with slavic-based languages comprise over 50% of the territory of Europe.Present-day Slavic people are classified into West Slavs (chiefly Poles, Czechs and Slovaks), East Slavs (chiefly Russians, Belarusians, and Ukrainians), and South Slavs (chiefly Serbs, Croats, Bosniaks, ethnic Macedonians, Slovenes, Montenegrins of the Former Yugoslavia and Bulgarians). Modern Slavic nations and ethnic groups are considerably diverse both genetically and culturally, and relations between them â even within the individual ethnic groups themselves â are varied, ranging from a sense of connection to mutual feelings of hostility." (DBpedia, 2018)
definition: «Les Slaves sont des peuples d'origine européenne. Les Slaves sont surtout présents en Europe centrale et en Europe de l'Est. Les ancêtres Indo-Européens des Slaves, proches des Baltes et des Germains sur le plan ethnolinguistique, sont connus depuis la fin du Ier millénaire avant notre ère. Ils sont situés le plus souvent au nord de l'Ukraine et au sud de la Biélorussie, dans une région située Ã la confluence du Dniepr et de la rivière Pripiat. Mais, les auteurs anciens ne commencent réellement Ã les mentionner qu'à partir du VIe siècle de notre ère.» (DBpedia, 2018) @fr
in scheme: ethnicity

slave
in dataset: The CWRC Ontology
type: occupation
type: Concept
alternative label: slave nurse
in scheme: occupation

slave or forced labourer
in dataset: The CWRC Ontology
type: social class
type: Concept
alternative label: bonded labourer
alternative label: serf
alternative label: serfs
alternative label: slave
definition: The category of slaves and forced labourers covers the spectrum from chattel slaves through indentured servants to serfs, including those bonded to servitude with no hope of paying their debt.
in scheme: social class

slave owner
in dataset: The CWRC Ontology
type: occupation
type: Concept
in scheme: occupation

slaver
in dataset: The CWRC Ontology
type: occupation
type: Concept
alternative label: slave trader
in scheme: occupation

smuggler
in dataset: The CWRC Ontology
type: occupation
type: Concept
alternative label: arms runner
alternative label: gun runner
in scheme: occupation

class identity
in dataset: The CWRC Ontology
subject-centric predicate: has class identity
type: ObjectProperty
domain: Person
label: une classe sociale @fr
range: social class
sub property of: cultural form

class identity of
in dataset: The CWRC Ontology
type: ObjectProperty
domain: social class
range: Person
sub property of: cultural form of

class identity (reported)
in dataset: The CWRC Ontology
subject-centric predicate: has class identity (reported)
type: ObjectProperty
domain: Person
label: classe sociale déclarée @fr
range: social class
sub property of: class identity

class identity (reported) of
in dataset: The CWRC Ontology
type: ObjectProperty
domain: social class
range: Person
sub property of: class identity of

class identity (self-reported)
in dataset: The CWRC Ontology
subject-centric predicate: has class identity (self-reported)
type: ObjectProperty
domain: Person
label: classe sociale autodéclarée @fr
range: social class
sub property of: class identity

class identity (self-reported) of
in dataset: The CWRC Ontology
type: ObjectProperty
domain: social class
range: Person
sub property of: class identity of

Social Gospel
in dataset: The CWRC Ontology
type: religion
type: Concept
comment: La description de ce terme est basée sur celle de DBPedia. @fr
comment: The description for this term is indebted to DBpedia.
label: Ãvangile social @fr
broader transitive: Protestantism
definition: "The Social Gospel was a Protestant movement that was most prominent in the early 20th century United States and Canada. The movement applied Christian ethics to social problems, especially issues of social justice such as economic inequality, poverty, alcoholism, crime, racial tensions, slums, unclean environment, child labor, inadequate labor unions, poor schools, and the danger of war. Theologically, the Social Gospellers sought to operationalize the Lord's Prayer (Matthew 6:10): "Thy kingdom come, Thy will be done on earth as it is in heaven." They typically were post-millennialist; that is, they believed the Second Coming could not happen until humankind rid itself of social evils by human effort. The Social Gospel was more popular among clergy than laity. Its leaders were predominantly associated with the liberal wing of the Progressive Movement, and most were theologically liberal, although a few were also conservative when it came to their views on social issues. Important leaders include Richard T. Ely, Josiah Strong, Washington Gladden, and Walter Rauschenbusch. Although most scholars agree that the Social Gospel movement peaked in the early 20th century, there is disagreement over when the movement began to decline, with some asserting that the destruction and trauma caused by World War I left many disillusioned with the Social Gospel's ideals while others argue that World War I stimulated the Social Gospelers' reform efforts. Theories regarding the decline of the Social Gospel after World War I often cite the rise of neo-orthodoxy as a contributing factor in the movement's decline. The Social Gospel, after World War II, along with neo-Thomism, influenced the formation of Christian Democracy political ideology. Many of the Social Gospel's ideas also reappeared in the Civil Rights Movement of the 1960s. "Social Gospel" principles continue to inspire newer movements such as Christians Against Poverty." (DBpedia, 2018)
definition: «L'Ãvangile social est un mouvement intellectuel chrétien qui s'est engagé Ã lutter contre la pauvreté, l'inégalité, le crime, le travail des enfants, les tensions raciales, les bidonvilles, le manque d'hygiène, les écoles pauvres et le danger de la guerre. Les organisateurs du mouvement étaient pour la plupart des protestants post-millénaristes. Il a notamment eu un impact Ã l'époque du New Deal américain et au sein du Parti social-démocratique du Canada. Parmi les figures du mouvement, l'on peut nommer Dorothy Day, Tommy Douglas, Diane Drufenbrock, Washington Gladden, Adolf von Harnack, Jesse Jackson, Martin Luther King, Jr., Charles Clayton Morrison, Walter Rauschenbusch, Josiah Strong et James Shaver Woodsworth. * Portail du christianisme Portail du christianisme * Portail du protestantisme Portail du protestantisme * Portail de la société Portail de la société» (DBpedia, 2018) @fr
in scheme: religion

social purity
in dataset: The CWRC Ontology
type: political affiliation
type: Concept
comment: The description for this term is indebted to DBpedia.
label: abolition de la prostitution (Royaume-Uni) @fr
alternative label: purity movement
definition: "The social purity movement was a late 19th-century social movement that sought to abolish prostitution and other sexual activities that were considered immoral according to Christian morality. Composed primarily of women, the movement was active in English-speaking nations from the late 1860s to about 1910, exerting an important influence on the contemporaneous feminist, eugenics, and birth control movements. The movement helped to shape feminist views on prostitution. The roots of the social purity movement lay in early 19th-century moral reform movements, such as radical utopianism, abolitionism, and the temperance movement. In the late 19th century, "social" was a euphemism for "sexual"; the movement first formed in opposition to the legalization and regulation of prostitution, and quickly spread to other sex-related issues such as raising the age of consent, sexually segregating prisons, eliminating abortion, opposing contraception, and censoring pornography." (DBpedia, 2017)
in scheme: political affiliation
related: feminism

social reform
in dataset: The CWRC Ontology
type: political affiliation
type: Concept
comment: The description for this term is indebted to DBpedia.
label: réforme sociale @fr
alternative label: progressivism
alternative label: reform
alternative label: reformer
alternative label: reformers
alternative label: reformist
alternative label: social and legal reform
alternative label: social reformer
alternative label: social welfare
definition: "A reform movement is the kind of social movement that aims to make gradual change, or change in certain aspects of society, rather than rapid or fundamental changes. A reform movement is distinguished from more radical social movements such as revolutionary movements. Reformists' ideas are often grounded in liberalism, although they may be rooted in socialist (specifically, social democratic) or religious concepts. Some rely on personal transformation; others rely on small collectives, such as Mahatma Gandhi's spinning wheel and the self-sustaining village economy, as a mode of social change. Reactionary movements, which can arise against any of these, attempt to put things back the way they were before any successes the new reform movement(s) enjoyed, or to prevent any such successes." (DBpedia, 2017)
in scheme: political affiliation

social relationship
in dataset: The CWRC Ontology
range includes: Work
range includes: AdminPlaceConcept
range includes: Feature
range includes: FormalOrganization
range includes: Person
subject-centric predicate: relates socially to
type: ObjectProperty
sub property of: biographical relationship

social scientist
in dataset: The CWRC Ontology
type: occupation
type: Concept
alternative label: anthropologist
alternative label: economist
alternative label: egyptologist
alternative label: sociologist
hidden label: academic economist
in scheme: occupation

social work
in dataset: The CWRC Ontology
type: occupation
type: Concept
alternative label: caseworker
alternative label: child care officer
alternative label: child welfare officer
alternative label: child welfare worker
alternative label: childcare officer
alternative label: children's aid worker
alternative label: community worker
alternative label: emigrant aid
alternative label: humanitarian
alternative label: immigrant aid
alternative label: organise soup kitchens
alternative label: organiser for the poor
alternative label: religious social worker
alternative label: social caseworker
alternative label: social investigation
alternative label: social investigator
alternative label: social work organizer
alternative label: social worker
alternative label: unemployment worker
alternative label: welfare officer
alternative label: welfare supervisor
alternative label: welfare worker
alternative label: worker with prostitutes
alternative label: youth club worker
alternative label: youth worker
hidden label: almshouse manager
hidden label: chief lady welfare officer
hidden label: child's aid worker
hidden label: organiser of women's community
hidden label: poor districts
hidden label: running a soup kitchen
in scheme: occupation

socialism
in dataset: The CWRC Ontology
type: occupation
type: political affiliation
type: Concept
comment: La description de ce terme est basée sur celle de DBPedia. @fr
comment: The description for this term is indebted to DBpedia.
label: socialisme @fr
alternative label: fabian socialist
alternative label: militant socialist
alternative label: owenite socialism
alternative label: radical socialist
alternative label: socialist
alternative label: socialist and feminist
alternative label: socialist feminist
alternative label: socialist organizer
broader transitive: politics
definition: "Socialism is a range of economic and social systems characterised by social ownership and democratic control of the means of production; as well as the political ideologies, theories, and movements that aim at their establishment. Social ownership may refer to forms of public, collective, or cooperative ownership; to citizen ownership of equity; or to any combination of these. Although there are many varieties of socialism and there is no single definition encapsulating all of them, social ownership is the common element shared by its various forms. Socialist economic systems can be divided into both non-market and market forms. Non-market socialism involves the substitution of factor markets and money with engineering and technical criteria based on calculation performed in-kind, thereby producing an economic mechanism that functions according to different economic laws from those of capitalism. Non-market socialism aims to circumvent the inefficiencies and crises traditionally associated with capital accumulation and the profit system. By contrast, market socialism retains the use of monetary prices, factor markets, and, in some cases, the profit motive with respect to the operation of socially owned enterprises and the allocation of capital goods between them. Profits generated by these firms would be controlled directly by the workforce of each firm or accrue to society at large in the form of a social dividend. The feasibility and exact methods of resource allocation and calculation for a socialist system are the subjects of the socialist calculation debate. The socialist political movement includes a diverse array of political philosophies that originated amid the revolutionary movements of the mid-to-late 1700s and of a general concern for the social problems that were associated with capitalism. In addition to the debate over markets and planning, the varieties of socialism differ in their form of social ownership, how management is to be organized within p…
definition: «Le mot socialisme recouvre un ensemble très divers de courants de pensée et de mouvements politiques, dont le point commun est de rechercher une organisation sociale et économique plus juste. Le but originel du socialisme est d'obtenir l'égalité sociale, ou du moins une réduction des inégalités, et notamment pour les courants d'inspiration marxiste, d'établir une société sans classes sociales. Plus largement, le socialisme peut être défini comme une tendance politique, historiquement marquée Ã gauche, dont le principe de base est l'aspiration Ã un monde meilleur, fondé sur une organisation sociale harmonieuse et sur la lutte contre les injustices. Selon les contextes, le mot socialisme ou l'adjectif socialiste peuvent qualifier une idéologie, un parti politique, un régime politique ou une organisation sociale. Le mot socialisme lui-même entre dans le langage courant Ã partir des années 1820, dans le contexte de la révolution industrielle et de l'urbanisation qui l'accompagne : il désigne alors un ensemble de revendications et d'idées visant Ã améliorer le sort des ouvriers, et plus largement de la population, via le remplacement du capitalisme par une société supposée plus juste. L'idée socialiste, sous de multiples formes, se développe au long du XIXe siècle et donne naissance dans le monde entier Ã des partis politiques s'en réclamant sous diverses dénominations (socialiste, mais également social-démocrate, travailliste, etc.). Dans la seconde moitié du XIXe siècle, le marxisme supplante l'approche dite du «socialisme utopique», ainsi que le «socialisme libertaire» des anarchistes : le courant de pensée marxiste se veut porteur d'une forme «scientifique» de socialisme, fondé sur une analyse du capitalisme, du dépassement de celui-ci par le biais de la lutte des classes et du passage Ã la propriété sociale des moyens de production. Dans les dernières années du siècle, une partie du socialisme européen s'oriente ce… @fr
in scheme: political affiliation
related: communism
related: social reform

socializer
in dataset: The CWRC Ontology
type: occupation
type: Concept
alternative label: bon viveur
alternative label: debutante
alternative label: socialite
hidden label: became a debutante
hidden label: bon viveur, drinker, and speculator
hidden label: fashionable beauty
in scheme: occupation

Society of Friends
in dataset: The CWRC Ontology
type: political affiliation
type: Concept
comment: La description de ce terme est basée sur celle de DBPedia. @fr
comment: The description for this term is indebted to DBpedia.
label: Société religieuse des Amis @fr
broader transitive: human rights
definition: "Quakers (or Friends) are members of a historically Christian group of religious movements generally known as the Religious Society of Friends. Members of the various Quaker movements are all generally united in a belief in the ability of each human being to experientially access "that of God in every person," and therefore they profess the priesthood of all believers, a doctrine derived from the First Epistle of Peter. They include those with evangelical, holiness, liberal, and traditional Quaker understandings of Christianity. To differing extents, the different movements that make up the Religious Society of Friends/Friends Church avoid creeds and hierarchical structures. In 2007, there were approximately 359,000 adult Quakers. In 2012, there were 377,055 adult Quakers. Around 79% of Quakers worldwide belong to the "evangelical" and "programmed" branches of Quakerismâthese Quakers worship in services with singing and a prepared message from the Bible, coordinated by a pastor. Around 11% of Friends practice waiting worship, or unprogrammed worship (more commonly known today as Meeting for Worship), where the order of service is not planned in advance, is predominantly silent, and may include unprepared vocal ministry from those present. Some meetings of both types have Recorded Ministers in their meetingsâFriends recognised for their gift of vocal ministry. The first Quakers lived in mid-17th century England. The movement arose from the Legatine-Arians and other dissenting Protestant groups, breaking away from the established Church of England. The Quakers, especially the ones known as the Valiant Sixty, attempted to convert others to their understanding of Christianity, travelling both throughout Great Britain and overseas, preaching the gospel of Jesus Christ. Some of these early Quaker ministers were women. They based their message on the religious belief that "Christ has come to teach his people himself", stressing the importance of a direct relationship with …
definition: «La Société religieuse des Amis est un mouvement religieux fondé en Angleterre au XVIIe siècle par des dissidents de l'Ãglise anglicane. Les membres de ce mouvement sont communément connus sous le nom de quakers () mais ils se nomment entre eux «Amis» et «Amies». Le mouvement est souvent nommé simplement Société des Amis et le surnom de «quaker» apparaît le plus souvent dans la dénomination officielle, sous la forme Société religieuse des Amis (quakers). Les historiens s'accordent Ã désigner George Fox comme le principal fondateur ou le plus important meneur des débuts du mouvement. Depuis sa création en Angleterre, le mouvement s'est d'abord répandu dans les pays de colonisation anglo-saxonne. Au XXe siècle, des missionnaires quakers ont propagé leur religion en Amérique latine et en Afrique. Aujourd'hui, les quakers déclarent être au nombre d'environ 350 000 dans le monde. La Société des Amis se différencie de la plupart des autres groupes issus du christianisme par l'absence de credo et de toute structure hiérarchique. Pour les quakers, la croyance religieuse appartient Ã la sphère personnelle et chacun est libre de ses convictions. Le concept de «lumière intérieure» (inner light) est cependant partagé par la plupart d'entre eux, quelle que soit la signification donnée Ã ces mots. De nombreux quakers reconnaissent le christianisme mais ne ressentent pas leur foi comme entrant dans les catégories chrétiennes traditionnelles. On trouve aujourd'hui dans la Société des Amis des pratiques très diverses, y compris un large courant évangélique.» (DBpedia, 2017) @fr
in scheme: political affiliation
related: abolitionism
related: feminism

Socinianism
in dataset: The CWRC Ontology
type: religion
type: Concept
comment: La description de ce terme est basée sur celle de DBPedia. @fr
comment: The description for this term is indebted to DBpedia.
label: socinianisme @fr
definition: "Socinianism (pronunciation: /sÉËsÉªniËÉnizm/) is a system of Christian doctrine named for Fausto Sozzini (Latin: Faustus Socinus), which was developed among the Polish Brethren in the Minor Reformed Church of Poland during the 16th and 17th centuries and embraced by the Unitarian Church of Transylvania during the same period. It is most famous for its Nontrinitarian Christology but contains a number of other unorthodox beliefs as well." (DBpedia, 2018)
definition: «Le socinianisme est un courant chrétien remontant Ã l'Italien Fausto Socin (Fausto Sozzini) qui refuse la doctrine chrétienne de la Trinité, et se présente comme libéral.» (DBpedia, 2018) @fr
in scheme: religion

son
in dataset: The CWRC Ontology
subject-centric predicate: has son
type: ObjectProperty
range: Person
sub property of: child

son of
in dataset: The CWRC Ontology
type: ObjectProperty
domain: Person
label: fil de @fr
range: Person
sub property of: child of
inverse of: has son
broader: parent

sort order of
in dataset: The CWRC Ontology
domain includes: personal name
type: ObjectProperty
inverse of: has sort order

Spanish republicanism
in dataset: The CWRC Ontology
type: political affiliation
type: Concept
comment: The description for this term is indebted to DBpedia.
label: républicanisme Espagnol @fr
alternative label: spanish republican
alternative label: spanish republican supporter
broader transitive: republicanism
definition: "There has existed in the Kingdom of Spain a persistent trend of republican thought, especially throughout the 19th, 20th, and 21st centuries, that has manifested itself in diverse political parties and movements over the entire course of the history of Spain. While these movements have shared the objective of establishing a republic in Spain, during these three centuries there have surged distinct schools of thought on the form republicans would want to give to the Spanish State: unitary (centralized) or federal. Despite the country's long-lasting schools of republican movements, the government of Spain has been organized as a republic during only two very short periods in its history, which totaled less than 10 years of republican government in the entirety of Spanish history. The First Spanish Republic lasted from February 1873 to December 1874, and the Second Spanish Republic lasted from April 1931 to April 1939. Currently there are movements and political parties throughout the entire political spectrum that advocate for a Third Spanish Republic, including almost all of the Spanish left, as well as liberal, right-winged, and nationalist parties." (DBpedia, 2017)
in scheme: political affiliation

spatial relationship
in dataset: The CWRC Ontology
subject-centric predicate: has spatial relation to
type: ObjectProperty

spinner
in dataset: The CWRC Ontology
type: occupation
type: Concept
alternative label: cotton spinner
alternative label: spinning
broader transitive: skilled trade
in scheme: occupation

spiritualism
in dataset: The CWRC Ontology
type: religion
type: Concept
comment: La description de ce terme est basée sur celle de DBPedia. @fr
comment: The description for this term is indebted to DBpedia.
label: spritisme @fr
alternative label: psychic
definition: "Spiritualism is the belief that the spirits of the dead have both the ability and the inclination to communicate with the living. The afterlife, or the "spirit world", is seen by spiritualists not as a static place, but as one in which spirits continue to evolve. These two beliefs: that contact with spirits is possible, and that spirits are more advanced than humans, lead spiritualists to a third belief, that spirits are capable of providing useful knowledge about moral and ethical issues, as well as about the nature of God. Some spiritualists will speak of a concept which they refer to as "spirit guides"âspecific spirits, often contacted, who are relied upon for spiritual guidance. Spiritism, a branch of spiritualism developed by Allan Kardec and today practiced mostly in Continental Europe and Latin America, especially in Brazil, emphasises reincarnation." (DBpedia, 2017)
definition: «Le spiritisme est considéré, selon les sources, comme une superstition, comme une science occulte ou comme une doctrine. Il est fondé sur la croyance que certains phénomènes paranormaux sont le moyen pour des entités de l'au-delà appelées «esprits», le plus souvent des personnes décédées, de communiquer avec les vivants. Ce mot s'applique ainsi, de manière large, Ã un courant disparate où les pratiquants, appelés «spirites», communiquent avec ces «esprits» par divers moyens, comme des sujets en état de transe (médiums) ou des supports inanimés (tables tournantes...).» (DBpedia, 2017) @fr
in scheme: religion

sports
in dataset: The CWRC Ontology
type: occupation
type: Concept
alternative label: athlete
alternative label: boxer
alternative label: curling
alternative label: golf
alternative label: oarsman
alternative label: olympic athlete
alternative label: physical training instructor
alternative label: polo player
alternative label: skier
alternative label: sport
alternative label: sportsman
alternative label: yachtsman
alternative label: yachtsperson
alternative label: yachtswoman
hidden label: championship skier
in scheme: occupation

Social Sciences and Humanities Research Council
type: Organization
name: Conseil de recherches en sciences humaines @fr
nick: SSHRC

Stalinism
in dataset: The CWRC Ontology
type: political affiliation
type: Concept
comment: La description de ce terme est basée sur celle de DBPedia. @fr
comment: The description for this term is indebted to DBpedia.
label: Stalinisme @fr
alternative label: stalinist
alternative label: totalitarian
definition: "Stalinism is the means of governing and related policies implemented by Joseph Stalin. Stalinist policies in the Soviet Union included state terror, rapid industrialization, the theory of socialism in one country, a centralized state, collectivization of agriculture, cult of personality in leadership, and subordination of interests of foreign communist parties to those of the Communist Party of the Soviet Unionâdeemed by Stalinism to be the most forefront vanguard party of communist revolution at the time. Stalinism promoted the escalation of class conflict, utilizing state violence to forcibly purge society of claimed supporters of the bourgeoisie, regarding them as threats to the pursuit of the communist revolution that resulted in substantial political violence and persecution of such people. These included not only bourgeois people but also working-class people accused of counter-revolutionary sympathies. Stalinist industrialization was officially designed to accelerate the development towards communism, stressing that such rapid industrialization was needed because the country was previously economically backward in comparison with other countries; and that it was needed in order to face the challenges posed by internal and external enemies of communism. Rapid industrialization was accompanied with mass collectivization of agriculture and rapid urbanization. Rapid urbanization converted many small villages into industrial cities. To accelerate the development of industrialization, Stalin pragmatically created joint venture contracts with major American private enterprises, such as Ford Motor Company, that under state supervision assisted in developing the basis of industry of the Soviet economy from the late 1920s to 1930s. After the American private enterprises completed their tasks, Soviet state enterprises took over." (DBpedia, 2017)
definition: «Le mot stalinisme désigne l'idéologie et la pratique politique des partis communistes ayant adopté la ligne politique définie par les partisans de Joseph Staline, secrétaire général du Parti communiste de l'Union soviétique. Par extension, ces partis et leurs membres ont été qualifiés de staliniens. Le stalinisme est caractérisé par le centralisme et l'emploi de la force et de la terreur comme mode de gouvernement, accompagnés d'un culte de la personnalité organisé autour du principal dirigeant de chaque Parti communiste. Les régimes staliniens se caractérisent par une économie planifiée par l'état. Par extension, le terme de stalinisme et les adjectifs stalinien ou, plus rarement, staliniste sont parfois utilisés pour qualifier l'ensemble des régimes basés sur le modèle soviétique, ainsi que les partis politiques les soutenant. Après la déstalinisation (1956), l'Union soviétique cesse de se réclamer de Staline, mais le terme stalinisme et l'adjectif stalinien continuent d'être utilisés, dans le cadre de discours critiques ou polémiques, pour qualifier l'URSS, l'ensemble des pays du bloc de l'Est et plus largement l'ensemble des régimes dictatoriaux communistes. En Europe après la déstalinisation, seule la République populaire socialiste d'Albanie s'est réclamée de la continuité stalinienne. En Asie en revanche, ce fut encore, durant des décennies, le cas des régimes communistes chinois, vietnamien, laotien, cambodgien et surtout coréen qui, au XXIe siècle, est parfois qualifiée de «dernier régime stalinien».» (DBpedia, 2017) @fr
in scheme: political affiliation
related: Bolshevism
related: communism
related: Marxism

stateless
in dataset: The CWRC Ontology
type: national identity
type: Concept
comment: La description de ce terme est basée sur celle de DBPedia. @fr
comment: The description for this term is indebted to DBpedia.
label: apatride @fr
definition: "In international law, statelessness is the lack of citizenship. A stateless person is someone who is "not considered as a national by any state under the operation of its law". Some stateless persons are also refugees. However, not all refugees are stateless, and many persons who are stateless have never crossed an international border. Most people belonging to a stateless nation, despite lacking their own nation state, nonetheless hold citizenship in one or more countries, in some cases effectively as second-class citizens." (DBpedia, 2018)
definition: Un apatride est, selon la convention de New York du 28 septembre 1954, « toute personne qu'aucun Ãtat ne considère comme son ressortissant par application de sa législation ». Plus simplement, un apatride est une personne dépourvue de nationalité, qui ne bénéficie de la protection d'aucun Ãtat. Il y aurait plus de 12 millions d'apatrides, selon le Haut Commissariat des Nations unies pour les réfugiés (HCR). Le mot « apatride » est composé du préfixe privatif a- et du grec patris, (« terre des ancêtres »).Le terme allemand heimatlos, dont il est le synonyme, s'utilise, en français, pour désigner les allemands ayant fui l'Allemagne nazie durant la Seconde Guerre mondiale.[réf. nécessaire] (DBpedia, 2018) @fr
in scheme: national identity

statistician
in dataset: The CWRC Ontology
type: occupation
type: Concept
alternative label: medical statistician
broader transitive: mathematics
in scheme: occupation

stepbrother
in dataset: The CWRC Ontology
subject-centric predicate: has stepbrother
type: ObjectProperty
range: Person
sub property of: brother

stepbrother of
in dataset: The CWRC Ontology
type: ObjectProperty
sub property of: brother of
inverse of: has stepbrother
broader: sibling

stepchild
in dataset: The CWRC Ontology
subject-centric predicate: has stepchild
type: ObjectProperty
range: Person
sub property of: child
related: children

stepchild of
in dataset: The CWRC Ontology
type: ObjectProperty
domain: Person
label: enfant d'un autre mariage @fr
range: Person
sub property of: child of
inverse of: has stepchild
related: parent

stepdaughter
in dataset: The CWRC Ontology
subject-centric predicate: has stepdaughter
type: ObjectProperty
range: Person
sub property of: stepchild
related: children

stepdaughter of
in dataset: The CWRC Ontology
type: ObjectProperty
domain: Person
label: belle-fille de @fr
range: Person
sub property of: stepchild of
inverse of: has stepdaughter
related: parent

stepfather
in dataset: The CWRC Ontology
subject-centric predicate: has stepfather
type: ObjectProperty
range: Person
sub property of: stepparent

stepfather of
in dataset: The CWRC Ontology
type: ObjectProperty
domain: Person
label: beau-père de @fr
range: Person
sub property of: stepparent of
inverse of: has stepfather
broader: children
definition: Une personne qui prend le rôle d'un père pour un enfant sans être son père biologique. Notez-bien lâambiguïté avec le text français pour le rôle du mari d'une soeur or d'un frère. @fr

stepmother
in dataset: The CWRC Ontology
subject-centric predicate: has stepmother
type: ObjectProperty
range: Person
sub property of: stepparent
inverse of: stepmother of

stepmother of
in dataset: The CWRC Ontology
type: ObjectProperty
label: belle-mère de @fr
sub property of: stepparent of
broader: children
definition: Une personne qui prend le rôle d'une mère pour un enfant sans être sa mère biologique. Notez-bien lâambiguïté avec le text français pour le rôle de la femme d'une soeur or d'un frère. @fr

stepparent
in dataset: The CWRC Ontology
subject-centric predicate: has stepparent
type: ObjectProperty
range: Person
sub property of: parent
inverse of: has stepchild

stepparent of
in dataset: The CWRC Ontology
type: ObjectProperty
domain: Person
label: stepparent de @fr
range: Person
sub property of: parent of
inverse of: has stepparent
broader: children

stepsister
in dataset: The CWRC Ontology
subject-centric predicate: has stepsister
type: ObjectProperty
range: Person
sub property of: sister

stepsister of
in dataset: The CWRC Ontology
type: ObjectProperty
domain: Person
range: Person
sub property of: sister of
inverse of: has stepsister
broader: sibling

stepson
in dataset: The CWRC Ontology
subject-centric predicate: has stepson
type: ObjectProperty
range: Person
sub property of: stepchild
related: children

stepson of
in dataset: The CWRC Ontology
type: ObjectProperty
label: beau-fils de @fr
sub property of: stepchild of
inverse of: has stepson
related: parent

stillbirth
in dataset: The CWRC Ontology
type: reproductive history
type: Concept
alternative label: still birth
alternative label: stillborn
definition: Related to a stillborn child.
in scheme: reproductive history

storyteller
in dataset: The CWRC Ontology
type: occupation
type: Concept
alternative label: raconteur
in scheme: occupation

student
in dataset: The CWRC Ontology
type: occupation
type: Concept
alternative label: apprentice
alternative label: architecture student
alternative label: art student
alternative label: engineering student
alternative label: law student
alternative label: marker
alternative label: medical student
alternative label: study law
alternative label: studying
alternative label: theology student
alternative label: university student
hidden label: studied at oxford
in scheme: occupation

studied by
in dataset: The CWRC Ontology
type: ObjectProperty
inverse of: studies

studies
in dataset: The CWRC Ontology
range includes: Work
range includes: educational subject
type: ObjectProperty
sub property of: relates by education to
definition: Indicates a subject, field, art, or skill studied in the course of their education, whether formal or informal, institutional or domestic.

subject-centric predicate
type: InverseFunctionalProperty
type: ObjectProperty
domain: ObjectProperty
range: ObjectProperty
inverse of: context predicate
definition: Indicates the version of this predicate associated with triples that do not have annotations, or triples derived from this annotation which take the Context focus as their subject.

subject of study
in dataset: The CWRC Ontology
subject-centric predicate: studies
type: ObjectProperty
range: educational subject
sub property of: education relationship

suffrage movement
in dataset: The CWRC Ontology
contrary to: anti-feminism
type: political affiliation
type: Concept
comment: The description for this term is indebted to DBpedia.
label: Droit de vote @fr
alternative label: International Suffrage Congress
alternative label: Woman Suffrage
alternative label: Women's Enfranchisement
alternative label: christian suffragist
alternative label: female suffrage
alternative label: moderate suffragist
alternative label: non-militant suffragist
alternative label: suffrage
alternative label: suffrage demonstrator
alternative label: suffrage leader
alternative label: suffrage organisations
alternative label: suffrage organizer
alternative label: suffrage politics
alternative label: suffragette
alternative label: suffragettes
alternative label: suffragist
alternative label: supporter of the women's suffrage movement
alternative label: women's suffrage
broader transitive: feminism
broader transitive: social reform
definition: "The right to vote in public, political elections, also called political franchise, or simply franchise. As a political cause, it can refer to the granting or extension of the vote to any sector of the population of a country, such as the extension of the vote to a wider range of men in Britain over the course of the nineteenth century, starting with the Reform Act of 1832. Most references to suffrage as a political cause in the British context, however, refer to the campaign for women's suffrage, the right of women to vote in elections. Advocates of female or women's suffrage were called suffragists or suffragettes." (DBpedia, 2018)
hidden label: activist; suffrage campaigner
in scheme: political affiliation

Sufism
in dataset: The CWRC Ontology
type: religion
type: Concept
comment: La description de ce terme est basée sur celle de DBPedia. @fr
comment: The description for this term is indebted to DBpedia.
label: Soufisme @fr
broader transitive: Islamism
definition: "Sufism or Taṣawwuf (Arabic: Ø§ÙØªØµÙÙââ) is defined as the inner mystical dimension of Islam. Practitioners of Sufism, referred to as Sufis (ṣūfī) (/ËsuËfi/; ØµÙÙÙÙÙÙ), often belong to different ṭuruq or "orders"âcongregations formed around a grand master referred to as a mawla who traces a direct chain of teachers back to the Islamic prophet, Muhammad. These orders meet for spiritual sessions (majalis) in meeting places known as zawiyas, khanqahs, or tekke. Sufis strive for ihsan (perfection of worship) as detailed in a hadith: "Ihsan is to worship Allah as if you see Him; if you can't see Him, surely He sees you." Rumi stated: "The Sufi is hanging on to Muhammad, like Abu Bakr." Sufis regard Muhammad as al-InsÄn al-KÄmil, the primary perfect man who exemplifies the morality of God. Sufis regard Muhammad as their leader and prime spiritual guide. All Sufi orders trace many of their original precepts from Muhammad through his cousin and son-in-law Ali with the notable exception of the Naqshbandi, who claim to trace their origins from Muhammad through the first Rashid Caliph, Abu Bakr. Sufi orders largely follow one of the four madhhabs (jurisprudent schools of thought) of Sunni Islam and maintain a Sunni aqidah (creed). Classical Sufis were characterised by their asceticism, especially by their attachment to dhikr, the practice of repeating the names of God, often performed after prayers. Sufism gained adherents among a number of Muslims as a reaction against the worldliness of the early Umayyad Caliphate (661â750). Sufis have spanned several continents and cultures over a millennium, originally expressing their beliefs in Arabic before spreading into Persian, Turkish, and Urdu among dozens of other languages. According to William Chittick, "In a broad sense, Sufism can be described as the interiorization, and intensification of Islamic faith and practice."" (DBpedia, 2018)
definition: «Le soufisme (en arabe : ØªØµÙÙ [taṣawwuf]) ou taçawwuf désigne en islam le cÅur de la tradition islamique. Le mot taçawwuf peut se traduire correctement par « initiation ». Il désigne "el-haqîqah" c'est-Ã -dire la "vérité" intérieure qui vivifie et permet la compréhension profonde de "es-shariyah" (la "grande route"). Le Taçawwuf comprend non seulement la haqîqah mais aussi l'ensemble des moyens destinés Ã y parvenir, appelé tarîqah - "voie" ou "sentier" - conduisant de la shariyah vers la haqîqah, c'est-Ã -dire de l'"écorce" (el-qishr) vers le "noyau" (el-lobb) par l'intermédiaire du "rayon" allant de la circonférence vers le centre. Le soufisme est intimement lié, depuis les origines de révélation prophétique de l'islam, Ã la fois aux orthodoxies sunnite et chiite, bien qu'il ait pris des formes différentes dans les deux cas. Pour Ibn Arabi, « Le soufisme ce n'est rien de plus que les cinq prières et l'attente de la mort ». Ibn Arabi précise en citant cette formule : « Il y a là une science immense ».» (DBpedia, 2018) @fr
in scheme: religion

surveyor
in dataset: The CWRC Ontology
type: occupation
type: Concept
alternative label: assistant road surveyor
alternative label: assistant surveyor
alternative label: building surveyor
alternative label: land surveyor
alternative label: quantity surveyor
alternative label: railway surveyor
alternative label: surveyor of highways
hidden label: deputy surveyor of royal parks and palaces
in scheme: occupation

Swedenborgianism
in dataset: The CWRC Ontology
type: religion
type: Concept
comment: The description for this term is indebted to DBpedia.
alternative label: New Church
definition: "The New Church (or Swedenborgianism) is the name for several historically related Christian denominations that developed as a new religious movement, informed by the writings of Swedish scientist and theologian Emanuel Swedenborg (1688â1772). Swedenborg claimed to have received a new revelation from Jesus Christ through continuous heavenly visions which he experienced over a period of at least twenty-five years. In his writings, he predicted that God would replace the traditional Christian Church, establishing a 'New Church', which would worship God in one person: Jesus Christ. The New Church doctrine is that each person must actively cooperate in repentance, reformation, and regeneration of one's life. The movement was founded on the belief that God explained the spiritual meaning of the Scriptures to Swedenborg as a means of revealing the truth of the Second Coming of Jesus Christ. Swedenborg claimed divine inspiration for his writings and followers believe that Swedenborg witnessed the Last Judgment in the spiritual world, along with the inauguration of the New Church. The New Church is seen by members of New Church organizations as something which the Lord is establishing with all those who believe that the Lord Jesus Christ is the one God of heaven and Earth, and that obeying his commandments is necessary for salvation. Therefore, it is thought that any Christian holding these beliefs is part of this New Church movement. New Church organizations also acknowledge the universal nature of the Lord's church: all who do good from the truth of their religion will be accepted by the Lord into heaven, as God is goodness itself, and doing good conjoins one to God. Adherents believe that the doctrine of the New Church is derived from scripture and provides the benefit of further enlightenment concerning the truth, and that this leads to diminished doubt, a recognition of personal faults, and thus a more directed and happier life. Other names for the movement include Swe…
in scheme: religion

tailor
in dataset: The CWRC Ontology
type: occupation
type: Concept
alternative label: garment worker
broader transitive: clothing production
in scheme: occupation

Tatar
in dataset: The CWRC Ontology
type: national heritage
type: Concept
comment: La description de ce terme est basée sur celle de DBPedia. @fr
comment: The description for this term is indebted to DBpedia.
label: Tatars @fr
definition: "The Tatars are a Turkic people living in Asia and Europe who were one of the five major tribal confederations (khanlig) in the Mongolian plateau in the 12th century CE. The name "Tatar" first appears in written form on the Kul Tigin monument as ð±ð±ð°º (TaTaR). Today the term Tatars refers to people who speak one of the Turkic languages. The Mongol Empire, established under Genghis Khan in 1206, subjugated the Tatars. Under the leadership of Genghis Khan's grandson Batu Khan (c. 1207â1255), the Mongols moved westwards, driving with them many of the Mongol tribes toward the plains of Russia. The "Tatar" clan still exists among the Mongols and Hazaras. Russians and Europeans used the name Tatar to denote Mongols as well as Turkic peoples under Mongol rule (especially in the Golden Horde). Later, it applied to any Turkic- or Mongolic-speaking people encountered by Russians. Eventually, however, the name became associated with the Turkic Muslims of Ukraine and Russia, namely the descendants of Muslim Volga Bulgars, Kipchaks, Cumans, and Turkicized Mongols or Turko-Mongols (Nogais), as well as other Turkic-speaking peoples (Siberian Tatars, Qasim Tatars, and Mishar Tatars) in the territory of the former Russian Empire (and as such generally includes all Northwestern Turkic-speaking peoples). The Tatars formed the Turkic-speaking population of Tartaryâthe lands ruled by Mongol élites from the 14th century until their conquest by the Russian Empire in the 18th to 19th centuries. The largest group by far that the Russians have called "Tatars" are the Volga Tatars, native to the Volga region (Tatarstan and Bashkortostan), who for this reason are often also simply known as "Tatars", with their language known as the Tatar language. As of 2002 they had an estimated population close to 6 million." (DBpedia, 2018)
definition: «Les Tatars (ou Tartares) est un nom collectif donné Ã des peuples turcs d'Europe orientale et d'Asie du Nord. La plupart des Tatars vivent au centre et au sud de la Russie, en Ukraine, en Bulgarie, en Chine, au Kazakhstan, en Roumanie, en Turquie, et en Ouzbékistan. On en dénombrait plus de huit millions Ã la fin du XXe siècle. Ils forment par ailleurs l'un des cinquante-six groupes ethniques recensés par la République populaire de Chine. Il existe des distinctions entre les Tatars eux-mêmes, parmi lesquels les Nogaïs. Aujourd'hui, parmi les Tatars, on trouve des musulmans et des chrétiens orthodoxes (notamment en Russie). Le terme tartare était également désigné par confusion chez les occidentaux pour désigner les peuples mongols et donna lieu Ã lâappellation de Tartarie pour les régions habitées par les peuples turco-mongols» (DBpedia, 2018) @fr
in scheme: national heritage

tax official
in dataset: The CWRC Ontology
type: occupation
type: Concept
alternative label: commissioner of taxes
alternative label: customs inspector
alternative label: customs officer
alternative label: customs official
alternative label: exciseman
broader transitive: government official
in scheme: occupation

tax resistance
in dataset: The CWRC Ontology
type: political affiliation
type: Concept
comment: La description de ce terme est basée sur celle de DBPedia. @fr
comment: The description for this term is indebted to DBpedia.
label: Résistance fiscale @fr
alternative label: tax resister
alternative label: tax withholder
definition: "Tax resistance is the refusal to pay tax because of opposition to the government that is imposing the tax or to government policy or as opposition to the concept of taxation in itself. Tax resistance is a form of direct action and if in violation of the tax regulations, a form of civil disobedience. Examples of tax resistance campaigns include those advocating home rule, such as the Salt March led by Mahatma Gandhi, and those promoting women's suffrage, such as the Women's Tax Resistance League. War tax resistance is the refusal to pay some or all taxes that pay for war and a form of nonviolent resistance. War tax resistance may be practiced by conscientious objectors, pacifists, or those protesting against a particular war. As a percentage of income tax funds military expenditure, war tax resisters may avoid or refuse to pay some or all income tax. For example, war resisters may choose to avoid taxes by living simply below the income tax threshold. Tax resisters are distinct from tax protesters who deny that the legal obligation to pay taxes exists or applies. Tax resisters may accept that some law commands them to pay taxes but they still choose to resist taxation." (DBpedia, 2017)
definition: «La résistance fiscale (ou résistance Ã l'imposition ou désobéissance fiscale) est un acte politique consistant Ã refuser de participer Ã la fiscalité de son pays au nom de valeurs morales. C'est une forme de résistance non-violente.» (DBpedia, 2017) @fr
in scheme: political affiliation
related: anti-monarchism

teacher
in dataset: The CWRC Ontology
type: occupation
type: Concept
alternative label: art instructor
alternative label: art teacher
alternative label: assistant schoolmistress
alternative label: bible teaching
alternative label: classical tutor
alternative label: classics teacher
alternative label: creative writing teacher
alternative label: dancing teacher
alternative label: educational pioneer
alternative label: elocution teacher
alternative label: french teacher
alternative label: geography teacher
alternative label: giving courses
alternative label: home educator
alternative label: housemaster
alternative label: instructor
alternative label: music teacher
alternative label: piano teacher
alternative label: pupil teacher
alternative label: religious teacher
alternative label: school mistress
alternative label: schoolmaster
alternative label: schoolmistress
alternative label: schoolteacher
alternative label: senior english mistress
alternative label: singing teacher
alternative label: sub preceptor
alternative label: sunday school mistress
alternative label: sunday school teacher
alternative label: teacher's assistant
alternative label: teaching
alternative label: teaching aide
alternative label: tutor
alternative label: tutor in divinity
alternative label: tutor in languages and belles lettres
alternative label: tutoring
alternative label: university tutor
alternative label: weapons instructor
alternative label: writing instructor
broader transitive: education
hidden label: assistant mistress
hidden label: first assistant mistress
in scheme: occupation

teaches educational subject
in dataset: The CWRC Ontology
type: ObjectProperty
range: educational subject
definition: Indicates a subject, field, art, or skill taught by an instructor or educational organization.

teaching educational subject
in dataset: The CWRC Ontology
subject-centric predicate: teaches educational subject
type: ObjectProperty
range: educational subject
sub property of: education relationship

teaching qualification
in dataset: The CWRC Ontology
type: credential
type: Concept
alternative label: Certificate in the Theory and Practice of Teaching
alternative label: Diploma of Education
alternative label: Elementary School Teachers' Certificate
alternative label: Elementary Teacher's Certificate
alternative label: Post-Graduate Certificate of Education
alternative label: Teacher's Diploma
alternative label: Teaching Certificate, First Class
alternative label: Teaching Certificate,, First Class
alternative label: Teaching Diploma
alternative label: USA teaching certificate
alternative label: diploma in education
alternative label: education diploma
alternative label: second class teaching certificate
alternative label: teacher's certificate
alternative label: teaching certificate
definition: Credential signifying training in teaching, usually at the primary or secondary school level.
in scheme: credential

technician
in dataset: The CWRC Ontology
type: occupation
type: Concept
in scheme: occupation

telephone operator
in dataset: The CWRC Ontology
type: occupation
type: Concept
in scheme: occupation

television industry
in dataset: The CWRC Ontology
type: occupation
type: Concept
alternative label: television director
broader transitive: broadcaster
in scheme: occupation

temperance movement
in dataset: The CWRC Ontology
type: occupation
type: political affiliation
type: Concept
comment: La description de ce terme est basée sur celle de DBPedia. @fr
comment: The description for this term is indebted to DBpedia.
label: Ligue de tempérance @fr
alternative label: temperance
alternative label: temperance activist
alternative label: temperance supporter
alternative label: temperance work
alternative label: temperance worker
broader transitive: politics
definition: "The temperance movement is a social movement against the consumption of alcoholic beverages. Temperance movements typically criticize excessive alcohol consumption, promote complete abstinence (teetotalism), or use its political influence to press the government to enact alcohol laws to regulate the availability of alcohol or even its complete prohibition." (DBpedia, 2017)
definition: «Une Ligue de tempérance est une association formée pour s'opposer Ã la consommation d'alcools. Son fondement est souvent d'ordre religieux ou moral : la plupart des mouvements du XXe siècle en Occident sont également associés au mouvement féministe, l'alcool étant souvent la cause de violences conjugales et absorbant une part substantielle des revenus des familles Ã bas revenus.» (DBpedia, 2017) @fr
in scheme: political affiliation
related: conservatism
related: feminism

textiles
in dataset: The CWRC Ontology
type: occupation
type: Concept
alternative label: textile mill worker
alternative label: textile worker
in scheme: occupation

theatre work
in dataset: The CWRC Ontology
type: occupation
type: Concept
alternative label: assistant theatre manager
alternative label: cabaret dresser
alternative label: costume designer
alternative label: play reader
alternative label: prompter
alternative label: property mistress
alternative label: set designer
alternative label: stage manager
alternative label: theatre
alternative label: theatre censor
alternative label: theatre company director
alternative label: theatre designer
alternative label: theatre director
alternative label: theatre dresser
alternative label: theatre manager
alternative label: theatre organiser
alternative label: theatre president
alternative label: theatre producer
alternative label: theatrical agent
alternative label: theatrical director
alternative label: theatrical manager
alternative label: usherette
alternative label: wardrobe assistant
hidden label: founded a small theatre group
hidden label: men of the theatre
hidden label: student production of one of her plays
hidden label: theatre literary manager
hidden label: theatre trust president
hidden label: workshopping plays
in scheme: occupation

theism
in dataset: The CWRC Ontology
type: religion
type: Concept
comment: La description de ce terme est basée sur celle de DBPedia. @fr
comment: The description for this term is indebted to DBpedia.
label: théisme @fr
alternative label: theist
definition: "Theism, in the field of comparative religion, is the belief in the existence of deities. In popular parlance, the term theism often describes the classical conception of god(s) that is found in the monotheistic and polytheistic religions. The term theism derives from the Greek theos meaning "god". The term theism was first used by Ralph Cudworth (1617â1688). In Cudworth's definition, they are "strictly and properly called Theists, who affirm, that a perfectly conscious understanding being, or mind, existing of itself from eternity, was the cause of all other things". Atheism is commonly understood as rejection of theism in the broadest sense of theism, i.e. the rejection of belief in a god or gods. The claim that the existence of any deity is unknown or unknowable is agnosticism." (DBpedia, 2018)
definition: «Un théisme (du grec theos, dieu) est une croyance ou doctrine qui affirme l'existence d'au moins une divinité sans forcément que ces divinités aient encore une influence dans l'univers. Selon le théisme religieux, la relation de l'Homme avec Dieu passe par des intermédiaires (la religion). Selon le théisme philosophique, Dieu régit l'univers directement.Le théisme est opposé Ã l'athéisme. Parmi les formes de théisme, on peut notamment citer le panenthéisme, le monothéisme et le polythéisme. Et Ã côté de lui (car opposés Ã lui sur la question de la transcendance) le déisme et le panthéisme (parfois assimilé Ã un athéisme).» (DBpedia, 2018) @fr
in scheme: religion

Thracian
in dataset: The CWRC Ontology
type: ethnicity
type: Concept
comment: La description de ce terme est basée sur celle de DBPedia. @fr
comment: The description for this term is indebted to DBpedia.
label: thrace @fr
alternative label: Thracians
broader transitive: European
definition: "The Thracians (/ËÎ¸reÉªÊÉnz/; Ancient Greek: ÎÏá¾·ÎºÎµÏ ThrÄikes, Latin: Thraci) were a group of Indo-European tribes inhabiting a large area in southeastern Europe. They spoke the Thracian language â a scarcely attested branch of the Indo-European language family. The study of Thracians and Thracian culture is known as Thracology." (DBpedia, 2017)
definition: «Les Thraces constituaient un peuple de langue paléo-balkanique (donc indo-européenne) dont les tribus, signalées dans les Balkans en même temps que les Achéens, les Ãoliens et les Ioniens, partageaient un ensemble de croyances, un mode de vie et une même langue avec des variantes et dialectes. Leur civilisation, encore mal connue, s'est épanouie du IIe millénaire av. J.âC. au iiie siècle av. J.-C., sur un substrat anté-indo-européen dit «pélasge» développé dès le Ve millénaire av. J.âC. comme civilisation agricole et pourvue de nécropoles richement dotées en or. L'étymologie de ce nom reste incertaine. Orale, la culture des Thraces était faite de légendes et de mythes incluant la croyance en l'immortalité sous la forme de l'«orphisme», décrit par Hérodote. Les connaissances que nous avons de ce peuple viennent des auteurs grecs anciens et de découvertes archéologiques récentes.» (DBpedia, 2017) @fr
in scheme: ethnicity

timber trade
in dataset: The CWRC Ontology
type: occupation
type: Concept
alternative label: sawyer
alternative label: timber manager
in scheme: occupation

time certainty of
in dataset: The CWRC Ontology
type: InverseFunctionalProperty
type: ObjectProperty
domain: certainty
sub property of: certainty of
inverse of: has time certainty

tinker
in dataset: The CWRC Ontology
type: occupation
type: Concept
in scheme: occupation

Tory Party (Britain)
is replaced by: Conservative Party (UK)
in dataset: The CWRC Ontology
contrary to: whiggism
type: Concept
comment: Deprecated in favour of instance Conservative Party (UK).
comment: Désapprouver en faveur de l'instance Parti Conservateur (Royaume-Uni). @fr
comment: The description for this term is indebted to DBpedia.
label: Parti Tory (Royaume-Uni) @fr
deprecated: true
term status: deprecated
alternative label: tory
broader transitive: conservatism
definition: "The Tories were members of two political parties which existed, sequentially, in the Kingdom of England, the Kingdom of Great Britain and later the United Kingdom of Great Britain and Ireland from the 17th to the early 19th centuries. The first Tories emerged in 1678 in England, when they opposed the Whig-supported Exclusion Bill which set out to disinherit the heir presumptive James, Duke of York (who eventually became James II of England and VII of Scotland). This party ceased to exist as an organised political entity in the early 1760s, although it was used as a term of self-description by some political writers. A few decades later, a new Tory party would rise to establish a hold on government between 1783 and 1830, with William Pitt the Younger followed by Robert Jenkinson, 2nd Earl of Liverpool. The Earl of Liverpool was succeeded by fellow Tory Arthur Wellesley, 1st Duke of Wellington, whose term included the Catholic Emancipation, which occurred mostly due to the election of Daniel O'Connell as a Catholic MP from Ireland. When the Whigs subsequently regained control, the Representation of the People Act 1832 removed the rotten boroughs, many of which were controlled by Tories. In the following general election, the Tory ranks were reduced to 180 MPs. Under the leadership of Robert Peel, the Tamworth Manifesto was issued, which began to transform the Tories into the Conservative Party. However, Peel lost many of his supporters by repealing the Corn Laws, causing the party to break apart. One faction, led by the Earl of Derby and Benjamin Disraeli, survived to become the modern Conservative Party, whose members are commonly still referred to as Tories." (DBpedia, 2017)
in scheme: political affiliation

tour guide
in dataset: The CWRC Ontology
type: occupation
type: Concept
alternative label: mountain guide
hidden label: youth hostel warden
in scheme: occupation

Tractarian Movement
in dataset: The CWRC Ontology
type: religion
type: Concept
comment: La description de ce terme est basée sur celle de DBPedia. @fr
comment: The description for this term is indebted to DBpedia.
label: tractarianisme @fr
alternative label: Oxford Movement
alternative label: Tractarian
broader transitive: Anglicanism
definition: "The Oxford Movement was a movement of High Church members of the Church of England which eventually developed into Anglo-Catholicism. The movement, whose original devotees were mostly associated with the University of Oxford, argued for the reinstatement of some older Christian traditions of faith and their inclusion into Anglican liturgy and theology. They thought of Anglicanism as one of three branches of the One, Holy, Catholic, and Apostolic Church. The movement's philosophy was known as Tractarianism after its series of publications, the Tracts for the Times, published from 1833 to 1841. Tractarians were also disparagingly referred to as "Newmanites" (before 1845) and "Puseyites" (after 1845) after two prominent Tractarians, John Henry Newman and Edward Bouverie Pusey. Other well-known Tractarians included John Keble, Charles Marriott, Richard Froude, Robert Wilberforce, Isaac Williams, and William Palmer." (DBpedia, 2017)
definition: «Le Mouvement d'Oxford (Oxford Movement) est un courant théologique anglais du XIXe siècle, situé dans la lignée des théories défendues par la Haute Ãglise (High Church) anglicane.» (DBpedia, 2017) @fr
in scheme: religion

trade unionism
in dataset: The CWRC Ontology
type: political affiliation
type: Concept
comment: The description for this term is indebted to DBpedia.
label: syndicalisme @fr
alternative label: trade unionist
alternative label: union movement
alternative label: unionism
alternative label: women's trade unions
broader transitive: social reform
definition: In support of the formation of a trade union. See Trade union - Wikipedia
definition: Lutte pour la consitution de syndicats professionnels. Voir Syndicat professionnel â Wikipédia et Syndicalisme â Wikipédia @fr
in scheme: political affiliation

trader
in dataset: The CWRC Ontology
type: occupation
type: Concept
alternative label: clothes trader
alternative label: fur trader
alternative label: wool trader
in scheme: occupation

transgender
in dataset: The CWRC Ontology
type: gender
type: Concept
label: transgenre @fr
alternative label: transgendered
definition: Indicates divergence of a person's gender identity from their sex as understood or assigned at birth. Unlike transwoman or transman, "the term transgender is not indicative of gender expression," nor is it indicative of "sexual orientation, hormonal makeup, physical anatomy, or how one is perceived in daily life."(TSER, 2017)
definition: Indique la discordance entre le genre et le sexe d'une personne, tel que celui-ci a été compris ou assigné Ã sa naissance. Contrairement Ã femme trans ou homme trans, «le terme n'est pas révélateur de l'expression du genre, de l'orientation sexuelle, de la constitution hormonale, de l'anatomie, ou de la façon dont une personne est perçue au quotidien» (TSER, 2017). @fr
in scheme: gender

trans man/trans male
in dataset: The CWRC Ontology
represented by: man
type: gender
type: Concept
label: homme trans @fr
alternative label: transgendered female to male
definition: Indique habituellement l'identification en tant qu'homme alors que le sexe «féminin» a été assigné Ã la naissance. Certains hommes trans renoncent Ã la mention «trans» et préfèrent utiliser le terme «homme» seul. (TSER, 2017). Cette définition inclut également les garçons trans. @fr
definition: Typically indicates identification as a man while having been assigned the sex "female" at birth. Some trans men prefer to drop the prefix "trans" and keep the label "man" (TSER, 2017). This definition includes trans boys too.
in scheme: gender

trans woman/trans female
in dataset: The CWRC Ontology
represented by: woman
type: gender
type: Concept
label: femme trans @fr
alternative label: transgendered male to female
definition: Indique habituellement l'identification en tant que femme alors que le sexe «masculin» a été assigné Ã la naissance. Certaines femmes trans renoncent Ã la mention «trans» et préfèrent utiliser le terme «femme» seul. (TSER, 2017). Cette définition inclut également les filles trans. @fr
definition: Typically indicates identification as a woman while having been assigned the sex "male" at birth. Some trans women prefer to drop the prefix "trans" and keep the label "woman" (TSER, 2017). This definition includes trans girls too.
in scheme: gender

transcriber
in dataset: The CWRC Ontology
type: occupation
type: Concept
in scheme: occupation

translator
in dataset: The CWRC Ontology
type: occupation
type: Concept
alternative label: interpreter
hidden label: free lance translations
in scheme: occupation

transportation work
in dataset: The CWRC Ontology
type: occupation
type: Concept
alternative label: bus conductor
alternative label: bus driver
alternative label: bus inspector
alternative label: bus worker
alternative label: cab driver
alternative label: driver
alternative label: transportation
alternative label: van driver
in scheme: occupation

travel
in dataset: The CWRC Ontology
range includes: AdminPlaceConcept
range includes: Feature
subject-centric predicate: travelled to
type: ObjectProperty
sub property of: spatial relationship

travelling
in dataset: The CWRC Ontology
type: occupation
type: Concept
alternative label: sightseeing
alternative label: travel agent
alternative label: travel guide
alternative label: traveller
in scheme: occupation

travelled to
in dataset: The CWRC Ontology
range includes: AdminPlaceConcept
range includes: Feature
type: ObjectProperty
domain: Person
sub property of: has spatial relation to
inverse of: has traveller
definition: Indicates that a person travelled to this place.

treasurer
in dataset: The CWRC Ontology
type: occupation
type: Concept
alternative label: city treasurer
alternative label: hospital department treasurer
alternative label: society treasurer
hidden label: treasurer to the royal society
hidden label: under treasurer for the navy
in scheme: occupation

trustee
in dataset: The CWRC Ontology
type: occupation
type: Concept
hidden label: tate gallery trustee
in scheme: occupation

type setter
in dataset: The CWRC Ontology
type: occupation
type: Concept
alternative label: typesetter
broader transitive: book production
in scheme: occupation

uncle
in dataset: The CWRC Ontology
subject-centric predicate: has uncle
type: ObjectProperty
range: Person
sub property of: relative

uncle of
in dataset: The CWRC Ontology
type: ObjectProperty
domain: Person
label: oncle de @fr
range: Person
sub property of: relative of
inverse of: has uncle
broader: relatedTo

undefined
in dataset: The CWRC Ontology
type: gender
type: Concept
label: genre indéterminé @fr
definition: Indicates that the person's gender is not disclosed by them or is not indicated in the source.
definition: Indique que le genre de la personne n'est pas déterminé par elle·lui-même ou n'est pas indiqué dans la source. @fr
in scheme: gender

undergraduate degree
in dataset: The CWRC Ontology
type: credential
type: Concept
comment: The description for this term is indebted to DBpedia.
alternative label: B. Litt.
alternative label: BLitt
alternative label: Bachelor
alternative label: degree
alternative label: degree in advertising
alternative label: two-year degree
definition: "An undergraduate degree (also called first degree, bachelor's degree or simply degree) is a colloquial term for an academic degree taken by a person who has completed undergraduate courses. It is usually offered at an institution of higher education, such as a university. The most common type of this degree is the bachelor's degree, which typically takes at least three or four years to complete." (DBpedia, 2018)
in scheme: credential

Unidentified tagger
in dataset: The CWRC Ontology
type: natural person
type: Concept
label: Tagueur non identifié(e) @fr
definition: A human tagger whose identity has not been recorded, for example within legacy datasets.
definition: Un encodeur humain non identifié par le système, par exemple dans des jeux de données hérités. @fr
name: Unidentified tagger.

Unitarian Church
is replaced by: Unitarianism
in dataset: The CWRC Ontology
type: Concept
comment: Deprecated in favour of instance Unitarianism.
comment: Désapprouver en faveur de l'instance unitarisme. @fr
comment: La description de ce terme est basée sur celle de DBPedia. @fr
label: Ãglise unitarienne @fr
deprecated: true
term status: deprecated
alternative label: unitarianChurch
broader transitive: Christianity
definition: "Unitarian church usually refers to a church (either a single church or a group of churches and/or its followers) which follows Unitarianism, a Christian theology. It can also more broadly refer to a church which is a member of an umbrella group with "Unitarian" in its title, such as the Unitarian Universalist Association in the U.S., the Canadian Unitarian Council, and similar bodies." (DBpedia, 2017)

Unitarianism
in dataset: The CWRC Ontology
type: occupation
type: religion
type: Concept
comment: La description de ce terme est basée sur celle de DBPedia. @fr
comment: The description for this term is indebted to the Getty Art & Architecture Thesaurus.
label: unitarios @es
label: unitarisme @fr
label: unitarismo @es
alternative label: Unitarian
alternative label: Unitarian Church
alternative label: Unitarian Movement
alternative label: active unitarian
alternative label: unitarianMovement
broader transitive: Dissent (Protestant)
broader transitive: religious
definition: "In het bijzonder te gebruiken voor de vrijzinnig protestantse beweging die in Europa opkwam tijdens de Reformatie in de 16de eeuw, werd belichaamd door een kerk in Transsylvanië en een confessionele status verkreeg in Groot-Brittannië, de Verenigde Staten en Canada tijdens de 19de eeuw. De beweging wordt gekenmerkt door de afwijzing van de orthodox christelijke leer van de Drie-eenheid en de goddelijke Christus, het vrije gebruik van de rede in religieuze zaken en het geloof dat God bestaat in één persoon. In 1961 fuseerde deze beweging in de Verenigde Staten en Canada met de universalistische beweging, waardoor het âunitaristisch universalisme' ontstond. Ook in het algemeen te gebruiken voor de theologische leer van de eenheid van God en het mens-zijn van Jezus, zoals voor het eerst verwoord in het monarchisme van de 2de en 3de eeuw en in de leer van Arius in de 3de en 4de eeuw, en later in de leer van de radicale neoplatonisten uit de Reformatie zoals Michael Servetus, Faustus Socinus en Ferenc David." (Getty, 2017) @nl
definition: "The liberal Protestant movement that arose in Europe during the 16th century Reformation, was embodied in a church in Transylvania, and achieved denominational status in the 19th century in the United Kingdom, the United States, and Canada. It is characterized by a denial of the orthodox Christian doctrines of the Trinity and the divinity of Jesus, the free use of reason in religion, and the belief that God exists in one person. In 1961, in the United States and Canada, it merged with the Universalist denomination to form "Unitarian Universalism." Use also generally for the theological doctrines of the unified nature of God and the humanity of Jesus, first expressed in second- and third-century monarchism and in the teachings of Arius in the third and fourth centuries, and later in the radical Neoplatonist thinkers of the Reformation such as Michael Servetus, Faustus Socinus, and Ferenc David." (Getty, 2017)
definition: "Ãsese específicamente para el movimiento protestante liberal que surgió en Europa durante la Reforma del siglo XVI, que tuvo su manifestación en una iglesia en Transilvania, y que logró un estatus confesional en el siglo XIX en el Reino Unido, los Estados Unidos y Canadá. Es caracterizado por una desaprobación de las doctrinas cristianas ortodoxas de la Trinidad y la divinidad de Jesús, el libre uso de la razón en la religión y la creencia que Dios existe en una persona. En 1961, en los Estados Unidos y Canadá s" (Getty, 2017) @es
definition: «L'unitarisme est une doctrine qui affirme que le Dieu du christianisme est une seule personne, et non pas une seule nature ou «ousie» en trois hypostases comme l'affirme le dogme de la Trinité : Père, Fils et Esprit. Selon le dogme de la Trinité, ces trois personnes divines participent d'une seule nature divine unique . Le «trinitarisme» est la doctrine officielle du christianisme depuis le premier concile de Nicée (325) et le concile de Chalcédoine (451).» (DBpedia, 2017) @fr
in scheme: religion

Universalist
in dataset: The CWRC Ontology
type: religion
type: Concept
comment: The description for this term is indebted to DBpedia.
alternative label: universal salvation
definition: "Universalism is a religious, theological, and philosophical concept with universal application or applicability. Universalist doctrines consider all people in their formation. In terms of religion, in a broad sense, universalism claims that religion is a universal human quality. This can be contrasted with non-universalist religions. Religion in this context is defined as "a set of beliefs concerning the cause, nature, and purpose of the universe, especially when considered as the creation of a superhuman agency or agencies, usually involving devotional and ritual observances, and often containing a moral code governing the conduct of human affairs." In some sects of Christianity, universal reconciliation is the doctrine that all sinful and alienated human souls â because of divine love and mercy â will ultimately be reconciled to God. Unitarian Universalism believes that religion is a universal human quality, emphasizing the universal principles of most religions and accepting other religions in an inclusive manner, believing in a universal reconciliation between humanity and the divine. Universalism has had a strong influence on modern Hinduism, in turn influencing western modern spirituality. A community that calls itself universalist may emphasize the universal principles of most religions and accept other religions in an inclusive manner, believing in a universal reconciliation between humanity and the divine. For example, some forms of Abrahamic religions happened to claim the universal value of their doctrine and moral principles, and feel inclusive. A belief in one common truth is also another important tenet. The living truth is seen as more far-reaching than national, cultural, or religious boundaries." (DBpedia, 2018)
in scheme: religion

unknown certainty
in dataset: The CWRC Ontology
type: certainty
type: precision
comment: The description for this term is indebted to the Text Encoding Initiative's P5: Guidelines for Electronic Text Encoding and Interchange.
label: probabilité inconnue @fr
definition: A predefined value of certainty that is used when one does not want to assert an opinion on certainty or precision, or the degree of certainty or precision is not known. Equivalent to the "unknown" attribute value for certainty of the Text Encoding Initiative.
definition: Une valeur de probabilité prédéfinie utilisée lorsque l'on ne veut pas exprimer d'opinion sur la probabilité. @fr

Unknown
in dataset: The CWRC Ontology
type: Concept
comment: Deprecated with no current equivalence.
label: Inconnue @fr
deprecated: true
term status: deprecated

unskilled labourer
in dataset: The CWRC Ontology
type: occupation
type: Concept
alternative label: dishwasher
alternative label: laundry worker
hidden label: sweeping the floor
in scheme: occupation

unspecified
in dataset: The CWRC Ontology
type: reproductive history
type: Concept
definition: Some aspect of the subject's reproductive history.
in scheme: reproductive history

upholsterer
in dataset: The CWRC Ontology
type: occupation
type: Concept
broader transitive: skilled trade
in scheme: occupation

upper-middle class
in dataset: The CWRC Ontology
type: social class
type: Concept
comment: This term is a CWRC-specific addition not in the original Orlando tag set.
label: classe moyenne supérieure @fr
broader transitive: middle class
definition: La classe moyenne supérieure est une classe sociale qui regroupe les individus de la classe moyenne dont les revenus sont les plus élevés (en France, supérieurs Ã 30 000 euros par an). En tant que membres de la classe moyenne, leurs revenus restent inférieurs Ã ceux de l'élite entrepreneuriale et des professions libérales. On y trouve surtout des cadres, parfois des artisans indépendants. La classe moyenne supérieure a tendance Ã se confondre avec la petite bourgeoisie, on y trouve par exemple un actionnariat développé ainsi qu'un niveau d'éducation élevé. Depuis les crises économiques des années 1970, la classe moyenne supérieure se distingue de plus en plus de la fausse jumelle, la classe moyenne inférieure ; la première étant caractérisée par son ascension sociale, l'autre par son déclassement. @fr
definition: The upper middle class is a sociological concept referring to the social group constituted by higher status members of the middle class. This is in contrast to the term "lower middle class", which is used for the group at the opposite end of the middle class stratum, and to the broader term "middle class". There is considerable debate as to how the upper middle class might be defined. According to sociologist Max Weber the upper middle class consists of well-educated professionals with graduate degrees and comfortable incomes.
in scheme: social class
note: Overlaps with the professional class.

urban unskilled
in dataset: The CWRC Ontology
type: social class
type: Concept
label: ouvrier non qualifié @fr
alternative label: URBAN-INDUSTRIALUNSKILLED
definition: Cette classe inclut les ouvriers/ères d'usine et les travailleurs/euses des grandes industries ou des industries urbaines, qui ne possèdent ni profession ni qualification définie. Elle renvoie également aux emplois du secteur des services avec des salaires et des statuts faibles, comme la restauration ou l'industrie du fast-food dans les sociétés industrielles et postindustrielles. @fr
definition: This class includes factory workers and workers in urban or large-scale industries without defined trades or professional qualifications, and those in low-wage and low-status service sector jobs, such as the restaurant or fast-food industry, in industrial or post-industrial societies. (Brown, 2006)
in scheme: social class

urban planning
in dataset: The CWRC Ontology
type: occupation
type: Concept
in scheme: occupation

urban reform
in dataset: The CWRC Ontology
type: political affiliation
type: Concept
comment: The description for this term is indebted to DBpedia.
label: renouvellement urbain @fr
alternative label: urban reformer
broader transitive: social reform
definition: Advocacy or activism in support of reforming the urban environment, often in support of alleviating poverty. See Urban renewal - Wikipedia
definition: Militantisme ou lutte en faveur de la réforme de l'environnement urbain, souvent pour réduire les problèmes de pauvreté. Voir Renouvellement urbain â Wikipédia @fr
in scheme: political affiliation

utilitarianism
in dataset: The CWRC Ontology
type: political affiliation
type: Concept
comment: La description de ce terme est basée sur celle de DBPedia. @fr
comment: The description for this term is indebted to DBpedia.
label: Utilitarisme @fr
definition: "Utilitarianism is a theory about what we ought to do. It states that the best action is the one that maximizes utility. "Utility" is defined in various ways, usually in terms of the well-being of sentient entities, such as human beings and other animals. Jeremy Bentham, the founder of utilitarianism, gave this definition of "utility": it is the sum of all pleasure that results from an action, minus the suffering of anyone involved in the action. The philosopher John Stuart Mill developed this concept further. He included not only the quantity of the pleasure, but also the quality of pleasure. He focused on rules, instead of individual actions. Others have proposed a theory called "negative utilitarianism." They define utility only in terms of suffering. Utilitarianism is a version of what Elizabeth Anscombe called "consequentialism". Consequentialism states that the consequences of any action are the only standard of right and wrong. Contrast this view with virtue ethics, which enshrines virtue as a moral good. Some believe that one's intentions are also ethically important. Unlike other forms of consequentialism, such as egoism, utilitarianism considers all interests equally. Proponents of utilitarianism have disagreed on a number of points. Should individual acts should conform to utility (act utilitarianism)? Or, should agents conform to ethical rules (rule utilitarianism)? Should utility should be calculated as an aggregate (total utilitarianism) or as an average (average utilitarianism)? Though the seeds of the theory can be found in the hedonists Aristippus and Epicurus, who viewed happiness as the only good, the tradition of utilitarianism properly begins with Bentham, and has included John Stuart Mill, Henry Sidgwick, R. M. Hare and Peter Singer. It has been applied the suffering of non-human animals, and the ethics of raising animals for food. Opponents of utilitarianism have raised a number of objections. Some say that utilitarianism ignores justice. Othe…
definition: «L'utilitarisme est une doctrine en philosophie politique ou en éthique sociale qui prescrit d'agir (ou de ne pas agir) de manière Ã maximiser le bien-être collectif, entendu comme la somme ou la moyenne de bien-être (bien-être agrégé) de l'ensemble des êtres sensibles et affectés. Les utilitaristes perçoivent donc le gaspillage de bien-être (production de bien-être total ou moyen inférieur au maximum possible) comme une injustice.» (DBpedia, 2017) @fr
in scheme: political affiliation

vegetarianism
in dataset: The CWRC Ontology
type: political affiliation
type: Concept
comment: La description de ce terme est basée sur celle de DBPedia. @fr
comment: The description for this term is indebted to DBpedia.
label: Végétarisme @fr
alternative label: vegetarian
definition: "Vegetarianism /vÉdÊÉªËtÉÉriÉnÉªzÉm/ is the practice of abstaining from the consumption of meat (red meat, poultry, seafood, and the flesh of any other animal), and may also include abstention from by-products of animal slaughter. Vegetarianism can be adopted for different reasons. Many object to eating meat out of respect for sentient life. Such ethical motivations have been codified under various religious beliefs, along with animal rights. Other motivations for vegetarianism are health-related, political, environmental, cultural, aesthetic, economic, or personal preference. There are varieties of the diet as well: an ovo-vegetarian diet includes eggs but not dairy products, a lacto-vegetarian diet includes dairy products but not eggs, and an ovo-lacto vegetarian diet includes both eggs and dairy products. A vegan diet excludes all animal products, including eggs, dairy, and honey. Some vegans also avoid other animal products such as beeswax, leather or silk clothing, and goose-fat shoe polish. Various packaged or processed foods, including cake, cookies, candies, chocolate, yogurt and marshmallows, often contain unfamiliar animal ingredients, and may be a special concern for vegetarians due to the likelihood of such additions. Often, products are reviewed by vegetarians for animal-derived ingredients prior to purchase or consumption. Vegetarians vary in their feelings regarding these ingredients, however. For example, while some vegetarians may be unaware of animal-derived rennet's role in the usual production of cheese and may therefore unknowingly consume the product, other vegetarians may not take issue with its consumption. Semi-vegetarian diets consist largely of vegetarian foods, but may include fish or poultry, or sometimes other meats, on an infrequent basis. Those with diets containing fish or poultry may define meat only as mammalian flesh and may identify with vegetarianism. This is because earlier dictionaries included fish as part of the definition w…
definition: «Le végétarisme est une pratique alimentaire qui exclut la consommation de chair animale. Sa définition la plus large correspond Ã l'ovo-lacto-végétarisme, qui consiste Ã consommer des végétaux, des champignons et des aliments d'origine animale (comme le miel, les Åufs, le lait ainsi que leurs produits dérivés). Il s'agit du végétarisme occidental classique dont les pratiquants étaient appelés «pythagoréens / pythagoriciens» jusqu'en 1847. Le végétarisme indien (hindou et sikh), basé sur l'ahimsâ, autorise la consommation de produits laitiers mais exclut les Åufs (les Lois de Manu excluent aussi la consommation des champignons). Le végétarisme est adopté pour des motivations diverses. Certains deviennent végétariens pour des raisons éthiques, religieuses, culturelles ou liées Ã la santé. D'autres facteurs peuvent motiver l'adoption d'un régime végétarien : la critique des méthodes de traçabilité, d'élevage et d'abattage, l'accès aux denrées alimentaires, l'impact environnemental des modes de production et de prélèvement de ces dernières (les économies d'énergies et d'eau) ou encore le refus par principe de l'exploitation animale. Plusieurs études tendent Ã montrer qu'une alimentation végétarienne aurait un effet bénéfique sur la santé â diminution des risques de maladies cardiovasculaires et de diabète notamment â et sur l'espérance de vie. Pour autant, cet avantage des régimes sans viande est moins important lorsqu'on les compare avec des régimes omnivores sains. Dans le langage courant, toutes les pratiques alimentaires excluant la chair animale mais incluant la consommation d'autres produits d'origine animale sont appelées «végétarisme» et leurs pratiquants «végétariens». D'autres pratiques alimentaires influencées par le végétarisme existent, comme le pesco-végétarisme (ou «pescétarisme») qui inclut la consommation de poisson, de mollusques et de crustacés aquatiques, ou le flexitarisme, souv… @fr
in scheme: political affiliation
related: animal welfare advocacy

venereal disease
in dataset: The CWRC Ontology
type: reproductive history
type: Concept
alternative label: VD
alternative label: syphilis
alternative label: venereal
definition: Related to venereal disease.
in scheme: reproductive history

veterinary work
in dataset: The CWRC Ontology
type: occupation
type: Concept
alternative label: veterinary doctor
alternative label: veterinary worker
in scheme: occupation

vintner
in dataset: The CWRC Ontology
type: occupation
type: Concept
alternative label: wine maker
in scheme: occupation

violence association
in dataset: The CWRC Ontology
domain includes: Person
range includes: Work
range includes: AdminPlaceConcept
range includes: Feature
range includes: FormalOrganization
range includes: Person
subject-centric predicate: associated by violence with
type: ObjectProperty
sub property of: biographical relationship

visit
in dataset: The CWRC Ontology
range includes: AdminPlaceConcept
range includes: Feature
subject-centric predicate: visits
type: ObjectProperty
sub property of: travel

visits
in dataset: The CWRC Ontology
range includes: AdminPlaceConcept
range includes: Feature
type: ObjectProperty
domain: Person
sub property of: travelled to
inverse of: has vistor
definition: Indicates that a person visited this place.

visual artist
in dataset: The CWRC Ontology
type: occupation
type: Concept
alternative label: amateur artist
alternative label: amateur painter
alternative label: artist
alternative label: colourist
alternative label: commercial artist
alternative label: craft artist
alternative label: etcher
alternative label: historical painter
alternative label: illuminator
alternative label: landscape painter
alternative label: miniaturist
alternative label: painter
alternative label: portraitist
alternative label: printmaker
alternative label: sculptor
alternative label: watercolourist
alternative label: wax modeller
hidden label: artist, painter
hidden label: chinaware painter
hidden label: etcher, artist
hidden label: feather artisan
hidden label: illustrator and landscape painter
hidden label: miniature portrait painter
hidden label: painter in enamel
in scheme: occupation

vitalism
in dataset: The CWRC Ontology
type: religion
type: Concept
comment: La description de ce terme est basée sur celle de DBPedia. @fr
comment: The description for this term is indebted to DBpedia.
label: vitalisme @fr
alternative label: vitalist
definition: "Vitalism is a discredited scientific hypothesis that "living organisms are fundamentally different from non-living entities because they contain some non-physical element or are governed by different principles than are inanimate things". Where vitalism explicitly invokes a vital principle, that element is often referred to as the "vital spark", "energy" or "élan vital", which some equate with the soul. Although rejected by modern science, vitalism has a long history in medical philosophies: most traditional healing practices posited that disease results from some imbalance in vital forces. In the Western tradition founded by Hippocrates, these vital forces were associated with the four temperaments and humours; Eastern traditions posited an imbalance or blocking of qi or prana. One example of a similar notion in Africa is the Yoruba concept of ase." (DBpedia, 2018)
definition: «Le vitalisme est une tradition philosophique pour laquelle le vivant n'est pas réductible aux lois physico-chimiques. Elle envisage la vie comme de la matière animée d'un principe ou force vitale, qui s'ajouterait pour les êtres vivants aux lois de la matière. Selon cette conception, c'est cette force qui insufflerait la vie Ã la matière. En biologie, ce cadre théorique revient régulièrement dans l'histoire des sciences. Le terme désigne parfois la vision philosophique défendue naguère par l'Ãcole de Montpellier (voir Paul-Joseph Barthez (1734-1806)).» (DBpedia, 2018) @fr
in scheme: religion

volunteer
in dataset: The CWRC Ontology
type: occupation
type: Concept
alternative label: civil defence volunteer
alternative label: food kitchen volunteer
alternative label: food volunteer
alternative label: hospital volunteer
alternative label: school volunteer
alternative label: volunteer counsellor
alternative label: volunteer office work
alternative label: volunteer personnel work
alternative label: volunteer soldier
alternative label: war volunteer
alternative label: war volunteers
broader transitive: philanthropist
hidden label: voluntary aid detachment
hidden label: volunteer cook and waitress
hidden label: volunteering for the newly formed babies club
in scheme: occupation

volunteer occupation
in dataset: The CWRC Ontology
subject-centric predicate: has volunteer occupation
type: ObjectProperty
range: occupation
sub property of: occupation

volunteer occupation of
in dataset: The CWRC Ontology
type: ObjectProperty
domain: occupation
range: Person
sub property of: occupation of

walking
in dataset: The CWRC Ontology
type: occupation
type: Concept
alternative label: hiker
in scheme: occupation

war work
in dataset: The CWRC Ontology
type: occupation
type: Concept
alternative label: war duties
alternative label: war effort
alternative label: war efforts
alternative label: war worker
hidden label: chief of war staff
in scheme: occupation

warehouse work
in dataset: The CWRC Ontology
type: occupation
type: Concept
alternative label: warehousing
in scheme: occupation

watchmaker
in dataset: The CWRC Ontology
type: occupation
type: Concept
broader transitive: skilled trade
in scheme: occupation

weaver
in dataset: The CWRC Ontology
type: occupation
type: Concept
alternative label: handloom weaver
alternative label: power loom weaver
alternative label: stocking weaver
broader transitive: skilled trade
broader transitive: textiles
in scheme: occupation

welder
in dataset: The CWRC Ontology
type: occupation
type: Concept
in scheme: occupation

Welsh
in dataset: The CWRC Ontology
type: Concept
comment: Deprecated in favour of foreign instance ISO 3166-2:GB-WLS.
comment: Désapprouver en faveur de l'instance ISO 3166-2:GB-WLS. @fr
label: Gallois @fr
deprecated: true
term status: deprecated
definition: Indicates a subject's identification with or labelling as Welsh as an inherited national identity.
definition: Indique qu'un sujet s'identifie Ã ou s'est vu assigner un héritage national gallois. @fr

Welsh nationalism
in dataset: The CWRC Ontology
type: political affiliation
type: Concept
comment: La description de ce terme est basée sur celle de DBPedia. @fr
comment: The description for this term is indebted to DBpedia.
label: Nationalisme gallois @fr
alternative label: welsh nationalist
broader transitive: nationalism
definition: "Welsh nationalism (Welsh: Cenedlaetholdeb Cymreig) emphasises the distinctiveness of Welsh language, culture, and history, and calls for more self-determination for Wales, which might include more devolved powers for the Welsh Assembly or full independence from the United Kingdom." (DBpedia, 2017)
definition: Le nationalisme gallois consiste dans le projet de défense de l'identité du Pays de Galles, de la culture et de la langue galloise. Ses revendications vont de l'autonomisme, visant Ã obtenir des pouvoirs accrus pour l'Assemblée nationale du Pays de Galles et le gouvernement gallois, Ã l'indépendantisme, défendu notamment par le parti Plaid Cymru. * Portail de la politique britannique Portail de la politique britannique * Portail du pays de Galles" Portail du pays de Galles" (DBpedia, 2017) @fr
in scheme: political affiliation

Wendish
in dataset: The CWRC Ontology
type: ethnicity
type: Concept
comment: La description de ce terme est basée sur celle de DBPedia. @fr
comment: The description for this term is indebted to DBpedia.
label: Wende @fr
alternative label: Wends or Sorbs
broader transitive: European
definition: "Wends (Old English: Winedas, Old Norse: Vindr, German: Wenden, Winden, Danish: vendere, Swedish: vender, Polish: Wendowie) is a historical name for the West Slavs living near Germanic settlement areas. It does not refer to a homogeneous people, but to various peoples, tribes or groups depending on where and when it is used." (DBpedia, 2017)
definition: «Le nom de Wendes, transcription germanique du latin Venedi, peut avoir plusieurs sens : Les Wendes (Venedi) en l'an 125, dans la perspective historique. Le mot désigne l'ensemble des Slaves. dans une perspective historique, communément admise par les milieux universitaires, l'ethnonyme Wenden désigne toutes les tribus slaves en allemand : c'est le nom donné au Moyen ge par les Allemands Ã tous les peuples slaves établis sur le territoire délimité par l'Oder, la Spree, la Saale et les monts Métallifères. Les Wendes de la basse Elbe et de la côte Baltique étaient des Polabes et des Obodrites, ceux du sud-est des Slovinces et ceux de l'Elbe supérieure des Sorabes.» (DBpedia, 2017) @fr
in scheme: ethnicity

Wesleyanism
in dataset: The CWRC Ontology
type: religion
type: Concept
comment: La description de ce terme est basée sur celle de DBPedia. @fr
comment: The description for this term is indebted to DBpedia.
label: Wesleyanisme @fr
alternative label: Wesleyan
alternative label: Wesleyan Independent
alternative label: Wesleyan Methodist
broader transitive: Methodism
definition: "Wesleyanism, or Wesleyan theology, is a movement of Protestant Christians who seek to follow the "methods" or theology of the eighteenth-century evangelical reformers John Wesley and his brother Charles Wesley. More broadly, it refers to the theological system inferred from the various sermons, theological treatises, letters, journals, diaries, hymns, and other spiritual writings of the Wesleys and their contemporary coadjutors such as John William Fletcher. Wesleyanism, manifest today in Methodist and holiness churches, is named for its founders, the Wesleys. In 1736, these two brothers traveled to the Georgia colony in America as missionaries for the Church of England; they left rather disheartened at what they saw. Both of them subsequently had "religious experiences", especially John in 1738, being greatly influenced by the Moravian Christians. They began to organize a renewal movement within the Church of England to focus on personal faith and holiness. John Wesley took Protestant churches to task over the nature of sanctification, the process by which a believer is conformed to the image of Christ, emphasizing New Testament teachings regarding the work of God and the believer in sanctification. The movement did well within the Church of England in Britain, but when the movement crossed the ocean into America, it took on a form of its own, finally being established as the Methodist Episcopal Church in 1784. The Wesleyan churches are very similar to Anglicanism (in Church government and liturgical practices), yet have added a strong emphasis on personal faith and personal experience. At its heart, the theology of John Wesley stressed the life of Christian holiness: to love God with all oneâs heart, mind, soul and strength and to love oneâs neighbour as oneself. See also Ministry of Jesus. Wesleyâs teaching also stressed experiential religion and moral responsibility." (DBpedia, 2018)
definition: «Le wesleyanisme ou théologie wesleyaniste est une théologie chrétienne basée sur les enseignements de John Wesley selon une perspective méthodiste. Le concept central de cette théologie est la vie sainte du chrétien : aimer Dieu de tout son cÅur, de tout son esprit et de toute son âme, ainsi qu'aimer son prochain comme soi-même. Les enseignements de Wesley insistent sur l'expérience religieuse et la responsabilité morale. Wesleyan est la forme adjectivée anglaise du nom propre Wesley qui réfère soit Ã John Wesley, le fondateur du méthodisme, une tendance du mouvement protestant, soit Ã une ou lâautre des églises méthodistes qui en découlent. LâÃglise wesleyenne sâest séparée de lâÃglise méthodiste épiscopale en 1843.» (DBpedia, 2018) @fr
in scheme: religion

West Indian
in dataset: The CWRC Ontology
type: ethnicity
type: Concept
comment: La description de ce terme est basée sur celle de DBPedia. @fr
comment: The description for this term is indebted to DBpedia.
definition: "A West Indian is a native or inhabitant of the West Indies (the Antilles and the Lucayan Archipelago). For more than 100 years the words West Indian specifically described natives of the West Indies, but by 1661 Europeans had begun to use it also to describe the descendants of European colonists who stayed in the West Indies. Some West Indian people reserve this term for citizens or natives of the British West Indies." (DBpedia, 2018)
definition: «La population [antillaise] est mixte et donc de provenance diverse. Composée majoritairement de noirs d'origines africaines et de métis comme Ã la Jamaïque ou en Haïti, elle comprend aussi des individus d'origine européenne, hindoue, arabe, juive. Ã noter un très faible pourcentage d'Asiatiques. Quelques rares survivants des premiers occupants de ces régions, les Amérindiens, y sont encore présents, comme les Caraïbes Ã lâîle de la Dominique.» (DBpedia, 2018) @fr
in scheme: ethnicity

West Indian
in dataset: The CWRC Ontology
type: national heritage
type: Concept
comment: La description de ce terme est basée sur celle de DBPedia. @fr
comment: The description for this term is indebted to DBpedia.
definition: "A West Indian is a native or inhabitant of the West Indies (the Antilles and the Lucayan Archipelago). For more than 100 years the words West Indian specifically described natives of the West Indies, but by 1661 Europeans had begun to use it also to describe the descendants of European colonists who stayed in the West Indies. Some West Indian people reserve this term for citizens or natives of the British West Indies." (DBpedia, 2018)
definition: «La population [antillaise] est mixte et donc de provenance diverse. Composée majoritairement de noirs d'origines africaines et de métis comme Ã la Jamaïque ou en Haïti, elle comprend aussi des individus d'origine européenne, hindoue, arabe, juive. Ã noter un très faible pourcentage d'Asiatiques. Quelques rares survivants des premiers occupants de ces régions, les Amérindiens, y sont encore présents, comme les Caraïbes Ã lâîle de la Dominique.» (DBpedia, 2018) @fr
in scheme: national heritage

wet nurse
in dataset: The CWRC Ontology
type: occupation
type: Concept
broader transitive: nursing
in scheme: occupation

whaler
in dataset: The CWRC Ontology
type: occupation
type: Concept
in scheme: occupation

whiggism
in dataset: The CWRC Ontology
type: political affiliation
type: Concept
comment: The description for this term is indebted to DBpedia.
label: whiggisme @fr
alternative label: dissident whig
alternative label: foxite whig
alternative label: opposition whig
alternative label: pittite whig
alternative label: whig
alternative label: whigs
alternative label: williamite
definition: "Whiggism, sometimes spelled Whigism, is a historical political philosophy that grew out of the Parliamentarian faction in the Wars of the Three Kingdoms (1639â1651). The whigs' key policy positions were the supremacy of Parliament (as opposed to that of the king), tolerance of Protestant dissenters, and opposition to a Catholic (especially a Stuart) on the throne. After the huge success of the Glorious Revolution of 1688â1689, Whiggism dominated English and British politics until about 1760, although in practice it splintered into different factions. After 1760 the Whigs lost power, apart from sharing it in a few short-lived coalitions, but Whiggism fashioned itself into a generalized belief system that emphasised innovation and liberty and was strongly held by about half of the leading families in England and Scotland, as well as most merchants, Dissenters and professionals. The opposing Tory position was held by the other great families, the Church of England, and most of the landed gentry and officers of the army and the navy. Whigs who opposed Robert Walpole often called themselves "Old Whigs" and comprised part of the Country Party. Whiggism referred originally to the Whigs of the British Isles, but in its "Old Whig" form was largely adopted by the American Patriots in the Thirteen Colonies. American Whiggism was known as republicanism. One meaning of 'whiggism' given by the Oxford English Dictionary is "moderate or antiquated Liberalism"." (DBpedia, 2017)
in scheme: political affiliation
related: left-wing
related: liberalism

white
in dataset: The CWRC Ontology
represented by: white identity
type: ethnicity
type: Concept
comment: La description de ce terme est basée sur celle de DBPedia. @fr
comment: The description for this term is indebted to DBpedia.
label: blanc @fr
definition: "White people is a racial classification specifier, used for people of Europid ancestry, with the exact implications dependent on context. The contemporary usage of 'white people' or a 'white race; as a large group of (mainly European) populations contrasting with 'black', American Indian, 'colored' or non-white originates in the 17th century. It is today particularly used as a racial classifier in multiracial societies, such as the United States (White American), the United Kingdom (White British), Brazil (White Brazilian), and South Africa (White South African). Various social constructions of whiteness have been significant to national identity, public policy, religion, population statistics, racial segregation, affirmative action, white privilege, eugenics, racial marginalization and racial quotas. The term 'white race' or 'white people' entered the major European languages in the later 17th century, in the context of racialized slavery and unequal status in European colonies. Description of populations as 'white' in reference to their skin color predates this notion and is found in Greco-Roman ethnography and other ancient sources. Scholarship on race generally distinguishes the modern concept from pre-modern descriptions of collective difference." (DBpedia, 2017)
definition: «Le terme Blanc est employé, dans le langage courant, pour désigner des êtres humains caractérisés notamment par une couleur de peau claire. Le terme est généralement employé pour désigner les individus présentant des caractéristiques physiques qui sont historiquement associées aux populations européennes. La définition d'un 'individu blanc' diffère sensiblement d'après les contextes historiques, légaux, culturels, et géographiques. Dans certains contextes, en particulier aux Ãtats-Unis, le terme 'caucasien' est utilisé comme synonyme. D'un point de vue biologique, la peau blanche est une adaptation génétique issue de la sélection naturelle favorisant la synthèse de la vitamine D en milieu faiblement ensoleillé en permettant une pénétration plus profonde des rayons de soleil dans l'épiderme du fait d'un taux de mélanine plus bas2,3. Les latitudes tempérées sont moins soumises aux risques liés au rayonnement ultraviolet, Ã l'inverse des milieux fortement ensoleillés dans lesquels les individus ont la peau plus foncée.» (DBpedia, 2017) @fr
in scheme: ethnicity
related: European

white identity
in dataset: The CWRC Ontology
represents: white
type: textual label
type: Concept
label: identité blanche @fr
definition: A subclass of textual label, this discursive label reflects the ambiguity of whiteness associated with different cultural forms. It provides a means of aggregating and searching multiple instances of "White" cultural identities (e.g. the cultural forms of white, white in the discursive context of ethnicity, and white, white in the discursive context of race or colour).
definition: Une sous-classe d'Ãtiquettes Textuelles, cette étiquette discursive reflète l'ambiguité de la blancheur de peau en tant que charactérique physique associée Ã diverses formes culturelles. Elle permet de compiler et de rechercher les multiples instances d'identités culturelles «blanches» (par exemple blanc, blanc). @fr
in scheme: textual label

white
is replaced by: white
in dataset: The CWRC Ontology
type: Concept
comment: Deprecated in favour of instance white.
comment: Désapprouver en faveur de l'instance blanc. @fr
label: blanc @fr
subclass of: white identity
deprecated: true
term status: deprecated

white
in dataset: The CWRC Ontology
represented by: white identity
type: race or colour
type: Concept
comment: La description de ce terme est basée sur celle de DBPedia. @fr
comment: The description for this term is indebted to DBpedia.
label: blanc @fr
alternative label: presumably white
broader: SkinColorSimpleWhite
definition: "White people is a racial classification specifier, used for people of Europid ancestry, with the exact implications dependent on context. The contemporary usage of 'white people' or a 'white race' as a large group of (mainly European) populations contrasting with 'black', American Indian, colored' or non-white originates in the 17th century. It is today particularly used as a racial classifier in multiracial societies, such as the United States (White American), the United Kingdom (White British), Brazil (White Brazilian), and South Africa (White South African). Various social constructions of whiteness have been significant to national identity, public policy, religion, population statistics, racial segregation, affirmative action, white privilege, eugenics, racial marginalization and racial quotas. The term 'white race' or 'white people' entered the major European languages in the later 17th century, in the context of racialized slavery and unequal status in European colonies. Description of populations as 'white' in reference to their skin color predates this notion and is found in Greco-Roman ethnography and other ancient sources. Scholarship on race generally distinguishes the modern concept from pre-modern descriptions of collective difference." (DBpedia, 2017)
definition: «Le terme Blanc est employé, dans le langage courant, pour désigner des êtres humains caractérisés notamment par une couleur de peau claire. Le terme est généralement employé pour désigner les individus présentant des caractéristiques physiques qui sont historiquement associées aux populations européennes. La définition d'un «individu blanc» diffère sensiblement d'après les contextes historiques, légaux, culturels, et géographiques. Dans certains contextes, en particulier aux Ãtats-Unis, le terme «caucasien» est utilisé comme synonyme. D'un point de vue biologique, la peau blanche est une adaptation génétique issue de la sélection naturelle favorisant la synthèse de la vitamine D en milieu faiblement ensoleillé en permettant une pénétration plus profonde des rayons de soleil dans l'épiderme du fait d'un taux de mélanine plus bas. Les latitudes tempérées sont moins soumises aux risques liés au rayonnement ultraviolet, Ã l'inverse des milieux fortement ensoleillés dans lesquels les individus ont la peau plus foncée.» (DBpedia, 2017) @fr
in scheme: race or colour

wife
in dataset: The CWRC Ontology
subject-centric predicate: has wife
type: occupation
type: ObjectProperty
type: Concept
range: Person
sub property of: partner
alternative label: candidate's wife
alternative label: colonial governor's wife
alternative label: diplomat's wife
alternative label: headmaster's wife
alternative label: housemaster's wife
alternative label: housewife
alternative label: vicar's wife
in scheme: occupation

wife of
in dataset: The CWRC Ontology
type: ObjectProperty
domain: Person
label: femme de @fr
range: Person
sub property of: partner of
different from: Partnership
inverse of: has wife
broader: spouse

Wilkite
in dataset: The CWRC Ontology
type: political affiliation
type: Concept
comment: The description for this term is indebted to DBpedia.
broader transitive: social reform
definition: A view of the law, in support of John Wilkes. Focused on government accountability and right to trial by jury. See: John Wilkes - Wikipedia
definition: Conception de la loi en accord avec John Wilkes. Comprend surtout la responsabilité gouvernementale et le droit au procès devant jury. Voir John Wilkes â Wikipédia @fr
in scheme: political affiliation

witness
in dataset: The CWRC Ontology
type: occupation
type: Concept
alternative label: character witness
alternative label: expert witness
alternative label: witness for the defence
in scheme: occupation

woman
in dataset: The CWRC Ontology
represented by: woman
type: gender
type: Concept
label: femme @fr
alternative label: female
definition: Indicates a subject identification with or labelling as the gender woman, and who is often but not necessarily understood to be sexed female. "One is not born, but rather becomes, woman." (Simone de Beauvoir, 1973) Where terms associated with this label are applied to younger individuals, âgirlâ is understood to apply for âwomanâ.
definition: Indique l'identification ou l'assignation au genre féminin, et qui est souvent mais non nécessairement de sexe féminin. «On ne naît pas femme, on le devient»: Simone de Beauvoir, Le deuxième sexe (1973) @fr
in scheme: gender

woman
in dataset: The CWRC Ontology
represents: cis woman/cis female
represents: lesbianism
represents: trans woman/trans female
represents: woman
type: textual label
type: Concept
label: femme @fr
definition: A subclass of textual label, this discursive label reflects the ambiguity of womanhood, femininity, or femaleness associated with different cultural forms. It provides a means of aggregating and searching multiple instances of "woman" (e.g. woman, trans woman/trans female) cultural identities. Where associated terms are applied to younger individuals, gendered variants, such as âgirlâ for âwomanâ, are understood to apply.
definition: Une sous-classe d'étiquettes textuelles, cette étiquette discursive reflète l'ambiguité de la féminité. Elle permet de compiler et de rechercher les multiples instances d'identités culturelles «féminines» (par exemple femme, femme trans). @fr
in scheme: textual label

womanism
in dataset: The CWRC Ontology
contrary to: anti-feminism
type: political affiliation
type: Concept
comment: The description for this term is indebted to DBpedia.
label: féminisme africain @fr
alternative label: womanist
broader transitive: feminism
definition: "Womanism is a social theory deeply rooted in the racial and gender-based oppression of black women. There are varying interpretations on what the term "womanist" means, and efforts to provide a concise and all encompassing definition have only been marginally successful. The ambiguity within the theory allows for its continuous expansion of its basic tenets, though this ambiguity is also widely considered its greatest weakness. At its core, womanism is a social change perspective based upon the everyday problems and experiences of black women and other women of minority demographics, but more broadly seeks methods to eradicate inequalities not just for black women, but for all people." (DBpedia, 2017)
in scheme: political affiliation
related: anti-racism

women's education reform
in dataset: The CWRC Ontology
contrary to: anti-feminism
type: political affiliation
type: Concept
comment: The description for this term is indebted to DBpedia.
label: réforme de l'éducation des filles @fr
alternative label: activist for women's education
alternative label: campaigner for women's education
alternative label: education for women
alternative label: female education
alternative label: female education advocate
alternative label: women's education reformer
alternative label: women's higher education
alternative label: women's medical education
broader transitive: education reform
broader transitive: feminism
definition: Reform of education for women. See Female education - Wikipedia; Category:Women and education - Wikipedia
definition: Réforme de l'éducation des femmes. Voir Histoire des femmes dans l'enseignement public français â Wikipédia et Histoire de l'éducation des filles en France â Wikipédia @fr
in scheme: political affiliation

women's employment reform
in dataset: The CWRC Ontology
contrary to: anti-feminism
type: political affiliation
type: Concept
comment: The description for this term is indebted to DBpedia.
label: réforme du travail des femmes @fr
alternative label: employment activist
alternative label: equal rights in the work place
alternative label: female employment
alternative label: women's employment reformer
broader transitive: feminism
broader transitive: social reform
definition: Advocacy or activism related to women's employment including training, opportunities, wages, and working conditions. See Women in the workforce - Wikipedia
definition: Militantisme et lutte liés Ã l'emploi des femmes, incluant le droits Ã la formation, aux opportunités, aux salaires et aux conditions de travail décentes. Voir Inégalités de revenu â Wikipédia @fr
in scheme: political affiliation

Women's Enfranchisement
is replaced by: suffrage movement
in dataset: The CWRC Ontology
type: Concept
comment: Deprecated in favour of instance suffrage movement.
comment: Désapprouver en faveur de l'instance Droit de vote. @fr
comment: The description for this term is indebted to DBpedia.
deprecated: true
term status: deprecated
definition: "The Women's Enfranchisement Act, 1930, was an act of the Parliament of South Africa which granted white women aged 21 and older the right to vote and to run for office. It also had the effect of diluting the limited voting power of non-white people (in the Cape Province) by effectively doubling the number of white voters. It was enacted by the National Party government of Prime Minister J. B. M. Hertzog. The first general election at which women could vote was the election of 17 May 1933. At that election Leila Reitz (wife of Deneys Reitz) was elected as the first female MP, representing Parktown for the South African Party. The act enfranchised all white women, while certain property qualifications still applied to men. In June 1931 the Franchise Laws Amendment Act, 1931 enfranchised all white men while retaining the property qualifications for non-white voters, thus further diluting the non-white vote. The delimitation of electoral divisions was still based on the white male population until April 1937, when the Electoral Quota Act, 1937 altered it to be based on the whole white population. The Women's Enfranchisement Act was repealed in 1946 when the franchise laws were consolidated into the Electoral Consolidation Act, 1946." (DBpedia, 2018)
in scheme: political affiliation

working class
in dataset: The CWRC Ontology
type: social class
type: Concept
label: classe ouvrière @fr
alternative label: rural working class parents
alternative label: urban working class
alternative label: working classes
alternative label: working woman
definition: "The working class (also labouring class and proletariat) are the people employed for wages, especially in manual-labour occupations and in skilled, industrial work. Working-class occupations include blue-collar jobs, some white-collar jobs, and most service-work jobs. The working class only rely upon their earnings from wage labour, thereby, the category includes most of the working population of industrialized economies, of the urban areas (cities, towns, villages) of non-industrialized economies, and of the rural workforce. In Marxist theory and in socialist literature, the term working class usually is synonymous and interchangeable with the term proletariat, and includes all workers who expend either physical labour or mental labour (salaried knowledge workers and white-collar workers) to produce economic value for the owners of the means of production, the bourgeoisie. Since working-class wages can be very low, and because the state of unemployment is defined as a lack of independent means of generating an income and a lack wage-labour employment, the term working class also includes the lumpenproletariat, unemployed people who are extremely poor." (DBpedia, 2018)
definition: «La notion de classe ouvrière se détermine par le sentiment d'appartenance Ã la catégorie sociale des ouvriers, qui ne disposent pas de la propriété des moyens de production et vendent leur force de travail.» (DBpedia, 2018) @fr
in scheme: social class

writer
in dataset: The CWRC Ontology
type: occupation
type: Concept
alternative label: amateur playwright
alternative label: amateur writer
alternative label: author
alternative label: biographer
alternative label: blurb writer
alternative label: chief copywriter
alternative label: children's writer
alternative label: commemorative writer
alternative label: contributor
alternative label: cookbook writer
alternative label: copywriter
alternative label: diarist
alternative label: dramatist
alternative label: educational writer
alternative label: essayist
alternative label: feature writer
alternative label: legal writer
alternative label: letter writer
alternative label: literary career
alternative label: literary collaborator
alternative label: mathematical writer
alternative label: media comedy writer
alternative label: medical writer
alternative label: memoirist
alternative label: novelist
alternative label: pedagogical author
alternative label: playwright
alternative label: poet
alternative label: poetry
alternative label: polemical writer
alternative label: political poet
alternative label: political writer
alternative label: professional writer
alternative label: public relations writer
alternative label: radio scriptwriter
alternative label: religious poet
alternative label: religious writer
alternative label: satirist
alternative label: scholarly writer
alternative label: screenwriter
alternative label: script writer
alternative label: scriptwriter
alternative label: short story writer
alternative label: songwriter
alternative label: textbook writer
alternative label: travel author
alternative label: travel writer
alternative label: wrote
hidden label: amateur drama
hidden label: art exhibition writer
hidden label: automatic writing
hidden label: diarist and memoirist
hidden label: freelance advertising copywriter
hidden label: letter writers
hidden label: occasional contributors
hidden label: part time novelist
hidden label: philanthropic writer
hidden label: populariser of poetry
hidden label: published
hidden label: published a sermon
hidden label: published two books of sceptical humanist philosophy
hidden label: quaker writer
hidden label: vice president of the european writers' congress
hidden label: writers
hidden label: writing poetry
hidden label: writing pulp fiction
hidden label: writing small books for indian readers
hidden label: wrote extensively on india
in scheme: occupation

writer In residence
in dataset: The CWRC Ontology
type: occupation
type: Concept
alternative label: poet in residence
alternative label: resident dramatist
alternative label: writer in residence
in scheme: occupation

writing group participant
in dataset: The CWRC Ontology
type: occupation
type: Concept
alternative label: writing group member
alternative label: writing group president
in scheme: occupation

writing relationship
in dataset: The CWRC Ontology
range includes: Work
range includes: AdminPlaceConcept
range includes: Feature
range includes: FormalOrganization
range includes: Person
subject-centric predicate: has writing relation to
type: ObjectProperty
sub property of: hasBody

yeoman farmer
in dataset: The CWRC Ontology
type: occupation
type: social class
type: Concept
label: paysanne yeoman @fr
alternative label: YEOMAN-FARMER
alternative label: yeoman
broader transitive: farming
definition: Les membres de cette classe historique «posséd[aient] juste assez de terre pour subvenir Ã leurs besoins, Ã condition qu'ils fassent eux-mêmes la plus grande partie du travail». Elizabeth Ham et Mary Webb en sont des exemples. @fr
definition: Members of this historic class "own[ed] just enough land to support themselves if they did most of the work themselves." Examples include Elizabeth Ham and Mary Webb. (Brown, 2006)
in scheme: social class

Yorkist
in dataset: The CWRC Ontology
type: political affiliation
type: Concept
comment: La description de ce terme est basée sur celle de DBPedia. @fr
label: Maison d'York @fr
definition: «La maison d'York est une branche cadette de la dynastie Plantagenêt qui a combattu la maison de Lancastre lors de la guerre des Deux-Roses. Son emblème est la rose blanche.» (DBpedia, 2018) @fr
in scheme: political affiliation

youngest
in dataset: The CWRC Ontology
type: birth position
type: Concept
label: benjamin·e @fr
definition: Indicates that the subject is the youngest child in the family.
definition: Indique que la personne est l'enfant le plus jeune de la famille. @fr
in scheme: birth position

Zen
in dataset: The CWRC Ontology
type: religion
type: Concept
comment: La description de ce terme est basée sur celle de DBPedia. @fr
comment: The description for this term is indebted to DBpedia.
label: zen @fr
alternative label: Zen Buddhism
definition: "Zen (Chinese: ç¦ª; pinyin: Chán) is a school of Mahayana Buddhism that originated in China during the Tang dynasty as Chan Buddhism. It was strongly influenced by Taoism and developed as a distinguished school of Chinese Buddhism. From China, Chan Buddhism spread south to Vietnam, northeast to Korea and east to Japan, where it became known as Japanese Zen. Zen emphasizes rigorous self-control, meditation-practice, insight into Buddha-nature, and the personal expression of this insight in daily life, especially for the benefit of others. As such, it de-emphasizes mere knowledge of sutras and doctrine and favors direct understanding through zazen and interaction with an accomplished teacher. The teachings of Zen include various sources of Mahayana thought, especially Yogachara, the TathÄgatagarbha sūtras and the Huayan school, with their emphasis on Buddha-nature, totality, and the Bodhisattva-ideal. The PrajñÄpÄramitÄ literature and, to a lesser extent, Madhyamaka have also been influential in the shaping of the "paradoxical language" of the Zen-tradition." (DBpedia, 2018)
definition: «Le zen est une branche japonaise du bouddhisme mahÄyÄna qui met l'accent sur la méditation (dhyÄna) Ã partir de la posture assise dite de zazen. Le mot « zen » est la romanisation de la prononciation japonaise du caractère chinois ç¦ ou ç¦ª, (« méditation silencieuse ») ; il est prononcé chán en mandarin et zeu en shanghaien. Ces différents termes remontent Ã une origine commune°: le mot sanskrit, dhyÄna -en pâli, jhÄna (« recueillement parfait »). Le zen se réfère au chan chinois, influencé par le taoïsme et, plus particulièrement, Ã la méditation de SiddhÄrtha Gautama lorsqu'il obtint l'éveil sous l'arbre de la Bodhi, il y a plus de 2 500 ans en Inde. On y trouve aussi l'influence coréenne du son.» (DBpedia, 2018) @fr
in scheme: religion

Zionism
in dataset: The CWRC Ontology
type: political affiliation
type: Concept
comment: La description de ce terme est basée sur celle de DBPedia. @fr
comment: The description for this term is indebted to DBpedia.
label: Sionisme @fr
alternative label: proto-Zionist
alternative label: zionist
broader transitive: nationalism
definition: "Zionism is a nationalist political movement of Jews and Jewish culture that supports the re-establishment of a Jewish homeland in the territory defined as the historic Land of Israel (roughly corresponding to Palestine, Canaan or the Holy Land). Zionism emerged in the late 19th century in central and eastern Europe as a national revival movement, in reaction to anti-Semitic and exclusionary nationalist movements in Europe. Soon after this, most leaders of the movement associated the main goal with creating the desired state in Palestine, then an area controlled by the Ottoman Empire. Until 1948, the primary goals of Zionism were the re-establishment of Jewish sovereignty in the Land of Israel, ingathering of the exiles, and liberation of Jews from the antisemitic discrimination and persecution that they experienced during their diaspora. Since the establishment of the State of Israel in 1948, Zionism continues primarily to advocate on behalf of Israel and address threats to its continued existence and security. A religious variety of Zionism supports Jews upholding their Jewish identity defined as adherence to religious Judaism, opposes the assimilation of Jews into other societies, and has advocated the return of Jews to Israel as a means for Jews to be a majority nation in their own state. A variety of Zionism, called cultural Zionism, founded and represented most prominently by Ahad Ha'am, fostered a secular vision of a Jewish "spiritual center" in Israel. Unlike Herzl, the founder of political Zionism, Ahad Ha'am strived for Israel to be "a Jewish state and not merely a state of Jews". Advocates of Zionism view it as a national liberation movement for the repatriation of a persecuted people residing as minorities in a variety of nations to their ancestral homeland. Critics of Zionism view it as a colonialist, racist, and exceptionalist ideology that led advocates to violence during Mandatory Palestine, followed by the forced exodus of Palestinians, and the subs…
definition: «Le sionisme est une idéologie politique fondée sur un sentiment national juif, décrite comme nationaliste par les uns et comme émancipatrice par les autres, prônant l'existence d'un centre territorial ou étatique peuplé par les Juifs en Terre d'Israël (Eretz Israël). Ã la naissance du mouvement, Ã la fin du XIXe siècle, ce territoire correspondait Ã la Palestine ottomane, puis après la Première Guerre mondiale Ã la partie occidentale de la Palestine mandataire. Sur un plan idéologique et institutionnel, le sionisme entend Åuvrer Ã donner ou redonner aux Juifs un statut perdu depuis l'annexion du Royaume d'Israël par l'Empire assyrien en -720, Ã savoir celui d'un peuple disposant d'un territoire. Il faut le différencier du post-sionisme, qui veut donner une orientation laïque Ã l'Ãtat d'Israël, normaliser les relations avec les Palestiniens, et du néo-sionisme, qui milite pour la migration des Palestiniens et des Arabes israéliens vers les autres pays arabes. Le mouvement sioniste est né parmi les communautés ashkénazes d'Europe centrale et orientale sous la pression des pogroms, mais aussi en Europe occidentale, Ã la suite du choc causé par l'affaire Dreyfus â qui compte parmi les motifs du lancement du Congrès sioniste par Theodor Herzl. Bien qu'ayant des caractères spécifiques du fait de la dispersion des Juifs, cette idéologie est contemporaine de l'affirmation d'autres nationalismes en Europe.» (DBpedia, 2017) @fr
in scheme: political affiliation
related: anti-antisemitism

Zoroastrianism
in dataset: The CWRC Ontology
type: religion
type: Concept
comment: La description de ce terme est basée sur celle de DBPedia. @fr
comment: The description for this term is indebted to DBpedia.
label: Zoroastrisme @fr
alternative label: Parsi
definition: "Zoroastrianism, or more natively Mazdayasna, is one of the world's oldest religions, "combining a cosmogonic dualism and eschatological monotheism in a manner unique [â¦] among the major religions of the world." Ascribed to the teachings of the Iranian prophet Zoroaster (or Zarathustra), he exalted their deity of wisdom, Ahura Mazda (Wise Lord), as its Supreme Being. Leading characteristics, such as messianism, heaven and hell, and free will are said to have influenced other religious systems, including Second Temple Judaism, Gnosticism, Christianity, and Islam. With possible roots dating back to the second millennium BCE, Zoroastrianism enters recorded history in the 5th-century BCE, and including a Mithraic Median prototype and Zurvanist Sassanid successor it served as the state religion of the pre-Islamic Iranian empires from around 600 BCE to 650 CE. Zoroastrianism was suppressed from the 7th century onwards following the Muslim conquest of Persia. Recent estimates place the current number of Zoroastrians at around 2.6 million, with most living in India and Iran. Besides the Zoroastrian diaspora, the older Mithraic faith Yazdânism is still practised amongst the Kurds. The religious philosophy of Zoroaster divided the early Iranian gods. The most important texts of the religion are those of the Avesta. In Zoroastrianism, the creator Ahura Mazda, through the Spenta Mainyu (Good Spirit, "Bounteous Immortals") is an all-good "father" of Asha (Truth, âorder, justice,") in opposition to Druj (âfalsehood, deceitâ) and no evil originates from "him". "He" and his works are evident to humanity through the six primary Amesha Spentas and the host of other Yazatas, through whom worship of Mazda is ultimately directed. Spenta Mainyu adjoined unto "truth" oppose the Spirit's opposite, Angra Mainyu and its forces born of AkÉm Manah (âevil thinkingâ). Zoroastrianism has no major theological divisions, though it is not uniform; modern-era influences having a significant impact …
definition: «Le zoroastrisme est une religion monothéiste de l'Iran ancien. Elle est une réforme du mazdéisme et tire son nom de son « prophète » ou fondateur Zarathoustra, dont le nom a été transcrit en Zoroastre par les Grecs (ÎÏÏÎ¿Î¬ÏÏÏÎ·Ï, ZÅroastrÄs). Cette réforme est intervenue au cours du Ier millénaire av. J.-C.. La reforme religieuse de Zarathustra a pour principal effet d'orienter la religion mazdéenne vers le monothéisme au bénéfice du dieu Ahura Mazdâ (pehlevi : Ohrmazd) entouré d'un certain nombre d'entités. Ahura Mazda est seul responsable de l'ordonnancement du chaos initial, le créateur du ciel et de la Terre Le zoroastrisme a fait fonction de religion officielle de l'empire perse Ã trois reprises (sous le roi Hystaspès, sous les Achéménides, et sous les Sassanides jusqu'en 651, date de l'assassinat du dernier roi zoroastrien). Malgré l'arrivée de l'islam et les persécutions qui en découlèrent, il a réussi Ã se maintenir dans le patrimoine culturel iranien, afghan et d'Asie centrale. En effet, les Iraniens, les Kurdes et les Afghans, indépendamment de leur religion, accordent beaucoup d'importance aux fêtes zoroastriennes, en particulier celle de Nowruz, le nouvel an zoroastrien, célébré le 21 mars. Les zoroastriens, aussi appelés guèbres, respectent le feu comme symbole divin. Zoroastre prêchait un dualisme apparent, qui reposait sur le combat entre le Bien et le Mal, la Lumière et les Ténèbres. Le principe de Zoroastre est qu'il existe un esprit saint (Spenta Mainyu), fils d'Ahura MazdÄ, et un esprit mauvais (Angra Mainyu) (pehlevi Ahriman), son jumeau, tous deux opposés car représentant le jour et la nuit, la vie et la mort. Ces deux esprits coexistent dans chacun des êtres vivants. Toutefois, le zoroastrisme est bel et bien un monothéisme, puisque seul Ahura Mazda conserve la prééminence céleste et que seul ce dernier triomphera du mal Ã la fin des temps.» (DBpedia, 2018) @fr
in scheme: religion