Ontologia della Descrizione di Contesto (ArCo network)
type: Ontology
imports: core
creator: Aldo Gangemi (ISTC-CNR, STLab)
creator: Andrea Nuzzolese (ISTC-CNR, STLab)
creator: Chiara Veninata (MiBACT, ICCD)
creator: Ludovica Marinucci (ISTC-CNR, STLab)
creator: Luigi Asprino (ISTC-CNR, STLab)
creator: Margherita Porena (ISTC-CNR, STLab)
creator: Marialetizia Mancinelli (MiBACT, ICCD)
creator: Valentina Carriero (ISTC-CNR, STLab)
creator: Valentina Presutti (ISTC-CNR, STLab)
description: Questo modulo, detto della descrizione di contesto, include le informazioni che riguardano il contesto (inteso in senso ampio) in cui il bene culturale viene a trovarsi nel corso della sua storia. Fanno per esempio parte delle informazioni di contesto: autore, committente, collezione, ambito culturale, eventi coinvolti, contenitore giuridico, utente, circostanza, modalità di fruizione, bibliografia, documentazione collegata, collocazione in un determinato inventario, etc. Dunque, rappresenta attributi che non sono il risultato di una misurazione condotta sul bene culturale, ma che sono associati al bene culturale.
description: The Context Description module includes models for the context of a cultural property, in a broad sense: agents (e.g.: author, collector, copyright holder), objects (e.g.: inventories, bibliography, protective measures, other cultural properties, collections etc.), activities (e.g.: surveys, conservation interventions), situations (e.g.: commission, coin issuance, estimate, legal situation) related, involved or involving the cultural property. Thus it represents attributes that do not result from a measurement of features in a cultural property, but are associated with it. @en
language: ENG
language: ITA
title: Context Description Ontology (ArCo network) @en
issued: 2018-03-07
license: https://creativecommons.org/licenses/by-sa/4.0/
license: A31 CCBYSA40
modified: 2020-03-27
reuses pattern as template: BornDigitalArchives ODP.owl
reuses pattern as template: agentrole.owl
reuses pattern as template: classification.owl
reuses pattern as template: collectionentity.owl
reuses pattern as template: countingas.owl
reuses pattern as template: situation.owl
reuses pattern as template: place.owl#
comment: Questo modulo, detto della descrizione di contesto, include le informazioni che riguardano il contesto (inteso in senso ampio) in cui il bene culturale viene a trovarsi nel corso della sua storia. Fanno per esempio parte delle informazioni di contesto: autore, committente, collezione, ambito culturale, eventi coinvolti, contenitore giuridico, utente, circostanza, modalità di fruizione, bibliografia, documentazione collegata, collocazione in un determinato inventario, etc. Dunque, rappresenta attributi che non sono il risultato di una misurazione condotta sul bene culturale, ma che sono associati al bene culturale. In questo modulo sono riusati come template i seguenti Ontology Design Patterns: - http://www.ontologydesignpatterns.org/cp/owl/collectionentity.owl - http://www.ontologydesignpatterns.org/cp/owl/countingas.owl - http://www.ontologydesignpatterns.org/cp/owl/agentrole.owl - http://www.ontologydesignpatterns.org/cp/owl/classification.owl - http://mklab.iti.gr/pericles/BornDigitalArchives_ODP.owl - http://www.ontologydesignpatterns.org/cp/owl/place.owl - http://www.ontologydesignpatterns.org/cp/owl/situation.owl
comment: The Context Description module includes models for the context of a cultural property, in a broad sense: agents (e.g.: author, collector, copyright holder), objects (e.g.: inventories, bibliography, protective measures, other cultural properties, collections etc.), activities (e.g.: surveys, conservation interventions), situations (e.g.: commission, coin issuance, estimate, legal situation) related, involved or involving the cultural property. Thus it represents attributes that do not result from a measurement of features in a cultural property, but are associated with it. In this module the following Ontology Design Patterns have been used: - http://www.ontologydesignpatterns.org/cp/owl/collectionentity.owl - http://www.ontologydesignpatterns.org/cp/owl/countingas.owl - http://www.ontologydesignpatterns.org/cp/owl/agentrole.owl - http://www.ontologydesignpatterns.org/cp/owl/classification.owl - http://mklab.iti.gr/pericles/BornDigitalArchives_ODP.owl - http://www.ontologydesignpatterns.org/cp/owl/place.owl - http://www.ontologydesignpatterns.org/cp/owl/situation.owl @en
version info: Version 1.1 @en
version info: Versione 1.1

ha acquisizione
type: ObjectProperty
sub property of: hasSituation
inverse of: è acquisizione di
domain: CulturalEntity
range: Acquisizione
comment: Questa proprietà collega un bene culturale coinvolto in un evento di acquisizione all'acquisizione stessa.
comment: This property relates a cultual property involved in an acquisition event to the actual acquisition. @en
label: has acquisition @en
version info: stabile
version info: stable @en
iccd norm tag: ICCD Normativa Trasversale 4.00: TU/ACQ

ha tipo di acquisizione
type: ObjectProperty
sub property of: hasType
inverse of: è tipo di acqusizione di
type: FunctionalProperty
domain: Acquisizione
range: Tipo di acquisizione
comment: Questa proprietà collega un'acquisizione di un bene culturale al tipo di acquisizione (es.: donazione, alienazione, confisca).
comment: This property relates a cultural entity's acquisition to its acquisition type (i.e. donation, seizure). @en
label: has acquisition type @en
version info: stabile
version info: stable @en
iccd norm tag: ICCD Normativa Trasversale 4.00: TU/ACQ/ACQT

ha operatore dell'attività
type: ObjectProperty
sub property of: ha agente correlato
inverse of: è operatore dell'attività
domain: Activity
range: Agent
comment: Questa proprietà collega un'attività (per esempio, un'indagine o un intervento su un bene culturale) all'operatore dell'attività. La relazione tra il ruolo e l'agente che lo riveste è espressa nel nome della proprietà, che quindi ne fornisce una rappresentazione semplificata, con ridotta espressività. Nell'ontologia questa relazione è modellata anche, in maniera più espressiva, dalla classe AgentRole, che permette di collegare l'agente e il suo ruolo.
comment: This property relates an activity to the agent who performed the activity. In the ontology this relationship is modelled also by the class AgentRole which allows more expressiveness. @en
label: has activity operator @en
version info: stabile
version info: stable @en
iccd norm tag: ICCD Normativa Trasversale: RE/IND/INDN; CO/RST/RSTN - ICCD Normativa SM e BDM 4.00: DR/DRL - ICCD normative di versioni precedenti: RE/AIN/AINR

ha responsabile dell'attività
type: ObjectProperty
sub property of: ha agente correlato
inverse of: è responsabile dell'attività
domain: Activity
range: Agent
comment: Questa proprietà collega un'attività (per esempio, un'indagine o un intervento su un bene culturale) all'ente o al soggetto responsabile del rilevamento. La relazione tra il ruolo e l'agente che lo riveste è espressa nel nome della proprietà, che quindi ne fornisce una rappresentazione semplificata, con ridotta espressività. Nell'ontologia questa relazione è modellata anche, in maniera più espressiva, dalla classe AgentRole, che permette di collegare l'agente e il suo ruolo.
comment: This property relates an activity to the institution or the survey's responsible entity. In the ontology this relationship is modelled also by the class AgentRole which allows more expressiveness. @en
label: has activity responsible @en
version info: stabile
version info: stable @en
iccd norm tag: ICCD Normativa Trasversale 4.00: RE/RCG/RCGR; RE/DSC/DSCF; RE/IND/INDE; RE/FOI/FOIE - Normativa SM e BDM 4.00: DR/DRV

ha finanziatore dell'attività
type: ObjectProperty
sub property of: ha agente correlato
inverse of: è responsabile dell'attività
domain: Activity
range: Agent
comment: Questa proprietà collega un'attività (per esempio, un'indagine o un intervento su un bene culturale) all'ente o al soggetto che ha finanziato l'attività.
comment: This property relates an activity to its investor. The investor may be an institution or an agent. @en
label: has activity sponsor @en
version info: stabile
version info: stable @en
iccd norm tag: ICCD Normativa Trasversale 4.00: RS/RST/RSTR; RE/IND/INDR

ha età della morte stimata
type: ObjectProperty
sub property of: hasSituation
inverse of: è età della morte stimata di
domain: CulturalEntity
range: Interpretazione dell'età della morte
comment: Questa proprietà collega un reperto antropologico alla stima dell'età della morte.
comment: This property relates an antropologic artifact to the interpretation of its age of death. @en
label: has age of death interpretation @en
version info: stabile
version info: stable @en

ha agente con responsabilità
type: ObjectProperty
sub property of: ha agente correlato
inverse of: è agente con responsabilità in
domain: Responsabilità
range: Agent
comment: Questa proprietà collega l'individuazione di una responsabilità relativamente ai processi di produzione e di divulgazione che caratterizzano specificamente i beni fotografici all'agente che ha quella specifica responsabilità.
comment: This property relates the responsibility's identification to the agent which has that specific responsibility, focusing on the production process and dissemination of the photographic heritage. @en
label: has agent with responsibility @en
version info: stabile
version info: stable @en
iccd norm tag: ICCD Normativa F e FF 4.00: PD/PDF/PDFN - ICCD Normativa F 3.00: PD/PDF/PDFN o PD/PDF/PDFB

ha datazione alternativa
type: ObjectProperty
sub property of: hasType
inverse of: è datazione alternativa di
domain: Datazione alternativa
range: Tipo di datazione alternativa
comment: Questa proprietà collega una datazione alternativa con la sua tipologia.
comment: This property relates an alternative dating to its type. @en
label: has alternative dating type @en
version info: stabile
version info: stable @en
iccd norm tag: ICCD Normativa Trasversale: DT/ADT/ADTT

ha anomalia
type: ObjectProperty
sub property of: hasSituation
inverse of: è anomalia di
domain: Fotointerpretazione e fotorestituzione
range: Anomalia
comment: Questa proprietà collega una fotointerpretazione o fotorestituzione a un'anomalia rilevata nel corso dell'indagine.
comment: This property relates a photo interepretation rendering to an anomaly revealed by a survey. @en
label: has anomaly @en
version info: stabile
version info: stable @en
iccd norm tag: ICCD Normativa Trasversale 4.00: RE/FOI/FOIA + RE/FOI/FOIQ + RE/FOI/FOIF

ha origine dell'anomalia
type: ObjectProperty
sub property of: hasCharacteristic
inverse of: è origine dell'anomalia di
domain: Anomalia
range: Origine dell'anomalia
comment: Questa proprietà collega un'anomalia rilevata durante una fotointerpretazione o fotorestituzione all'origine dell'anomalia (naturale, antropica, incerta).
comment: This property relates an anomaly detected during a photo interpretation or rendering survey to the origin of the anomaly (e.g. natural, unsure). @en
label: has anomaly origin @en
version info: stabile
version info: stable @en
iccd norm tag: ICCD Normativa Trasversale 4.00: RE/FOI/FOIA

ha tipo di anomalia
type: ObjectProperty
sub property of: hasType
inverse of: è tipo di anomalia di
domain: Anomalia
range: Tipo di anomalia
comment: Questa proprietà collega un'anomalia rilevata nel corso di una fotointerpretazione o fotorestituzione al tipo di anomalia (puntuale, lineare, areale).
comment: This property relates an anomaly revealed by a photo interpretation rendering to its anomaly type (line, point, poligony anomaly). @en
label: has anomaly type @en
version info: stabile
version info: stable @en
iccd norm tag: ICCD Normativa Trasversale 4.00: RE/FOI/FOIQ

ha tipo di indagine su bene archeologico
type: ObjectProperty
sub property of: hasType
inverse of: è tipo di indagine su bene archeologico
domain: Indagine su bene archeologico
range: Tipo di indagine su bene archeologico
comment: Questa proprietà collega un'indagine su un bene archeologico al tipo di indagine.
comment: This property relates a survey on an archaeological property to the type of survey. @en
label: has archaeological property survey type @en
version info: stabile
version info: stable @en
iccd norm tag: ICCD Normativa AT 3.00: IN/INI/INIT

ha tipo di indagine archeometrica e diagnostica
type: ObjectProperty
sub property of: hasType
inverse of: è tipo di indagine archeometrica e diagnostica di
domain: Indagine archeometrica e diagnostica
range: Tipo di indagine archeometrica e diagnostica
comment: Questa proprietà collega un'indagine archeometrica e diagnostica al suo tipo (es.: analisi della malta, carotaggio, termografia, etc.)
comment: This property relates an arecheometric diagnostic survey to its type (i.e. thermal imaging, coring). @en
label: has archaeometric diagnostic survey type @en
version info: stabile
version info: stable @en
iccd norm tag: ICCD Normativa Trasversale 4.00: RE/IND/INDI - ICCD normative di versioni precedenti: RE/AIN/AINT

ha unità archivistica complessa
type: ObjectProperty
inverse of: è unità archivistica complessa in
domain: Appartenenza a unità archivistica complessa
range: Unità archivistica complessa
comment: Questa proprietà, inversa a "è unità archivistica complessa in", collega il rapporto tra una unità archivistica complessa e un bene culturale che ne fa parte alla unità archivistica stessa.
comment: This property relates the relationship of an archival set and a one of its belonging cultural entities. @en
label: has archival record set @en
version info: stabile
version info: stable @en
iccd norm tag: ICCD Normativa F: UB/UBF

ha archivio
type: ObjectProperty
sub property of: ha agente correlato
inverse of: è archiviato in
domain: Fonti e documenti
range: Agent
comment: Questa proprietà collega una documentazione costituita da fonti e documenti all'archivio e/o istituzione conservativa.
comment: This property relates the documentation made of sources and documents to the archive or conservative institution. @en
label: has archive @en
version info: stabile
version info: stable @en
iccd norm tag: ICCD Normativa Trasversale 4.00: DO/FNT/FNTN

ha elemento associato
type: ObjectProperty
inverse of: è oggetto associato a
domain: Contesto di rinvenimento
range: Object
comment: Questa proprietà collega il contesto di rinvenimento di un bene culturale (in particolare, un reperto antropologico) a un elemento associato al bene in quel contesto (es.: orecchini, scudo, resti di tessuto).
comment: This property relates a finding context of a cultural property (in particular, an anthropological material) to an object associated to the cultural property (e.g: earrings, shield, cloth, etc.) @en
label: has associated object @en
version info: stabile
version info: stable @en
iccd norm tag: ICCD Normativa AT 3.01: OG/OGC/OGCE

ha autore attribuito
type: ObjectProperty
sub property of: ha agente correlato
inverse of: è autore attribuito in
domain: Class
  union of: Attribuzione Alternativa di Autore
  union of: Attribuzione Primaria di Autore
range: Agent
comment: Questa proprietà collega una situazione in cui viene attribuito un autore a un bene culturale all'autore stesso.
comment: This property relates a situation where an autorship is attributed to a cultural entity's author. @en
label: has attributed author @en
version info: stabile
version info: stable @en
iccd norm tag: AU/AUT/AUTN (+ AU/AUT/AUTS); AU/AAT; AU/AAT/AATN

ha autore
type: ObjectProperty
sub property of: ha agente correlato
inverse of: è autore di
domain: Thing
range: Agent
property chain axiom: ha attribuzione di autore/responsabilità
property chain axiom: ha autore attribuito
comment: Questa proprietà collega una entità di qualsiasi tipo (documentazione, bene culturale, etc.) con il suo autore.
comment: This property relates a entity (i.e. documentation, cultural entity, etc.) to its author. @en
comment: This property relates an entity to its author. @en
label: has author @en
version info: stabile
version info: stable @en
iccd norm tag: ICCD Normativa Trasversale: DO/FTA/FTAA, DO/DRA/DRAA, DO/VDC/VDCR, DO/REG/REGA, DO/FNT/FNTA, DO/BIB/BIBA - Normativa S 3: RO/ADL/ADLA - Normative VeAC e AT 3.01: DO/BSE/BSEA - Normativa MI 3.00: AU/DDC/DDCN

ha ente schedatore dell'authority file
type: ObjectProperty
sub property of: ha agente correlato
inverse of: è ente schedatore dell'authority file di
domain: Thing
range: Agent
comment: Questa proprietà collega un'entità descritta in una scheda di Authority File all'ente schedatore dell'authority file stesso. Per esempio, l'attribuzione di un autore a un bene culturale, uno scavo archeologico, una ricognizione archeologica, una bibliografia. Questa proprietà, esprimendo il significato della relazione nel nome, dà una rappresentazione semplificata della relazione che lega questa entità, l'authority file, e l'ente schedatore dell'authority file.
comment: This property relates an entity described in a authority file to the file's cataloguing institution. @en
label: has authority file cataloguing agency @en
version info: stabile
version info: stable @en
iccd norm tag: ICCD Normativa Trasversale 4.00: AU/AUT/AUTJ; DO/BIB/BIBJ; RE/RCG/RCGJ; RE/DSC/DSCJ - ICCD Normativa F: PD/PDF/PDFJ

ha attribuzione di autore/responsabilità
type: ObjectProperty
sub property of: hasSituation
inverse of: è attribuzione di autore/responsabilità di
domain: CulturalEntity
range: Attribuzione di Autore o responsabilità
comment: Proprietà che lega un oggetto culturale a un'attribuzione di autore o di responsabilità relativa all'oggetto.
comment: This property relates a cultural entity to an authorship or resposibility attribution of the entity. @en
label: has authorship attribution @en
version info: stabile
version info: stable @en
iccd norm tag: ICCD Normativa Trasversale 4.00: AU/AUT; AU/ATB; AU/AAT

ha bibliografia
type: ObjectProperty
inverse of: è bibliografia di
domain: Thing
range: Bibliografia
comment: Questa proprietà collega un'entità alla sua bibliografia. Per esempio, nell'ambito del Catalogo Generale, collega un bene culturale alla bibliografia che riguarda il bene stesso, descritto in una scheda di catalogo.
comment: This property relates an entity to its bibliography. @en
label: has bibliography @en
version info: stabile
version info: stable @en
iccd norm tag: ICCD Normativa Trasversale 4.00: DO/BIB; RE/RCG/RCGS

ha tipo di bibliografia
type: ObjectProperty
sub property of: hasType
inverse of: è tipo di bibliografia di
domain: Bibliografia
range: Tipo di bibliografia
comment: Questa proprietà collega la bibliografia al tipo di riferimento bibliografico.
comment: This property relates a bibliography to its bibliography type. @en
label: has bibliography type @en
version info: stabile
version info: stable @en
iccd norm tag: BIB/BIBF

ha tassonomia biologica
type: ObjectProperty
sub property of: hasClassification
inverse of: è tassonomia biologica di
domain: Thing
range: Tassonomia biologica
comment: Questa proprietà collega un'entità biologica a una tassonomia.
comment: This property relates a biological entity to a taxon. @en
label: has biological taxon @en
deprecated: true
version info: stabile
version info: stable @en
iccd norm tag: ICCD Normativa AT: OG/OGS

ha mutamento condizione materiale
type: ObjectProperty
sub property of: hasSituation
inverse of: è mutamento di condizione materiale di
domain: CulturalEntity
range: Mutamento condizione materiale
comment: Questa proprietà collega un bene culturale coinvolto in un un evento di mutamento di condizione materiale (furto, distruzione, recupero) all'evento stesso.
comment: This property relates a cultural enity involved in a change of availability event (i.e. theft, destruction, recovery) to the event. @en
label: has change of availability @en
version info: stabile
version info: stable @en

ha tipo di mutamento condizione materiale
type: ObjectProperty
sub property of: hasType
inverse of: è tipo di mutamento condizione materiale di
type: FunctionalProperty
domain: Mutamento condizione materiale
range: Tipo di mutamento condizione materiale
comment: Questa proprietà collega il mutamento di condizione materiale di un bene culturale al tipo di evento (es.: furto, distruzione, recupero).
comment: This property relates a cultural entity's change of availability to the event type (i.e. theft, destruction, recovery). @en
label: has change of availability type @en
version info: stabile
version info: stable @en
iccd norm tag: ICCD Normativa Trasversale 4.00: TU/ALN/ALNT

ha circostanza
type: ObjectProperty
sub property of: hasSituation
inverse of: è circostanza di
domain: Thing
range: Occasione
comment: Questa proprietà collega una situazione all'occasione che ha determinato quella situazione. Per esempio, può collegare una situazione in cui viene indicata la committenza di un bene culturale all'occasione che ha determinato quella committenza, oppure un luogo di ripresa di un bene fotografico all'occasione che ha determinato il motivo della ripresa, o ancora l'uso di un bene culturale all'occasione d'uso.
comment: This property relates a situation to the circumstance which led to the situation. For example it can connect a situation where is indicated a cultural entity's committment to its circumstance. @en
label: has circumstance @en
version info: stabile
version info: stable @en
iccd norm tag: ICCD Normativa Trasversale: UT/UTU/UTUO; normativa BDM: UT/UTO; AU/CMM/CMMC; normativa VeAC: AU/FRU/FRUC; normativa F: LR/LRO - ICCD Normativa MI: AU/DDC/DDCC

ha tipo di circostanza
type: ObjectProperty
sub property of: hasType
inverse of: è tipo di circostanza di
domain: Occasione
range: Tipo di circostanza
comment: Questa proprietà collega un'occasione con il tipo di occasione.
comment: This property relates the circumstance to its type. @en
label: has circumstance type @en
version info: stabile
version info: stable @en
iccd norm tag: ICCD Normativa BDI: CA/CAR; CA/CAC

ha emissione di moneta
type: ObjectProperty
sub property of: hasSituation
inverse of: è emissione di moneta
domain: Class
  union of: CulturalEntity
  union of: Counterstamp
range: Emissione di moneta
comment: Questa proprietà collega un bene numismatico alla sua emissione, o una contromarca a una nuova emissione che sostituisce nominale, autorità emittente, zecca e cronologia della moneta originari.
comment: This property relates a numismatic entity to its issuance. @en
label: has coin issuance @en
version info: stabile
version info: stable @en
iccd norm tag: ICCD Normativa NU: DA/AUE; DA/CON/CONN; DA/CON/CONZ; DA/CON/CONA; DA/CON/CONC - ICCD Normativa OA (dopo il rilascio della specifica scheda NU nel 2004 la scheda OA non è stata più utilizzata per la catalogazione di monete e medaglie): AU/EDT

ha moneta membro
type: ObjectProperty
sub property of: hasMember
inverse of: è moneta membro di
domain: Serie numismatica
range: CulturalEntity
comment: Questa proprietà collega una serie di monete a una moneta che ne è membro.
comment: This property relates a numismatic series to a coin that is member of it. @en
label: has coin member @en
version info: stabile
version info: stable @en

ha collezione
type: ObjectProperty
inverse of: è collezione in
domain: Appartenenza a Collezione
range: CollectionCulEnt
comment: Questa proprietà collega l'appartenenza di un bene culturale a una collezione in un intervallo di tempo alla collezione coinvolta nella relazione
comment: This property relates a cultural property to the collection to which it belongs in a time span. @en
label: has collection @en
version info: stabile
version info: stable @en
iccd norm tag: UB/COL/COLD

ha collezionista
type: ObjectProperty
sub property of: ha agente correlato
inverse of: è collezionista di
domain: CollectionCulEnt
range: Agent
comment: Questa proprietà collega una collezione di beni culturali al collezionista.
comment: This property relates a collection of cultural properties to its collector. @en
label: has collector @en
version info: stabile
version info: stable @en
iccd norm tag: UB/COL/COLN

ha committenza
type: ObjectProperty
sub property of: hasSituation
inverse of: è committenza di
domain: CulturalEntity
range: Committenza
comment: Questa proprietà collega un bene culturale alla sua committenza.
comment: This property relates a cultural entity to its commission. @en
label: has commission @en
version info: stabile
version info: stable @en
iccd norm tag: AU/CMM

ha committente
type: ObjectProperty
sub property of: ha agente correlato
inverse of: è committente in
domain: Committenza
range: Agent
comment: Questa proprietà collega una situazione in cui viene indicata la committenza di un bene culturale alla persona o istituzione committente.
comment: This property relates a situation where it is indicated a cultural entity's commission to the investor agent or institution. @en
label: has committent @en
version info: stabile
version info: stable @en
iccd norm tag: ICCD Normativa Trasversale 4.00: AU/CMM/CMMN

ha diritti d'autore
type: ObjectProperty
inverse of: sono diritti d'autore di
domain: Thing
range: Diritti d'autore
comment: Questa proprietà collega un'entità, per esempio un bene fotografico, ai diritti d'autore detenuti da un agente, o allo stato di "in pubblico dominio" relativo all'entità stessa, qualora i diritti siano scaduti.
comment: This property relates an entity to copiright held by an agent or its "public domain" condition, if it is out of copyright. @en
label: has copyright @en
version info: stabile
version info: stable @en
iccd norm tag: ICCD Normativa F 4.00 e OAC: TU/CPR

ha titolare dei diritti d'autore
type: ObjectProperty
sub property of: ha agente correlato
inverse of: è titolare dei diritti d'autore in
domain: Diritti d'autore
range: Agent
comment: Questa proprietà collega i diritti d'autore di un'entità al titolare dei diritti d'autore. Questa proprietà fornisce una rappresentazione semplificata della relazione, il cui valore viene esplicitato nel nome della proprietà. La stessa relazione viene anche modellata nell'ontologia, in maniera più espressiva, per mezzo della classe AgentRole, che permette di collegare un agente al ruolo che ha rivestito (in questo caso, al ruolo di "titolare dei diritti d'autore").
comment: This property relates an entity's copyright to its copyright holder. In the ontology this relationship is modelled also by the class AgentRole which allows more expressiveness. @en
label: has copyright holder @en
version info: stabile
version info: stable @en
iccd norm tag: ICCD Normativa F 4.00 e OAC: TU/CPR/CPRN

ha luogo di creazione
type: ObjectProperty
sub property of: ha opera collegata
inverse of: è luogo di realizzazione di
domain: CulturalEntity
range: CulturalEntity
comment: Questa proprietà collega un bene culturale a un altro bene culturale collegato, che ne costituisce la sede di produzione/realizzazione.
comment: This property relates a cultural entity to a connected cultural entity which constitutes its production site. @en
label: has creation location @en
label: è stato realizzato in
version info: stabile
version info: stable @en
iccd norm tag: ICCD Normativa Trasversale 4.00: RV/RSE/RSER = 'è stato realizzato in' (versioni precedenti: 'sede di realizzazione')

ha area geografico-culturale
type: ObjectProperty
inverse of: è area geografico-culturale di
domain: Uso
range: Feature
comment: Questa proprietà collega l'uso del bene con la sua area geografico-culturale.
comment: This property relates a cultural entity's use to its cultural geographical area. @en
label: has cultural geographic area @en
version info: stabile
version info: stable @en

ha stima di bene culturale
type: ObjectProperty
sub property of: ha stima
inverse of: è stima del bene culturale
domain: CulturalEntity
range: Stima di bene culturale
comment: Questa proprietà collega un bene culturale alla stima effettuata sul bene stesso.
comment: This property relates a cultural property to the estimate of that cultural property. @en
label: has cultural property estimate @en
version info: stabile
version info: stable @en

ha fase di realizzazione
type: ObjectProperty
inverse of: è stadio del bene culturale in
domain: Rapporto con opera collegata
range: Stadio del bene culturale
comment: Questa proprietà collega il rapporto tra un bene culturale e un'altra entità collegata (opera preparatoria o opera finale) allo stadio di realizzazione del bene stesso in rapporto a questa entità.
comment: This property relates the relatioship between a cultural property and a related work (preparatory or final work) to the stage of the cultural property referring to this related work. @en
label: has cultural property stage @en
version info: stabile
version info: stable @en
iccd norm tag: ICCD Normative RA, SMO, PST, S, OAC, OA, MI, D, NU, F: RO/ROF/ROFF

ha ambito culturale
type: ObjectProperty
sub property of: hasTopic
inverse of: è ambito culturale di
domain: Attribuzione di Ambito Culturale
range: Ambito culturale
comment: Questa proprietà collega una situazione in cui viene attribuito un ambito culturale di un bene culturale all'ambito culturale stesso.
comment: This property relates a situation, where a cultural scope is attributed to a cultural entity, to the cultural scope. @en
label: has cultural scope @en
version info: stabile
version info: stable @en
iccd norm tag: ICCD Normativa Trasversale 4.00: AU/ATB

ha cronologia
type: ObjectProperty
sub property of: hasSituation
inverse of: è cronologia di
domain: Thing
range: Cronologia
comment: Questa proprietà collega un'entità alla sua cronologia.
comment: This property relates an entity to its dating. @en
label: has dating @en
version info: stabile
version info: stable @en
iccd norm tag: ICCD Normativa Trasversale 4.00: DT - ICCD Normative F, RA, SMO, PST, S, OAC, OA, MI, D, NU: RO/ROF

ha evento relativo a datazione
type: ObjectProperty
inverse of: è evento relativo alla datazione di
domain: Cronologia
range: EventOrSituation
comment: Questa proprietà collega una cronologia a un evento relativo al bene culturale, cui si riferisce la specifica cronologia.
comment: This property relates a dating to an event involving the cultural property, which the dating is about. @en
label: has event related to dating @en
version info: stabile
version info: stable @en
iccd norm tag: DTN/DTNS; se non c'è, Event = "realizzazione"

ha raffigurazione
type: ObjectProperty
comment: Questa proprietà collega un'entità alla sua raffigurazione
comment: This property relates an entity to its depiction. @en
label: has depiction @en
version info: instabile
version info: unstable @en

ha tipo di opera derivata
type: ObjectProperty
sub property of: hasType
inverse of: è tipo di opera derivata di
domain: Opera derivata
range: Tipo di opera derivata
comment: Questa proprietà collega un'opera derivata da un bene culturale al tipo di opera derivata.
comment: This property relates a work derivated from a cultural entity to its type. @en
label: has derivated work type @en
version info: stabile
version info: stable @en
iccd norm tag: ICCD Normativa F: RO/CRF/CRFT - Normativa S: RO/ADL/ADLL - Normative RA, SMO, PST, S, OA, MI, D, NU: RO/REI/REIT - Normative CA, MA: RO/RIU/RIUT

ha metodo di individuazione
type: ObjectProperty
sub property of: hasMethod
inverse of: è metodo di individuazione di
domain: CulturalEntity
range: Metodo di individuazione
comment: Questa proprietà collega un bene culturale alla modalità di individuazione che ne ha permesso l'individuazione.
comment: This property relates a cultural property to the detection method that allowed the detection of the cultural property. @en
label: has detection method @en
version info: stabile
version info: stable @en
iccd norm tag: ICCD Normativa Trasversale 4.00: OG/OGM

ha documentazione
type: ObjectProperty
inverse of: è documentazione di
domain: Thing
range: Documentazione
comment: Questa proprietà collega un bene culturale alla documentazione che riguarda il bene descritto in una scheda di catalogo.
comment: This property relates a cultural entity to the documentation related to the cutultural entity described in a catalogue record. @en
label: has documentation @en
version info: stabile
version info: stable @en
iccd norm tag: ICCD Normativa Trasversale 4.00: tutti i campi strutturati di DO tranne BIB

ha tipo di documentazione
type: ObjectProperty
sub property of: hasType
inverse of: è tipo di documentazione di
domain: Documentazione
range: Tipo di documentazione
comment: Questa proprietà collega una documentazione al tipo di documentazione.
comment: This property relates a documentation to its type. @en
label: has documentation type @en
version info: stabile
version info: stable @en
iccd norm tag: FTAP, DRAT, FNTP (+VDCP, REGP), ADMP (v. 3.00 e 3.01)

ha edizione
type: ObjectProperty
inverse of: è edizione di
domain: Thing
range: Edizione
comment: Questa proprietà collega un'entità a una sua edizione.
comment: This property relates an entity to its edition. @en
label: has edition @en
version info: stabile
version info: stable @en
iccd norm tag: ICCD Normative VeAC e AT 3.01: DO/BSE/BSEN - Normativa S 3.00: RO/ADL/ADLE.

ha editore
type: ObjectProperty
sub property of: ha agente correlato
inverse of: è editore di
domain: Edizione
range: Agent
comment: Questa proprietà collega un'edizione all'editore.
comment: This property relates an edition to its editor. @en
label: has editor @en
version info: stabile
version info: stable @en

ha intervento ammesso
type: ObjectProperty
inverse of: è intervento ammesso da
domain: Strumento urbanistico-territoriale
range: Intervento ammesso
comment: Questa proprietà collega uno strumento urbanistico-territoriale all'intervento ammesso dalla normativa specifica (es.: restauro/ manutenzione straordinaria).
comment: This property relates a urban planning instrument to the eligible intervention (e.g.: conservation intervention/ exceptional maintenance). @en
label: has eligible intervention @en
version info: stabile
version info: stable @en
iccd norm tag: ICCD Normativa Trasversale 4.00: TU/STU/STUN

ha stima
type: ObjectProperty
sub property of: hasSituation
inverse of: è stima di
domain: Thing
range: Stima
comment: Questa proprietà collega un'entità a una sua stima.
comment: This property relates an entity to its estimate. @en
label: has estimate @en
version info: stabile
version info: stable @en
iccd norm tag: ICCD Normativa Trasversale 4.00: UB/STI - ICCD Normative di versione 2.00: UB/INV/INVS

ha certificazione di esportazione/importazione
type: ObjectProperty
inverse of: è certificato di importazione/esportazione di
domain: CulturalEntity
range: Certificazione di importazione o esportazione
comment: Questa proprietà collega un bene culturale a una certificazione amministrativa per la circolazione e l'esportazione/importazione che riguarda il bene stesso.
comment: This property relates a cultural entity to its import-export certification. @en
label: has export/import certification @en
version info: stabile
version info: stable @en
iccd norm tag: ICCD Normativa Trasversale 4.00: TU/ESP

has export import certification type
type: ObjectProperty
sub property of: hasType
inverse of: è tipo di certificazione di esportazione o importazione di
domain: Certificazione di importazione o esportazione
range: Tipo di certificazione di esportazione o importazione
comment: Questa proprietà collega una certificazione amministrativa di circolazione ed esportazione/importazione di un bene culturale alla sua tipologia (es.: attestato di libera circolazione, licenza di esportazione definitiva, ecc).
comment: This property relates a import-export certification of a cultural entity to its type (i.e. delivery confirmation certification, free movement certification etc). @en
comment: ha tipo di certificazione di esportazione o importazione
version info: stabile
version info: stable @en
iccd norm tag: ICCD Normativa Trasversale 4.00: TU/ESP/ESPT

ha ufficio esportazione
type: ObjectProperty
sub property of: ha agente correlato
inverse of: è ufficio esportazione di
domain: Certificazione di importazione o esportazione
range: Agent
comment: Questa proprietà collega una certificazione di importazione/esportazione al'Ufficio Esportazione che ha emesso la certificazione.
comment: This property relates an export/import certification to the certifying Export Department. @en
label: has export office @en
version info: stabile
version info: stable @en
iccd norm tag: ICCD Normativa Trasversale 4.00: TU/ESP/ESPU

ha contesto di rinvenimento
type: ObjectProperty
sub property of: hasSituation
inverse of: è contesto di rinvenimento di
domain: CulturalEntity
range: Contesto di rinvenimento
comment: Questa proprietà collega un bene culturale, in particolare un reperto antropologico, al suo contesto di rinvenimento.
comment: This property relates a cultural property, and in particular an anthropological material, to its finding context. @en
label: has finding context @en
version info: stabile
version info: stable @en
iccd norm tag: ICCD Normativa AT 3.01: OG/OGC

ha tipo di contesto di rinvenimento
type: ObjectProperty
sub property of: hasType
inverse of: è tipo di contesto di rinvenimento di
domain: Contesto di rinvenimento
range: Tipo di contesto di rinvenimento
comment: Questa proprietà collega il contesto di rinvenimento di un bene culturale, e in particolare di un reperto antropologico, al tipo di contesto.
comment: This property relates a cultural property (anthropological material) finding context to the type of context. @en
label: has finding context type @en
version info: stabile
version info: stable @en
iccd norm tag: ICCD Normativa AT 3.01: OG/OGC/OGCT

ha sede di rinvenimento
type: ObjectProperty
sub property of: ha opera collegata
inverse of: è luogo di ritrovamento di
domain: CulturalEntity
range: CulturalEntity
comment: Questa proprietà collega un bene culturale a un altro bene culturale collegato, che ne costituisce la sede di rinvenimento archeologico.
comment: This property relates a cultural entity to a connected cultural entity which constitutes the site where it was rediscovered. @en
label: has finding location @en
label: è stato rinvenuto in
version info: stabile
version info: stable @en
iccd norm tag: ICCD Normativa Trasversale 4.00: RV/RSE/RSER = 'è stato rinvenuto in' (versioni precedenti: 'sede di rinvenimento')

ha formato
type: ObjectProperty
sub property of: hasDescription
inverse of: è formato di
domain: Documentazione
range: Formato
comment: Questa proprietà collega la documentazione con il suo formato.
comment: This property relates the documentation to its format. @en
label: has format @en
version info: stabile
version info: stable @en
iccd norm tag: ICCD Normativa Trasversale: DO/FTA/FTAF, DO/DRA/DRAF, DO/DNT/FNTR

ha fruizione
type: ObjectProperty
sub property of: hasSituation
inverse of: è fruizione di
domain: CulturalEntity
range: Fruizione
comment: Questa proprietà collega un vestimento antico o contemporaneo a un'occasione in cui è stato indossato da una o più persone.
comment: This property relates garment to the context in which it has been worn. @en
label: has fruition @en
version info: stabile
version info: stable @en
iccd norm tag: Normativa VeAC: AU/FRU

ha genere
type: ObjectProperty
sub property of: hasConcept
inverse of: è genere in
type: FunctionalProperty
comment: Questa proprietà collega una tassonomia linneana al genere, che è uno dei concetti della tassonomia.
comment: This property relates a linnaean taxon to the genus, that is one of the concept of the taxon. @en
label: has genus @en
deprecated: true
version info: stabile
version info: stable @en
iccd norm tag: ICCD Normativa AT: OG/OGS/OGSG. - Normativa BNB: RB/RBN/RBNA; SB/NAA/NAAA; SB/NAT/NATA

ha criterio interpretativo
type: ObjectProperty
sub property of: hasDescription
inverse of: è criterio interpretativo di
domain: Thing
range: Criterio interpretativo
comment: Questa proprietà associa una attribuzione di autore/responsabilità, una cronologia, una committenza, o altre situazioni che prevedono una interpretazione, alla motivazione o criterio che hanno determinato quella interpretazione.
comment: This property relates an authorship, dating, commission, or other interpretation situations, to the reason or criterion which led to that interpretation. @en
label: has interpretation criterion @en
version info: stabile
version info: stable @en
iccd norm tag: ICCD Normativa Trasversale 4.00: AU/AUT/AUTM; AU/CMM/CMMF; AU/AAT/AATM; AU/ATB/ATBM; DT/DTM/DTMM; SG/SGT/SGTL - ICCD Normativa F: PD/PDF/PDFM - ICCD Normativa VeAC: AU/FRU/FRUF - CCD Normative F, RA, SMO, PST, S, OAC, OA, MI, D, NU: RO/ROF/ROFM

ha intervento
type: ObjectProperty
sub property of: isMemberOf
inverse of: è intervento su
domain: CulturalEntity
range: Intervento
comment: Questa proprietà collega un bene culturale con un intervento, a fini conservativi o di altro tipo, che lo ha interessato.
comment: This property relates a cultural entity to a intervention on it, for conservational or other purposes. @en
label: has intervention @en
version info: stabile
version info: stable @en
iccd norm tag: ICCD Normativa Trasversale 4.00: CO/RST; normative di versioni precedenti: RS/RST - Normativa VeAC: CO/RIA - Normativa CA: RO/RIS

ha ruolo nell'intervento
type: ObjectProperty
inverse of: è ruolo nell'intervento
domain: Attribuzione di Autore o responsabilità
range: Role
comment: Questa proprietà associa un'attribuzione di autore/responsabilità al ruolo rivestito dall'autore o dall'ambito culturale.
comment: This property relates an authorship attribution to the agent's role. @en
label: has intervention role @en
version info: stabile
version info: stable @en
iccd norm tag: AU/ATB/ATBR; AU/AUT/AUTR

ha tipo di intervento
type: ObjectProperty
sub property of: hasType
inverse of: è tipo di intervento di
domain: Intervento
range: Tipo di intervento
comment: Questa proprietà collega un intervento, a fini conservativi o di altro tipo, che ha interessato un bene culturale al tipo di intervento.
comment: This property relates an intervention on a cultural property (i.e. conservation, interventions, reprocessing, restoring, etc.) to its intervention type. @en
label: has intervention type @en
version info: stabile
version info: stable @en
iccd norm tag: ICCD Normativa Trasversale 4.00: valori di CO/RST/RSTI Normativa VeAC: CO/RIA (riadattamento/modifica) Normativa CA: RO/RIS (intervento successivo)

ha inventario
type: ObjectProperty
inverse of: è inventario di
domain: Thing
range: Inventario
comment: Questa proprietà collega un bene culturale o una delle entità o attività collegate al bene culturale a un inventario che registra informazioni relative al bene culturale.
comment: This property relates a cultural property or an entity or an activity related to it to an inventory. @en
label: has inventory @en
version info: stabile
version info: stable @en
iccd norm tag: UB/INV; ICCD Normativa Trasversale: UB/INP

ha responsabile di numero di inventario
type: ObjectProperty
sub property of: ha agente correlato
inverse of: è responsabile di numero di inventario di
domain: Inventario
range: Agent
comment: Questa proprietà collega un inventario al contenitore giuridico che conserva attualmente il bene o che lo ha conservato in passato, e che è responsabile dell'assegnazione del numero di inventario.
comment: This property relates an inventory to the juridical container responsible for the inventory identifier of the cultural property. @en
label: has inventory identifier responsible @en
version info: stabile
version info: stable @en
iccd norm tag: ICCD Normativa Trasversale: UB/INV/INVG

ha soggetto emittente
type: ObjectProperty
sub property of: ha agente correlato
inverse of: è emittente in
domain: Emissione di moneta
range: Agent
comment: Questa proprietà collega l'emissione della moneta al soggetto emittente. Questa proprietà, esprimendo il significato della relazione nel nome, dà una rappresentazione semplificata della relazione che lega questa entità e l'agente; la stessa relazione è rappresentata attraverso una n-ary relation, arco-core:AgentRole, che permette di collegare l'agente al ruolo che riveste nei confronti dell'entità.
comment: This property relates to coin's issuance to the issuer agent. In the ontology this relationship is modelled also by the class AgentRole which allows more expressiveness. @en
label: has issuer @en
version info: stabile
version info: stable @en
iccd norm tag: ICCD Normativa NU: DA/AUE/AUEE - ICCD Normativa OA (dopo il rilascio della specifica scheda NU nel 2004 la scheda OA non è stata più utilizzata per la catalogazione di monete e medaglie): AU/EDT/EDTN

ha ente che ha emanato il provvedimento
type: ObjectProperty
sub property of: ha agente correlato
inverse of: è ente che ha emanato il provvedimento
domain: Strumento urbanistico-territoriale
range: Agent
comment: Questa proprietà collega uno strumento urbanistico-territoriale con l'ente o l'amministrazione che ha emanato il provvedimento.
comment: This property relates an urban-planning instrument to the institution which issued the provision. @en
label: has issuing agency @en
version info: stabile
version info: stable @en
iccd norm tag: TU/STU/STUE

ha Stato emittente
type: ObjectProperty
sub property of: ha agente correlato
inverse of: è stato emittente in
domain: Emissione di moneta
range: Agent
comment: Questa proprietà collega l'emissione della moneta alla realtà statuale emittente, coeva all'emissione della moneta. Questa proprietà, esprimendo il significato della relazione nel nome, dà una rappresentazione semplificata della relazione che lega questa entità e l'agente; la stessa relazione è rappresentata attraverso una n-ary relation, arco-core:AgentRole, che permette di collegare l'agente al ruolo che riveste nei confronti dell'entità.
comment: This property relates the coin issuance to the issuing State of that historic period. In the ontology this relationship is modelled also by the class AgentRole which allows more expressiveness. @en
label: has issuing State @en
version info: stabile
version info: stable @en
iccd norm tag: ICCD Normativa NU: DA/AUE/AUES - ICCD Normativa OA (dopo il rilascio della specifica scheda NU nel 2004 la scheda OA non è stata più utilizzata per la catalogazione di monete e medaglie): AU/EDT/EDTA

ha tipo di analisi di laboratorio
type: ObjectProperty
sub property of: hasType
inverse of: è tipo di analisi di laboratorio di
domain: Analisi di laboratorio
range: Tipo di analisi di laboratorio
comment: Questa proprietà collega un'analisi di laboratorio con il tipo di analisi (es.: analisi metallurgica, analisi chimica, etc.).
comment: This property relates a laboratory test to its test type (i.e. chemical or metallurgical analysis). @en
label: has laboratory test type @en
version info: stabile
version info: stable @en
iccd norm tag: ICCD Normative NU, RA, BNB, MA, CA: RS/ALB/ALBT

ha condizione giuridica
type: ObjectProperty
sub property of: hasSituation
inverse of: è condizione giuridica di
domain: Thing
range: Situazione giuridica
comment: Questa proprietà collega un'entità, per esempio un bene culturale, alla sua condizione giuridica.
comment: This property relates an entity, for example a cultural entity, to its legal situation. @en
label: has legal situation @en
version info: stabile
version info: stable @en
iccd norm tag: ICCD Normativa Trasversale 4.00: TU/CDG

ha membro di unità archivistica complessa
type: ObjectProperty
inverse of: è membro di un'unità archivistica complessa di
domain: Appartenenza a unità archivistica complessa
range: CulturalEntity
comment: Questa proprietà, inversa a "è membro di unità archivistica complessa", collega l'appartenenza di un bene culturale a un'unità archivistica al bene coinvolto nella relazione.
comment: This property relates the membership of a cultural entity to an archival record set. It is the inverse property of "isMemberofArchivalRecordSet". @en
label: has member of archival record set @en
version info: stabile
version info: stable @en
iccd norm tag: ICCD Normativa F: UB/UBF

ha membro di collezione
type: ObjectProperty
inverse of: è membro di collezione di
domain: Appartenenza a Collezione
range: CulturalEntity
comment: Questa proprietà, inversa a "è membro di collezione", collega l'appartenenza di un bene culturale a una collezione in un certo intervallo di tempo al bene culturale mobile coinvolto nella relazione.
comment: This property relates the membership of a movable cultural entity to a collection in a time interval. It is the inverse property of "isMemberofCollection". @en
label: has member of collection @en
version info: stabile
version info: stable @en
iccd norm tag: UB/COL

ha membro di serie fotografica
type: ObjectProperty
inverse of: è membro di serie fotografica in
domain: Appartenenza a serie fotografica
range: CulturalEntity
comment: Questa proprietà, inversa a "è membro di serie", collega l'appartenenza di un bene fotografico a una serie editoriale al bene fotografico coinvolto nella relazione.
comment: This property relates the membership of a cultural entity (e.g. photographic heritage) to its photographic series. It is the inverse property of "isMemberPhotographicSeries". @en
label: has member of photographic series @en
version info: stabile
version info: stable @en
iccd norm tag: ICCD Normativa F: PD/SFI; PD/SSI

ha zecca
type: ObjectProperty
sub property of: ha agente correlato
inverse of: è zecca in
domain: Emissione di moneta
range: Agent
comment: Questa proprietà collega l'emissione della moneta alla Zecca. Questa proprietà, esprimendo il significato della relazione nel nome, dà una rappresentazione semplificata della relazione che lega questa entità e l'agente; la stessa relazione è rappresentata attraverso una n-ary relation, arco-core:AgentRole, che permette di collegare l'agente al ruolo che riveste nei confronti dell'entità.
comment: This property relates the coin issuance to the Mint. In the ontology this relationship is modelled also by the class AgentRole which allows more expressiveness. @en
label: has mint @en
version info: stabile
version info: stable @en
iccd norm tag: ICCD Normativa NU: DA/ZEC - ICCD Normativa OA (dopo il rilascio della specifica scheda NU nel 2004 la scheda OA non è stata più utilizzata per la catalogazione di monete e medaglie): AU/EDT/EDTZ

ha zecchiere
type: ObjectProperty
sub property of: ha agente correlato
inverse of: è zecchiere in
domain: Emissione di moneta
range: Agent
comment: Questa proprietà collega l'emissione della moneta allo zecchiere, monetiere, maestro di zecca. Questa proprietà, esprimendo il significato della relazione nel nome, dà una rappresentazione semplificata della relazione che lega questa entità e l'agente; la stessa relazione è rappresentata attraverso una n-ary relation, arco-core:AgentRole, che permette di collegare l'agente al ruolo che riveste nei confronti dell'entità.
comment: This property relates the coin issuance to the minter. In the ontology this relationship is modelled also by the class AgentRole which allows more expressiveness. @en
label: has minter @en
version info: stabile
version info: stable @en
iccd norm tag: ICCD Normativa NU: DA/AUE/AUEZ

ha organico musicale
type: ObjectProperty
sub property of: ha agente correlato
inverse of: è organico musicale di
domain: CulturalEntity
range: Agent
comment: Questa proprietà collega uno strumento musicale al gruppo di musicisti (bande, complessi musicali, associazioni corali, ecc.) in cui lo strumento assume, o ha assunto, abitualmente un ruolo esecutivo. Questa relazione è modellata anche, con maggiore potere espressivo, tramite il pattern AgentRole, che collega lo strumento musicale a una situazione in cui un agente ha rivestito un ruolo (in questo caso, organico musicale).
comment: This property relates an musical instrument to the musical ensamble where the instument is (or were) played. In the ontology this relationship is modelled also by the class AgentRole which allows more expressiveness. @en
label: has musical ensemble @en
version info: stabile
version info: stable @en
iccd norm tag: ICCD Normativa SM 4.00: OS/OSD

ha musicista
type: ObjectProperty
sub property of: ha agente correlato
inverse of: è musicista di
domain: CulturalEntity
range: Agent
comment: Questa proprietà collega uno strumento musicale a una persona che assume - o ha assunto - un ruolo certo come esecutore dello strumento. Questa relazione è modellata anche, con maggiore potere espressivo, tramite il pattern AgentRole, che collega lo strumento musicale a una situazione in cui un agente ha rivestito un ruolo (in questo caso, chitarrista, flautista, pianista, ecc., o genericamente musicista).
comment: This property relates a musical instrument to the person who plays (in the present or past) a certain role as the instrument's exectutor. In the ontology this relationship is modelled also by the class AgentRole which allows more expressiveness. @en
label: has musician @en
version info: stabile
version info: stable @en
iccd norm tag: ICCD Normativa SM 4.00: MU/MUTN

ha tipo di indagine di rilevamento
type: ObjectProperty
sub property of: hasType
inverse of: è tipo di indagine di rilevamento di
domain: Indagine di rilevamento
range: Tipo di indagine di rilevamento
comment: Questa proprietà collega un'indagine di rilevamento al tipo di indagine di rilevamento (nel contesto/decontestualizzato).
comment: This property relates an observation survey to the type of observation survey (in the context, out of context). @en
label: has observation survey type @en
version info: stabile
version info: stable @en
iccd norm tag: ICCD Normativa BDI 4.00: LA/PRM

ha proprietario
type: ObjectProperty
sub property of: ha agente correlato
inverse of: è proprietario in
domain: Situazione giuridica
range: Agent
comment: Questa proprietà collega una condizione giuridica al proprietario dell'oggetto che si trova in quella condizione.
comment: This property relates a legal situation to the owner of the object that is in that legal situation. @en
label: has owner @en
version info: stabile
version info: stable @en
iccd norm tag: ICCD Normativa Trasversale 4.00: TU/CDG/CDGS

ha serie fotografica
type: ObjectProperty
inverse of: è serie fotografica in
domain: Appartenenza a serie fotografica
range: Serie fotografica
comment: Questa proprietà, inversa a "è serie in", collega il rapporto tra una serie e un bene fotografico che ne fa parte alla serie stessa.
comment: This property relates a photographic series a the cultural entity which belongs to it. @en
label: has photographic series @en
version info: stabile
version info: stable @en
iccd norm tag: ICCD Normativa Trasversale: PD/SFI; PD/SSI

ha relazione urbanistico-ambientale con
type: ObjectProperty
sub property of: ha opera collegata
sub property of: è opera collegata a
type: SymmetricProperty
domain: CulturalEntity
range: CulturalEntity
comment: Questa proprietà collega un bene culturale a un altro bene culturale collegato, con cui è in relazione urbanistico-ambientale.
comment: This property relates a cultural entity to another cultural entity, in an planning environmental relation. @en
label: has planning environmental relation with @en
version info: stabile
version info: stable @en
iccd norm tag: ICCD Normativa Trasversale 4.00: RV/RSE/RSER = 'è in relazione urbanistico - ambientale con' (versioni precedenti: 'relazione urbanistico ambientale')

era contenuto in
type: ObjectProperty
sub property of: ha opera collegata
inverse of: è sede di provenienza di
domain: CulturalEntity
range: CulturalEntity
comment: Questa proprietà collega un bene culturale a un altro bene culturale collegato, che ne costituisce la sede di provenienza, prima della sua attuale collocazione.
comment: This property relates a cultural entity to a connected cultural entity which constitutes its provenance location before its current position. @en
label: ha sede di provenienza
label: has previous location @en
version info: stabile
version info: stable @en
iccd norm tag: ICCD Normativa Trasversale 4.00: RV/RSE/RSER = 'era contenuto in' (versioni precedenti: 'sede di provenienza')

ha soggetto fonte dell'acquisizione
type: ObjectProperty
sub property of: ha agente correlato
inverse of: è soggetto fonte dell'acquisizione di
domain: Acquisizione
range: Agent
comment: Questa proprietà collega un evento di acquisizione di un bene culturale al soggetto fonte dell'acquisizione.
comment: This property relates the event of a cultural entity's acquisition to the agent which is the source of the acquisition. @en
label: has previous owner @en
version info: stabile
version info: stable @en
iccd norm tag: ICCD Normativa Trasversale 4.00: TU/ACQ/ACQN

ha documentazione primaria
type: ObjectProperty
sub property of: ha documentazione
inverse of: è documentazione primaria di
domain: CulturalEntity
range: Documentazione
comment: Questa proprietà collega un bene demoetnoantropologico immateriale alla sua documentazione primaria, ovvero la documentazione che restituisce il bene immateriale e ritenuta più rappresentativa.
comment: This property relates an intangible demoethnoanthropological property to its primary documentation, that is the documentation more representative of the intangible heritage. @en
label: has primary documentation @en
version info: stabile
version info: stable @en
iccd norm tag: ICCD Normativa BDI 4.00: DU, DV, DF

ha professione
type: ObjectProperty
inverse of: è professione di
domain: Agent
range: Professione
comment: Questa proprietà collega un agente al suo mestiere o professione, per esempio l'utente del bene oppure il responsabile della fabbricazione di un bene con il suo mestiere o la sua professione.
comment: This property relates an agent to its job. For example the agent responsible of the production of a cultual entity. @en
label: has profession @en
version info: stabile
version info: stable @en
iccd norm tag: ICCD Normativa BDM 2.00: UT/UTN/UTNM - ICCD Normativa BDM 4.00: AU/AUT/AUTE

ha ente proponente
type: ObjectProperty
sub property of: ha agente correlato
inverse of: è ente proponente di
domain: Class
  union of: CulturalEntity
  union of: Provvedimento di tutela
range: Agent
comment: Questa proprietà collega un'entità, che può essere direttamente il bene culturale o specificamente il provvedimento di tutela relativo al bene culturale, all'ente proponente, ovvero al soggetto che ha proposto il provvedimento, identificato per mezzo della denominazione per esteso oppure, nel caso di Enti accreditati dall'ICCD, del relativo codice assegnato dall'Istituto. La relazione tra il ruolo e l'agente che lo riveste è espressa, in maniera generica, nel nome della proprietà, che quindi ne fornisce una rappresentazione semplificata, con ridotta espressività. Nell'ontologia questa relazione è modellata anche, in maniera più espressiva, dalla classe AgentRole, che permette di collegare l'agente e il suo ruolo.
comment: This property relates an entity (e.g a cultural entity or a cultual entity's protective measure) to the proposing institution. In the ontology this relationship is modelled also by the class AgentRole which allows more expressiveness. @en
label: has proponet agency @en
version info: stabile
version info: stable @en
iccd norm tag: ICCD Normativa Trasversale 4.00: TU/NVC/NVCA; Versioni precedenti: CD/EPR

ha provvedimento di tutela
type: ObjectProperty
inverse of: è provvedimento di tutela di
domain: CulturalEntity
range: Provvedimento di tutela
comment: Questa proprietà collega un bene culturale a un provvedimento di tutela nazionale o internazionale che lo ha interessato.
label: has protective measure @en
version info: stabile
version info: stable @en
iccd norm tag: ICCD Normativa Trasversale 4.00: TU/NVC

ha repertorio
type: ObjectProperty
inverse of: è repertorio di riferimento di
domain: Copia
range: Repertorio
comment: Questa proprietà collega la copia della stampa con il suo repertorio.
comment: This property relates a print's copy to its reference catalogue. @en
label: has reference catalogue @en
version info: stabile
version info: stable @en
iccd norm tag: ICCD Normativa S 3: RO/COP/COPR

ha agente correlato
type: ObjectProperty
inverse of: è agente correlato a
domain: Thing
range: Agent
property chain axiom: hasAgentRole
property chain axiom: hasAgent
comment: Questa proprietà collega un'entità di qualsiasi tipo a un agente che è collegato in qualche modo a quell'entità. È una relazione generica che viene usata per quei casi in cui non sia possibile definire in maniera più precisa la natura della relazione.
comment: This property is used to associate an entity of any kind to an agent related to that entity in some way. It is used when it is not possible to express the relation in a more specific way. @en
label: has related agent @en
version info: stabile
version info: stable @en
iccd norm tag: ICCD Normativa Trasversale: AU/NMC

ha opera collegata
type: ObjectProperty
inverse of: è opera collegata a
domain: CulturalEntity
range: CulturalEntity
comment: Questa proprietà collega un bene culturale a un'altra opera collegata (es.: copia, fase preparatoria, etc.), che può essere essa stessa un bene culturale.
comment: This property relates a cultural property to a related work (e.g. copy, preparatory work). @en
label: has related work @en
version info: stabile
version info: stable @en

ha rapporto con opera collegata
type: ObjectProperty
sub property of: hasSituation
inverse of: è rapporto con opera collegata di
domain: CulturalEntity
range: Rapporto con opera collegata
comment: Questa proprietà collega un bene culturale alla relazione tra il bene stesso e un'altra opera che ne costituisce una fase preparatoria o che ne rappresenta la fase finale, e in riferimento alla quale il bene culturale si trova in un determinato stadio.
comment: This property relates a cultural property to a situation in which this cultural property is related to another work, that could even be another cultural property, as its preparatory or final phase. @en
label: has related work situation @en
version info: stabile
version info: stable @en

ha affidabilità
type: ObjectProperty
sub property of: hasCharacteristic
inverse of: è affidabilità di
domain: Fotointerpretazione e fotorestituzione
range: Affidabilità
comment: Questa proprietà collega una fotointerpretazione o fotorestituzione al livello di affidabilità delle informazioni rilevate nell'indagine.
comment: This property relates a photo interpretation rendering survey to the reliability of the information collected during the survey. @en
label: has reliability @en
version info: stabile
version info: stable @en
iccd norm tag: ICCD Normativa Trasversale 4.00: RE/FOI/FOIO

ha riproduzione
type: ObjectProperty
inverse of: è riproduzione di
domain: Stampa in pubblicazione
range: Riproduzione
comment: Questa proprietà collega la pubblicazione con la riproduzione della stampa che ne è, o è stata, parte integrante.
comment: This property relates a publication to the print reproduction which is or was part of it. @en
label: has reproduction @en
version info: stabile
version info: stable @en
iccd norm tag: ICCD Normativa S 3: RO/ADL

ha posizione della riproduzione
type: ObjectProperty
inverse of: è posizione della riproduzione di
domain: Riproduzione
range: Posizione della riproduzione
comment: Questa proprietà collega la riproduzione di una stampa all'interno di una pubblicazione con la posizione fisica nella pubblicazione stessa (es.: frontespizio, copertina, colophon, etc.).
comment: This property relates the print reproduction in a publication to the position in the publication. @en
label: has reproduction position @en
version info: stabile
version info: stable @en
iccd norm tag: ICCD Normativa S 3: RO/ADL/ADLP

ha ricerca
type: ObjectProperty
inverse of: è ricerca su
domain: CulturalEntity
range: Ricerca
comment: Questa proprietà collega un bene culturale alla ricerca nell'ambito della quale è stata redatta la scheda.
comment: This property relates a culural entity to the research, which is the context where the enity's cataloguing record has been produced. @en
label: has research @en
version info: stabile
version info: stable @en
iccd norm tag: ICCD Normativa SM e BDM 4.00: DR/DRT

ha responsabile scientifico della ricerca
type: ObjectProperty
sub property of: ha agente correlato
inverse of: è responsabile scientifico della ricerca di
domain: Ricerca
range: Agent
comment: Questa proprietà collega una ricerca al responsabile scientifico della ricerca. La relazione tra il ruolo e l'agente che lo riveste è espressa nel nome della proprietà, che quindi ne fornisce una rappresentazione semplificata, con ridotta espressività. Nell'ontologia questa relazione è modellata anche, in maniera più espressiva, dalla classe AgentRole, che permette di collegare l'agente e il suo ruolo.
comment: This property relates a research to the research's scientific responsible. In the ontology this relationship is modelled also by the class AgentRole which allows more expressiveness. @en
label: has research scientific director @en
version info: stabile
version info: stable @en
iccd norm tag: ICCD Normativa SM e BDM 4.00: DR/DRR

ha responsabilità
type: ObjectProperty
inverse of: è responsibilità su
domain: CulturalEntity
range: Responsabilità
comment: Questa proprietà collega un bene fotografico (fotografia o fondo fotografico) all'individuazione di una responsabilità attribuibile a un agente relativamente ai processi di produzione e di divulgazione che caratterizzano specificamente i beni fotografici, quindi alle diverse personalità responsabili, a vario titolo, del ciclo produttivo del bene in esame, oltre che della sua circolazione, divulgazione, commercializzazione e promozione (committenti, stampatori, ritoccatori, coloritori, editori, distributori, sponsor, curatori e responsabili di edizioni e di serie, dedicanti e dedicatari, responsabili di collezioni e di collazioni, ecc.).
comment: This property relates a photographic cultural entity (photography or photographic fond) to the responsibility attribution of an agent. The agent is in charge of the production or disclosure process which characterises photographic heritage (i.e. printers, editors, distributors, sposors, collection responsibles etc.) @en
is defined by: This property relates a photographic heritage to the the attribution of a responsibility to an agent, relating to the activities of production and dissemination of photographic heritage (e.g.: committent, editor, printer, dedicatee, etc.). @en
label: has responsibility @en
version info: stabile
version info: stable @en
iccd norm tag: ICCD Normativa F: PD/PDF

ha tipo di responsabilità
type: ObjectProperty
sub property of: hasType
inverse of: è tipo di responsabilità di
domain: Responsabilità
range: Tipo di responsabilità
comment: Questa proprietà collega una responsabilità individuata relativamente ai processi di produzione e di divulgazione che caratterizzano specificamente i beni fotografici al tipo di responsabilità (es.: stampatori, ritoccatori, coloritori, ecc.).
comment: This property relates a resposibility relative to some production or disclosure process which characterise photographic artefacts, to its responsibility type (i.e. printers, retouchers). @en
label: has responsibility type @en
version info: stabile
version info: stable @en
iccd norm tag: ICCD Normative F e FF: PD/PDF/PDFR

ha responsabile dell'immissione in patrimonio
type: ObjectProperty
sub property of: ha agente correlato
inverse of: è responsabile dell'immissione in patrimonio di
domain: Inventario Patrimoniale
range: Agent
comment: Questa proprietà, rappresentazione semplificata della relazione n-ary Agent Role, che rappresenta una situazione in cui un agente riveste un ruolo, collega un inventario patrimoniale al responsabile dell'inventariazione patrimoniale del bene.
comment: This property relates a current inventory to the agent responsible for the cultural entity's inventory. In the ontology this relationship is modelled also by the class AgentRole which allows more expressiveness. @en
label: has responsible for insertion @en
version info: stabile
version info: stable @en
iccd norm tag: ICCD Normativa Trasversale 4.00: UB/INP/INPE

ha categoria SEC
type: ObjectProperty
sub property of: hasCategory
domain: Inventario Patrimoniale
range: Categoria SEC
comment: Questa proprietà collega un inventario patrimoniale alla categoria SEC attribuita al bene.
comment: This property relates a current inventory to the patrimonial category attributed to the cultural property based on the SEC classification. @en
label: has SEC category @en
version info: stabile
version info: stable @en

ha codice SEC
type: ObjectProperty
sub property of: hasCategory
domain: Inventario Patrimoniale
range: Codice SEC
comment: Questa proprietà collega un inventario patrimoniale al codice SEC (modello 15) attribuito al bene.
comment: This property relates the current inventory to the patrimonial code of a cultural property, referring to the SEC classification 1995. @en
label: has SEC identifier @en
version info: stabile
version info: stable @en
iccd norm tag: ICCD Normativa Trasversale 4.00: UB/INP/INPS

ha scala
type: ObjectProperty
inverse of: è scala di
domain: Documentazione grafica e cartografica
range: Scala
comment: Questa proprietà collega la documentazione grafica e cartografica alla sua scala di rappresentazione.
comment: This property relates the graphic or cartographic documentation to its representation scale. @en
label: has scale @en
version info: stabile
version info: stable @en
iccd norm tag: ICCD Normativa Trasversale: DO/DRA/DRAS

ha autore secondario
type: ObjectProperty
sub property of: ha agente correlato
inverse of: è autore secondario di
domain: Thing
range: Agent
comment: Questa proprietà collega un'entità al suo autore secondario, come ad esempio l'autore di un contributo o una parte di una pubblicazione.
comment: This property relates an entity to its secondary authors. For example an author of a publication's contribution or section. @en
label: has secondary author @en
version info: stabile
version info: stable @en
iccd norm tag: ICCD Normative VeAC e AT 3.01: DO/BSE/BSER

ha sesso stimato
type: ObjectProperty
sub property of: hasSituation
inverse of: è interpretazione del sesso di
domain: CulturalEntity
range: Interpretazione del sesso
comment: Questa proprietà collega un reperto antropologico alla stima del sesso.
comment: This property relates an antropologic artifact to its sex estimate. @en
label: has sex interpretation @en
version info: stabile
version info: stable @en
iccd norm tag: ICCD Normativa AT: DA/STS

ha specie
type: ObjectProperty
sub property of: hasConcept
inverse of: è specie in
type: FunctionalProperty
comment: Questa proprietà collega una tassonomia biologica alla specie, che è uno dei concetti della tassonomia.
comment: This property relates a linnaean taxon to the subspecies, that is one of the concept of the taxon. @en
label: has species @en
deprecated: true
version info: stabile
version info: stable @en
iccd norm tag: ICCD Normativa AT: OG/OGS/OGSN. - Normativa BNB: RB/RBN/RBNB; SB/NAA/NAAB; SB/NAT/NATB

ha unità stratigrafica
type: ObjectProperty
sub property of: hasLocation
inverse of: è unità stratigrafica di
domain: Scavo archeologico
range: Unità stratigrafica
comment: Questa proprietà collega uno scavo archeologico all'unità stratigrafica dalla quale proviene il bene rinvenuto nello scavo.
comment: This property relates an archeological excavation to the stratigraphic unit from which a cultural property has been found. @en
label: has stratigraphic unit @en
version info: stabile
version info: stable @en
iccd norm tag: ICCD Normativa Trasversale 4.00: RE/DSC/DSCU

ha soggetto
type: ObjectProperty
inverse of: è soggetto di
domain: Thing
range: Soggetto
comment: Questa proprietà collega un bene culturale, un'opera correlata a un bene culturale in quanto sua fase preparatoria o finale, o un apparato iconografico-decorativo di un bene culturale al suo soggetto o motivo ornamentale.
comment: This property relates a cultural property or a preparatory or final work of a cultural property to ist subject or ornamental motif. @en
label: has subject @en
version info: stabile
version info: stable @en
iccd norm tag: ICCD Normativa Trasversale: DA/AID/AIDI - Normativa F: SG/SGT/SGTI - Altre normative di versioni precedenti alla 4.00: OG/SGT/SGTI - ICCD Normative F, RA, SMO, PST, S, OAC, OA, MI, D, NU: RO/ROF/ROFS

ha sottospecie
type: ObjectProperty
sub property of: hasConcept
inverse of: è sottospecie in
type: FunctionalProperty
comment: Questa proprietà collega una tassonomia biologica alla sottospecie, che è uno dei concetti della tassonomia.
comment: This property relates a linnaean taxon to the subspecies, that is one of the concept of the taxon. @en
label: has subspecies @en
deprecated: true
version info: stabile
version info: stable @en
iccd norm tag: ICCD Normativa AT: OG/OGS/OGST. - Normativa BNB: RB/RBN/RBND; SB/NAA/NAAD; SB/NAT/NATD

ha indagine
type: ObjectProperty
inverse of: è indagine su
domain: CulturalEntity
range: Indagine
comment: Questa proprietà collega un bene culturale a un'indagine effettuata sul bene stesso, per la sua individuazione, per il suo studio e per l'approfondimento delle sue caratteristiche tecniche.
comment: This property relates a cultural entity's acquisition to its acquisition type. @en
label: has survey @en
version info: stabile
version info: stable @en
iccd norm tag: ICCD Normativa Trasversale 4.00: RE; CM/ISP - ICCD Normative NU, RA, BNB, MA, CA: RS/ALB - ICCD Normativa AT 3.00: IN/INI - Normativa BDM e SM 4.00: DR

ha immagine di indagine
type: ObjectProperty
inverse of: è immagine di indagine
domain: Fotointerpretazione e fotorestituzione
range: Immagine di indagine
comment: Questa proprietà collega una fotointerpretazione o fotorestituzione all'immagine presa in esame nel corso dell'indagine.
comment: This property relates a photo interpretation rendering to the survey image. @en
label: has survey image @en
version info: stabile
version info: stable @en
iccd norm tag: ICCD Normativa Trasversale 4.00: RE/FOI/FOIT + FOID

ha tipo di immagine di indagine
type: ObjectProperty
sub property of: hasType
inverse of: è tipo di immagine di indagine di
domain: Immagine di indagine
range: Tipo di immagine di indagine
comment: Questa proprietà collega una immagine di indagine al suo tipo (fotografia aerea o fotografia satellitare).
comment: This property relates a survey image to its type (i.e. aerial photograph, Satellite photograph). @en
label: has survey image type @en
version info: stabile
version info: stable @en
iccd norm tag: ICCD Normativa Trasversale 4.00: RE/FOI/FOIT

ha metodo di indagine
type: ObjectProperty
sub property of: hasMethod
inverse of: è metodo di indagine di
domain: Indagine
range: Metodo di indagine
comment: Questa proprietà collega un'indagine al metodo adottato nel corso dell'indagine.
comment: This property relates a survey to the method adopted in the survey. @en
label: has survey method @en
version info: stabile
version info: stable @en
iccd norm tag: ICCD Normativa Trasversale 4.00: RE/RCG/RCGM; RE/DSC/DSCM - ICCD Normativa AT: PT/PTC/PTCM

ha motivo di indagine
type: ObjectProperty
sub property of: hasDescription
inverse of: è motivo di indagine di
domain: Class
  union of: Scavo archeologico
  union of: Ricognizione archeologica
  union of: Indagine archeometrica e diagnostica
  union of: Fotointerpretazione e fotorestituzione
range: Motivo di indagine
comment: Questa proprietà collega uno scavo archeologico, una ricognizione archeologica, un'indagine archeometrica e diagnostica o una fotointerpretazione e fotorestituzione al motivo principale che li ha determinati.
comment: This property relates an archeological, archaeometric or diagnostic survey or a photo interpretation rendering to the the main motivation that led to it. @en
label: has survey motivation @en
version info: stabile
version info: stable @en

ha fotografo dell'indagine
type: ObjectProperty
sub property of: ha agente correlato
inverse of: è fotografo dell'indagine di
domain: Indagine di rilevamento
range: Agent
comment: Questa proprietà collega un'indagine di rilevamento di un bene demo-etno-antropologico al fotografo professionista (diverso dal rilevatore) che ha effettuato la ripresa. La relazione tra il ruolo e l'agente che lo riveste è espressa nel nome della proprietà, che quindi ne fornisce una rappresentazione semplificata, con ridotta espressività. Nell'ontologia questa relazione è modellata anche, in maniera più espressiva, dalla classe AgentRole, che permette di collegare l'agente e il suo ruolo.
comment: This property relates an observation survey of a demo-etno-antropologic entity to the professional photographer who took the shot. In the ontology this relationship is modelled also by the class AgentRole which allows more expressiveness. @en
label: has survey photographer @en
version info: stabile
version info: stable @en
iccd norm tag: ICCD Normativa BDI 3.00: DR/DRG

ha responsabile scientifico dell'indagine
type: ObjectProperty
sub property of: ha agente correlato
inverse of: è responsabile scientifico dell'indagine di
domain: Indagine
range: Agent
comment: Questa proprietà collega un'indagine al suo responsabile scientifico.
comment: This property relates a survey to its scientific director. @en
label: has survey scientific director @en
version info: stabile
version info: stable @en
iccd norm tag: ICCD Normativa Trasversale 4.00: RE/RCG/RCGA; RE/DSC/DSCA; RE/FOI/FOIS

ha fonico dell'indagine
type: ObjectProperty
sub property of: ha agente correlato
inverse of: è fonico dell'indagine di
domain: Indagine di rilevamento
range: Agent
comment: Questa proprietà collega un'indagine di rilevamento di un bene demo-etno-antropologico al fonico professionista (diverso dal rilevatore) che ha effettuato la registrazione sonora. La relazione tra il ruolo e l'agente che lo riveste è espressa nel nome della proprietà, che quindi ne fornisce una rappresentazione semplificata, con ridotta espressività. Nell'ontologia questa relazione è modellata anche, in maniera più espressiva, dalla classe AgentRole, che permette di collegare l'agente e il suo ruolo.
comment: This property relates an observation survey of a demo-etno-antropologic entity to the sound engineer who recorded it. In the ontology this relationship is modelled also by the class AgentRole which allows more expressiveness. @en
label: has survey sound engineer @en
version info: stabile
version info: stable @en
iccd norm tag: ICCD Normativa BDI 3.00: DR/DRF

ha titolo
type: ObjectProperty
inverse of: è titolo di
domain: Thing
range: Titolo
comment: Questa proprietà collega un oggetto al suo titolo. Nel caso del dominio dei beni culturali, può collegare un bene culturale o un'opera collegata al bene culturale perché sua fase finale o preparatoria (proprio, attribuito, parallelo, alternativo), oppure un'edizione al suo titolo (principale o secondario), oppure una serie fotografica al suo titolo, etc.
comment: This property relates an object to its title. @en
label: has title @en
version info: stabile
version info: stable @en
iccd norm tag: OG/SGT/SGTP; SG/SGL/SGLT; SG/SGL/SGLL; OG/SGT/SGTR; DA/AID/AIDN; SG/SGL/SGLA; DA/AID/AIDT; OG/SGT/SGTT; RO/ROF/ROFT; DO/BSE/BSET; DO/BSE/BSEC.

ha tipo di titolo
type: ObjectProperty
sub property of: hasType
inverse of: è tipo di titolo di
domain: Titolo
range: Tipo di Titolo
comment: Questa proprietà collega un titolo di un bene culturale al tipo di titolo.
comment: This property relates a cultural entity's title to its title type. @en
label: has title type @en
version info: stabile
version info: stable @en
iccd norm tag: OG/SGT/SGTP; SG/SGL/SGLT; SG/SGL/SGLL; OG/SGT/SGTR; DA/AID/AIDN; SG/SGL/SGLA; DA/AID/AIDT; OG/SGT/SGTT

ha deposizione funeraria
type: ObjectProperty
inverse of: è deposizione funeraria di
domain: Scavo archeologico
range: Deposizione funeraria
comment: Questa proprietà collega uno scavo archeologico alla deposizione funeraria individuata durante l'indagine.
comment: This property relates an archaeological excavation to the tomb detected during the survey. @en
label: has tomb @en
version info: stabile
version info: stable @en
iccd norm tag: ICCD Normativa Trasversale 4.00: RE/DSC/DSCS

ha strumento urbanistico-territoriale
type: ObjectProperty
inverse of: è strumento urbanistico-territoriale di
domain: CulturalEntity
range: Strumento urbanistico-territoriale
comment: Questa proprietà collega un bene culturale a uno strumento urbanistico-territoriale, ovvero a un piano regolatore generale e particolareggiato o a un piano paesaggistico che interessa il bene stesso.
comment: This class relates a cultural property to the related urban planning instrument. @en
label: has urban planning instrument @en
version info: stabile
version info: stable @en
iccd norm tag: ICCD Normativa Trasversale 4.00: TU/STU

ha uso
type: ObjectProperty
sub property of: hasDescription
inverse of: è uso di
domain: CulturalEntity
range: Uso
comment: Questa proprietà collega il bene culturale con il suo uso.
comment: This property relates a cultural entity to its use. @en
label: has use @en
version info: stabile
version info: stable @en
iccd norm tag: ICCD Normativa Trasversale: UT

ha funzione d'uso
type: ObjectProperty
inverse of: è funzione d'uso di
domain: Thing
range: Funzione d'uso
comment: Questa proprietà collega un'entità alla sua funzione d'uso.
comment: This property relates an entity to its use function. @en
label: has use function @en
version info: stabile
version info: stable @en
iccd norm tag: ICCD Normativa Trasversale: UT/UTU/UTUF; LC/LDC/LDCF; LA/PRC/PRCF - BDM 2.00:UT/UTF - PST 3.01: DA/UTF

ha tipo d'uso
type: ObjectProperty
sub property of: hasType
inverse of: è tipo d'uso di
domain: Uso
range: Tipo d'uso
comment: Questa proprietà collega l'uso del bene con il suo tipo (attuale, precedente, storico).
comment: This property relates a cultural entity's use to its use type. @en
label: has use type @en
version info: stabile
version info: stable @en
iccd norm tag: ICCD Normativa Trasversale: UT/UTU/UTUT

ha specifiche del tipo d'uso
type: ObjectProperty
inverse of: è specifica del tipo di uso di
domain: Uso
range: Specifiche del tipo d'uso
comment: Questa proprietà collega l'uso del bene con le specifiche relative al tipo di utilizzo.
comment: This property relates the use of a cultural property to the specification of the type of use. @en
label: has use type specification @en
version info: stabile
version info: stable @en
iccd norm tag: ICCD Normativa Trasversale: UT/UTUS

ha utente
type: ObjectProperty
sub property of: ha agente correlato
inverse of: è utente di
domain: Thing
range: Agent
comment: Questa proprietà collega un'entità a un utente, inteso come agente che ha fatto uso di quell'entità. Per esempio, può collegare un'occasione in cui un vestimento antico o contemporaneo è stato indossato da una persona al fruitore stesso, oppure un particolare uso di un bene culturale al tipo di utente coinvolto in quell'uso.
comment: This property relates an entity to the user, intended as the agent who employed the entity. @en
label: has user @en
version info: stabile
version info: stable @en
iccd norm tag: ICCD Normativa Trasversale: UT/UTU/UTUN; Normativa VeAC: AU/FRU/FRUF

ha categoria sociale dell'utente
type: ObjectProperty
sub property of: hasCategory
domain: Agent
range: Categoria sociale dell'utente
comment: Questa proprietà collega l'utente di un bene culturale con la sua categoria sociale.
comment: This property relates the user of a cultural property to its social category. @en
label: has user social category @en
version info: stabile
version info: stable @en
iccd norm tag: ICCD Normative BDM 2.00: UT/UTN/UTNC

coinvolge
type: ObjectProperty
sub property of: è opera collegata a
inverse of: è coinvolto in
domain: CulturalEntity
range: CulturalEntity
comment: Questa è la proprietà inversa di 'is involved in', che collega un bene culturale a un altro bene culturale collegato, di tipo immateriale, in cui è coinvolto.
comment: This is the inverse property of 'is involved in', which relates a cultural entity to another involved cultural entity (e.g. immaterial). @en
label: involves @en
version info: stabile
version info: stable @en

coinvolge opera collegata
type: ObjectProperty
inverse of: è opera collegata coinvolta in
domain: Rapporto con opera collegata
range: CulturalEntity
comment: Questa proprietà collega il rapporto tra un bene culturale e un'opera collegata all'opera collegata stessa (es.: un lavoro preparatorio, un prototipo, una copia, un reimpiego di tutto il bene o di una sua parte, ecc.).
comment: This property relates the situation in which a cultural property is related to another work with the related work itself (e.g.: a preparatory work, a prototype, a copy, a reuse, etc.). @en
label: involves related work @en
version info: stabile
version info: stable @en
iccd norm tag: ICCD Normative RA, SMO, PST, S, OAC, OA, MI, D, NU, CA, MA, F: RO

è acquisizione di
type: ObjectProperty
sub property of: isSituationOf
domain: Acquisizione
range: CulturalEntity
comment: Questa proprietà collega un evento di acquisizione al bene culturale coinvolto nell'acquisizione.
comment: This property relates an acquisition event to the cultural entity involved in the acquisition. @en
label: is acquisition of @en
version info: stabile
version info: stable @en
iccd norm tag: ICCD Normativa Trasversale 4.00: TU/ACQ

è tipo di acqusizione di
type: ObjectProperty
sub property of: isTypeOf
domain: Tipo di acquisizione
range: Acquisizione
comment: Questa proprietà collega il tipo di acquisizione (es.: donazione, alienazione, confisca) all'acquisizione di un bene culturale.
comment: This property relates a cultural entity's acquisition type (i.e. donation, seizure) to its acquisition. @en
label: is acquisition type of @en
version info: stabile
version info: stable @en

è operatore dell'attività
type: ObjectProperty
sub property of: è agente correlato a
domain: Agent
range: Activity
comment: Questa è la proprietà inversa di "ha operatore dell'attività".
comment: This is the inverse property of "has activity operator". @en
label: is activity operator of @en
version info: stabile
version info: stable @en

è responsabile dell'attività
type: ObjectProperty
sub property of: è agente correlato a
domain: Agent
range: Activity
comment: Questa è la proprietà inversa di "ha responsabile dell'attività".
comment: This is the inverse property of "has activity responsible". @en
label: is activity responsible of @en
version info: stabile
version info: stable @en

è responsabile dell'attività
type: ObjectProperty
sub property of: è agente correlato a
domain: Agent
range: Activity
comment: Questa è la proprietà inversa a "ha sponsor dell'attività".
comment: This is the inverse property of "has activity sponsor". @en
label: is activity responsible of @en
version info: stabile
version info: stable @en

è età della morte stimata di
type: ObjectProperty
sub property of: isSituationOf
domain: Interpretazione dell'età della morte
range: CulturalEntity
comment: This property relates the age of death interpretation of an antropologic artifact to the its antropologic artifact. @en
is defined by: Questa proprietà collega la stima della morte di un reperto antropologico al suo reperto archeologico.
label: is age of death interpretation of @en
version info: stabile
version info: stable @en

è agente correlato a
type: ObjectProperty
domain: Agent
range: Thing
comment: Questa proprietà collega un agente che è collegato in qualche modo a un'entità di qualsiasi tipo a quell'entità. È una relazione generica che viene usata per quei casi in cui non sia possibile definire in maniera più precisa la natura della relazione.
comment: This property is used to associate an agent related in some way to an entity of any kind to that entity. It is used when it is not possible to express the relation in a more specific way. @en
label: is agent related to @en
version info: stabile
version info: stable @en

è agente con responsabilità in
type: ObjectProperty
sub property of: è agente correlato a
domain: Agent
range: Responsabilità
comment: Questa è la proprietà inversa a "ha agente con responsabilità".
comment: This is the inverse property of "has agent with responsibility". @en
label: is agent with responsibility in @en
version info: stabile
version info: stable @en

è datazione alternativa di
type: ObjectProperty
sub property of: isTypeOf
domain: Tipo di datazione alternativa
range: Datazione alternativa
comment: Questa proprietà collega la tipologia di datazione alternativa con la relativa datazione.
comment: This property relates the type of an alternative dating to the related dating. @en
label: is alternative dating type @en
version info: stabile
version info: stable @en

è anomalia di
type: ObjectProperty
sub property of: isSituationOf
domain: Anomalia
range: Fotointerpretazione e fotorestituzione
comment: Questa proprietà collega un'anomalia rilevata nel corso dell'indagine tramite fotointerpretazione o fotorestituzione alla relativa indagine.
comment: This property relates an anomaly revealed by a photo interepretation rendering to the related survey. @en
label: is anomaly of @en
version info: stabile
version info: stable @en

è origine dell'anomalia di
type: ObjectProperty
sub property of: isCharacteristicOf
domain: Origine dell'anomalia
range: Anomalia
comment: Questa proprietà collega l'origine dell'anomalia (naturale, antropica, incerta) all'anomalia rilevata durante una fotointerpretazione o fotorestituzione.
comment: This property relates the origin of the anomaly (e.g. natural, unsure) to an anomaly detected during a photo interpretation or rendering survey. @en
label: is anomaly origin of @en
version info: stabile
version info: stable @en

è tipo di anomalia di
type: ObjectProperty
sub property of: isTypeOf
domain: Tipo di anomalia
range: Anomalia
comment: Questa proprietà collega il tipo di anomalia (puntuale, lineare, areale) a un'anomalia rilevata nel corso di una fotointerpretazione o fotorestituzione.
comment: This property relates the anomaly type (line, point, poligony anomaly) to an anomaly revealed by a photo interpretation rendering. @en
label: is anomaly type of @en
version info: stabile
version info: stable @en

è tipo di indagine su bene archeologico
type: ObjectProperty
sub property of: isTypeOf
domain: Tipo di indagine su bene archeologico
range: Indagine su bene archeologico
comment: Questa proprietà collega il tipo di indagine alla relativa indagine su un bene archeologico.
comment: This property relates the type of a survey to the related survey on an archaeological property. @en
label: is archaeological property survey type of @en
version info: stabile
version info: stable @en

è tipo di indagine archeometrica e diagnostica di
type: ObjectProperty
sub property of: isTypeOf
domain: Tipo di indagine archeometrica e diagnostica
range: Indagine archeometrica e diagnostica
comment: Questa proprietà collega il tipo d'indagine archeometrica e diagnostica (es.: analisi della malta, carotaggio, termografia, etc.) alla relativa indagine.
comment: This property relates the type of an arecheometric diagnostic survey (i.e. thermal imaging, coring) to the survey itself . @en
label: is archaeometric diagnostic survey type of @en
version info: stabile
version info: stable @en

è unità archivistica complessa in
type: ObjectProperty
domain: Unità archivistica complessa
range: Appartenenza a unità archivistica complessa
comment: Questa proprietà, inversa a "ha unità archivistica complessa", collega una unità archivistica complessa al rapporto tra l'unità stessa e un bene culturale che ne fa parte.
comment: This property relates an archival record set to the relationship (membership) between the set itself and a cultural property that is member of it. @en
label: is archival record set in @en
version info: stabile
version info: stable @en
iccd norm tag: ICCD Normativa F: UB/UBF

è archiviato in
type: ObjectProperty
sub property of: è agente correlato a
domain: Agent
range: Fonti e documenti
comment: Questa proprietà collega l'archivio e/o istituzione conservativa con la relativa documentazione costituita da fonti e documenti.
comment: This property relates the archive or conservative institution to the documentation made of sources and documents. @en
label: is archived in @en
version info: stabile
version info: stable @en

è autore attribuito in
type: ObjectProperty
sub property of: è agente correlato a
domain: Agent
range: Class
  union of: Attribuzione Alternativa di Autore
  union of: Attribuzione Primaria di Autore
comment: Questa è la proprietà inversa a "ha autore attribuito".
comment: This is the inverse property of "has attributed author". @en
label: is attributed author in @en
version info: stabile
version info: stable @en

è autore di
type: ObjectProperty
sub property of: è agente correlato a
domain: Agent
range: Thing
property chain axiom: è autore attribuito in
property chain axiom: è attribuzione di autore/responsabilità di
comment: Questa proprietà collega un agent a una entità di qualsiasi tipo (documentazione, bene culturale, etc.) di cui quell'agente è autore.
comment: This property relates an agent to an entity the agent is author of. @en
label: is author of @en
version info: stabile
version info: stable @en

è ente schedatore dell'authority file di
type: ObjectProperty
sub property of: è agente correlato a
domain: Agent
range: Thing
comment: Questa proprietà collega l'ente schedatore dell'authority file a un'entità descritta in una scheda di Authority File.
comment: This property relates the file's cataloguing institution to an entity described in a authority file. @en
label: is authority file cataloguing agency of @en
version info: stabile
version info: stable @en

è attribuzione di autore/responsabilità di
type: ObjectProperty
sub property of: isSituationOf
domain: Attribuzione di Autore o responsabilità
range: CulturalEntity
comment: Property that links an authorship attribution referred to a cultural entity to that cultural entity. @en
comment: Proprietà che lega un'attribuzione di autore o di responsabilità relativa a un'entità culturale all'entità culturale stessa.
label: is authorship attribution of @en
version info: stabile
version info: stable @en
iccd norm tag: ICCD Normativa Trasversale 4.00: AU/AUT; AU/ATB; AU/AAT

è bibliografia di
type: ObjectProperty
domain: Bibliografia
range: Thing
comment: Questa proprietà collega una bibliografia all'entità alla quale si riferisce.
comment: This property relates a bibliography to the entity which is referred to. @en
label: is bibliography of @en
version info: stabile
version info: stable @en
iccd norm tag: ICCD Normativa Trasversale 4.00: DO/BIB; RE/RCG/RCGS

è tipo di bibliografia di
type: ObjectProperty
sub property of: isTypeOf
domain: Tipo di bibliografia
range: Bibliografia
comment: Questa proprietà collega il tipo di riferimento bibliografico alla bibliografia.
comment: This property relates the bibliography type to its bibliography. @en
label: is bibliography type of @en
version info: stabile
version info: stable @en

è tassonomia biologica di
type: ObjectProperty
sub property of: è collezione in
range: Thing
comment: Questa proprietà collega una tassonomia con un'entità biologica.
comment: This property relates a taxon to a biological entity.
label: is biological taxon of @en
deprecated: true
version info: stabile
version info: stable @en

è mutamento di condizione materiale di
type: ObjectProperty
sub property of: isSituationOf
domain: Mutamento condizione materiale
range: CulturalEntity
comment: Questa proprietà collega un mutamento di condizione materiale a un'entità culturale.
comment: This property relates a change of availability to a cultural entity. @en
label: is change of availability of @en
version info: stabile
version info: stable @en

è tipo di mutamento condizione materiale di
type: ObjectProperty
sub property of: isTypeOf
domain: Tipo di mutamento condizione materiale
range: Mutamento condizione materiale
comment: Questa proprietà collega il tipo di evento (es.: furto, distruzione, recupero) di mutamento di condizione materiale di un bene culturale al mutamento stesso.
comment: This property relates the event type (i.e. theft, destruction, recovery) of a cultural entity change of availability to the change itself. @en
label: is change of availability type of @en
version info: stabile
version info: stable @en

è circostanza di
type: ObjectProperty
sub property of: isSituationOf
domain: Occasione
range: Thing
comment: Questa proprietà, inversa di 'ha circostanza', collega l'occasione che ha determinato una situazione (es. la committenza di un bene culturale, l'uso di un bene culturale ecc.) alla relativa situazione.
comment: This property, inverse of 'has circumstance' relates the circumstance which led to a situation (e.g. a cultural entity committment, a cultural entity use, etc.) to the related situation. @en
label: is circumstance of @en
version info: stabile
version info: stable @en

è tipo di circostanza di
type: ObjectProperty
sub property of: isTypeOf
domain: Tipo di circostanza
range: Occasione
comment: Questa proprietà collega il tipo di occasione con la relativa occasione.
comment: This property relates the type of circumstance to the related circumstance. @en
label: is circumstance type of @en
version info: stabile
version info: stable @en

è emissione di moneta
type: ObjectProperty
sub property of: isSituationOf
domain: Emissione di moneta
range: Class
  union of: CulturalEntity
  union of: Counterstamp
comment: Questa è la proprietà inversa a "ha emissione di moneta".
comment: This is the inverse property of "has coin issuance". @en
label: is coin issuance of @en
version info: stabile
version info: stable @en

è moneta membro di
type: ObjectProperty
sub property of: isMemberOf
domain: CulturalEntity
range: Serie numismatica
comment: Questa proprietà collega una moneta a una serie di monete di cui è membro.
comment: This property relates a coin to a numismatic series which is member of. @en
label: is coin member of @en
version info: stabile
version info: stable @en

è collezione in
type: ObjectProperty
domain: CollectionCulEnt
range: Appartenenza a Collezione
comment: Questa proprietà, inversa a "ha collezione", rappresenta la partecipazione di una collezione nel rapporto tra una collezione e un bene culturale che ne fa parte, in un certo intervallo di tempo.
comment: This property relates a collection to the relationship (membership) between the collection itself and a cultural property that is member of it. @en
label: is collection in @en
version info: stabile
version info: stable @en
iccd norm tag: UB/COL/COLD

è collezionista di
type: ObjectProperty
sub property of: è agente correlato a
domain: Agent
range: CollectionCulEnt
comment: Questa proprietà, inversa a "ha collezionista", collega un collezionista alla relativa collezione di beni culturali.
comment: This property relates a collector to its collection of cultural properties. @en
label: is collector of @en
version info: stabile
version info: stable @en
iccd norm tag: UB/COL/COLN

è committenza di
type: ObjectProperty
sub property of: isSituationOf
domain: Committenza
range: CulturalEntity
comment: Questa proprietà collega l'individuazione di una committenza all'entità culturale che è stata commissionata.
comment: This property relates a commission to the cultural entity that was commissioned. @en
label: is commission of @en
version info: stabile
version info: stable @en

è committente in
type: ObjectProperty
sub property of: è agente correlato a
domain: Agent
range: Committenza
comment: Questa proprietà collega una persona o istituzione committente a una situazione in cui viene indicata la committenza di un bene culturale.
comment: This property relates an agent that is committent of a cultural property to the identification of the commission of that cultural property. @en
label: is committent in @en
version info: stabile
version info: stable @en
iccd norm tag: ICCD Normativa Trasversale 4.00: AU/CMM/CMMN

è titolare dei diritti d'autore in
type: ObjectProperty
sub property of: è agente correlato a
domain: Agent
range: Diritti d'autore
comment: Questa è la proprietà inversa di "ha titolare dei diritti d'autore"
comment: This is the inverse property of "has copyright holder". @en
label: is copyright holder in @en
version info: stabile
version info: stable @en

sono diritti d'autore di
type: ObjectProperty
domain: Diritti d'autore
range: Thing
comment: Questa è la proprietà inversa di "ha diritti d'autore".
comment: This is the inverse property of "is copyright of". @en
label: is copyright of @en
version info: stabile
version info: stable @en

è luogo di realizzazione di
type: ObjectProperty
sub property of: è opera collegata a
domain: CulturalEntity
range: CulturalEntity
comment: Questa è la proprietà inversa di "ha luogo di creazione".
comment: This is the inverse property of "has creation location". @en
label: is creation location of @en
version info: stabile
version info: stable @en

è area geografico-culturale di
type: ObjectProperty
domain: Feature
range: Uso
comment: Questa proprietà collega l'area geografico-culturale con l'uso del bene presente.
comment: This property relates a cultural geographical area to the use of the cultural property which is present. @en
label: is cultural geographic area of @en
version info: stabile
version info: stable @en

è stima del bene culturale
type: ObjectProperty
sub property of: è stima di
domain: Stima di bene culturale
range: CulturalEntity
comment: Questa proprietà collega una stima di un bene culturale al bene culturale stimato.
comment: This property relates a cultural property estimate to the estimated cultural property. @en
label: is cultural property estimate of @en
version info: stabile
version info: stable @en

è stadio del bene culturale in
type: ObjectProperty
domain: Stadio del bene culturale
range: Rapporto con opera collegata
comment: Questa proprietà collega lo stadio di realizzazione del bene culturale in relazione a un'altra entità collegata (opera preparatoria o opera finale) al rapporto tra il bene culturale stesso e questa entità.
comment: This cultural property relates the stage of a cultural property referring to another entity (preparatory or final work) to this relationship between the two entities. @en
label: is cultural property stage in @en
version info: stabile
version info: stable @en
iccd norm tag: ICCD Normative RA, SMO, PST, S, OAC, OA, MI, D, NU, F: RO/ROF/ROFF

è ambito culturale di
type: ObjectProperty
sub property of: isTopicOf
domain: Ambito culturale
range: Attribuzione di Ambito Culturale
comment: Questa proprietà collega l'ambito culturale attribuito a un bene culturale alla situazione in cui è avvenuta tale attribuzione.
comment: This property relates a cultural scope of a cultural entity to the situation where this cultural scope is attributed. @en
label: is cultural scope of @en
version info: stabile
version info: stable @en

è evento relativo alla datazione di
type: ObjectProperty
domain: EventOrSituation
range: Cronologia
comment: Questa proprietà collega un evento relativo al bene culturale, cui si riferisce la specifica cronologia a una cronologia.
comment: This property relates an event involving the cultural property, which the dating is about, to a dating. @en
label: is dating event of @en
version info: stabile
version info: stable @en

è cronologia di
type: ObjectProperty
sub property of: isSituationOf
domain: Cronologia
range: Thing
comment: Questa proprietà collega una cronologia all'entità cui si riferisce.
comment: This property relates a dating to an entity. @en
label: is dating of @en
version info: stabile
version info: stable @en

è raffigurazione di
type: ObjectProperty
comment: Questa proprietà collega una raffigurazione all'entità che raffigura
comment: This property relates a depiction to the entity it depicts @en
label: is depiction of @en
version info: instabile
version info: unstable @en

è tipo di opera derivata di
type: ObjectProperty
sub property of: isTypeOf
domain: Tipo di opera derivata
range: Opera derivata
comment: Questa proprietà collega il tipo di opera derivata da un bene culturale alla relativa opera derivata.
comment: This property relates the type of a work derivated from a cultural entity to its work derivated. @en
label: is derivated work type of @en
version info: stabile
version info: stable @en

è metodo di individuazione di
type: ObjectProperty
sub property of: isMethodOf
domain: Metodo di individuazione
range: CulturalEntity
comment: Questa proprietà collega la modalità di individuazione di un bene culturale al bene culturale stesso.
comment: This property relates the detection method of a cultural property to the cultural property itself. @en
label: is detection method of @en
version info: stabile
version info: stable @en

è documentazione di
type: ObjectProperty
domain: Documentazione
range: Thing
comment: Questa proprietà collega una documentazione a un'entità che viene documentata. Per esempio, può collega una documentazione che riguarda il bene descritto in una scheda di catalogo al bene stesso.
comment: This property relates a documentation to an entity. For example, it can relates a documentation concerning a cultural property described in a catalogue record to that cultural property. @en
label: is documentation of @en
version info: stabile
version info: stable @en
iccd norm tag: ICCD Normativa Trasversale 4.00: tutti i campi strutturati di DO tranne BIB

è tipo di documentazione di
type: ObjectProperty
sub property of: isTypeOf
domain: Tipo di documentazione
range: Documentazione
comment: Questa proprietà collega il tipo di documentazione alla sua documetanzione.
comment: This property relates the type of documentation to its documentation. @en
label: is documentation type of @en
version info: stabile
version info: stable @en

è edizione di
type: ObjectProperty
domain: Edizione
range: Thing
comment: Questa proprietà collega un'edizione di un'entità all'entità stessa.
comment: This property relates an entity's edition to the entity. @en
label: is edition of @en
version info: stabile
version info: stable @en
iccd norm tag: ICCD Normative VeAC e AT 3.01: DO/BSE/BSEN - Normativa S 3.00: RO/ADL/ADLE.

è editore di
type: ObjectProperty
sub property of: è agente correlato a
domain: Agent
range: Edizione
comment: Questa è la proprietà inversa di "ha editore".
comment: This is the inverse property of "has editor". @en
label: is editor of @en
version info: stabile
version info: stable @en

è stima di
type: ObjectProperty
sub property of: isSituationOf
domain: Stima
range: Thing
comment: Questa proprietà collega una stima di un'entità all'entità stimata.
comment: This property relates an estimate of an entity to that entity. @en
label: is estimate of @en
version info: stabile
version info: stable @en

è certificato di importazione/esportazione di
type: ObjectProperty
domain: Certificazione di importazione o esportazione
range: CulturalEntity
comment: Questa proprietà collega un certificato di importazione/esportazione a un'entità culturale.
comment: This property relates an export import certification to a cultural entity. @en
label: is export import certification of @en
version info: stabile
version info: stable @en

è tipo di certificazione di esportazione o importazione di
type: ObjectProperty
sub property of: isTypeOf
domain: Tipo di certificazione di esportazione o importazione
range: Certificazione di importazione o esportazione
comment: Questa proprietà collega la tipologia (es.: attestato di libera circolazione, licenza di esportazione definitiva, ecc) di una certificazione amministrativa di circolazione ed esportazione/importazione di un bene culturale alla relativa certificazione.
comment: This property relates the type (i.e. delivery confirmation certification, free movement certification etc) of an import-export certification of a cultural entity to the rrelated certification. @en
label: is export import certification type of @en
version info: stabile
version info: stable @en

è ufficio esportazione di
type: ObjectProperty
sub property of: è agente correlato a
domain: Agent
range: Certificazione di importazione o esportazione
comment: Questa proprietà collega un ufficio di esportazione a un certificazione di esportazione/importazione.
comment: This property relates an export office to an export/import certification. @en
label: is export office of @en
version info: stabile
version info: stable @en
iccd norm tag: ICCD Normativa Trasversale 4.00: TU/ESP/ESPU

è contesto di rinvenimento di
type: ObjectProperty
sub property of: isSituationOf
domain: Contesto di rinvenimento
range: CulturalEntity
comment: Questa proprietà collega il contesto di rinvenimento di un bene culturale, in particolare un reperto antropologico, al bene culturale.
comment: This property relates the finding context of a cultural property, and in particular an anthropological material, to the related cultural property. @en
label: is finding context of @en
version info: stabile
version info: stable @en

è tipo di contesto di rinvenimento di
type: ObjectProperty
sub property of: isTypeOf
domain: Tipo di contesto di rinvenimento
range: Contesto di rinvenimento
comment: Questa proprietà collega il tipo di contesto di rinvenimento di un bene culturale, e in particolare di un reperto antropologico, al suo contesto.
comment: This property relates a type of cultural property (i.e. anthropological material) finding context to its context. @en
label: is finding context type of @en
version info: stabile
version info: stable @en

è luogo di ritrovamento di
type: ObjectProperty
sub property of: è opera collegata a
domain: CulturalEntity
range: CulturalEntity
comment: Questa è la proprietà inversa di 'ha luogo di ritrovamento'.
comment: This is the inverse property of "has finding location". @en
label: is finding location of @en
version info: stabile
version info: stable @en

è formato di
type: ObjectProperty
sub property of: isDescriptionOf
domain: Formato
range: Documentazione
comment: Questa proprietà collega il formato con la relativa documentazione.
comment: This property relates the format to the related documentation. @en
label: is format of @en
version info: stabile
version info: stable @en

è fruizione di
type: ObjectProperty
sub property of: isSituationOf
domain: Fruizione
range: CulturalEntity
comment: Questa proprietà collega una fruizione di un vestimento al vestimento stesso.
comment: This property relates the fruition of a garment to that garment. @en
label: is fruition of @en
version info: stabile
version info: stable @en

è genere in
type: ObjectProperty
sub property of: isConceptOf
comment: Questa proprietà collega un genere alla tassonomia in cui è classificato.
comment: This property relates a genus to the linnaean taxon in which it is classified. @en
label: is genus in @en
deprecated: true
version info: stabile
version info: stable @en

è criterio interpretativo di
type: ObjectProperty
sub property of: isDescriptionOf
domain: Criterio interpretativo
range: Thing
comment: Questa proprietà collega un criterio interpretativo all'interpretazione che si è basata su quel criterio.
comment: This property relates an interpretation criterion to the interpretation that was based on that criterion. @en
label: is interpretation criterion of @en
version info: stabile
version info: stable @en

è intervento ammesso da
type: ObjectProperty
domain: Intervento ammesso
range: Strumento urbanistico-territoriale
comment: Questa proprietà, inversa a "ha intervento ammesso", collega un intervento allo strumento urbanistico-territoriale che ammette quell'intervento.
comment: This property, inverse of "has eligible intervention", relates an intervention to the urban planning instrument that finds eligible that intervention. @en
label: is intervention eligible by @en
version info: stabile
version info: stable @en

è intervento su
type: ObjectProperty
domain: Intervento
range: CulturalEntity
comment: Questa proprietà, inversa a "ha intervento", collega un intervento, a fini conservativi o di altro tipo, che ha interessato un bene culturale, al bene stesso.
comment: This property relates an intervention on a cultural property to that cultural property.
label: is intervention on @en
version info: stabile
version info: stable @en
iccd norm tag: ICCD Normativa Trasversale 4.00: CO/RST; normative di versioni precedenti: RS/RST - Normativa VeAC: CO/RIA - Normativa CA: RO/RIS

è ruolo nell'intervento
type: ObjectProperty
domain: Role
range: Attribuzione di Autore o responsabilità
comment: Questa è la proprietà inversa di "ha ruolo nell'intervento".
comment: This is the inverse property of "has intervention role". @en
label: is intervention role in @en
version info: stabile
version info: stable @en

è tipo di intervento di
type: ObjectProperty
sub property of: isTypeOf
domain: Tipo di intervento
range: Intervento
comment: Questa proprietà collega il tipo di intervento, a fini conservativi o di altro tipo, che ha interessato un bene culturale al relativo intervento.
comment: This property relates the type of intervention on a cultural property to the related intervention. @en
label: is intervention type of @en
version info: stabile
version info: stable @en

è responsabile di numero di inventario di
type: ObjectProperty
sub property of: è agente correlato a
domain: Agent
range: Inventario
comment: Questa proprietà collega il contenitore giuridico che conserva attualmente il bene, o che lo ha conservato in passato, e che è responsabile dell'assegnazione del numero di inventario all'inventario stesso.
comment: This property relates the juridical container responsible for the inventory identifier of the cultural property to the inventory itself. @en
label: is inventory identifier responsible of @en
version info: stabile
version info: stable @en

è inventario di
type: ObjectProperty
sub property of: hasMember
domain: Inventario
range: Thing
comment: Questa proprietà collega un inventario che registra informazioni relative al bene culturale al bene culturale o alle entità o attività collegate al bene culturale.
comment: This property relates an inventory to a cultural property or an entity or an activity related to it. @en
label: is inventory of @en
version info: stabile
version info: stable @en

è coinvolto in
type: ObjectProperty
sub property of: ha opera collegata
domain: CulturalEntity
range: CulturalEntity
comment: Questa proprietà collega un bene culturale a un altro bene culturale collegato, di tipo immateriale, in cui è coinvolto.
comment: This property relates a cultural entity to another involved cultural entity (e.g. immaterial). @en
label: is involved in @en
version info: stabile
version info: stable @en
iccd norm tag: ICCD Normativa Trasversale 4.00: RV/RSE/RSER = 'è coinvolto in' (versioni precedenti: 'esecuzione/evento di riferimento')

è emittente in
type: ObjectProperty
sub property of: è agente correlato a
domain: Agent
range: Emissione di moneta
comment: Questa è la proprietà inversa di "ha emittente".
comment: This is the inverse property of "has issuer". @en
label: is issuer in @en
version info: stabile
version info: stable

è ente che ha emanato il provvedimento
type: ObjectProperty
sub property of: è agente correlato a
domain: Agent
range: Strumento urbanistico-territoriale
comment: Questa è la proprietà inversa di "ha ente che ha emanato il provvedimento".
comment: This is the inverse property of "has issuing agency". @en
label: is issuing agency of @en
version info: stabile
version info: stable @en

è stato emittente in
type: ObjectProperty
sub property of: è agente correlato a
domain: Agent
range: Emissione di moneta
comment: Questa è la proprietà inversa di "ha stato emittente".
comment: This is the inverse property of "has issuing state". @en
label: is issuing state in @en
version info: stabile
version info: stable @en

è tipo di analisi di laboratorio di
type: ObjectProperty
sub property of: isTypeOf
domain: Tipo di analisi di laboratorio
range: Analisi di laboratorio
comment: Questa proprietà collega il tipo di analisi di laboratorio (es.: analisi metallurgica, analisi chimica, etc.) con la relativa analisi.
comment: This property relates the laboratory test type (i.e. chemical or metallurgical analysis) to the related laboratory test. @en
label: is laboratory test type of @en
version info: stabile
version info: stable @en

è condizione giuridica di
type: ObjectProperty
sub property of: isSituationOf
domain: Situazione giuridica
range: Thing
comment: Questa proprietà collega una condizione giuridica a un'entità che si trova in quella condizione.
comment: This property relates a legal situation to an entity that is in that situation. @en
label: is legal situation of @en
version info: stabile
version info: stable @en

ha luogo di collocazione
type: ObjectProperty
sub property of: ha opera collegata
inverse of: è luogo di collocazione di
domain: CulturalEntity
range: CulturalEntity
comment: Questa proprietà collega un bene culturale a un altro bene culturale collegato, che ne costituisce il luogo di collocazione.
comment: This property relates a cultural entity to a connected cultural entity which constitutes its location area. @en
label: is located in @en
label: è contenuto in
version info: stabile
version info: stable @en
iccd norm tag: ICCD Normativa Trasversale 4.00: RV/RSE/RSER = 'è contenuto in' (versioni precedenti: 'luogo di collocazione/localizzazione'; 'scheda contenitore')

è luogo di collocazione di
type: ObjectProperty
sub property of: è opera collegata a
domain: CulturalEntity
range: CulturalEntity
comment: Questa proprietà, inversa di 'is located in', collega un bene culturale a un altro bene culturale collegato, che costituisce il luogo di collocazione del primo.
comment: This property, inverse of 'is located in', relates a cultural entity to a connected cultural entity, which constitutes its location area. @en
label: is location of @en
version info: stabile
version info: stable @en

è membro di un'unità archivistica complessa di
type: ObjectProperty
domain: CulturalEntity
range: Appartenenza a unità archivistica complessa
comment: Questa proprietà collega un bene culturale alla classe che rappresenta l'appartenenza del bene a una unità archivistica complessa.
comment: This property relates a cultural property to the class that represents the membership relation between this cultural property and an archival record set. @en
label: is member of archival record set of @en
version info: stabile
version info: stable @en
iccd norm tag: ICCD Normativa F: UB/UBF

è membro di collezione di
type: ObjectProperty
domain: CulturalEntity
range: Appartenenza a Collezione
comment: Questa proprietà collega un bene culturale mobile alla classe che rappresenta l'appartenenza del bene culturale a una collezione in un certo intervallo di tempo.
comment: This property relates a cultural property to the class that represents the membership relation between this cultural property and a collection.
label: is member of collection of @en
version info: stabile
version info: stable @en
iccd norm tag: UB/COL

è membro di serie fotografica in
type: ObjectProperty
domain: CulturalEntity
range: Appartenenza a serie fotografica
comment: Questa proprietà collega un bene fotografico alla classe che rappresenta l'appartenenza del bene a una serie editoriale.
comment: This property relates a cultural property to the class that represents the membership relation between this cultural property and a photographic series.
label: is member of photographic series in @en
version info: stabile
version info: stable @en
iccd norm tag: ICCD Normativa F: PD/SFI; PD/SSI

è zecca in
type: ObjectProperty
sub property of: è agente correlato a
domain: Agent
range: Emissione di moneta
comment: Questa è la proprietà inversa di "ha zecca".
comment: This is the inverse property of "has mint". @en
label: is mint in @en
version info: stabile
version info: stable @en

è zecchiere in
type: ObjectProperty
sub property of: è agente correlato a
domain: Agent
range: Emissione di moneta
comment: Questa è la proprietà inversa di "ha zecchiere".
comment: This is the inverse property of "has minter". @en
label: in minter in @en
version info: stabile
version info: stable @en

è organico musicale di
type: ObjectProperty
sub property of: è agente correlato a
domain: Agent
range: CulturalEntity
comment: Questa proprietà collega il gruppo di musicisti (bande, complessi musicali, associazioni corali, ecc.) in cui uno strumento assume, o ha assunto, abitualmente un ruolo esecutivo al relativo strumento musicale.
comment: This property relates the musical ensamble where an instument is (or were) played to the related musical instrument. @en
label: is musical ensemble of @en
version info: stabile
version info: stable @en

è musicista di
type: ObjectProperty
sub property of: è agente correlato a
domain: Agent
range: CulturalEntity
comment: Questa proprietà collega una persona che assume - o ha assunto - un ruolo certo come esecutore di uno strumento musicale al relativo strumento.
comment: This property relates the person who plays (in the present or past) a certain role as a musical instrument's exectutor to the related instrument. @en
label: is musician of @en
version info: stabile
version info: stable @en

è oggetto associato a
type: ObjectProperty
domain: Object
range: Contesto di rinvenimento
comment: Questa è la proprietò inversa a "ha oggetto associato".
comment: This is the inverse property of "has associated object". @en
label: is object associated to @en
version info: stabile
version info: stable @en

è tipo di indagine di rilevamento di
type: ObjectProperty
sub property of: isTypeOf
domain: Tipo di indagine di rilevamento
range: Indagine di rilevamento
comment: Questa proprietà collega il tipo di indagine di rilevamento (nel contesto/decontestualizzato) alla relativa indagine di rilevamento.
comment: This property relates the type of observation survey (in the context, out of context) to the related observation survey. @en
label: is observation survey type of @en
version info: stabile
version info: stable @en

è proprietario in
type: ObjectProperty
sub property of: è agente correlato a
domain: Agent
range: Situazione giuridica
comment: Questa proprietà, inversa a "ha proprietario", rappresenta la partecipazione di un agente alla condizione giuridica di un bene culturale, di cui l'agente ha la proprietà.
comment: This class relates an agent, that is the owner of a cultural property, to the legal situation of that cultural property. @en
label: is owner in @en
version info: stabile
version info: stable @en
iccd norm tag: ICCD Normativa Trasversale 4.00: TU/CDG/CDGS

è serie fotografica in
type: ObjectProperty
domain: Serie fotografica
range: Appartenenza a serie fotografica
comment: Questa proprietà, inversa a "ha serie", collega una serie fotografica editoriale al rapporto tra la serie e un bene fotografico che ne fa parte.
comment: This property relates a photographic series to the class that represents the membership relation between this photographic series and a cultural property that is member of it. @en
label: is photographic series in @en
version info: stabile
version info: stable @en
iccd norm tag: ICCD Normativa Trasversale: PD/SFI; PD/SSI

è sede di provenienza di
type: ObjectProperty
sub property of: è opera collegata a
domain: CulturalEntity
range: CulturalEntity
comment: Questa è la proprietà inversa di "ha sede di provenienza".
comment: This is the inverse property of "has previous location". @en
label: is previous location of @en
version info: stabile
version info: stable @en

è soggetto fonte dell'acquisizione di
type: ObjectProperty
sub property of: è agente correlato a
domain: Agent
range: Acquisizione
comment: Questa proprietà, inversa a "ha soggetto fonte di acquisizione", collega il soggetto fonte dell'acquisizione di un bene all'acquisizione stessa.
comment: This property relates the previous owner of a cultural property to the acquisition by a new owner. @en
label: is previous owner of @en
version info: stabile
version info: stable @en
iccd norm tag: ICCD Normativa Trasversale 4.00: TU/ACQ/ACQN

è documentazione primaria di
type: ObjectProperty
sub property of: è documentazione di
domain: Documentazione
range: CulturalEntity
comment: Questa è la proprietà inversa di "ha documentazione primaria".
comment: This is the inverse property of "has primary documentation". @en
label: is primary documentation of @en
version info: stabile
version info: stable @en

è professione di
type: ObjectProperty
domain: Professione
range: Agent
comment: Questa è la proprietà inversa di "ha professione".
comment: This is the inverse property of "has profession". @en
label: is profession of @en
version info: stabile
version info: stable @en

è ente proponente di
type: ObjectProperty
sub property of: è agente correlato a
domain: Agent
range: Class
  union of: CulturalEntity
  union of: Provvedimento di tutela
comment: Questa proprietà collega all'ente proponente, ovvero il soggetto che ha proposto il provvedimento (identificato per mezzo della denominazione per esteso oppure, nel caso di Enti accreditati dall'ICCD, del relativo codice assegnato dall'Istituto) al provvedimento di tutela relativo al bene culturale, oppure direttamente al bene culturale. La relazione tra il ruolo e l'agente che lo riveste è espressa, in maniera generica, nel nome della proprietà, che quindi ne fornisce una rappresentazione semplificata, con ridotta espressività. Nell'ontologia questa relazione è modellata anche, in maniera più espressiva, dalla classe AgentRole, che permette di collegare l'agente e il suo ruolo.
comment: This property relates an agent that is a proponent agency of a protective measure of a cultural property to the protective measure or to the cultural entity itself. The relation is declared in the name of the property, but within the ontology this relation is also modeled, in a more expressive way, through the class AgentRole. @en
label: is proponent agency of @en
version info: stabile
version info: stable @en
iccd norm tag: ICCD Normativa Trasversale 4.00: TU/NVC/NVCA

è provvedimento di tutela di
type: ObjectProperty
domain: Provvedimento di tutela
range: CulturalEntity
comment: Questa proprietà collega un provvedimento di tutela nazionale o internazionale al bene culturale cui si applica.
comment: This property relates an international or national protective measure to the cultural enitity to which it is applied. @en
label: is protective measure of @en
version info: stabile
version info: stable @en
iccd norm tag: ICCD Normativa Trasversale 4.00: TU/NVC

è repertorio di riferimento di
type: ObjectProperty
domain: Repertorio
range: Copia
comment: Questa è la proprietà inversa di "ha repertorio di riferimento".
comment: This is the inverse property of "has reference catalogue". @en
label: is reference catalogue of @en
version info: stabile
version info: stable @en

si riferisce a ricerca
type: ObjectProperty
type: FunctionalProperty
domain: Indagine di rilevamento
range: Ricerca
comment: Questa proprietà collega un rilevamento di un bene musicale o demoetnoantropologico alla ricerca nell'ambito della quale è stata redatta la scheda.
comment: This class relates an observation survey of musical or demoetnoanthropological heritage to the research in which the catalogue record describing a cultural property was recorded (e.g.: a cataloguing campaign) @en
label: is related to research @en
version info: stabile
version info: stable @en
iccd norm tag: ICCD Normativa SM 4.00: DR

è opera collegata coinvolta in
type: ObjectProperty
domain: CulturalEntity
range: Rapporto con opera collegata
comment: Questa proprietà collega un'opera collegata a un bene culturale al rapporto tra l'opera e il bene culturale (es.: un lavoro preparatorio, un prototipo, una copia, un reimpiego di tutto il bene o di una sua parte, ecc.)
comment: This property relates a work related to a cultural property (e.g.: a preparatory work, a prototype, a copy, a reuse, etc.) to the situation in which that work is related to the cultural property itself. @en
label: is related work involved in @en
version info: stabile
version info: stable @en

è rapporto con opera collegata di
type: ObjectProperty
domain: Rapporto con opera collegata
range: CulturalEntity
comment: Questa proprietà, inversa di 'ha rapporto con opera collegata', collega la relazione tra il bene culturale e un'altra opera che ne costituisce una fase preparatoria o che ne rappresenta la fase finale al bene culturale stesso.
comment: This property, inverse of 'has related work situation', relates a situation in which a cultural property is related to another work, that could even be another cultural property, to the cultural property. @en
label: is related work situation of @en
version info: stabile
version info: stable @en

è affidabilità di
type: ObjectProperty
sub property of: isCharacteristicOf
domain: Affidabilità
range: Fotointerpretazione e fotorestituzione
comment: Questa proprietà collega il livello di affidabilità delle informazioni rilevate nell'indagine a una fotointerpretazione o fotorestituzione.
comment: This property relates the reliability of the information collected during the survey to a photo interpretation rendering survey. @en
label: is reliability of @en
version info: stabile
version info: stable @en

è riprodotto da
type: ObjectProperty
inverse of: riproduce
domain: CulturalEntity
range: Riproduzione
comment: Questa proprietà collega una stampa con la sua riproduzione contenuta in una pubblicazione, di cui la stampa è, o è stata, parte integrante.
comment: This property relates a print to the reproduction of that print in a publication. @en
label: is reproduced by @en
version info: stabile
version info: stable @en
iccd norm tag: ICCD Normativa S 3: RO/ADL

è riproduzione di
type: ObjectProperty
domain: Riproduzione
range: Stampa in pubblicazione
comment: Questa è la proprietà inversa di "ha riproduzione".
comment: This is the inverse property of "has reproduction". @en
label: is reproduction of @en
version info: stabile
version info: stable @en

è posizione della riproduzione di
type: ObjectProperty
domain: Posizione della riproduzione
range: Riproduzione
comment: Questa proprietà collega la posizione fisica della riproduzione di una stampa all'interno di una pubblicazione (es.: frontespizio, copertina, colophon, etc.). con la relativa riproduzione della stampa.
comment: This property relates the position of the print reproduction in a publication to the print reproduction itself. @en
label: is reproduction position of @en
version info: stabile
version info: stable @en

è ricerca su
type: ObjectProperty
domain: Ricerca
range: CulturalEntity
comment: Questa proprietà la ricerca nell'ambito della quale è stata redatta la scheda su un bene culturale al bene stesso.
comment: This property relates a research from which has been produced a cultural entity's catalogue record, to the cultural entity. @en
label: is research on @en
version info: stabile
version info: stable @en
iccd norm tag: ICCD Normativa SM e BDM 4.00: DR/DRT

è responsabile scientifico della ricerca di
type: ObjectProperty
sub property of: è agente correlato a
domain: Agent
range: Ricerca
comment: Questa proprietà collega il responsabile scientifico di una ricerca alla ricerca.
comment: This property relates the research's scientific responsible to its research. @en
label: is research scientific director of @en
version info: stabile
version info: stable @en

è responsibilità su
type: ObjectProperty
domain: Responsabilità
range: CulturalEntity
comment: This property relates the attribution of a responsibility to an agent, relating to the activities of production and dissemination of photographic heritage (e.g.: committent, editor, printer, dedicatee, etc.) to photographic heritage. @en
label: is responsibility for @en
version info: stabile
version info: stable @en
iccd norm tag: ICCD Normativa F: PD/PDF

è tipo di responsabilità di
type: ObjectProperty
sub property of: isTypeOf
domain: Tipo di responsabilità
range: Responsabilità
comment: Questa proprietà collega al tipo di responsabilità (es.: stampatori, ritoccatori, coloritori, ecc.) alla relativa responsabilità individuata relativamente ai processi di produzione e di divulgazione che caratterizzano specificamente i beni fotografici.
comment: This property relates the esponsibility type (i.e. printers, retouchers) to the related resposibility relative to some production or disclosure process which characterise photographic artefacts. @en
label: is responsibility type of @en
version info: stabile
version info: stable @en

è responsabile dell'immissione in patrimonio di
type: ObjectProperty
sub property of: è agente correlato a
domain: Agent
range: Inventario Patrimoniale
comment: Questa proprietà collega il responsabile dell'inventariazione patrimoniale del bene all'inventario patrimoniale.
comment: This property relates the agent responsible for the cultural entity's inventory to the current inventory. @en
label: is responsible for insertion of @en
version info: stabile
version info: stable @en

è riutilizzato in
type: ObjectProperty
sub property of: ha opera collegata
inverse of: riutilizza
domain: CulturalEntity
range: CulturalEntity
comment: Questa proprietà collega un bene culturale a un altro bene culturale collegato che lo riutilizza in tutto o in parte.
comment: This property relates a cultural entity to a connected cultural entity that reuse it or a part of it. @en
label: is reused by @en
version info: stabile
version info: stable @en
iccd norm tag: ICCD Normativa Trasversale 4.00: RV/RSE/RSER = 'è riutilizzato in' (versioni precedenti: 'bene composto')

è scala di
type: ObjectProperty
domain: Scala
range: Documentazione grafica e cartografica
comment: Questa proprietà collega la scala di rappresentazione alla documentazione grafica e cartografica.
comment: This property relates the representation scale to its graphic or cartographic representation. @en
label: is scale of @en
version info: stabile
version info: stable @en

è autore secondario di
type: ObjectProperty
sub property of: è agente correlato a
domain: Agent
range: Thing
comment: Questa proprietà collega l'autore secondario di un entità, come ad esempio un contributo o una parte di una pubblicazione, all'entità stessa.
comment: This property relates the secondary authors of an entity (i.e. a publication's contribution or section) to the related entity. @en
label: is secondary author of @en
version info: stabile
version info: stable @en

è interpretazione del sesso di
type: ObjectProperty
sub property of: isSituationOf
domain: Interpretazione del sesso
range: CulturalEntity
comment: Questa proprietà collega la stima del sesso di un reperto antropologico al reperto stesso.
comment: This property relates the sex estimate of an antropologic artifact to the related artifact. @en
label: is sex interpretation of @en
version info: stabile
version info: stable

è specie in
type: ObjectProperty
sub property of: isConceptOf
comment: Questa proprietà collega una specie alla tassonomia in cui è classificata.
comment: This property relates a species to the linnaean taxon in which it is classified. @en
label: is species in @en
deprecated: true
version info: stabile
version info: stable @en

è unità stratigrafica di
type: ObjectProperty
sub property of: isLocationOf
domain: Unità stratigrafica
range: Scavo archeologico
comment: Questa proprietà collega l'unità stratigrafica dalla quale proviene il bene rinvenuto nello scavo al relativo scavo archeologico.
comment: This property relates the stratigraphic unit from which a cultural property has been found to the related archeological excavation. @en
label: is stratigraphic unit of @en
version info: stabile
version info: stable @en

è soggetto di
type: ObjectProperty
domain: Soggetto
range: Thing
comment: Questa proprietà, inversa a "ha soggetto", collega un soggetto o motivo ornamentale al bene culturale o a un'opera correlata a un bene culturale in quanto sua fase preparatoria o finale o a un apparato iconografico-decorativo su cui è rappresentato.
comment: This property relates a subject or ornamental motif to the cultural property or to the final or preparatory work of a cultural property. @en
label: is subject of @en
version info: stabile
version info: stable @en
iccd norm tag: ICCD Normativa Trasversale: DA/AID/AIDI - Normativa F: SG/SGT/SGTI - Altre normative di versioni precedenti alla 4.00: OG/SGT/SGTI - ICCD Normative F, RA, SMO, PST, S, OAC, OA, MI, D, NU: RO/ROF/ROFS

è sottospecie in
type: ObjectProperty
sub property of: isConceptOf
comment: Questa proprietà collega una sottospecie alla tassonomia in cui è classificata.
comment: This property relates a subspecies to the linnaean taxon in which it is classified. @en
label: is subspecies in @en
deprecated: true
version info: stabile
version info: stable @en

è immagine di indagine
type: ObjectProperty
domain: Immagine di indagine
range: Fotointerpretazione e fotorestituzione
comment: Questa è la proprietà inversa di "ha immagine di indagine".
comment: This is the inverse property of "has survey image". @en
label: is survey image of @en
version info: stabile
version info: stable @en

è tipo di immagine di indagine di
type: ObjectProperty
sub property of: isTypeOf
domain: Tipo di immagine di indagine
range: Immagine di indagine
comment: Questa proprietà collega il tipo una immagine di indagine (fotografia aerea o fotografia satellitare). con la relativa immagine di indagine.
comment: This property relates the type of a survey image (i.e. aerial photograph, Satellite photograph) to the related survey image. @en
label: is survey image type of @en
version info: stabile
version info: stable @en

è metodo di indagine di
type: ObjectProperty
sub property of: isMethodOf
domain: Metodo di indagine
range: Indagine
comment: Questa proprietà collega il metodo adottato nel corso di un'indagine all'indagine stessa.
comment: This property relates the method adopted in a survey to the survey itself. @en
label: is survery method of @en
version info: stabile
version info: stable @en

è motivo di indagine di
type: ObjectProperty
sub property of: isDescriptionOf
domain: Motivo di indagine
range: Indagine
comment: Questa proprietà collega il motivo principale che ha determinato uno scavo archeologico, una ricognizione archeologica, un'indagine archeometrica e diagnostica o una fotointerpretazione e fotorestituzione a ciascuno di essi.
comment: This property relates the main motivation that led to an archeological, archaeometric or diagnostic survey or a photo interpretation rendering to each of them.
label: is survey motivation of @en
version info: stabile
version info: stable @en

è indagine su
type: ObjectProperty
domain: Indagine
range: CulturalEntity
comment: Questa proprietà collega un'indagine effettuata su un bene culturale al bene stesso.
comment: This property relates a cultural entity's survey to the cultural entity. @en
label: is survey on @en
version info: stabile
version info: stable @en
iccd norm tag: ICCD Normativa Trasversale 4.00: RE; CM/ISP - ICCD Normative NU, RA, BNB, MA, CA: RS/ALB - ICCD Normativa AT 3.00: IN/INI - Normativa BDM e SM 4.00: DR

è fotografo dell'indagine di
type: ObjectProperty
sub property of: è agente correlato a
domain: Agent
range: Indagine di rilevamento
comment: Questa proprietà collega il fotografo professionista (diverso dal rilevatore) che ha effettuato l'indagine all'indagine di rilevamento di un bene demo-etno-antropologico.
comment: This property relates the professional photographer who took the shot to the observation survey of a demo-etno-antropologic entity. @en
label: is observation photographer of @en
version info: stabile
version info: stable @en

è responsabile scientifico dell'indagine di
type: ObjectProperty
sub property of: è agente correlato a
domain: Agent
range: Indagine
comment: Questa proprietà collega il responsabile scientifico di un'indagine alla relativa indagine.
comment: This property relates the scientific director of a survey to the related survey. @en
label: is survey scientific director of @en
version info: stabile
version info: stable @en

è fonico dell'indagine di
type: ObjectProperty
sub property of: è agente correlato a
domain: Agent
range: Indagine di rilevamento
comment: Questa proprietà collega il fonico professionista (diverso dal rilevatore) che ha effettuato la registrazione sonora all'indagine di rilevamento di un bene demo-etno-antropologico.
comment: This property relates the sound engineer who recorded an observation survey to the related observation survey of a demo-etno-antropologic entity. @en
label: is survey sound engineer of @en
version info: stabile
version info: stable @en

è titolo di
type: ObjectProperty
domain: Titolo
range: Thing
comment: Questa proprietà collega un titolo all'entità cui si riferisce.
comment: This property relates a title to the entity to which it is referred. @en
label: is title of @en
version info: stabile
version info: stable @en
iccd norm tag: OG/SGT/SGTP; SG/SGL/SGLT; SG/SGL/SGLL; OG/SGT/SGTR; DA/AID/AIDN; SG/SGL/SGLA; DA/AID/AIDT; OG/SGT/SGTT; RO/ROF/ROFT; DO/BSE/BSET; DO/BSE/BSEC.

è tipo di titolo di
type: ObjectProperty
sub property of: isTypeOf
domain: Tipo di Titolo
range: Titolo
comment: Questa proprietà collega il tipo di titolo di un bene culturale al relativo titolo.
comment: This property relates the type of a cultural entity title to its title. @en
label: is title type of @en
version info: stabile
version info: stable @en

è deposizione funeraria di
type: ObjectProperty
domain: Deposizione funeraria
range: Scavo archeologico
comment: Questa è la proprietà inversa di "ha deposizione funeraria".
comment: This is the inverse property of "has tomb". @en
label: is tomb of @en
version info: stabile
version info: stable @en

è strumento urbanistico-territoriale di
type: ObjectProperty
domain: Strumento urbanistico-territoriale
range: CulturalEntity
comment: Questa proprietà collega uno strumento urbanistico-territoriale, ovvero un piano regolatore generale e particolareggiato o un piano paesaggistico che interessa un bene culturale al bene stesso.
comment: This class relates a urban planning instrument to the related cultural property. @en
label: is urban planning instrument of @en
version info: stabile
version info: stable @en
iccd norm tag: ICCD Normativa Trasversale 4.00: TU/STU

è funzione d'uso di
type: ObjectProperty
domain: Funzione d'uso
range: Thing
comment: Questa proprietà collega la funzione d'uso di un'entità alla relativa entità.
comment: This property relates the use function of an entity to the related entity. @en
label: is use function of @en
version info: stabile
version info: stable @en

è uso di
type: ObjectProperty
sub property of: isDescriptionOf
domain: Uso
range: CulturalEntity
comment: Questa proprietà collega l'uso di un bene culturale con il bene culturale stesso.
comment: This property relates the use of a cultural entity to the related cultural property. @en
label: is use of @en
version info: stabile
version info: stable @en

è tipo d'uso di
type: ObjectProperty
sub property of: isTypeOf
domain: Tipo d'uso
range: Uso
comment: Questa proprietà collega il tipo di uso del bene (attuale, precedente, storico) con il suo uso.
comment: This property relates the type of a cultural entity use to its use. @en
label: is use type of @en
version info: stabile
version info: stable @en

è specifica del tipo di uso di
type: ObjectProperty
sub property of: hasConcept
domain: Specifiche del tipo d'uso
range: Uso
comment: Questa proprietà collega le specifiche relative al tipo di utilizzo di un bene con il relativo uso.
comment: This property relates the specification of the type of a cultural property use to the related use. @en
label: is use type specification of @en
version info: stabile
version info: stable @en

è utente di
type: ObjectProperty
sub property of: è agente correlato a
domain: Agent
range: Thing
comment: Questa proprietà collega un utente, inteso come agente che ha fatto uso di un'entità, all'entità stessa.
comment: This property relates the user, intended as the agent who employed an entity, to the related entity. @en
label: is user of @en
version info: stabile
version info: stable @en

è opera collegata a
type: ObjectProperty
domain: CulturalEntity
range: CulturalEntity
comment: Questa è la proprietà inversa a "ha opera collegata".
comment: This is the inverse property of "has related work". @en
label: is work related to @en
version info: stabile
version info: stable @en

riproduce
type: ObjectProperty
domain: Riproduzione
range: CulturalEntity
comment: Questa proprietà collega la riproduzione dell'immagine contenuta nella pubblicazione di cui la stampa è, o è stata, parte integrante con la stampa stessa.
comment: This property relates the reproduction of an print in a publication to the print itself. @en
label: reproduces @en
version info: stabile
version info: stable @en
iccd norm tag: ICCD Normativa S 3: RO/ADL

riutilizza
type: ObjectProperty
sub property of: è opera collegata a
domain: CulturalEntity
range: CulturalEntity
comment: Questa è la proprietà inversa di 'è riutilizzato da', che collega un bene culturale a un altro bene culturale collegato che lo riutilizza in tutto o in parte.
comment: This is the invers property of 'is reused by', which relates a cultural entity to a connected cultural entity that reuse it or a part of it. @en
label: reuses @en
version info: stabile
version info: stable @en

cronologia specifica
type: ObjectProperty
sub property of: atTime
inverse of: cronologia specifica di
domain: EventOrSituation
range: TimeInterval
comment: Questa proprietà collega l'evento (realizzazione, demolizione, etc.) cui si riferisce una specifica cronologia di un bene culturale alla cronologia specifica, cioè la cronologia in anni (anche a cavallo di secoli diversi) o con date precise (nella forma "aaaa/mm/gg"). Nel caso in cui la cronologia corrisponda ad uno specifico anno, l'intervallo di tempo avrà lo stesso valore per data di inizio e data di fine.
comment: This property relates the event (creation, distruction) to which a dating of a cultural property is related to the "specific time", as the dating expressed in year or as a date yyyy/mm/dd. @en
label: specific time @en
version info: stabile
version info: stable @en
iccd norm tag: ICCD Normativa Trasversale: DT/DTS/DTSI + DT/DTS/DTSV + DT/DTS/DTSF + DT/DTS/DTSL

cronologia specifica di
type: ObjectProperty
domain: TimeInterval
range: EventOrSituation
comment: Questa proprietà collega la cronologia specifica, cioè la cronologia in anni (anche a cavallo di secoli diversi) o con date precise (nella forma "aaaa/mm/gg") con l'evento (realizzazione, demolizione, etc.) cui si riferisce una specifica cronologia di un bene culturale.
comment: This property relates the "specific time", as the dating expressed in year or as a date yyyy/mm/dd, with the event (creation, distruction) to which a dating of a cultural property is related to. @en
label: specific time of @en
version info: stabile
version info: stable @en

causale RCS
type: DatatypeProperty
domain: Inventario Patrimoniale
range: Literal
comment: Questa proprietà rappresenta il codice della causale RCS (Ragioneria Centrale dello Stato) di aumento o diminuzione del valore del bene.
comment: This property represents the code of the RCS causal (Central State Accounting Office) of increasing or decreasing property value. @en
label: RCS reason @en
iccd norm tag: ICCD Normativa Trasversale 4.00: UB/INP/INPU

abbreviazione
type: DatatypeProperty
domain: Bibliografia
range: Literal
comment: Questa proprietà rappresenta l'abbreviazione che identifica il riferimento bibliografico.
comment: This property represents the abbreviation that identifies the bibliographic reference. @en
label: abbreviation @en
version info: stabile
version info: stable @en
iccd norm tag: BIBR

luogo di acquisizione
type: DatatypeProperty
domain: Acquisizione
range: Literal
comment: Questa proprietà rappresenta il luogo in cui è avvenuto un evento di acquisizione, generalmente espresso, in base ai dati disponibili, nella forma: "Regione/sigla provincia/denominazione per esteso del Comune/località o toponimo"
comment: This property represents the place where an acquisition event, generally expressed, based on the available data, took place, in the form: "Region / abbreviation province / full name of the Municipality / locality or toponym" @en
label: acquisition location @en
version info: stabile
version info: stable @en
iccd norm tag: ICCD Normativa Trasversale 4.00: TU/ACQ/ACQL

indirizzo
type: DatatypeProperty
sub property of: contatti
domain: Agent
range: Literal
comment: Questa proprietà rappresenta l'indirizzo di riferimento di un agente (persona, organizzazione), inteso come un tipo specifico di contatto presso il quale l'agente è reperibile.
comment: This property represents a specific type of contact at which the agent is available. @en
label: address @en
version info: stabile
version info: stable @en
iccd norm tag: ICCD Normativa Trasversale 4.00: TU/CDG/CDGI

età della morte stimata
type: DatatypeProperty
type: FunctionalProperty
domain: Interpretazione dell'età della morte
range: Literal
comment: Questa proprietà rappresenta l'età della morte stimata nel contesto della stima dell'età della morte di un reperto antropologico.
comment: This property represents an anthropological finding estimated age of death. @en
label: estimated age of death @en
version info: stabile
version info: stable @en

indicazioni cronologiche relative a un agente
type: DatatypeProperty
domain: Agent
range: Literal
comment: Questa proprietà permette di associare delle indicazioni cronologiche generiche (le date di nascita e di morte o, quando queste sono ignote, le date di attività), anche sotto forma testuale, a un agente.
comment: This property allows you to associate generic chronological indications to an agent. @en
label: agent date @en
version info: stabile
version info: stable @en

codice identificativo locale dell'agente
type: DatatypeProperty
sub property of: localIdentifier
type: FunctionalProperty
domain: Agent
range: Literal
comment: Questa proprietà rappresenta il codice identificativo, che individua il riferimento autoriale in modo univoco nell'ambito di un repertorio locale, di un agente, per esempio di un autore di un bene culturale o di un agente che riveste una responsabilità nei confronti del bene (es.: editore, stampatore, etc.).
comment: This property represents the identification code, which identifies the author's reference unambiguously in the context of a local repertoire, of an agent. @en
label: agent local identifier @en
version info: stabile
version info: stable @en
iccd norm tag: ICCD Normativa Trasversale 4.00: AU/AUT/AUTH - ICCD Normativa F 4.00: RO/CRF/CRFX; PD/PDF/PDFH - ICCD Normativa F 3.00: RO/CRF/CRFH

titolo alternativo
type: DatatypeProperty
sub property of: titolo
domain: CulturalEntity
range: Literal
comment: Questa proprietà rappresenta un altro titolo noto del soggetto, in alternativa o in aggiunta al titolo più noto o accreditato.
comment: This property represents an entity's alternative title. @en
label: alternative title @en
version info: stabile
version info: stable @en
iccd norm tag: ICCD Normativa Trasversale: DA/AID/AIDN

codice univoco ICCD dello scavo archeologico
type: DatatypeProperty
sub property of: ICCDIdentifier
type: FunctionalProperty
domain: Scavo archeologico
range: Literal
comment: Questa proprietà rappresenta il codice, assegnato dall'ICCD, che individua lo scavo archeologico in modo univoco a livello nazionale.
comment: This property represents the code, assigned by the ICCD, which identifies the archaeological excavation unequivocally at national level. @en
label: archaeological excavation ICCD identifier @en
version info: stabile
version info: stable @en
iccd norm tag: ICCD Normativa Trasversale 4.00: RE/DSC/DSCK

codice identificativo locale dello scavo archeologico
type: DatatypeProperty
sub property of: localIdentifier
type: FunctionalProperty
domain: Scavo archeologico
range: Literal
comment: Questa proprietà rappresenta il codice identificativo, numerico o alfanumerico, che individua lo scavo archeologico in modo univoco nell'ambito di un repertorio locale. @en
comment: This property represents the identification code, numeric or alphanumeric, which identifies the archaeological excavation unambiguously in the context of a local repertoire. @en
label: archaeological excavation local identifier @en
version info: stabile
version info: stable @en
iccd norm tag: ICCD Normativa Trasversale 4.00: RE/DSC/DSCH

codice univoco ICCD della ricognizione archeologica
type: DatatypeProperty
sub property of: ICCDIdentifier
type: FunctionalProperty
domain: Ricognizione archeologica
range: Literal
comment: Questa proprietà rappresenta il codice, assegnato dall'ICCD, che individua il la ricognizione archeologica in modo univoco a livello nazionale.
comment: This property represents the code, assigned by the ICCD, which identifies the field survey unequivocally at national level. @en
label: archaeological field survey ICCD identifier @en
version info: stabile
version info: stable @en
iccd norm tag: ICCD Normativa Trasversale 4.00: RE/RCG/RCGK

codice identificativo locale della ricognizione archeologica
type: DatatypeProperty
sub property of: localIdentifier
type: FunctionalProperty
domain: Ricognizione archeologica
range: Literal
comment: Questa proprietà rappresenta il codice identificativo, numerico o alfanumerico, che individua la ricognizione archeologica in modo univoco nell'ambito di un repertorio locale.
comment: This property represents the identification code, numeric or alphanumeric, which identifies the field survey unambiguously in the context of a local repertoire. @en
label: archaeological field survey local identifier @en
version info: stabile
version info: stable @en
iccd norm tag: ICCD Normativa Trasversale 4.00: RE/RCG/RCGH

identificativo di unità documentaria
type: DatatypeProperty
sub property of: identifier
type: FunctionalProperty
domain: Unità documentaria
range: Literal
comment: Questa proprietà rappresenta l'identificativo di un'unità documentaria.
comment: This property represents the identifier of an archival record. @en
label: archival record identifier @en
version info: stabile
version info: stable @en
iccd norm tag: ICCD Normativa FF: PA/PAC/PACI; PA/PAC/PACA

collocazione di unità documentaria
type: DatatypeProperty
domain: Appartenenza a unità archivistica complessa
range: Literal
comment: Questa proprietà rappresenta la collocazione di un'unità documentaria all'interno di un'unità archivistica complessa.
comment: This property represents the location of a documentary unit within a complex archival unit. @en
label: archival record location @en
version info: stabile
version info: stable @en
iccd norm tag: ICCD Normativa F: UB/UBF/UBFC

identificativo di unità archivistica complessa
type: DatatypeProperty
sub property of: identifier
type: FunctionalProperty
domain: Unità archivistica complessa
range: Literal
comment: Questa proprietà rappresenta l'identificativo di un'unità archivistica complessa.
comment: This property represents the identifier of an archival record set. @en
label: archival record set identifier @en
version info: stabile
version info: stable @en
iccd norm tag: ICCD Normativa FF: PA/PAC/PACI; PA/PAC/PACA

titolo di unità archivistica complessa
type: DatatypeProperty
domain: Appartenenza a unità archivistica complessa
range: Literal
comment: Questa proprietà rappresenta il titolo dell'unità archivistica complessa (fondo, serie, sottoserie, etc.) in cui si trova un'unità documentaria.
comment: This property represents the title of the archival record set in which a documentary unit is located. @en
label: archival record set title @en
version info: stabile
version info: stable @en
iccd norm tag: ICCD Normativa F: UB/UBF/UBFU

settore ambiente quadrato
type: DatatypeProperty
domain: Scavo archeologico
range: Literal
comment: Questa proprietà collega uno scavo archeologico alla successione delle denominazioni, assegnate nell'ambito dello scavo, al settore (o l'area), all'ambiente e al quadrato da cui proviene il bene.
comment: This property relates an archaeological excavation to the succession of the denominations, assigned in the excavation, to the sector (or the area), to the environment and to the square from which the good comes. @en
label: area room square @en
version info: stabile
version info: stable @en
iccd norm tag: ICCD Normativa Trasversale 4.00: RE/DSC/DSCQ

titolo attribuito
type: DatatypeProperty
sub property of: titolo
domain: CulturalEntity
range: Literal
comment: Questa proprietà rappresenta un titolo attribuito di una fotografia, cioè un titolo desunto, se possibile, da fonti archivistiche, bibliografiche, orali o iconografiche (altri esemplari della stessa immagine) oppure creato in base al contenuto dell'immagine (o della serie di immagini; è necessario nei casi in cui siano del tutto assenti titoli sul/nel documento, o su materiali ad esso complementari, e nel caso in cui tali titoli risultino errati.
comment: This property represents an attributed title of a photograph, that is a title taken from archival, bibliographic, oral or iconographic sources, or created based on picture contents. @en
label: attributed title @en
version info: stabile
version info: stable @en
iccd norm tag: Normativa F: SG/SGL/SGLA

codice univoco ICCD dell'autore
type: DatatypeProperty
sub property of: ICCDIdentifier
type: FunctionalProperty
domain: Agent
range: Literal
comment: Questa proprietà permette di associare il codice univoco ICCD a un autore.
comment: This property allows you to associate the unique ICCD code with an author. @en
label: author ICCD identifier @en
version info: stabile
version info: stable @en
iccd norm tag: ICCD Normativa Trasversale 4.00: AU/AUT/AUTK

intervento dell'autore
type: DatatypeProperty
domain: Class
  union of: Attribuzione Alternativa di Autore
  union of: Attribuzione Primaria di Autore
range: Literal
comment: Questa proprietà rappresenta specifiche relative all'intervento effettuato dall'autore sul bene culturale.
comment: This property represents specifications relating to the intervention carried out by the author on the cultural property. @en
label: author intervention @en
version info: stabile
version info: stable @en
iccd norm tag: AU/AUT/AUTY

autore del riferimento bibliografico
type: DatatypeProperty
domain: Bibliografia
range: Literal
comment: Questa proprietà rappresenta l'autore relativo al riferimento bibliografico.
comment: This property represents the author related to the bibliographic reference. @en
label: bibliographic reference author @en
version info: instabile
version info: unstable @en
iccd norm tag: DO/BIB/BIBA

data del riferimento bibliografico
type: DatatypeProperty
sub property of: date
domain: Bibliografia
range: Literal
comment: Questa proprietà rappresenta la data relativa al riferimento bibliografico.
comment: This property represents the date of publication related to the bibliographic reference. @en
label: bibliographic reference date @en
version info: instabile
version info: unstable @en
iccd norm tag: DO/BIB/BIBD

codice univoco ICCD della bibliografia
type: DatatypeProperty
sub property of: ICCDIdentifier
type: FunctionalProperty
domain: Bibliografia
range: Literal
comment: Questa proprietà rappresenta il codice, assegnato dall'ICCD, che individua il riferimento bibliografico in modo univoco a livello nazionale.
comment: This property represents the code, assigned by the ICCD, which identifies the bibliographic reference uniquely at national level. @en
label: bibliography ICCD identifier @en
version info: stabile
version info: stable @en
iccd norm tag: ICCD Normativa Trasversale 4.00: DO/BIB/BIBK

codice identificativo locale della bibliografia
type: DatatypeProperty
sub property of: localIdentifier
type: FunctionalProperty
domain: Bibliografia
range: Literal
comment: Questa proprietà rappresenta una sequenza numerica o alfanumerica che identifica il riferimento bibliografico in modo univoco nell'ambito di un repertorio locale.
comment: This property represents a numerical or alphanumeric sequence that uniquely identifies the bibliographic reference within a local repertoire. @en
label: bibliography local identifier @en
version info: stabile
version info: stable @en
iccd norm tag: ICCD Normativa Trasversale 4.00: DO/BIB/BIBH

riferimento bibliografico
type: DatatypeProperty
domain: Bibliografia
range: Literal
comment: Questa proprietà rappresenta il riferimento bibliografico.
comment: This property represents the bibliographic reference. @en
label: bibliographic reference @en
version info: instabile
version info: unstable @en
iccd norm tag: DO/BIB/BIBA e DO/BIB/BIBD

didascalia
type: DatatypeProperty
domain: Documentazione fotografica
range: Literal
comment: Questa proprietà rappresenta una sintetica didascalia, se presente e utile alla comprensione di quanto documentato.
comment: This property represents a synthetic caption, useful for understanding what is documented. @en
label: caption @en
version info: stabile
version info: stable @en
iccd norm tag: FNTN

specifiche su pasta/argilla
type: DatatypeProperty
sub property of: specifications
domain: Analisi di laboratorio
range: Literal
comment: Questa proprietà rappresenta le specifiche su eventuali componenti significativi per lo studio del bene, nel caso di analisi su reperti in argilla.
comment: This property represents specifications on any significant components for the study of the entity, in case of analysis on clay findings. @en
label: clay specifications @en
version info: stabile
version info: stable @en

codice della collezione
type: DatatypeProperty
sub property of: identifier
type: FunctionalProperty
domain: CollectionCulEnt
range: Literal
comment: Questa proprietà rappresenta il codice identificativo di una collezione.
comment: This property represents the collection identifier. @en
label: collection identifier @en
version info: stabile
version info: stable @en

motivo di uscita dalla collezione
type: DatatypeProperty
domain: Appartenenza a Collezione
range: Literal
comment: Questa proprietà rappresenta il motivo che ha determinato l'uscita da una collezione di un bene culturale.
comment: This property represents the reason that led a cultural entity to the exit from a collection. @en
label: collection leaving reason @en
version info: stabile
version info: stable @en
iccd norm tag: UB/COL/COLM

codice inventario bene in collezione
type: DatatypeProperty
sub property of: identifier
type: FunctionalProperty
domain: CulturalEntity
range: Literal
comment: Questa proprietà rappresenta il codice d'inventario attribuito al bene nella collezione.
comment: This property represents the inventory code assigned to the cultural entity inside a collection. @en
label: collection unit inventory identifier @en
version info: stabile
version info: stable @en
iccd norm tag: UB/COL/COLI

riferimento bibliografico completo
type: DatatypeProperty
type: FunctionalProperty
domain: Bibliografia
range: Literal
comment: Questa proprietà rappresenta il riferimento bibliografico completo.
comment: This property represents the complete bibliographic reference. @en
label: complete bibliographic reference @en
version info: stabile
version info: stable @en
iccd norm tag: ICCD Normativa Trasversale 4.00: DO/BIB/BIBM; RE/RCG/RCGS - versioni precedenti: DO/BIL

contatti
type: DatatypeProperty
domain: Agent
range: Literal
comment: Questa proprietà rappresenta i contatti di riferimento di un agente (persona, organizzazione), es. indirizzo, numeri di telefono e di fax, indirizzi di posta elettronica, ecc.
comment: This property represents contacts of an agent (i.e. email, telephone number...) @en
label: contacts @en
version info: stabile
version info: stable @en
iccd norm tag: ICCD Normativa SM 4.00: OS/OSE

cultural property inventory description
type: DatatypeProperty
domain: Inventario Patrimoniale
range: Literal
comment: Questa proprietà rappresenta la descrizione patrimoniale del bene, con riferimento a quanto inserito nel modello 15 RCS a cura dell'ente competente per tutela. Il dato viene richiesto direttamente agli uffici di catalogo/inventario dei relativi Istituti.
comment: This property represents a cultural entity inventory description. @en
version info: stabile
version info: stable @en
iccd norm tag: ICCD Normativa Trasversale 4.00: UB/INP/INPD

collocazione dell'opera derivata
type: DatatypeProperty
domain: Opera derivata
range: Literal
comment: Questa proprietà rappresenta la localizzazione geografica e collocazione specifica dell'opera derivata dal bene culturale.
comment: This property represents derivated work's geographical and specific location. @en
label: derivated work location @en
version info: stabile
version info: stable @en
iccd norm tag: ICCD Normative F, RA, SMO, PST, S, OAC, OA, MI, D, NU: RO/ROF/ROFC - Normativa S: RO/COP/COPC - Normativa F: RO/CRF/CRFC

diagnosi
type: DatatypeProperty
domain: Indagine su paleopatologia
range: Literal
comment: Questa proprietà rappresenta la diagnosi di una paleopatologia di un reperto antropologico.
comment: This property represents the diagnosis of an anthropological finding paleopathology. @en
label: diagnosis @en
version info: stabile
version info: stable @en
iccd norm tag: ICCD Normativa AT: PT/PTC/PTCD

nome del file digitale
type: DatatypeProperty
sub property of: name
domain: Documentazione
range: Literal
comment: Questa proprietà rappresenta il nome del file digitale che riproduce il documento, nel caso della documentazione allegata alla scheda di catalogo.
comment: This property represents the name of the digital file that reproduces the document. @en
label: digital filename @en
version info: stabile
version info: stable @en
iccd norm tag: FTAK, DRAK, VDCK, REGK, FNTK

codice identificativo della documentazione
type: DatatypeProperty
sub property of: identifier
type: FunctionalProperty
domain: Documentazione
range: Literal
comment: Questa proprietà rappresenta una sequenza numerica o alfanumerica che identifica la scheda a cui il documento si riferisce.
comment: This property represents a numeric or alphanumeric sequence that identifies the record to which the document refers. @en
label: documentation identifier @en
version info: stabile
version info: stable @en
iccd norm tag: ICCD Normativa Trasversale 4.00: DO/FTA/FTAN; DO/DRA/DRAN; DO/VDC/VDCN; DO/REG/REGN; DO/FNT/FNTI

collocazione della documentazione
type: DatatypeProperty
domain: Documentazione
range: Literal
comment: Questa proprietà rappresenta la collocazione del documento, che può anche essere espressa per mezzo della collocazione inventariale o dell'identificativo (numerico o alfanumerico) della fonte o del documento.
comment: This property represents document location, which can also be expressed by inventory location or identifier. @en
label: documentation location @en
version info: stabile
version info: stable @en
iccd norm tag: ICCD Normativa Trasversale 4.00: DO/FTA/FTAC, DO/DRA/DRAC, DO/VDC/VDCC, DO/REG/REGC, DO/FNT/FNTS

titolo della documentazione
type: DatatypeProperty
domain: Documentazione
range: Literal
comment: Questa proprietà rappresenta il titolo o la denominazione del documento.
comment: This property represents document title or denomination. @en
label: documentation title @en
version info: stabile
version info: stable @en
iccd norm tag: FTAM, DRAM, VDCA, REGZ, FNTT

attribuzione dubbia di autore o responsabilità
type: DatatypeProperty
domain: Attribuzione di Autore o responsabilità
range: boolean
comment: Questa proprietà rappresenta un'attribuzione dubbia di autore o responsabilità
comment: This property represents a dubious autorship attribution @en
label: dubious authotship attribution @iten
version info: instabile
version info: unstable @en

luogo dell'edizione
type: DatatypeProperty
domain: Edizione
range: Literal
comment: Questa proprietà rappresenta il luogo dell'edizione di un'opera.
comment: This property represents work's edition place. @en
label: edition location @en
version info: stabile
version info: stable @en
iccd norm tag: ICCD Normative VeAC e AT 3.01: DO/BSE/BSEL.

situazione ambientale
type: DatatypeProperty
domain: Ricognizione archeologica
range: Literal
comment: Questa proprietà collega una ricognizione archeologica alla situazione ambientale al momento della ricognizione.
comment: This property relates an archaeological survey to environmental situation. @en
label: environmental state @en
version info: stabile
version info: stable @en
iccd norm tag: ICCD Normativa Trasversale 4.00: RE/RCG/RCGT - Versioni precedenti: RE/RCG/RCGU + RE/RCG/RCGC

valore del bene culturale
type: DatatypeProperty
sub property of: valore stimato
domain: Stima di bene culturale
range: Literal
comment: Questa proprietà rappresenta il valore economico di un bene culturale. Nel caso di una collezione, questa proprietà rappresenta il valore del bene desunto, quando presente, dall'inventario della collezione o dal suo prezzo di acquisto o vendita. Nel caso di un inventario patrimoniale, questa proprietà rappresenta la stima patrimoniale del bene. Il valore viene preceduto dalla specifica della valuta.
comment: This property represents cultural entity's economic value.. The value is preceded by the currency specification. @en
label: cultural property value @en
version info: stabile
version info: stable @en
iccd norm tag: ICCD Normativa Trasversale 4.00: UB/COL/COLV; UB/INP/INP/INPA; UB/STI

valore stimato
type: DatatypeProperty
type: FunctionalProperty
domain: Stima
range: Literal
comment: Questa proprietà rappresenta il valore stimato durante il processo di stima di un'entità.
comment: This property represents the value estimated in the context of an estimate process. @en
label: estimated value @en
version info: stabile
version info: stable @en

data di scadenza
type: DatatypeProperty
sub property of: time
domain: Thing
range: Literal
comment: Questa proprietà rappresenta una data di scadenza, per esempio la data di scadenza dei diritti d'autore su un oggetto (come un bene culturale).
comment: This property represents an expiration date. @en
label: expiry date @en
version info: stabile
version info: stable @en
iccd norm tag: ICCD Normativa F 4.00 e OAC: TU/CPR/CPRD

note interpretative
type: DatatypeProperty
sub property of: note
domain: CulturalEntity
range: Literal
comment: Questa proprietà permette di rappresentare l'interpretazione di un bene culturale, ricavabile dall'osservazione diretta e dai dati conoscitivi disponibili.
comment: This property represents a cultural asset interpretation. @en
label: explanation note @en
version info: stabile
version info: stable @en
iccd norm tag: ICCD Normativa CA: DA/INT - ICCD Normativa TMA: DA/DES/DESI - ICCD Normativa SI: DA/NCS

note di reperimento
type: DatatypeProperty
sub property of: note
domain: CulturalEntity
range: Literal
comment: Questa proprietà rappresenta le note relative alle modalità di individuazione e di reperimento del bene in esame, in forma di testo libero. Possono essere integrative rispetto a quanto rappresentato come Scavo Archeologico o Ricognizione Archeologica, oppure possono essere le uniche informazioni registrate sull'individuazione e il reperimento del bene, in quelle situazioni in cui i dati a disposizione non consentono di compilare le schede di Authority file RCG-Ricognizione archeologica e/o DSC-Scavo archeologico. Vengono quindi collegate direttamente al bene.
comment: This property represents notes relating to methods for identifying and finding the cultural property in question. @en
label: finding note @en
version info: stabile
version info: stable @en
iccd norm tag: ICCD Normativa Trasversale 4.00: RE/RES - ICCD Normativa RA 2.00: RP/SPR; RP/ROC/ROCC; RP/ROC/ROCI

foglio
type: DatatypeProperty
domain: Fonti e documenti
range: Literal
comment: Questa proprietà codifica il numero di foglio o di carta del documento per la classe di documentazione Fonti e documenti.
comment: This property represent document's folio number. @en
label: folio @en
version info: stabile
version info: stable @en
iccd norm tag: DO/FNT/FNTF

situazione
type: DatatypeProperty
domain: Intervento a fini conservativi
range: Literal
comment: Questa proprietà rappresenta la situazione in cui si svolge l'intervento di restauro. Nel caso in cui l’intervento sul bene sia in corso al momento della schedatura e non risulti ancora concluso, il valore di questa proprietà sarà "intervento in corso" con l'eventuale indicazione del luogo presso cui si sta effettuando.
comment: This property represents the framework in which the restoration is carried out. @en
label: framework @en
version info: stabile
version info: stable @en
iccd norm tag: RS/RST/RSTS

historicalBiographicalInformation
type: DatatypeProperty
domain: Agent
range: Literal
comment: Questa proprietà rappresenta informazioni di natura storico biografica relative a un agente.
comment: This property represents historical biographical information about an agent. @en

informazioni storiche
type: DatatypeProperty
domain: CulturalEntity
range: Literal
label: historical information @en
version info: stabile
version info: stable @en
iccd norm tag: ICCD Normativa Trasversale 4.00: DA/NSC

Codifica Iconclass
type: DatatypeProperty
sub property of: identifier
domain: Thing
range: Literal
comment: Questa proprietà rappresenta la codifica iconclass che permette di descrivere, mediante un codice alfanumerico, il soggetto o il motivo decorativo rappresentato su un bene culturale.
comment: This property represents the Iconclass code, for describing the subject or ornamental motif represented by the cultural property. @en
label: Iconclass Code @en
version info: stabile
version info: stable @en

informazioni raccolte sul luogo
type: DatatypeProperty
domain: CulturalEntity
range: Literal
comment: Questa proprietà rappresenta le informazioni raccolte sul luogo dove si trova il bene o sul luogo dove il bene è stato rilevato.
comment: This property represents information collected on the place where the cultural entity is located or on the place where it was detected. @en
label: information gathered on site @en
version info: stabile
version info: stable @en
iccd norm tag: ICCD Normativa Trasversale 4.00: DA/NRL

codice d'inventario
type: DatatypeProperty
sub property of: identifier
domain: Inventario
range: Literal
comment: Questa proprietà rappresenta il codice di inventario nella forma numerica o alfanumerica attribuita dalla struttura conservativa (soprintendenza, museo, galleria, deposito, ecc.) che ha effettuato l'inventariazione del bene.
comment: This property represents the inventory identifier attributed by a juridical container to a cultural property. @en
label: inventory identifier @en
version info: stabile
version info: stable @en
iccd norm tag: UB/INV/INVN

collocazione dell'inventario
type: DatatypeProperty
domain: Inventario
range: Literal
comment: Questa proprietà rappresenta la collocazione dell'inventario, cioè il luogo in cui è attualmente conservato l’inventario.
comment: This property represents the location of the inventory about a cultural property. @en
label: inventory location @en
version info: stabile
version info: stable @en
iccd norm tag: UB/INV/INVC

è mantenuto in
type: DatatypeProperty
domain: Uso
range: Literal
comment: Questa proprietà rappresenta la collocazione del bene nel suo ambiente, ovvero il luogo dove esso viene riposto quando non viene usato.
comment: This property represents the location of the asset in its environment, i.e. the place where it is stored when not in use. @en
label: is kept in @en
version info: stabile
version info: stable @en
iccd norm tag: ICCD Normativa BDM 2.00: UT/UTA

data di emissione
type: DatatypeProperty
sub property of: date
type: FunctionalProperty
domain: Class
  union of: Certificazione di importazione o esportazione
  union of: Provvedimento di tutela
range: dateTime
comment: Questa proprietà rappresenta la data di emissione di un provvedimento amministrativo o di una certificazione (es.: per la circolazione, esportazione/importazione di un bene culturale)
comment: This property represents issue date of an administrative provision or a certification. @en
label: issue date @en
version info: stabile
version info: stable @en
iccd norm tag: ICCD Normativa Trasversale 4.00: TU/NVC/NVCE; TU/ESP/ESPD

modalità di acquisizione
type: DatatypeProperty
domain: Inventario Patrimoniale
range: Literal
comment: Questa proprietà rappresenta, a testo libero, le modalità di acquisizione del bene nel patrimonio.
comment: This property represents how the cultural entity was inserted inside a collection. @en
label: method of insertion @en
version info: stabile
version info: stable @en
iccd norm tag: ICCD Normativa Trasversale 4.00: UB/INP/INPM

data di notifica
type: DatatypeProperty
sub property of: date
type: FunctionalProperty
domain: Provvedimento di tutela
range: dateTime
comment: Questa proprietà rappresenta la data della notifica del provvedimento amministrativo al proprietario.
comment: This property represents the date of notification of the administrative provision to the owner. @en
label: notice date @en
version info: stabile
version info: stable @en
iccd norm tag: ICCD Normativa Trasversale 4.00: TU/NVC/NVCD

numero nella tiratura
type: DatatypeProperty
type: FunctionalProperty
domain: CulturalEntity
range: Literal
comment: Questa proprietà rappresenta la numerazione dell'esemplare della fotografia o della stampa all'interno della tiratura e il numero complessivo degli esemplari tirati, qualora la fotografia o la stampa risalgano a una tiratura. Nel caso delle fotografie, per tiratura si intende un insieme prestabilito e limitato di esemplari (uguali) tratti dallo stesso negativo o dalla stessa, ovvero non modificata, fotografia digitale (o dalla stessa serie di matrici), numerati progressivamente.
comment: This property represents photograph copies numbering. @en
label: number in circulation @en
version info: stabile
version info: stable @en
iccd norm tag: ICCD Normativa F: PD/TRT; ICCD Normativa S: PD/TRT/TRTN

data di comunicazione di avvio
type: DatatypeProperty
sub property of: date
type: FunctionalProperty
domain: Provvedimento di tutela
range: dateTime
comment: Questa proprietà rappresenta la data (nella forma “aaaa/mm/gg”) della comunicazione di avvio del procedimento di dichiarazione di interesse al proprietario, possessore o detentore.
comment: This property represents date of interest declaration communication to the owner or holder. @en
label: opening notice date @en
version info: stabile
version info: stable @en
iccd norm tag: ICCD Normativa Trasversale 4.00: TU/NVC/NVCI

specifiche sulla sovrapposizione
type: DatatypeProperty
sub property of: specifications
domain: Fotointerpretazione e fotorestituzione
range: Literal
comment: Questa proprietà rappresenta le specifiche per effettuare sovrapposizioni con altri documenti utili per la lettura e l'interpretazione dell'immagine analizzata durante uan fotointerpretazione o fotorestituzione.
comment: This property represents specifications to make overlaps with other documents useful for reading and interpreting image analyzed during a photointerpretation or photo-repayment. @en
label: overlap specifications @en
version info: stabile
version info: stable @en
iccd norm tag: ICCD Normativa Trasversale 4.00: RE/FOI/FOIP

numero di pagina o tavola
type: DatatypeProperty
domain: Posizione della riproduzione
range: Literal
comment: Questa proprietà rappresenta le informazioni relative al numero della pagina o numero della tavola della pubblicazione in cui compare la stampa.
comment: This property represents information about page number or table number of publication in which the print appears. @en
label: page or table number @en
version info: stabile
version info: stable @en
iccd norm tag: ICCD Normativa S 3: RO/ADL/ADLN

titolo parallelo
type: DatatypeProperty
sub property of: titolo
domain: CulturalEntity
range: Literal
comment: Questa proprietà rappresenta un titolo parallelo, cioè lo stesso titolo principale tradotto in altre lingue e presentato come equivalente.
comment: This property represents the parallel title of a cultural property. @en
label: parallel title @en
version info: stabile
version info: stable @en
iccd norm tag: Normativa F: SG/SGL/SGLL - Normative S e MI: OG/SGT/SGTR

numero dell'item all'interno della serie
type: DatatypeProperty
type: FunctionalProperty
domain: Appartenenza a serie fotografica
range: Literal
comment: Questa proprietà rappresenta la numerazione della fotografia all'interno della serie fotografica editoriale.
comment: This property represents numbering of the photograph within editorial photographic series. @en
label: series item number @en
version info: stabile
version info: stable @en
iccd norm tag: ICCD Normativa F: PD/SFI/SFIN

numero dell'item all'interno della sottoserie fotografica
type: DatatypeProperty
type: FunctionalProperty
domain: Appartenenza a serie fotografica
range: Literal
comment: Questa proprietà rappresenta la numerazione della fotografia all'interno della sottoserie fotografica editoriale.
comment: This property represents numbering of the photograph within the editorial photographic subseries. @en
label: photographic subseries item number @en
version info: stabile
version info: unstable
iccd norm tag: ICCD Normativa F: PD/SSI/SSIN

attribuzione preferita di autore o responsabilità
type: DatatypeProperty
domain: Attribuzione di Autore o responsabilità
range: boolean
comment: Questa proprietà rappresenta l'attribuzione preferita di autore o responsabilità @en
comment: This property represents the preferred autorship attribution @en
label: preferred autorship attribution @en
version info: instabile
version info: unstable @en

collocazione dell'opera preparatoria o finale
type: DatatypeProperty
domain: Opera preparatoria o finale
range: Literal
comment: Questa proprietà rappresenta la localizzazione geografica e collocazione specifica dell'opera derivata dal bene culturale.
comment: This property represents geographical location and specific location of the work derived from the cultural property. @en
label: preparatory or final work location @en
version info: stabile
version info: stable @en
iccd norm tag: ICCD Normative F, RA, SMO, PST, S, OAC, OA, MI, D, NU: RO/ROF/ROFC - Normativa S: RO/COP/COPC - Normativa F: RO/CRF/CRFC

collocazione precedente dell'opera preparatoria o finale
type: DatatypeProperty
domain: Opera preparatoria o finale
range: Literal
comment: Questa proprietà rappresenta le informazioni relative all'antica o precedente l'attuale collocazione dell'opera da cui è tratta la matrice o la stampa presso collezioni, palazzi, chiese, ecc., quando questa è segnalata sulla matrice/stampa o sicuramente deducibile dalle fonti bibliografiche.
comment: This property represents information relating to ancient or previous location of the work from which the matrix or print is ​​drawn. @en
label: preparatory or final work previous location @en
version info: stabile
version info: stable @en
iccd norm tag: ICCD Normative S, MI 3: RO/ROF/ROFR

codice della scheda dell'opera originale o finale
type: DatatypeProperty
sub property of: identifier
type: FunctionalProperty
domain: Opera preparatoria o finale
range: Literal
comment: Questa proprietà rappresenta il codice, qualora esista, che identifica la scheda relativa all'opera finale o preparatoria in relazione con il bene culturale.
comment: This property represents the code which identifies the record relating to the final or preparatory work in relation with the cultural property. @en
label: preparatory or final work record identifier @en
version info: stabile
version info: stable @en
iccd norm tag: ICCD Normative F, RA, SMO, PST, S, OAC, OA, MI, D, NU: RO/ROF/ROFX

titolo proprio
type: DatatypeProperty
sub property of: titolo
domain: CulturalEntity
range: Literal
comment: Rappresenta il titolo proprio del soggetto di una stampa, di una matrice incisa o di una fotografia. Per titolo proprio di una stampa si intende il titolo principale nella forma in cui appare sulla stampa o sulla matrice stessa. Per titolo proprio (principale) di una fotografia, si intende nella forma in cui appare nell'immagine (o su uno dei suoi supporti, o nelle schede a campi testuali, o nei commenti sonori presenti all'interno del file contenente l'immagine digitale). Per la normativa F, Il titolo proprio include anche ogni eventuale titolo alternativo (altre denominazioni dell'opera che appaiano insieme al titolo principale) e, facoltativamente, i complementi del titolo proprio (ossia sottotitoli od ulteriori indicazioni che contribuiscono a qualificare più specificamente il contenuto dell'immagine).
comment: This property represents the proper title of a cultural property. @en
label: propert title @en
version info: stabile
version info: stable @en
iccd norm tag: Normative S e MI: OG/SGT/SGTP - Normativa F: SG/SGL/SGLT

provenienza
type: DatatypeProperty
domain: Inventario Patrimoniale
range: Literal
comment: Questa proprietà rappresenta, a testo libero, la provenienza del bene acquisito nel patrimonio.
comment: This property represents origin of the cultural entity acquired in the heritage. @en
label: provenance @en
version info: stabile
version info: stable @en
iccd norm tag: ICCD Normativa Trasversale 4.00: UB/INP/INPP

fa riferimento a indagini
type: DatatypeProperty
domain: Indagine su paleopatologia
range: Literal
comment: Questa proprietà rappresenta altre indagini cui fa riferimento un'indagine volta a elaborare una diagnosi di una paleopatologia rilevata in un reperto antropologico.
comment: This property represents other investigations referred to in a survey aimed at developing a diagnosis of a paleopathology found in an anthropological finding. @en
label: refers to surveys @en
version info: stabile
version info: stable @en
iccd norm tag: ICCD Normativa AT: PT/PTC/PTCI

data di registrazione o gazzetta ufficiale
type: DatatypeProperty
sub property of: date
domain: Provvedimento di tutela
range: Literal
comment: Questa proprietà rappresenta la data dell'avvenuta trascrizione al registro immobiliare, quando trattasi di vincoli imposti con leggi che richiedano la trascrizione, o il numero della Gazzetta Ufficiale su cui è stato pubblicato il decreto.
comment: This property represents the date of the registration or the number of the Official Journal on which the decree was published. @en
label: registration date or official journal @en
version info: stabile
version info: stable @en
iccd norm tag: ICCD Normativa Trasversale 4.00: TU/NVC/NVCR

note su opere collegate
type: DatatypeProperty
sub property of: note
domain: CulturalEntity
range: Literal
comment: Questa proprietà rappresenta note generali sulle relazioni instaurate fra il bene in esame e altre opere.
comment: This property represents general notes on the relationships established between the property in question and other works. @en
label: related work note @en
version info: stabile
version info: stable @en
iccd norm tag: ICCD Normativa Trasversale 4.00: RV/REZ

riferimento agli atti
type: DatatypeProperty
domain: Inventario Patrimoniale
range: Literal
comment: Questa proprietà rappresenta, a testo libero, eventuali riferimenti a documenti (atti amministrativi; riproduzioni digitali di registri inventariali, ecc.) che interessano l'acquisizione del bene nel patrimonio. Rappresenta anche i dati relativi ai registri inventariali in vigore, ma comunque dotati di qualità storica.
comment: This property represents any references to documents that affect cultural entity acquisition. @en
label: relevant legal act @en
version info: stabile
version info: stable @en
iccd norm tag: ICCD Normativa Trasversale 4.00: IUB/INP/INPO

referto
type: DatatypeProperty
domain: Class
  union of: Indagine su bene archeologico
  union of: Indagine archeometrica e diagnostica
range: Literal
comment: ICCD Normativa Trasversale 4.00: RE/IND/INDT - ICCD Normativa AT 3.00: IN/INI/INIR
comment: Questa proprietà rappresenta il referto di un'indagine archeometrica e diagnostica o di una tipologia particolare di bene archeologico, ovvero i reperti antropologici.
comment: This property represents the report of a anthropological finding's archaeometric and diagnostic investigation. @en
label: report @en
version info: stabile
version info: stable @en

gestione diritti
type: DatatypeProperty
domain: Class
  union of: CulturalEntity
  union of: Documentazione
range: Literal
comment: Questa proprietà rappresenta le informazioni a testo libero sulla gestione dei diritti. Nel caso di un bene culturale, permette di rappresentare indicazioni sulla presenza dei privilegi, autorizzazioni, licenze, specificando il concedente, eventualmente riportando anche il periodo di tempo della privativa.
comment: This property represents information on rights management. @en
label: rights @en
version info: stabile
version info: stable @en
iccd norm tag: ICCD Normativa Trasversale 4.00: DO/FTA/FTAY, DO/DRA/DRAY, DO/VDC/VDCY, DO/REG/REGY, DO/FNT/FNTY, DO/BIB/BIBY - ICCD Normativa MI 3.00: DA/PLC

sesso stimato
type: DatatypeProperty
type: FunctionalProperty
domain: Interpretazione del sesso
range: Literal
comment: Questa proprietà rappresenta il sesso stimato nel contesto della stima del sesso di un reperto antropologico.
comment: This property represents anthropological finding estimated sex. @en
label: estimated sex @en
version info: stabile
version info: stable @en

strisciata/numero fotogramma
type: DatatypeProperty
domain: Documentazione fotografica
range: Literal
comment: Questa proprietà rappresenta, per le foto aeree, le informazioni relative alla strisciata e al fotogramma.
comment: This property represents aerial photos information about run and frame. @en
label: strip run/frame number @en
version info: stabile
version info: stable @en
iccd norm tag: FTAR

soggetto
type: DatatypeProperty
domain: CulturalEntity
range: Literal
comment: Questa proprietà rappresenta il soggetto rappresentato da un bene culturale o il suo motivo decorativo.
comment: This property represents the subject of a cultural property, or its ornamental motif. @en
label: subject @en
version info: stabile
version info: stable @en
iccd norm tag: ICCD Normativa Trasversale: DA/AID/AIDI - Normativa F: SG/SGT/SGTI - Altre normative di versioni precedenti alla 4.00: OG/SGT/SGTI

identificativo immagine di indagine
type: DatatypeProperty
sub property of: identifier
type: FunctionalProperty
domain: Immagine di indagine
range: Literal
comment: Questa proprietà rappresenta il codice identificativo che individua l'immagine presa in esame nel corso di un'indagine di fotointerpretazione o fotorestituzione.
comment: This property represents the identification code that identifies the image examined during a photo-interpretation or photo-restoration investigation. @en
label: survey image identifier @en
version info: stabile
version info: stable @en
iccd norm tag: ICCD Normativa Trasversale 4.00: RE/FOI/FOID

autore e data della tassonomia
type: DatatypeProperty
type: FunctionalProperty
range: Literal
comment: Questa proprietà rappresenta l'autore che ha descritto la specie e l'anno di descrizione.
comment: This property represents the author that described the species and the date of description. @en
label: taxon author and date @en
version info: stabile
version info: stable @en
iccd norm tag: ICCD Normativa AT: OG/OGS/OGSA

documentazione tecnica
type: DatatypeProperty
domain: Indagine su bene archeologico
range: Literal
comment: Questa proprietà rappresenta la documentazione relativa alle informazioni rilevate nel corso dell'indagine su reperto antropologico.
comment: This property represents documentation relating to information collected during survey on anthropological evidence. @en
label: technical documentation @en
version info: stabile
version info: stable @en
iccd norm tag: ICCD Normativa AT 3.01: IN/INI/INIZ

titolo
type: DatatypeProperty
domain: CulturalEntity
range: Literal
comment: Questa proprietà rappresenta il titolo del soggetto di un bene culturale. La proprietà viene specificata in sottoproprietà per esprimere tipologie di titolo specifiche. Per la normativa trasversale è il titolo più noto e accreditato; nelle altre normative si specifica che è il titolo dato dall'autore o la denominazione tradizionale del soggetto.
comment: This property represents the title of a cultural property. @en
label: title @en
version info: stabile
version info: stable @en
iccd norm tag: Normativa trasversale: DA/AID/AIDT - Altre normative di versioni precedenti alla 4.00: OG/SGT/SGTT

modalità di uso
type: DatatypeProperty
type: FunctionalProperty
domain: Uso
range: Literal
label: use conditions @en
version info: stabile
version info: stable @en
iccd norm tag: ICCD Normativa Trasversale 4.00: UT/UTU/UTUM - BDM 2.00: UT/UTM - SMO, PTS 3.01: DA/UTM

funzione d'uso
type: DatatypeProperty
type: FunctionalProperty
domain: Funzione d'uso
range: Literal
comment: Questa proprietà rappresenta la funzione che l'oggetto ha o ha avuto.
comment: This property represents object function. @en
label: use function @en
version info: stabile
version info: stable @en
iccd norm tag: ICCD Normativa Trasversale: UT/UTU/UTUF - BDM 2.00:UT/UTF - PST 3.01: DA/UTF

Acquisizione
type: Class
subclass of: Situation
subclass of: Restriction
  on property: ha tipo di acquisizione
  some values from: Tipo di acquisizione
subclass of: Restriction
  on property: è acquisizione di
  some values from: CulturalEntity
subclass of: Restriction
  on property: ha soggetto fonte dell'acquisizione
  all values from: Agent
subclass of: Restriction
  on property: luogo di acquisizione
  all values from: Literal
subclass of: Restriction
  on property: time
  all values from: Literal
description: An example of usage of the class 'Acquisition' is the following: resource:Acquisition/1200865053-acquisition-1 a cd:Acquisition ; rdfs:label "Acquisition 1 of cultural property: 1200865053"@it ; cd:hasAcquisitionType resource:AcquisitionType/donazione ; cd:hasPreviousOwner resource:Agent/auriti-giacinto ; tiapit:time "1963" . @en
description: Un esempio d'uso della classe 'Acquisizione' è il seguente: resource:Acquisition/1200865053-acquisition-1 a cd:Acquisition ; rdfs:label "Acquisizione 1 del bene culturale: 1200865053"@it ; cd:hasAcquisitionType resource:AcquisitionType/donazione ; cd:hasPreviousOwner resource:Agent/auriti-giacinto ; tiapit:time "1963" .
comment: Questa classe rappresenta un evento in cui un bene culturale è stato acquisito e si trova in una certa condizione giuridica.
comment: This class represents a situation in which a cultural property is acquired, passing from an owner to another, and has a particular legal situation. @en
label: Acquisition @en
version info: stabile
version info: stable @en
iccd norm tag: ICCD Normativa Trasversale 4.00: TU/ACQ

Tipo di acquisizione
type: Class
subclass of: Type
comment: Questa classe rappresenta il tipo di acquisizione (es.: acquisto, alienazione, confisca, donazione) che ha interessato il bene culturale.
comment: This class represents the type of acquisition (e.g. purchase, donation, etc.) of a cultural property. @en
label: Acquisition type @en
version info: stabile
version info: stable @en
iccd norm tag: ICCD Normativa Trasversale 4.00: TU/ACQ/ACQT

Interpretazione dell'età della morte
type: Class
subclass of: Interpretazione
subclass of: Restriction
  on property: è età della morte stimata di
  some values from: CulturalEntity
subclass of: Restriction
  on property: età della morte stimata
  some values from: Literal
comment: Questa classe rappresenta la stima dell'età della morte di un reperto antropologico.
comment: This class represents the interpretation of the age of death of an anthropological material. @en
label: Age of death interpretation @en
version info: stabile
version info: stable @en
iccd norm tag: ICCD Normativa AT: DA/SEM

Attribuzione Alternativa di Autore
type: Class
subclass of: Attribuzione di Autore o responsabilità
subclass of: Restriction
  on property: ha autore attribuito
  some values from: Agent
subclass of: Restriction
  on property: intervento dell'autore
  all values from: Literal
comment: Questa classe rappresenta un'attribuzione di autore superata, alternativa o tradizionale.
comment: This class represents an authorship attribution alternative to the preferred one. @en
label: Alternative Authorship Attribution @en
version info: stabile
version info: stable @en
iccd norm tag: AU/AAT

Datazione alternativa
type: Class
subclass of: Cronologia
subclass of: Restriction
  on property: ha datazione alternativa
  some values from: Tipo di datazione alternativa
comment: Questa classe rappresenta una eventuale altra datazione che può riguardare un bene culturale (es.: datazione tradizionale, altro metodo di datazione).
comment: This class represents an alternative dating of a cultural property (e.g.: an obsolete dating, a dating based on another method of dating). @en
label: Alternative dating @en
version info: stabile
version info: stable @en
iccd norm tag: ICCD Normativa Trasversale: DT/ADT.

Tipo di datazione alternativa
type: Class
subclass of: Type
comment: Questa classe rappresenta il tipo di datazione alternativa che può riguardare un bene culturale (es.: altro metodo di datazione, datazione superata)
comment: This class represents the type of alternative dating of a cultural property (different dating, obsolete dating, other method dating) @en
label: Alternative dating type @en
version info: stabile
version info: stable @en
iccd norm tag: ICCD Normativa Trasversale: DT/ADT/ADTT.

Anomalia
type: Class
subclass of: Situation
subclass of: Restriction
  on property: è anomalia di
  some values from: Fotointerpretazione e fotorestituzione
subclass of: Restriction
  on property: ha origine dell'anomalia
  all values from: Origine dell'anomalia
subclass of: Restriction
  on property: ha tipo di anomalia
  all values from: Tipo di anomalia
comment: Questa classe rappresenta un'anomalia rilevata nel corso di una fotointerpretazione o fotorestituzione.
comment: This class represents an anomaly detected during a photo interpretation or rendering. @en
label: Anomaly @en
version info: stabile
version info: stable @en
iccd norm tag: ICCD Normativa Trasversale 4.00: RE/FOI/FOIA

Origine dell'anomalia
type: Class
subclass of: CulturalEntityCharacteristic
subclass of: Restriction
  on property:
    inverse of: ha origine dell'anomalia
  all values from: Anomalia
disjoint with: Stadio del bene culturale
comment: Questa classe rappresenta l'origine dell'anomalia rilevata nell'indagine di fotointerpretazione o fotorestituzione.
comment: This class represents the anomaly origin of the photo interpretation rendering. @en
label: Anomaly origin @en
version info: stabile
version info: stable @en
iccd norm tag: ICCD Normativa Trasversale 4.00: RE/FOI/FOIA

Tipo di anomalia
type: Class
subclass of: Type
comment: Questa classe rappresenta il tipo di anomalia (puntuale, lineare, areale) rilevata durante una fotointerpretazione o fotorestituzione.
comment: This class represents the type of anomaly (line anomaly, point anomaly, polygon anomaly) observed during a photo interpretation or rendering survey. @en
label: Anomaly type @en
version info: stabile
version info: stable @en
iccd norm tag: ICCD Normativa Trasversale 4.00: RE/FOI/FOIQ

Scavo archeologico
type: Class
subclass of: Indagine
subclass of: Restriction
  on property: ha responsabile dell'attività
  all values from: Agent
subclass of: Restriction
  on property: ha unità stratigrafica
  all values from: Unità stratigrafica
subclass of: Restriction
  on property: ha metodo di indagine
  all values from: Metodo di indagine
subclass of: Restriction
  on property: ha motivo di indagine
  all values from: Motivo di indagine
subclass of: Restriction
  on property: ha responsabile scientifico dell'indagine
  all values from: Agent
subclass of: Restriction
  on property: ha deposizione funeraria
  all values from: Deposizione funeraria
subclass of: Restriction
  on property: codice univoco ICCD dello scavo archeologico
  all values from: Literal
subclass of: Restriction
  on property: codice identificativo locale dello scavo archeologico
  all values from: Literal
subclass of: Restriction
  on property: settore ambiente quadrato
  all values from: Literal
comment: Questa classe rappresenta un tipo particolare di indagine su bene culturale, ovvero uno scavo archeologico, inteso come scavo stratigrafico.
comment: This class represents a particular type of survey on a cultural property, that is an archaeological (stratigraphic) excavation. @en
label: Archaeological excavation @en
version info: stabile
version info: stable @en
iccd norm tag: ICCD Normativa Trasversale 4.00: RE/DSC

Ricognizione archeologica
type: Class
subclass of: Indagine
subclass of: Restriction
  on property: ha responsabile dell'attività
  all values from: Agent
subclass of: Restriction
  on property: ha metodo di indagine
  all values from: Metodo di indagine
subclass of: Restriction
  on property: ha responsabile scientifico dell'indagine
  all values from: Agent
subclass of: Restriction
  on property: codice univoco ICCD della ricognizione archeologica
  all values from: Literal
subclass of: Restriction
  on property: codice identificativo locale della ricognizione archeologica
  all values from: Literal
subclass of: Restriction
  on property: situazione ambientale
  all values from: Literal
comment: Questa classe rappresenta un tipo particolare di indagine su bene culturale, ovvero una ricognizione archeologica, intesa come ricognizione di superficie.
comment: This class represents a particular type of survey on a cultural property, that is an archaeological field survey, limited to the surface. @en
label: Archaeological field survey @en
version info: stabile
version info: stable @en
iccd norm tag: ICCD Normativa Trasversale 4.00: RE/RCG

Indagine su bene archeologico
type: Class
subclass of: Indagine
subclass of: Restriction
  on property: ha tipo di indagine su bene archeologico
  all values from: Tipo di indagine su bene archeologico
subclass of: Restriction
  on property: ha motivo di indagine
  all values from: Motivo di indagine
subclass of: Restriction
  on property: documentazione tecnica
  all values from: Literal
comment: Questa classe rappresenta un'indagine su una tipologia particolare di bene archeologico, ovvero i reperti antropologici (es.: analisi istologica, analisi chimica, TC, etc.).
comment: This class represents a particular type of survey on a cultural property, that is a survey on anthropological materials (e.g.: chemical analysis, histological analysis, CT scan, etc.). @en
label: Archaeological property survey @en
version info: stabile
version info: stable @en
iccd norm tag: ICCD Normativa AT 3.01: IN/INI

Tipo di indagine su bene archeologico
type: Class
subclass of: Type
comment: Questa classe rappresenta il tipo di indagine su bene archeologico.
comment: This class represents the type of archaeological property survey. @en
label: Archaeological property survey type @en
version info: stabile
version info: stable @en
iccd norm tag: ICCD Normativa AT 3.01: IN/INI/INIT

Indagine archeometrica e diagnostica
type: Class
subclass of: Indagine
subclass of: Restriction
  on property: ha operatore dell'attività
  all values from: Agent
subclass of: Restriction
  on property: ha responsabile dell'attività
  all values from: Agent
subclass of: Restriction
  on property: ha finanziatore dell'attività
  all values from: Agent
subclass of: Restriction
  on property: ha tipo di indagine archeometrica e diagnostica
  all values from: Tipo di indagine archeometrica e diagnostica
subclass of: Restriction
  on property: ha motivo di indagine
  all values from: Motivo di indagine
subclass of: Restriction
  on property: referto
  all values from: Literal
comment: Questa classe rappresenta un tipo particolare di indagine su bene culturale, ovvero un'indagine archeometrica e diagnostica (carotaggi, prospezioni geofisiche, analisi di vario tipo).
comment: This class represents a particular type of survey on a cultural property, that is an archaeometric and diagnostic survey (coring, geophysical prospecting, etc.). @en
label: Archaeometric and diagnostic survey @en
version info: stabile
version info: stable @en
iccd norm tag: ICCD Normativa Trasversale 4.00: RE/IND - ICCD normative di versioni precedenti: RE/AIN

Tipo di indagine archeometrica e diagnostica
type: Class
subclass of: Type
comment: Questa classe rappresenta il tipo di indagine archeometrica e diagnostica (es.: analisi della malta, carotaggio, termografia, etc.)
comment: This class represents the type of archaeometric and diagnostic survey (e.g. coring) @en
label: Archaeometric diagnostic survey type @en
version info: stabile
version info: stable @en
iccd norm tag: ICCD Normativa Trasversale 4.00: RE/IND/INDI - ICCD normative di versioni precedenti: RE/AIN/AINT

Fondo archivistico
type: Class
subclass of: Unità archivistica complessa
subclass of: Restriction
  on property: hasComponent
  all values from: Serie archivistica
is native to: BornDigitalArchives ODP.owl
comment: Questa classe rappresenta un fondo archivistico.
comment: This class represents an archival fonds. @en
label: Archival fonds @en
version info: stabile
version info: stable @en
iccd norm tag: ICCD Normativa F: UB/UBF/UBFP

Unità documentaria
type: Class
subclass of: Object
subclass of: Restriction
  on property: isPartOf
  all values from: Unità archivistica complessa
subclass of: Restriction
  on property: identificativo di unità documentaria
  all values from: Literal
is native to: BornDigitalArchives ODP.owl
comment: Questa classe rappresenta una unità documentaria che fa parte di una unità archivistica complessa.
comment: This class represents the archival record that is part of an archival record set. @en
label: Archival record @en
version info: stabile
version info: stable @en
iccd norm tag: ICCD Normativa F: UB/UBF

Unità archivistica complessa
type: Class
subclass of: Collection
subclass of: Restriction
  on property: ha titolo
  all values from: Titolo
subclass of: Restriction
  on property: hasPart
  all values from: Class
    union of: Unità documentaria
    union of: Unità archivistica complessa
subclass of: Restriction
  on property: identificativo di unità archivistica complessa
  all values from: Literal
is native to: BornDigitalArchives ODP.owl
description: An example of usage of on of the subclasses of the class 'Archival Record Set' is the following: resource:ArchivalSubseries/museo-civico-romano a cd:ArchivalSubseries ; rdfs:label "Museo Civico Romano" ; cd:isArchivalRecordSetIn resource:ArchivalRecordSetMembership/1201251092 ; core:isComponentOf resource:ArchivalSeries/brescia . @en
description: Un esempio d'uso di una delle sottoclassi di 'Unità archivistica complessa' è il seguente: resource:ArchivalSubseries/museo-civico-romano a cd:ArchivalSubseries ; rdfs:label "Museo Civico Romano" ; cd:isArchivalRecordSetIn resource:ArchivalRecordSetMembership/1201251092 ; core:isComponentOf resource:ArchivalSeries/brescia .
comment: Questa classe rappresenta un'unità archivistica complessa (fondo, serie, sottoserie, etc.) di cui un bene culturale può fare parte.
comment: This class represents an archival record set (fonds, series, subseries) of which a cultural property can be member. @en
label: Archival record set @en
version info: stabile
version info: stable @en
iccd norm tag: ICCD Normativa F: UB/UBF

Appartenenza a unità archivistica complessa
type: Class
subclass of: Appartenenza
subclass of: Restriction
  on property: ha unità archivistica complessa
  some values from: Unità archivistica complessa
subclass of: Restriction
  on property: ha membro di unità archivistica complessa
  some values from: CulturalEntity
subclass of: Restriction
  on property: collocazione di unità documentaria
  all values from: Literal
subclass of: Restriction
  on property: titolo di unità archivistica complessa
  all values from: Literal
comment: Questa classe rappresenta l'appartenenza di un bene culturale a un'unità archivistica complessa (fondo, serie, sottoserie, etc.).
comment: This class represents the membership of a cultural property in an archival record set. @en
label: Archival record set membership @en
version info: stabile
version info: stable @en
iccd norm tag: ICCD Normativa F: UB/UBF

Serie archivistica
type: Class
subclass of: Unità archivistica complessa
subclass of: Restriction
  on property: hasComponent
  all values from: Sottoserie archivistica
subclass of: Restriction
  on property: isComponentOf
  all values from: Fondo archivistico
is native to: BornDigitalArchives ODP.owl
comment: Questa classe rappresenta una serie archivistica.
comment: This class represents an archival series. @en
label: Archival series @en
version info: stabile
version info: stable @en
iccd norm tag: ICCD Normativa F: UB/UBF/UBFS

Sottoserie archivistica
type: Class
subclass of: Unità archivistica complessa
subclass of: Restriction
  on property: isComponentOf
  all values from: Serie archivistica
comment: Questa classe rappresenta una sottoserie archivistica, ovvero una partizione interna alla serie.
comment: This class represents an archival subseries, that is component of an archival series. @en
label: Archival subseries @en
version info: stabile
version info: stable @en
iccd norm tag: ICCD Normativa F: UB/UBF/UBFT

Documentazione audio
type: Class
subclass of: Documentazione
subclass of: Restriction
  on property: ha formato
  some values from: Class
    intersection of: Tipo di documentazione
    intersection of: Formato
comment: Questa classe rappresenta la documentazione audio relativa a un oggetto, per esempio a un bene culturale.
comment: This class represents the audio documentation of an object, e.g. a cultural property. @en
label: Audio documentation @en
version info: stabile
version info: stable @en
iccd norm tag: DO/REG

Attribuzione di Autore o responsabilità
type: Class
subclass of: Interpretazione
subclass of: Restriction
  on property: è attribuzione di autore/responsabilità di
  some values from: CulturalEntity
subclass of: Restriction
  on property: ha autore attribuito
  all values from: Agent
subclass of: Restriction
  on property: ha ente schedatore dell'authority file
  all values from: Agent
subclass of: Restriction
  on property: ha ambito culturale
  all values from: Ambito culturale
subclass of: Restriction
  on property: ha ruolo nell'intervento
  all values from: Role
comment: Questa classe rappresenta l'attribuzione di un autore o di una responsabilità per la creazione di un bene culturale, cioè le informazioni relative ai soggetti (persone singole o enti collettivi) intervenuti nella realizzazione del bene e/o all'ambito culturale di riferimento.
comment: This class represents the attribution of authorship or a responsibility for the creation of a cultural property, referring to the agents that played a role in the creation of the cultural property or to the reference cultural scope. @en
label: Authorship Attribution @en
version info: stabile
version info: stable @en
iccd norm tag: ICCD Normativa Trasversale: AU/AAT; AU/ATB; AU/AUT

Bibliografia
type: Class
subclass of: Object
subclass of: Restriction
  on property: è bibliografia di
  some values from: Thing
subclass of: Restriction
  on property: ha tipo di bibliografia
  all values from: Tipo di bibliografia
subclass of: Restriction
  on property: ha edizione
  all values from: Edizione
subclass of: Restriction
  on property: hasCategory
  all values from: Genere della bibliografia
subclass of: Restriction
  on property: riferimento bibliografico completo
  some values from: Literal
subclass of: Restriction
  on property: abbreviazione
  all values from: Literal
subclass of: Restriction
  on property: codice univoco ICCD della bibliografia
  all values from: Literal
subclass of: Restriction
  on property: specifications
  all values from: Literal
subclass of: Restriction
  on property: URL
  all values from: anyURI
comment: Questa classe rappresenta un riferimento bibliografico che riguarda un'entità, per esempio un bene culturale.
comment: This class represents the bibliography of an entity, e.g. a cultural property. @en
label: Bibliography @en
version info: stabile
version info: stable @en
iccd norm tag: ICCD Normativa Trasversale 4.00: DO/BIB; RE/RCG/RCGS - Normative VeAC e AT 3.01: DO/BIB; DO/BSE.

Genere della bibliografia
type: Class
subclass of: Category
comment: Questa classe rappresenta la categoria della bibliografia. Nel contesto delle normative per la catalogazione ICCD, questa classe ha associato un vocabolario chiuso definito in tre tipi: bibliografia specifica, bibliografia di confronto e bibliografia di corredo.
comment: This class represents the category associated to a bibliography (e.g. accompanying bibliography, comparative bibliography, specific bibliography). @en
label: Bibliography category @en
version info: stabile
version info: stable @en
iccd norm tag: ICCD Normative OA-OAC-MI-D-S-RA-TMA-CA-MA-SAS-SI 3.00: DO/BIB/BIBX - Normative VeAC e AT 3.01: DO/BSE/BSEX.

Tipo di bibliografia
type: Class
subclass of: Type
disjoint with: Tipo di documentazione
comment: Questa classe rappresenta il tipo di riferimento bibliografico.
comment: This class represents the type of bibliography. @en
label: Bibliography type @en
version info: stabile
version info: stable @en
iccd norm tag: ICCD Normativa Trasversale DO/BIB/BIBF - Normative VeAC e AT 3.01: DO/BSE/BSES.

Tassonomia biologica
type: Class
subclass of: Classification
subclass of: Restriction
  on property: è tassonomia biologica di
  some values from: Thing
subclass of: Restriction
  on property: ha genere
  max qualified cardinality: 1
  on class: Genere
subclass of: Restriction
  on property: ha specie
  max qualified cardinality: 1
  on class: Specie
subclass of: Restriction
  on property: ha sottospecie
  max qualified cardinality: 1
  on class: Sottospecie
comment: Questa classe rappresenta una tassonomia biologica, ossia i criteri con cui si ordinano gli organismi in un sistema di classificazione.
comment: This class represents a biological taxon. @en
label: Biological taxon @en
deprecated: true
version info: stabile
version info: stable @en
iccd norm tag: ICCD Normativa AT: OG/OGS

Mutamento condizione materiale
type: Class
subclass of: Situation
subclass of: Restriction
  on property: ha tipo di mutamento condizione materiale
  some values from: Tipo di mutamento condizione materiale
subclass of: Restriction
  on property: è mutamento di condizione materiale di
  some values from: CulturalEntity
description: An example of usage of the class 'Change of availability' is the following: resource:ChangeOfAvailability/0900041230-change-of-availability a cd:ChangeOfAvailability ; rdfs:label "Change of availability of cultural property: 0900041230"@en ; cd:hasChangeOfAvailabilityType resource:ChangeOfAvailabilityType/furto ; tiapit:time "1998/11/15" . @en
description: Un esempio d'uso della classe 'Mutamento condizione materiale' è il seguente: resource:ChangeOfAvailability/0900041230-change-of-availability a cd:ChangeOfAvailability ; rdfs:label "Mutamento condizione materiale del bene culturale: 0900041230"@it ; cd:hasChangeOfAvailabilityType resource:ChangeOfAvailabilityType/furto ; tiapit:time "1998/11/15" .
comment: Questa classe rappresenta un evento che modifica la disponibilità materiale del bene culturale (es. per distruzione, furto, perdita, recupero)
comment: This class represents the change of availability of a cultural property (e.g.: theft, distruction, rescue, etc.) @en
label: Change of availability @en
version info: stabile
version info: stable @en
iccd norm tag: ICCD Normativa Trasversale 4.00: TU/ALN

Tipo di mutamento condizione materiale
type: Class
subclass of: Type
comment: Questa classe rappresenta il tipo di mutamento di condizione materiale di un bene culturale (es.: furto, distruzione, recupero).
comment: This class represents the type of change of availability of a cultural property (e.g. theft, distruction) @en
label: Change of availability type @en
version info: stabile
version info: stable @en
iccd norm tag: ICCD Normativa Trasversale 4.00: TU/ALN/ALNT

Occasione
type: Class
subclass of: Situation
subclass of: Restriction
  on property: è circostanza di
  some values from: Thing
subclass of: Restriction
  on property: ha tipo di circostanza
  all values from: Tipo di circostanza
comment: Questa classe rappresenta un'occasione che ha determinato una certa situazione, per esempio l'occasione per cui è stato commissionato un bene culturale, l'occasione che ha determinato la ripresa di un bene fotografico, l'occasione d'uso di un bene, l'occasione di un bene demoetnoantropologico immateriale.
comment: This class represents a circumstance that influenced a particular situation, e.g. the circumstance for which a cultural property was commissioned, tha circumstance in which a cultural property was used, etc. @en
label: Circumstance @en
label: Occasion @en
version info: stabile
version info: stable @en
iccd norm tag: ICCD Normativa Trasversale: UT/UTU/UTUO - Normativa BDM: UT/UTO; AU/CMM/CMMC - Normativa VeAC: AU/FRU/FRUC - Normativa F: LR/LRO - Normativa BDI: CA

Tipo di circostanza
type: Class
subclass of: Type
comment: Questa classe rappresenta il tipo di occasione (es.: civile, religiosa).
comment: This class represents the circumstance type (e.g.: civil, religious) @en
comment: This class represents the type of circumstance (e.g. civil, religious) @en
label: Circumstance type @en
version info: stabile
version info: stable @en
iccd norm tag: ICCD Normativa BDI: CA/CAR; CA/CAC

Emissione di moneta
type: Class
subclass of: Situation
subclass of: Restriction
  on property: è emissione di moneta
  some values from: CulturalEntity
subclass of: Restriction
  on property: ha soggetto emittente
  all values from: Agent
subclass of: Restriction
  on property: ha Stato emittente
  all values from: Agent
subclass of: Restriction
  on property: ha zecca
  all values from: Agent
subclass of: Restriction
  on property: ha zecchiere
  all values from: Agent
comment: Questa classe rappresenta l'emissione di una moneta, intesa come un evento collocato nel tempo, cui partecipano diversi agenti con diversi ruoli (Stato emittente, Zecca, Monetiere, etc.)
comment: This class represents the issuance of a coin, at a particular time and with different agents participanting to it (Mint, Issuing State, etc.) @en
label: Coin issuance @en
version info: stabile
version info: stable @en
iccd norm tag: ICCD Normativa NU: DA/AUE - ICCD Normativa OA (dopo il rilascio della specifica scheda NU nel 2004 la scheda OA non è stata più utilizzata per la catalogazione di monete e medaglie): AU/EDT

Appartenenza a Collezione
type: Class
subclass of: Appartenenza
subclass of: Restriction
  on property: ha membro di collezione
  some values from: CulturalEntity
subclass of: Restriction
  on property: ha collezione
  all values from: CollectionCulEnt
subclass of: Restriction
  on property: atTime
  all values from: TimeInterval
subclass of: Restriction
  on property: motivo di uscita dalla collezione
  all values from: Literal
subclass of: Restriction
  on property: codice inventario bene in collezione
  all values from: Literal
subclass of: Restriction
  on property: valore del bene culturale
  all values from: Literal
comment: Questa classe rappresenta l'appartenenza di un bene culturale a una collezione, in un certo intervallo di tempo. Uno stesso bene culturale può aver fatto parte di più collezioni nel corso del tempo.
comment: This class represents the membership of a cultural property in a collection. @en
label: Collection Membership @en
version info: stabile
version info: stable @en
iccd norm tag: UB/COL

Committenza
type: Class
subclass of: Interpretazione
subclass of: Restriction
  on property: è committenza di
  some values from: CulturalEntity
subclass of: Restriction
  on property: ha circostanza
  all values from: Occasione
subclass of: Restriction
  on property: ha committente
  all values from: Agent
comment: Questa classe rappresenta l'individuazione della committenza relativa a un bene culturale.
comment: This class represents the commission of a cultural property. @en
label: Commission @en
version info: stabile
version info: stable @en
iccd norm tag: ICCD Normativa Trasversale 4.00: AU/CMM

Intervento a fini conservativi
type: Class
subclass of: Intervento
subclass of: Restriction
  on property: situazione
  all values from: Literal
comment: Questa classe rappresenta un particolare tipo di intervento che ha interessato un bene culturale, cioè un intervento a fini conservativi (termine che sostituisce l'obsoleto "restauro", presente nelle versioni di normativa precedenti alla 4.00). Per esempio: consolidamento, controllo microclimatico, trattamento biocida-disinfestazione, rimozione di elementi non originali, pulitura meccanica, pulitura chimica, protezione finale, riadesione parti, trattamento parti metalliche.
comment: This class represents a conservation intervention on a cultural property (e.g.: microclimatic inspection, mechanical cleaning or with chemicals, pest control, etc.) @en
label: Conservation Intervention @en
version info: stabile
version info: stable @en
iccd norm tag: ICCD Normativa Trasversale 4.00: CO/RST quando RSTI='consolidamento' or 'controllo microclimatico' or 'trattamento biocida-disinfestazione' or 'rimozione di elementi non originali' or 'pulitura meccanica' or 'pulitura chimica' or 'protezione finale' or 'riadesione parti' or 'trattamento parti metalliche' - Normative di versioni precedenti: RS/RST

Copia
type: Class
subclass of: Opera derivata
comment: Questa classe rappresenta la copia di un bene culturale, per esempio di una fotografia o di una stampa. Nel caso della fotografia, in questo caso viene esplicitamente dichiarata la responsabilità del fotografo principale.
comment: This class represents the copy of a cultural property, e.g. a copy of a photography or a print. @en
label: Copy @en
version info: stabile
version info: stable @en
iccd norm tag: ICCD Normativa S 3: RO/COP; ICCD Normativa F: RO/CRF/CRFT = 'copia'

Diritti d'autore
type: Class
subclass of: Object
subclass of: Restriction
  on property: ha titolare dei diritti d'autore
  some values from: Agent
subclass of: Restriction
  on property: sono diritti d'autore di
  some values from: Thing
subclass of: Restriction
  on property: data di scadenza
  some values from: Literal
comment: Questa classe rappresenta i diritti d'autore detenuti da un agente su un oggetto, per esempio un bene culturale.
comment: This class represents the copyright of an object, e.g. a cultural property. @en
label: Copyright @en
version info: stabile
version info: stable @en
iccd norm tag: ICCD Normativa F 4.00 e OAC: TU/CPR

Stima di bene culturale
type: Class
subclass of: Stima
subclass of: Restriction
  on property: è stima del bene culturale
  some values from: CulturalEntity
subclass of: Restriction
  on property: valore del bene culturale
  some values from: Literal
comment: Questa classe rappresenta una stima di un bene culturale.
comment: This class represents the estimate of a cultural property. @en
label: Cultural property estimate @en
version info: stabile
version info: stable @en
iccd norm tag: ICCD Normativa Trasversale 4.00: UB/STI

Stadio del bene culturale
type: Class
subclass of: CulturalEntityCharacteristic
subclass of: Restriction
  on property: è stadio del bene culturale in
  all values from: Rapporto con opera collegata
comment: Questa classe rappresenta lo stadio del bene catalogato in rapporto con l'oggetto che ne costituisce una fase preparatoria o che ne rappresenta la fase finale.
comment: This class represents the stage of the catalogued cultural property related to the object which constitutes its preparatory or final stage. @en
label: Cultural property stage @en
version info: stabile
version info: stable @en
iccd norm tag: ICCD Normative RA, SMO, PST, S, OAC, OA, MI, D, NU, F: RO/ROF/ROFF

Ambito culturale
type: Class
subclass of: Topic
subclass of: Restriction
  on property: è ambito culturale di
  some values from: Attribuzione di Ambito Culturale
comment: Questa classe rappresenta l'ambito culturale a cui può essere riferito un bene culturale. Per l'ambito culturale si usano definizioni quali: ambito, cultura, periodo, produzione, scuola, manifattura, ecc.; a questi termini segue la qualificazione geografica o il nome dell'ambito, della cultura, del periodo, della produzione, della scuola, della manifattura, ecc. Nel caso della normativa VeAC, questa classe rappresenta l'ambito sartoriale/di produzione, ovvero il contesto sartoriale (oppure la manifattura, la maestranza, ecc.) a cui può essere ricondotta la realizzazione del bene catalogato.
comment: This class represents the cultural scope related to a cultural property (e.g.: neoclassical, Milanese manifacturing, etc.) @en
label: Cultural Scope @en
version info: stabile
version info: stable @en
iccd norm tag: ICCD Normativa Trasversale 4.00: AU/ATB

Attribuzione di Ambito Culturale
type: Class
subclass of: Attribuzione di Autore o responsabilità
subclass of: Restriction
  on property: ha ambito culturale
  some values from: Ambito culturale
comment: Questa classe rappresenta l'attribuzione di un ambito culturale a cui può essere riferito il bene culturale. Per l'ambito culturale si usano definizioni quali: ambito, cultura, periodo, produzione, scuola, manifattura, ecc.; a questi termini segue la qualificazione geografica o il nome dell'ambito, della cultura, del periodo, della produzione, della scuola, della manifattura, ecc.
comment: This class represents the attribution of a cultural scope, to which the cultural property is related (e.g.: neoclassical, Milanese manifacturing, etc.) @en
label: Cultural Scope Attribution @en
version info: stabile
version info: stable @en
iccd norm tag: AU/ATB

Inventario Patrimoniale
type: Class
subclass of: Inventario
subclass of: Restriction
  on property: ha responsabile dell'immissione in patrimonio
  some values from: Agent
subclass of: Restriction
  on property: ha categoria SEC
  some values from: Categoria SEC
subclass of: Restriction
  on property: ha codice SEC
  some values from: Codice SEC
subclass of: Restriction
  on property: causale RCS
  some values from: Literal
subclass of: Restriction
  on property: cultural property inventory description
  some values from: Literal
subclass of: Restriction
  on property: modalità di acquisizione
  some values from: Literal
subclass of: Restriction
  on property: provenienza
  some values from: Literal
comment: Questa classe rappresenta un inventario patrimoniale, che registra le informazioni amministrative relative alla situazione patrimoniale del bene.
comment: This class represents the current inventory of a cultural property, e.g. patrimonial informations.
label: Current Inventory @en
version info: stabile
version info: stable @en
iccd norm tag: ICCD Normativa Trasversale: UB/INP

Cronologia
type: Class
subclass of: Interpretazione
subclass of: Restriction
  on property: è cronologia di
  some values from: CulturalEntity
subclass of: Restriction
  on property: ha evento relativo a datazione
  all values from: EventOrSituation
comment: Questa classe rappresenta la cronologia di un'entità, cioè i dati cronologici che riguardano la storia dell'entità (es.: un bene culturale o un'opera collegata a un bene culturale). In relazione alle diverse situazioni, indicheranno un periodo esteso nel tempo oppure una singola data. Per ciascun bene viene fornita la cronologia della sua realizzazione, o, nel caso di immobili che presentano diverse fasi edilizie o diversi momenti di vita, un arco cronologico di riferimento; possono essere fornite anche altre notizie cronologiche relative ad altri eventi che hanno riguardato il bene (demolizione, progettazione, rimaneggiamenti, etc.)
comment: This class represents the dating of an entity, that is information about the chronology of the entity (e.g.: a cultural property), referring to a particular event (e.g.: the creation of the cultural property, its distruction, etc.) @en
label: Dating @en
version info: stabile
version info: stable @en
iccd norm tag: ICCD Normativa Trasversale 4.00: DT - ICCD Normative F, RA, SMO, PST, S, OAC, OA, MI, D, NU: RO/ROF/ROFD

Opera derivata
type: Class
subclass of: CulturalEntity
subclass of: Restriction
  on property: ha autore
  all values from: Agent
subclass of: Restriction
  on property: ha tipo di opera derivata
  all values from: Tipo di opera derivata
subclass of: Restriction
  on property: collocazione dell'opera derivata
  all values from: Literal
comment: Questa classe rappresenta una derivazione del bene catalogato (reimpiego, copia, contraffazione, replica, controtipo) prodotta dallo stesso o da altro autore.
comment: This class represents a derivated work of a cultural property (copy, reuse, facsimile, forgery), created by the same author or by another author. @en
label: Derivated work @en
version info: stabile
version info: stable @en
iccd norm tag: ICCD Normativa S 3: RO/COP - Normativa F: RO/CRF - Normative RA, SMO, PST, OAC, OA, MI, D, NU: RO/REI - Normative CA, MA: RO/RIU

Tipo di opera derivata
type: Class
subclass of: Type
comment: Questa classe rappresenta il tipo di opera derivata da un bene culturale.
comment: This class represents the type of derivated work of a cultural property. @en
label: Derivated work type @en
version info: stabile
version info: stable @en
iccd norm tag: ICCD Normativa F: RO/CRF/CRFT - Normativa S: RO/ADL/ADLL - Normative RA, SMO, PST, S, OA, MI, D, NU: RO/REI/REIT - Normative CA, MA: RO/RIU/RIUT

Metodo di individuazione
type: Class
subclass of: Method
subclass of: Restriction
  on property: è metodo di individuazione di
  some values from: CulturalEntity
comment: Questa classe rappresenta la modalità di individuazione che ha consentito l'individuazione di un bene culturale e che è indicativa della tipologia e della consistenza di alcune informazioni presenti nella scheda di catalogo che lo descrive (es.: carotaggio, dati di archivio, fonti orali).
comment: This class represents the method of detection that allowed the detection of a cultural property and which is indicative of the type and consistency of some information in the catalogue record that describes it (e.g.: coring, archive data, oral sources). @en
label: Detection Method @en
version info: stabile
version info: stable @en
iccd norm tag: ICCD Normativa Trasversale 4.00: OG/OGM

Documentazione
type: Class
subclass of: Object
subclass of: Restriction
  on property: è documentazione di
  some values from: Thing
subclass of: Restriction
  on property: ha tipo di documentazione
  all values from: Tipo di documentazione
subclass of: Restriction
  on property: ha formato
  all values from: Formato
subclass of: Restriction
  on property: codice identificativo della documentazione
  some values from: Literal
subclass of: Restriction
  on property: nome del file digitale
  all values from: Literal
subclass of: Restriction
  on property: gestione diritti
  all values from: Literal
subclass of: Restriction
  on property: specifications
  all values from: Literal
subclass of: Restriction
  on property: URL
  all values from: anyURI
description: An example of usage of one of the subclasses of the class 'Documentation' is the following: resource:AudioDocumentation/1200924650-audio-documentation-1 a cd:AudioDocumentation ; rdfs:label "Audio documentation 1 of cultural property: 1200924650"@en ; cd:documentationIdentifier "New_1401358982589" ; cd:hasDocumentationType resource:DocumentationType/cassetta-dat ; cd:hasFormat resource:Format/cassetta-dat ; core:hasCategory cd:AttachedDocumentation . @en
description: Un esempio d'uso di una delle sottoclassi della classe 'Documentazione' è il seguente: resource:AudioDocumentation/1200924650-audio-documentation-1 a cd:AudioDocumentation ; rdfs:label "Documentazione audio 1 del bene culturale: 1200924650"@it ; cd:documentationIdentifier "New_1401358982589" ; cd:hasDocumentationType resource:DocumentationType/cassetta-dat ; cd:hasFormat resource:Format/cassetta-dat ; core:hasCategory cd:AttachedDocumentation . @en
comment: Classe che rappresenta la documentazione, specializzata nelle sottoclassi che rappresentano tipi specifici di documentazione di corredo (immagini, disegni e rilievi, cartografia, documenti audio e video, fonti e documenti editi e inediti, referenze bibliografiche).
comment: This class represents the documentation, with subclasses for each specific type of documentation (images, drawings, audio, video, etc.) @en
label: Documentation @en
version info: stabile
version info: stable @en
iccd norm tag: ICCD Normativa Trasversale 4.00: DO

Genere della documentazione
type: Class
subclass of: Category
comment: Questa classe rappresenta la categoria della documentazione. Nel contesto delle normative per la catalogazione ICCD, questa classe ha un vocabolario chiuso definito in due tipi: documentazione allegata e documentazione esistente.
comment: This class represents the category associated to a documentation (e.g. attached documentation, existing documentation). @en
label: Documentation category @en
version info: stabile
version info: stable @en
iccd norm tag: FTAX, DRAX, VDCX, REGX, FNTX, ADMX (solo v. 3.00 e 3.01)

Tipo di documentazione
type: Class
subclass of: Type
comment: Questa classe rappresenta il tipo di documentazione.
comment: This class represents the type of documentation. @en
label: Documentation type @en
version info: stabile
version info: stable @en
iccd norm tag: FTAP, DRAT, FNTP (+VDCP, REGP), ADMP (v. 3.00 e 3.01)

Edizione
type: Class
subclass of: Object
subclass of: Restriction
  on property: è edizione di
  some values from: Thing
subclass of: Restriction
  on property: ha autore
  all values from: Agent
subclass of: Restriction
  on property: ha editore
  all values from: Agent
subclass of: Restriction
  on property: ha autore secondario
  all values from: Agent
subclass of: Restriction
  on property: ha titolo
  all values from: Titolo
subclass of: Restriction
  on property: luogo dell'edizione
  all values from: Literal
subclass of: Restriction
  on property: time
  all values from: Literal
comment: Questa classe rappresenta l'edizione di un'entità. Per esempio, l'edizione cartacea o digitale di un bene culturale o di un'opera collegata a un bene culturale (ad es. una pubblicazione contenente una stampa).
comment: This class represents the edition of an entity (e.g. the print edition of a cultural property). @en
label: Edition @en
version info: stabile
version info: stable @en
iccd norm tag: ICCD Normative VeAC e AT 3.01: DO/BSE/BSEN - Normativa S 3.00: RO/ADL/ADLE.

Intervento ammesso
type: Class
subclass of: Intervento
subclass of: Restriction
  on property: è intervento ammesso da
  all values from: Strumento urbanistico-territoriale
comment: Questa classe rappresenta il tipo di intervento ammesso da una normativa specifica, ovvero da un piano regolatore generale e particolareggiato o da un piano paesaggistico che interessa un bene culturale.
comment: This class represents the intervention considered eligible by a specific urban planning instrument related to a cultural property. @en
label: Eligible intervention @en
version info: stabile
version info: stable @en
iccd norm tag: ICCD Normativa Trasversale 4.00: TU/STU/STUN

Stima
type: Class
subclass of: Interpretazione
subclass of: Restriction
  on property: è stima di
  some values from: Thing
subclass of: Restriction
  on property: valore stimato
  some values from: Literal
comment: Questa classe rappresenta il concetto di stima di un'entità.
comment: This class represents the concept of estimate. @en
label: Estimate @en
version info: stabile
version info: stable @en

Diritti d'autore scaduti
type: Class
subclass of: Diritti d'autore
comment: Questa classe rappresenta i diritti d'autore scaduti, relativi quindi a un oggetto, per esempio un bene culturale, diventato di pubblico dominio.
comment: This class represents an expired copyright, related to an object, e.g. a cultural property. @en
label: Expired Copyright @en
version info: stabile
version info: stable @en
iccd norm tag: ICCD Normativa F 4.00 e OAC: TU/CPR (if CPRD = 'scaduti' or 'diritti scaduti' or 'in pubblico dominio')

Certificazione di importazione o esportazione
type: Class
subclass of: Object
subclass of: Restriction
  on property: has export import certification type
  some values from: Tipo di certificazione di esportazione o importazione
subclass of: Restriction
  on property: è certificato di importazione/esportazione di
  some values from: CulturalEntity
subclass of: Restriction
  on property: ha ufficio esportazione
  all values from: Agent
comment: Questa classe rappresenta una certificazione amministrativa per la circolazione e l'esportazione/importazione di un bene culturale.
comment: This class represents the export/import certification of a cultural property. @en
label: Export import certification @en
version info: stabile
version info: stable @en
iccd norm tag: ICCD Normativa Trasversale 4.00: TU/ESP

Tipo di certificazione di esportazione o importazione
type: Class
subclass of: Type
comment: Questa classe rappresenta il tipo di certificazione amministrativa di circolazione ed esportazione/importazione di un bene culturale (es.: attestato di libera circolazione, licenza di esportazione definitiva, ecc).
comment: This class represents the type of export/import certification of a cultural property (e.g.: temporary movement certification, temporary export license, free movement certification, etc.). @en
label: Export import certification type @en
version info: stabile
version info: stable @en
iccd norm tag: ICCD Normativa Trasversale 4.00: TU/ESP/ESPT

Controtipo
type: Class
subclass of: Opera derivata
comment: Questa classe rappresenta un controtipo di un bene culturale, specificamente di una fotografia, cioè una duplicazione realizzata nello stesso formato e nella stessa tecnica.
comment: This class represents a facsimile of a cultural property, and in particular of a photography, that has the same format and technique. @en
label: Facsimile @en
version info: stabile
version info: stable @en
iccd norm tag: ICCD Normativa F: RO/CRF/CRFT = 'controtipo'

Occasione legata a fiere e mercati
type: Class
subclass of: Occasione
disjoint with: Occasione indeterminata
comment: Questa classe rappresenta un'occasione connessa a fiere, mercati, sagre.
comment: This class represents a circumstance related to fairs, markets, festivals. @en
label: Fair market circumstance @en
version info: stabile
version info: stable @en
iccd norm tag: ICCD Normativa BDI 4.00: CA/CAO/CAOF

Documentazione video-cinematografica
type: Class
subclass of: Documentazione
subclass of: Restriction
  on property: ha formato
  some values from: Class
    intersection of: Tipo di documentazione
    intersection of: Formato
comment: Questa classe rappresenta la documentazione video-cinematografica relativa a un oggetto, per esempio a un bene culturale
comment: This class represents the film documentation of an object, e.g. a cultural property. @en
label: Video documentation @en
version info: stabile
version info: stable @en
iccd norm tag: VDC

Opera finale
type: Class
subclass of: Opera preparatoria o finale
disjoint with: Opera preparatoria
comment: Questa classe rappresenta un'entità collegata a un bene culturale, che ne costituisce la fase finale.
comment: This class represents an entity related to a cultural property, as its final stage. @en
label: Final work @en
version info: stabile
version info: stable @en
iccd norm tag: ICCD Normative F, RA, SMO, PST, S, OAC, OA, MI, D, NU: se RO/ROF/ROFF rappresenta uno stadio del bene catalogato riconducibile a una fase preparatoria, per cui è possibile dedurre che l'opera collegata al bene è una sua fase finale.

Contesto di rinvenimento
type: Class
subclass of: Situation
subclass of: Restriction
  on property: ha tipo di contesto di rinvenimento
  some values from: Tipo di contesto di rinvenimento
subclass of: Restriction
  on property: è contesto di rinvenimento di
  some values from: CulturalEntity
subclass of: Restriction
  on property: ha elemento associato
  all values from: Object
subclass of: Restriction
  on property: specifications
  all values from: Literal
comment: Questa classe rappresenta il contesto di ritrovamento (tipo di contesto, elementi associati) di un bene culturale, e in particolare di un reperto antropologico.
comment: This class represents the context (type of context, associated objects) in which a cultural property (in particular, an anthropological material) is found. @en
label: Finding context @en
version info: stabile
version info: stable @en
iccd norm tag: ICCD Normativa AT 3.01: OG/OGC

Tipo di contesto di rinvenimento
type: Class
subclass of: Type
comment: Questa classe rappresenta il tipo di contesto di rinvenimento di un bene culturale, e in particolare di un reperto antropologico (es.: sepoltura collettiva, sepoltura singola primaria, etc.)
comment: This class represents the type of finding context of a cultural property, and in particular of an anthropological material (e.g.: individual burial, common burial, etc.) @en
label: Finding context type @en
version info: stabile
version info: stable @en
iccd norm tag: ICCD Normativa AT 3.01: OG/OGC/OGCT

Contraffazione
type: Class
subclass of: Opera derivata
comment: Questa classe rappresenta una contraffazione di un bene culturale, cioè una riproduzione di un bene culturale da parte di un autore che non dichiari l'autore dell'originale.
comment: This class represents a forgery of a cultural property, that is a copy of a cultural property for which the author doesn't declare the original author. @en
label: Forgery @en
version info: stabile
version info: stable @en
iccd norm tag: ICCD Normativa F: RO/CRF/CRFT = 'contraffazione'

Formato
type: Class
subclass of: Description
subclass of: Restriction
  on property: è formato di
  some values from: Documentazione
comment: Questa classe rappresenta il formato della documentazione (es.: jpeg, A0, pdf, audiocassetta, MP4).
comment: This class represents the documentation format (e.g. jpeg, pdf, MP4) @en
label: Format @en
version info: stabile
version info: stable @en
iccd norm tag: ICCD Normativa Trasversale 4.00: DO/FTA/FTAF, DO/DRA/DRAF, DO/FNT/FNTR (+ DO/VDC/VDCP, DO/REG/REGP)

Fruizione
type: Class
subclass of: Interpretazione
subclass of: Restriction
  on property: ha utente
  some values from: Agent
subclass of: Restriction
  on property: è fruizione di
  some values from: CulturalEntity
subclass of: Restriction
  on property: ha circostanza
  all values from: Occasione
comment: Questa classe rappresenta un'occasione in cui il capo oggetto di catalogazione è stato indossato da una o più persone, sia perché ad esse destinato sia perché, ad esse pervenuto, hanno potuto riadattarlo a loro nuove esigenze.
comment: This class represents a circumstance in which a garment, catalogued as a cultural property, was worn by one or more people. @en
label: Fruition @en
version info: stabile
version info: stable @en
iccd norm tag: Normativa VeAC: AU/FRU

Genere
type: Class
subclass of: Concept
subclass of: Restriction
  on property: è genere in
  some values from: Tassonomia biologica
comment: Questa classe rappresenta uno dei livelli di classificazione di una tassonomia biologica, ovvero il genere.
comment: This class represents one level of a biological taxon, the genus. @en
label: Genus @en
deprecated: true
version info: stabile
version info: stable @en
iccd norm tag: ICCD Normativa AT: OG/OGS/OGSG

Documentazione grafica e cartografica
type: Class
subclass of: Documentazione
subclass of: Restriction
  on property: ha scala
  all values from: Scala
comment: Questa classe rappresenta la documentazione grafica e cartografica relativa a un oggetto, per esempio a un bene culturale.
comment: This class represents the graphic or cartographic documentation of an object, e.g. a cultural property. @en
label: Graphic and cartographic documentation @en
version info: stabile
version info: stable @en
iccd norm tag: DRA

Occasione indeterminata
type: Class
subclass of: Occasione
disjoint with: Occasione legata al ciclo della vita
disjoint with: Occasione legata al ciclo produttivo
disjoint with: Occasione legata al ciclo stagionale
disjoint with: Occasione legata alla socialità quotidiana
disjoint with: Occasione legata al lavoro
disjoint with: Occasione legata al ciclo dell'anno
comment: Questa classe rappresenta un'occasione indeterminata, cioè quando il bene non è in rapporto con una precisa occasione o scadenza, ma si realizza in modo del tutto estemporaneo e contingente. Occasioni indeterminate possono essere, per esempio, un'esecuzione musicale, una narrazione, un gioco, etc.
comment: This class represents an indeterminate circumstance, when the cultural property is not related to a determinate circumstance, but takes place in an extemporaneous and contingent way (e.g.: a musical performance, a narration, a game). @en
label: Indeterminate circumstance @en
version info: stabile
version info: stable @en
iccd norm tag: ICCD Normativa BDI 4.00: CA/CAO/CAOI

Ispezione
type: Class
subclass of: Indagine
subclass of: Restriction
  on property: ha responsabile dell'attività
  all values from: Agent
comment: Questa classe rappresenta un tipo particolare di indagine su bene culturale, ovvero un'ispezione effettuata per constatare lo stato del bene.
comment: This class represents a particular type of survey on a cultural property, that is an inspection carried out to verify the condition of a cultural property. @en
label: Inspection @en
version info: stabile
version info: stable @en
iccd norm tag: ICCD Normativa Trasversale 4.00: CM/ISP

Interpretazione
type: Class
subclass of: Situation
subclass of: Restriction
  on property: ha criterio interpretativo
  some values from: Criterio interpretativo
description: An example of usage of one of the subclasses of the class 'Interpretation' is the following: resource:PreferredAuthorshipAttribution/1200865600-1 a cd:PreferredAuthorshipAttribution ; rdfs:label "Preferred authorship attribution of cultural property: 1200865600"@en ; cd:hasAttributedAuthor resource:Agent/cavaceppi-bartolomeo-1717-1799 ; cd:hasSource resource:Source/documentation . @en
description: Un esempio di utilizzo di una delle sottoclassi della classe "Interpretazione" è il seguente: resource:PreferredAuthorshipAttribution/1200865600-1 a cd:PreferredAuthorshipAttribution ; rdfs:label "Attribuzione di autore preferita, maggiormente accreditata o convincente del bene: 1200865600"@it ; cd:hasAttributedAuthor resource:Agent/cavaceppi-bartolomeo-1717-1799 ; cd:hasSource resource:Source/documentazione .
comment: Questa classe rappresenta una situazione in cui viene individuata e registrata da un agente una certa informazione o un gruppo di informazioni relativamente a un oggetto, per esempio a un bene culturale o a una sua parte, supportata da una fonte o motivazione. Per esempio, l'attribuzione di autore, l'individuazione della committenza o delle entità responsabili di fasi successive alla creazione di un bene culturale sono tutte interpretazioni basate su fonti.
comment: This class represents a situation in which pieces of information related to an object (e.g.: a cultural property) are detected and recorded by an agent, based on a specific source or motivation (e.g.:ithe authorship attribution, commission, etc.) @en
label: Interpretation @en
version info: stabile
version info: stable @en

Criterio interpretativo
type: Class
subclass of: Description
subclass of: Restriction
  on property: è criterio interpretativo di
  some values from: Thing
comment: Questa classe rappresenta il criterio o la motivazione che ha determinato una certa interpretazione (es.: bibliografia, documentazione, iscrizione).
comment: This class represents the criterion that motivated an interpretation (e.g. inscription, bibliography, documentation). @en
label: Interpretation criterion @en
version info: stabile
version info: stable @en
iccd norm tag: ICCD Normativa Trasversale 4.00: AU/AUT/AUTM; AU/CMM/CMMF; AU/AAT/AATM; AU/ATB/ATBM; DT/DTM/DTMM; SG/SGT/SGTL - Normativa VeAC: AU/FRU/FRUF - Normativa MI 3.00: AU/DC/DDCF

Intervento
type: Class
subclass of: Activity
subclass of: Restriction
  on property: ha operatore dell'attività
  all values from: Agent
subclass of: Restriction
  on property: ha responsabile dell'attività
  all values from: Agent
subclass of: Restriction
  on property: ha finanziatore dell'attività
  all values from: Agent
subclass of: Restriction
  on property: ha tipo di intervento
  all values from: Tipo di intervento
subclass of: Restriction
  on property: è intervento su
  all values from: CulturalEntity
subclass of: Restriction
  on property: hasAgentRole
  all values from: AgentRole
subclass of: Restriction
  on property: atTime
  all values from: TimeInterval
subclass of: Restriction
  on property: description
  all values from: Literal
subclass of: Restriction
  on property: specifications
  all values from: Literal
disjoint with: Indagine
description: An example of usage of the class 'Intervention' is the following: resource:Intervention/0800640527-10-intervention-1 a cd:Intervention ; rdfs:label "Intervention 1 on cultural property 0800640527-10"@en ; cd:hasActivityOperator resource:Agent/tonelli-elvira ; cd:hasActivityResponsible resource:Agent/soprintendenza-per-i-beni-ambientali-ed-architettonici-di-bologna-modena-e-reggio-emilia ; cd:hasInterventionType resource:InterventionType/restauro ; tiapit:atTime resource:TimeInterval/1994 . @en
description: Un esempio di utilizzo della classe "Intervento" è il seguente: resource:Intervention/0800640527-10-intervention-1 a cd:Intervention ; rdfs:label "Intervento 1 sul bene culturale 0800640527-10"@it ; cd:hasActivityOperator resource:Agent/tonelli-elvira ; cd:hasActivityResponsible resource:Agent/soprintendenza-per-i-beni-ambientali-ed-architettonici-di-bologna-modena-e-reggio-emilia ; cd:hasInterventionType resource:InterventionType/restauro ; tiapit:atTime resource:TimeInterval/1994 .
comment: Questa classe rappresenta un intervento che ha interessato un bene culturale, a fini conservativi (per i quali si crea una sottoclasse di "Intervento") oppure di altro tipo: restauri (termine obsoleto che attualmente corrisponde a "intervento a fine conservativo"), rilavorazioni, ripristini, trasformazioni per recuperare aspetto e funzionalità rispondenti ai mutati gusti, ecc. In generale, per interventi si intendono attività che riguardano il bene, effettuate per la sua realizzazione/modifica e conservazione materiale.
comment: This class represents an intervention on a cultural property, that is an activity carried out for its conservation or for other purposes: conservation interventions, reprocessing, restoring, etc. @en
label: Intervention @en
version info: stabile
version info: stable @en
iccd norm tag: ICCD Normativa Trasversale 4.00: CO/RST - normative di versioni precedenti: RS/RST; Normativa VeAC: CO/RIA; Normativa CA: RO/RIS

Tipo di intervento
type: Class
subclass of: Type
comment: Questa classe rappresenta il tipo di intervento (a fini conservativi o di altro tipo) che ha interessato un bene culturale.
comment: This class represents the type of intervention on a cultural property. @en
label: Intervention type @en
version info: stabile
version info: stable @en
iccd norm tag: ICCD Normativa Trasversale 4.00: valori di CO/RST/RSTI - Normativa VeAC: CO/RIA (riadattamento/modifica) - Normativa CA: RO/RIS (intervento successivo)

Inventario
type: Class
subclass of: Object
subclass of: Restriction
  on property: è inventario di
  some values from: Thing
subclass of: Restriction
  on property: ha responsabile di numero di inventario
  all values from: Agent
subclass of: Restriction
  on property: codice d'inventario
  some values from: Literal
subclass of: Restriction
  on property: collocazione dell'inventario
  all values from: Literal
comment: Questa classe rappresenta un inventario, di vario tipo, relativo a un bene culturale o relativo a una delle entità o attività collegate al bene culturale (per esempio un inventario di scavo archeologico).
comment: This class represents an inventory about a cultural property or about an entity or an activity related to the cultural property. @en
label: Inventory @en
version info: stabile
version info: stable @en
iccd norm tag: ICCD Normativa Trasversale 4.00: UB/INV; ICCD Normativa RA 3.00 RE/DSC/DSCI

Analisi di laboratorio
type: Class
subclass of: Indagine
subclass of: Restriction
  on property: ha tipo di analisi di laboratorio
  all values from: Tipo di analisi di laboratorio
subclass of: Restriction
  on property: specifiche su pasta/argilla
  all values from: Literal
comment: Questa classe rappresenta un tipo particolare di indagine su bene culturale, ovvero un'analisi di laboratorio.
comment: This class represents a particular type of survey on a cultural property, that is a laboratory test. @en
label: Laboratory test @en
version info: stabile
version info: stable @en
iccd norm tag: ICCD Normative NU, RA, BNB, MA, CA: RS/ALB

Tipo di analisi di laboratorio
type: Class
subclass of: Type
comment: Questa classe rappresenta il tipo di analisi di laboratorio (es.: analisi metallurgica, analisi chimica, etc.)
comment: This class represents the type of laboratory test (es.: chemical analysis) @en
label: Laboratory test type @en
version info: stabile
version info: stable @en
iccd norm tag: ICCD Normative NU, RA, BNB, MA, CA: RS/ALB/ALBT

Situazione giuridica
type: Class
subclass of: Situation
subclass of: Restriction
  on property: è condizione giuridica di
  some values from: CulturalEntity
subclass of: Restriction
  on property: ha proprietario
  all values from: Agent
description: An example of usage of the class "Legal situation" is the following: resource:LegalSituation/1400054721-legal-situation-proprieta-stato a cd:LegalSituation ; rdfs:label "Legal situation of cultural property 1400054721: State property"@en ; cd:hasOwner resource:Agent/ministero-beni-culturali . @en
description: Un esempio d'uso della classe "Condizione giuridica" è il seguente: resource:LegalSituation/1400054721-legal-situation-proprieta-stato a cd:LegalSituation ; rdfs:label "Condizione giuridica del bene culturale 1400054721: proprietà Stato"@it ; cd:hasOwner resource:Agent/ministero-beni-culturali .
comment: Questa classe rappresenta la condizione giuridica di un bene culturale, con riferimenti al proprietario, detentore o possessore.
comment: This class represents the legal situation of a cultural property, related to the owner. @en
label: Legal situation @en
version info: stabile
version info: stable @en
iccd norm tag: ICCD Normativa Trasversale 4.00: TU/CDG/CDGG

Occasione legata al ciclo della vita
type: Class
subclass of: Occasione
comment: Questa classe rappresenta un'occasione legata ai cicli della vita (cerimonie, riti, feste).
comment: This class represents a circumstance related to life cycles (ceremonies, custom, celebration) @en
label: Life cycle circumstance @en
version info: stabile
version info: stable @en
iccd norm tag: ICCD Normativa BDI 4.00: CA/CAO/CAOV

Appartenenza
type: Class
subclass of: Situation
description: An example of usage of one of the subclasses of the class 'Membership' is the following: resource:CollectionMembership/0300633618-collection-membership-1 a cd:CollectionMembership ; rdfs:label "Collection membership 1 of cultural property: 0300633618"@en ; cd:hasCollection resource:CollectionOfCulturalEntities/collezione-mingozzi ; cd:hasMemberOfCollection resource:ScientificOrTechnologicalHeritage/0300633618 ; tiapit:atTime resource:TimeInterval/1967 . @en
description: Un esempio d'uso di una delle sottoclassi della classe 'Appartenenza' è il seguente: resource:CollectionMembership/0300633618-collection-membership-1 a cd:CollectionMembership ; rdfs:label "Appartenenza a collezione 1 del bene culturale: 0300633618"@it ; cd:hasCollection resource:CollectionOfCulturalEntities/collezione-mingozzi ; cd:hasMemberOfCollection resource:ScientificOrTechnologicalHeritage/0300633618 ; tiapit:atTime resource:TimeInterval/1967 .
comment: Questa classe rappresenta il concetto di appartenenza.
comment: This class represents the concept of membership. @en
label: Membership @en
version info: stabile
version info: stable @en

Altra documentazione multimediale
type: Class
subclass of: Documentazione
comment: Questa classe rappresenta la documentazione multimediale in formato digitale relativa al un oggetto, per esempio un bene culturale. Nel caso delle Normative per la catalogazione dell'ICCD questa classe riguarda la documentazione multimediale realizzata in formati non compresi dalle norme ICCD, allegata alla scheda di catalogo o esistente e depositata presso l'Ente schedatore o in altre raccolte.
comment: This class represents the multimedia documentation of an object, e.g. a cultural property. @en
label: Multimedia documentation @en
version info: stabile
version info: stable @en
iccd norm tag: ADM (solo versioni 3.00 e 3.01)

Stampa non più in volume
type: Class
subclass of: Riproduzione
comment: Questa classe rappresenta una stampa che non è più parte integrante della pubblicazione, ma che lo è stata in passato.
comment: This class represents a print that is no longer was a part of a publication. @en
label: Print no longer in publication @en
version info: stabile
version info: stable @en
iccd norm tag: ICCD Normativa S 3: RO/ADL/ADLS

Serie numismatica
type: Class
subclass of: Collection
subclass of: Restriction
  on property: ha moneta membro
  all values from: CulturalEntity
comment: Questa classe rappresenta la serie della quale una moneta fa parte (es.: Greca, Romana Repubblicana, Barbarica).
comment: This class represents the series which a particular coin is part of. @en
label: Numismatic series @en
version info: stabile
version info: stable @en
iccd norm tag: ICCD Normativa NU: OG/OGT/OGTR

Indagine di rilevamento
type: Class
subclass of: Indagine
subclass of: Restriction
  on property: ha operatore dell'attività
  all values from: Agent
subclass of: Restriction
  on property: ha responsabile dell'attività
  all values from: Agent
subclass of: Restriction
  on property: ha tipo di indagine di rilevamento
  all values from: Tipo di indagine di rilevamento
subclass of: Restriction
  on property: ha fotografo dell'indagine
  all values from: Agent
subclass of: Restriction
  on property: ha fonico dell'indagine
  all values from: Agent
subclass of: Restriction
  on property: si riferisce a ricerca
  all values from: Ricerca
comment: Questa classe rappresenta un tipo particolare di indagine, ovvero il rilevamento (l'occasione o l'indagine in occasione della quale è stato rilevato, individuato, osservato il bene) di un bene musicale di interesse etno-organologico o di un bene demoetno-antropologico.
comment: This class represents a particular type of survey on a cultural property, that is an observation survey: the observation of musical heritage or demoethnoanthropological heritage. @en
label: Observation survey @en
version info: stabile
version info: stable @en
iccd norm tag: ICCD Normativa SM e BDM 4.00: DR

Tipo di indagine di rilevamento
type: Class
subclass of: Type
comment: Questa classe rappresenta il tipo di indagine di rilevamento (rilevamento nel contesto/ rilevamento decontestualizzato).
comment: This class represents the type of observation survey (in the context / out of the context). @en
label: Observation survey type @en
version info: stabile
version info: stable @en
iccd norm tag: ICCD Normativa BDI 4.00: LA/PRM

Indagine su paleopatologia
type: Class
subclass of: Indagine
subclass of: Restriction
  on property: ha metodo di indagine
  all values from: Metodo di indagine
subclass of: Restriction
  on property: diagnosi
  all values from: Literal
subclass of: Restriction
  on property: fa riferimento a indagini
  all values from: Literal
comment: Questa classe rappresenta un'indagine, intesa come attività, in cui viene elaborata una diagnosi di una paleopatologia di un reperto antropologico.
comment: This class represents a particular type of survey on a cultural property, that is a survey in which is possible to make a diagnosis of a paleopathology of an anthropological material. @en
label: Paleopathology survey @en
version info: stabile
version info: stable @en
iccd norm tag: ICCD Normativa AT: PT

Fotointerpretazione e fotorestituzione
type: Class
subclass of: Indagine
subclass of: Restriction
  on property: ha responsabile dell'attività
  all values from: Agent
subclass of: Restriction
  on property: ha anomalia
  all values from: Anomalia
subclass of: Restriction
  on property: ha affidabilità
  all values from: Affidabilità
subclass of: Restriction
  on property: ha immagine di indagine
  all values from: Immagine di indagine
subclass of: Restriction
  on property: ha motivo di indagine
  all values from: Motivo di indagine
subclass of: Restriction
  on property: ha responsabile scientifico dell'indagine
  all values from: Agent
subclass of: Restriction
  on property: specifiche sulla sovrapposizione
  all values from: Literal
comment: Questa classe rappresenta un tipo particolare di indagine su bene culturale, ovvero una fotointerpretazione e fotorestituzione, intesa come indagine territoriale.
comment: This class represents a particular type of survey on a cultural property, that is photo interpretation and rendering. @en
label: Photo interpretation and rendering @en
version info: stabile
version info: stable @en
iccd norm tag: ICCD Normativa Trasversale 4.00: RE/FOI

Documentazione fotografica
type: Class
subclass of: Documentazione
subclass of: Restriction
  on property: didascalia
  all values from: Literal
subclass of: Restriction
  on property: strisciata/numero fotogramma
  all values from: Literal
comment: Questa classe rappresenta la documentazione fotografica relativa a un oggetto, per esempio a un bene culturale.
comment: This class represents the photographic documentation of an object, e.g. a cultural property. @en
label: Photographic documentation @en
version info: stabile
version info: stable @en
iccd norm tag: ICCD Normativa Trasversale 4.00: DO/FTA

Serie fotografica
type: Class
subclass of: Collection
subclass of: Restriction
  on property: è serie fotografica in
  all values from: Appartenenza a serie fotografica
subclass of: Restriction
  on property: hasPart
  all values from: Sottoserie fotografica
comment: Questa classe rappresenta una serie editoriale fotografica, ovvero un insieme di immagini ideate o pubblicate come un'unica entità, esplicitamente legate tra di loro da un titolo o da una numerazione progressiva o da altri elementi che ne individuino inequivocabilmente l'unitarietà in senso biblioteconomico.
comment: This class represents a photographic series, that is a set of photographs created or published as a unit, from a library sciences point of view. @en
label: Photographic series @en
version info: stabile
version info: stable @en
iccd norm tag: ICCD Normativa Trasversale 4.00: PD/SFI

Appartenenza a serie fotografica
type: Class
subclass of: Appartenenza
subclass of: Restriction
  on property: ha membro di serie fotografica
  some values from: CulturalEntity
subclass of: Restriction
  on property: ha serie fotografica
  some values from: Serie fotografica
subclass of: Restriction
  on property: numero dell'item all'interno della serie
  all values from: Literal
comment: Questa classe rappresenta l'appartenenza di un bene fotografico a una serie editoriale, esplicitamente indicata da un titolo o da una numerazione progressiva o da altri elementi che ne individuino inequivocabilmente l'appartenenza.
comment: This class represents the membership of photographic heritage in a photographic series, as a unit. @en
label: Photographic series membership @en
version info: stabile
version info: stable @en
iccd norm tag: ICCD Normativa F: PD/SFI; PD/SSI

Sottoserie fotografica
type: Class
subclass of: Serie fotografica
subclass of: Restriction
  on property: isPartOf
  all values from: Serie fotografica
comment: Questa classe rappresenta una sottoserie di una serie editoriale fotografica, ovvero una partizione interna alla serie.
comment: This class represents a photographic subseries, that is a component of a photographic series. @en
label: Photographic subseries @en
version info: stabile
version info: stable @en
iccd norm tag: ICCD Normativa F: PD/SSI

Attribuzione Primaria di Autore
type: Class
subclass of: Attribuzione di Autore o responsabilità
subclass of: Restriction
  on property: ha autore attribuito
  some values from: Agent
subclass of: Restriction
  on property: intervento dell'autore
  all values from: Literal
comment: Questa classe rappresenta l'attribuzione di autore maggiormente accreditata o convincente.
comment: This class represents the preferred authorship attribution, most accredited or convincing. @en
label: Preferred Authorship Attribution @en
version info: stabile
version info: stable @en
iccd norm tag: AU/AUT

Opera preparatoria o finale
type: Class
subclass of: CulturalEntity
subclass of: Restriction
  on property: ha autore
  all values from: Agent
subclass of: Restriction
  on property: ha cronologia
  all values from: Cronologia
subclass of: Restriction
  on property: ha inventario
  all values from: Inventario
subclass of: Restriction
  on property: ha titolo
  all values from: Titolo
subclass of: Restriction
  on property: collocazione dell'opera preparatoria o finale
  all values from: Literal
subclass of: Restriction
  on property: collocazione precedente dell'opera preparatoria o finale
  all values from: Literal
subclass of: Restriction
  on property: codice della scheda dell'opera originale o finale
  all values from: Literal
description: An example of usage of the class 'Preparatory or final work' is the following:: resource:PreparatoryOrFinalWork/0500212038-disegno a cd:PreparatoryOrFinalWork ; rdfs:label "Preparatory or final work 1 of cultural property 0500212038: disegno"@en ; cd:hasAuthor resource:Agent/tiziano-vecellio ; cd:hasDating resoruce:Dating/0500212038-disegno . @en
description: Un esempio di utilizzo della classe "Opera preparatoria o finale" è il seguente: resource:PreparatoryOrFinalWork/0500212038-disegno a cd:PreparatoryOrFinalWork ; rdfs:label "Opera originale o finale 1 del bene culturale 0500212038: disegno"@it ; cd:hasAuthor resource:Agent/tiziano-vecellio ; cd:hasDating resoruce:Dating/0500212038-disegno .
comment: Questa classe rappresenta un'entità collegata a un bene culturale, che ne costituisce una fase preparatoria o una fase finale.
comment: This class represents an entity related to a cultural property, that is its preparatory or final stage. @en
label: Preparatory or final work @en
version info: stabile
version info: stable @en
iccd norm tag: ICCD Normative F, RA, SMO, PST, S, OAC, OA, MI, D, NU: RO/ROF

Opera preparatoria
type: Class
subclass of: Opera preparatoria o finale
comment: Questa classe rappresenta un'entità collegata a un bene culturale, che ne costituisce una fase preparatoria.
comment: This class represents an entity related to a cultural property, as its preparatory stage. @en
label: Preparatory work @en
version info: stabile
version info: stable @en
iccd norm tag: ICCD Normative F, RA, SMO, PST, S, OAC, OA, MI, D, NU: se RO/ROF/ROFF rappresenta uno stadio del bene catalogato riconducibile a una fase finale, per cui è possibile dedurre che l'opera collegata al bene è una sua fase preparatoria.

Stampa in pubblicazione
type: Class
subclass of: Opera derivata
comment: Questa classe rappresenta la pubblicazione di cui una stampa è, o è stata, parte integrante.
comment: This class represents a publication of which a print is, or was, part. @en
label: Print in publication @en
version info: stabile
version info: stable @en
iccd norm tag: ICCD Normativa S 3: RO/ADL

Occasione legata al ciclo produttivo
type: Class
subclass of: Occasione
comment: Questa classe rappresenta un'occasione connessa ai cicli produttivi (bachicoltura, cerealicoltura, etc.)
comment: This class represents a circumstance related to production cycles (sericulture, cereal crop, etc.) @en
label: Production cycle circumstance @en
version info: stabile
version info: stable @en
iccd norm tag: ICCD Normativa BDI 4.00: CA/CAO/CAOP

Professione
type: Class
subclass of: Role
disjoint with: Funzione d'uso
comment: Questa classe rappresenta il mestiere o la professione dell'utente del bene.
comment: This class represents the role of a cultural entity's user. @en
label: Profession @en
version info: stabile
version info: stable @en
iccd norm tag: ICCD Normativa BDM 2: UT/UTN/UTNM

Provvedimento di tutela
type: Class
subclass of: Object
subclass of: Restriction
  on property: è provvedimento di tutela di
  some values from: CulturalEntity
subclass of: Restriction
  on property: ha ente proponente
  all values from: Agent
subclass of: Restriction
  on property: data di emissione
  all values from: Literal
subclass of: Restriction
  on property: data di notifica
  all values from: Literal
subclass of: Restriction
  on property: data di comunicazione di avvio
  all values from: Literal
subclass of: Restriction
  on property: data di registrazione o gazzetta ufficiale
  all values from: Literal
comment: Questa classe rappresenta un provvedimento di tutela nazionale o internazionale, che ha interessato un bene culturale.
comment: This class represents the protective measure, national or international, related to a cultural property. @en
label: Protective measure @en
version info: stabile
version info: stable @en
iccd norm tag: ICCD Normativa Trasversale 4.00: TU/NVC

Repertorio
type: Class
subclass of: Object
subclass of: Restriction
  on property: è repertorio di riferimento di
  some values from: Copia
comment: Questa classe rappresenta il repertorio che cita la copia di una stampa.
comment: This class represents the reference catalogue that cites the copy of a print. @en
label: Reference catalogue @en
version info: stabile
version info: stable @en
iccd norm tag: ICCD Normativa S 3: RO/COP/COPR

Rapporto con opera collegata
type: Class
subclass of: Situation
subclass of: Restriction
  on property: coinvolge opera collegata
  some values from: CulturalEntity
subclass of: Restriction
  on property: è rapporto con opera collegata di
  some values from: CulturalEntity
subclass of: Restriction
  on property: ha fase di realizzazione
  all values from: Stadio del bene culturale
description: An example of usage of the class 'Related work situation' is the following: resource:RelatedWorkSituation/0300199368-preparatory-final-work-1 a cd:RelatedWorkSituation ; rdfs:label "Relation 1 between the cultural property 0300199368 and preparatory or final work"@en ; cd:hasCulturalPropertyStage resource:CulturalPropertyStage/bozzetto ; cd:hasRelatedWork resource:FinalWork/0300199368-dipinto . @en
description: Un esempio d'uso della classe 'Rapporto con opera collegata' è il seguente: resource:RelatedWorkSituation/0300199368-preparatory-final-work-1 a cd:RelatedWorkSituation ; rdfs:label "Relation 1 between the cultural property 0300199368 and preparatory or final work"@en , "Rapporto 1 tra il bene culturale 0300199368 e opera originale o finale"@it ; cd:hasCulturalPropertyStage resource:CulturalPropertyStage/bozzetto ; cd:hasRelatedWork resource:FinalWork/0300199368-dipinto .
comment: Questa classe rappresenta la relazione, il rapporto, tra il bene culturale in esame e un'altra opera, che può anche essere un bene culturale. In riferimento a questo rapporto, si definisce lo stadio di realizzazione del bene culturale in rapporto con l'oggetto che ne costituisce una fase preparatoria o che ne rappresenta la fase finale o che ne rappresenta una derivazione. Nel caso di una relazione tra un bene culturale e un altro bene culturale, in riferimento a questo rapporto si definisce, se possibile, il tipo di relazione tra i due beni (es.: luogo di realizzazione, luogo di ritrovamento, etc.).
comment: This class represents a situation in which a cultural property is related to another work, that could even be another cultural property. The cultural property stage is defined referring to this relationship with a related work, that can represent a preparatory, a final phase or a derivation of the cultural property. When the relationship is between two cultural properties, when possible, the nature of the relationship is specified (e.g.: finding location) @en
label: Related work situation @en
version info: stabile
version info: stable @en

Affidabilità
type: Class
subclass of: Characteristic
subclass of: Restriction
  on property:
    inverse of: ha affidabilità
  all values from: Fotointerpretazione e fotorestituzione
comment: Questa classe rappresenta il livello di affidabilità delle informazioni rilevate nell'indagine di fotointerpretazione/fotorestituzione.
comment: This class represents the reliability level of detected information relative to photo interpretation rendering. @en
label: Reliability @en
version info: stabile
version info: stable @en
iccd norm tag: ICCD Normativa Trasversale 4.00: RE/FOI/FOIO

Riproduzione
type: Class
subclass of: Object
subclass of: Restriction
  on property: è riproduzione di
  some values from: Stampa in pubblicazione
subclass of: Restriction
  on property: ha posizione della riproduzione
  all values from: Posizione della riproduzione
comment: Questa classe rappresenta la riproduzione dell'immagine contenuta nella pubblicazione di cui la stampa è, o è stata, parte integrante.
comment: This class represents the reproduction of an image, that is, or was, part of a publication. @en
label: Reproduction @en
version info: stabile
version info: stable @en
iccd norm tag: ICCD Normativa S 3: RO/ADL

Posizione della riproduzione
type: Class
subclass of: Location
subclass of: Restriction
  on property: è posizione della riproduzione di
  some values from: Riproduzione
subclass of: Restriction
  on property: numero di pagina o tavola
  all values from: Literal
disjoint with: Unità stratigrafica
comment: Questa classe rappresenta la posizione fisica della riproduzione della stampa all'interno della pubblicazione, che rappresenta quindi una derivazione della stampa stessa.
comment: This class represents the phisical position of a printed reproduction in a publication. @en
label: Reproduction position @en
version info: stabile
version info: stable @en
iccd norm tag: ICCD Normativa S 3: RO/ADL/ADLP

Ricerca
type: Class
subclass of: Activity
subclass of: Restriction
  on property: ha responsabile scientifico della ricerca
  all values from: Agent
subclass of: Restriction
  on property:
    inverse of: si riferisce a ricerca
  all values from: Indagine di rilevamento
subclass of: Restriction
  on property: name
  some values from: Literal
comment: Questa classe rappresenta la ricerca nell'ambito della quale è stata redatta la scheda, intendendo con il termine "ricerca" vari e differenziati livelli, fra cui quello della campagna di catalogazione. La ricerca si può collegare al rilevamento di un bene musicale di interesse etno-organologico.
comment: This class represents the research in which the catalogue record describing a cultural property was recorded (e.g.: a cataloguing campaign). The research can be related to the observation survey on musical heritage. @en
label: Research @en
version info: stabile
version info: stable @en
iccd norm tag: ICCD Normativa SM e BDM 4.00: DR/DRT

Responsabilità
type: Class
subclass of: Interpretazione
subclass of: Restriction
  on property: ha agente con responsabilità
  some values from: Agent
subclass of: Restriction
  on property: ha tipo di responsabilità
  some values from: Tipo di responsabilità
subclass of: Restriction
  on property: è responsibilità su
  some values from: CulturalEntity
subclass of: Restriction
  on property: ha ente schedatore dell'authority file
  all values from: Agent
comment: Questa classe rappresenta l'individuazione di una responsabilità attribuibile a un agente relativamente ai processi di produzione e di divulgazione che caratterizzano specificamente i beni fotografici, quindi alle diverse personalità responsabili, a vario titolo, del ciclo produttivo del bene in esame, oltre che della sua circolazione, divulgazione, commercializzazione e promozione (committenti, stampatori, ritoccatori, coloritori, editori, distributori, sponsor, curatori e responsabili di edizioni e di serie, dedicanti e dedicatari, responsabili di collezioni e di collazioni, ecc.).
comment: This class represents the attribution of a responsibility to an agent, relating to the activities of production and dissemination of photographic heritage (e.g.: committent, editor, printer, dedicatee, etc.) @en
label: Responsibility @en
version info: stabile
version info: stable @en
iccd norm tag: ICCD Normative F e FF: PD/PDF

Tipo di responsabilità
type: Class
subclass of: Type
comment: Questa classe rappresenta il tipo di responsabilità individuata relativamente ai processi di produzione e di divulgazione che caratterizzano specificamente i beni fotografici (es.: stampatori, ritoccatori, coloritori, ecc.).
comment: This class represents the type of responsibility related to the production and dissemination of photographic heritage (e.g.: printer, editor) @en
label: Responsibility type @en
version info: stabile
version info: stable @en
iccd norm tag: ICCD Normative F e FF: PD/PDF/PDFR

Riuso
type: Class
subclass of: Opera derivata
type: NamedIndividual
type: Specifiche del tipo d'uso
version info: stabile
iccd norm tag: ICCD Normative RA, SMO, PST, OAC, OA, MI, NU: RO/REI - ICCD Normative CA, MA: RO/RIU - ICCD Normativa F: ROP/CRF/CRFT = 'reimpiego'
comment: Questa classe rappresenta il riuso subito dal bene catalogato o da una sua parte.
comment: This class represents the reuse of a cultural property or of one of its parts. @en
version info: stable @en
version info: provvisoria @en
comment: This class represents cultural entity's reuse. @en
label: Reuse @en

Categoria SEC
type: Class
subclass of: Category
subclass of: Restriction
  on property:
    inverse of: ha categoria SEC
  all values from: Inventario Patrimoniale
comment: Questa classe rappresenta la categoria patrimoniale del bene, con riferimento alla classificazione del Sistema Europeo dei Conti 1995
comment: This class represents the patrimonial category of a cultural property, referring to the SEC classification 1995. @en
label: SEC Category @en
version info: stabile
version info: stable @en
iccd norm tag: ICCD Normativa Trasversale 4.00: UB/INP/INPZ

Codice SEC
type: Class
subclass of: Category
comment: Questa classe rappresenta il codice patrimoniale del bene (SEC - Modello 15), con riferimento alla classificazione del Sistema Europeo dei Conti 1995.
comment: This class represents the patrimonial code of a cultural property, referring to the SEC classification 1995. @en
label: SEC Identifier @en
version info: stabile
version info: stable @en
iccd norm tag: ICCD Normativa Trasversale 4.00: UB/INP/INPS

Replica
type: Class
subclass of: Copia
comment: Questa classe rappresenta una replica di un bene culturale, cioè una duplicazione dell'originale da parte dello stesso autore.
comment: This class represents a copy of a cultural property created by the same author of the original cultural property. @en
label: Same author copy @en
version info: stabile
version info: stable @en
iccd norm tag: ICCD Normativa F: RO/CRF/CRFT = 'replica'

Scala
type: Class
subclass of: Object
subclass of: Restriction
  on property: è scala di
  some values from: Documentazione grafica e cartografica
comment: Questa classe rappresenta le indicazioni sulla scala di rappresentazione della documentazione grafica e cartografica.
comment: This class represents the representative scale of a graphic or cartographic documentation. @en
label: Scale @en
version info: stabile
version info: stable @en
iccd norm tag: ICCD Normativa Trasversale 4.00: DO/DRA/DRAS

Occasione legata al ciclo stagionale
type: Class
subclass of: Occasione
comment: Questa classe rappresenta un'occasione legata ai cicli stagionali, ovvero cicli che si riferiscono a: oggetto di concezioni, credenze, mito, scienza, di elaborazione in poesia, prosa, canto, arte e di culto; riferimento di attività, pratiche, comportamenti, di dati o fenomeni a particolari cicli, giorni, settimane, lunazioni, mesi, stagioni ecc.; giorni e periodi fausti e infausti.
comment: This class represents a circumstance related to seasonal cycles, referred to: subject of popular belief, myth, science; poetry, prose, songs, art, ritual; practical activities, behaviour, phenomena connected to specific cycles, days, months, seasons; fortunate or unfortunate days and periods. @en
label: Season cycle circumstance @en
version info: stabile
version info: stable @en
iccd norm tag: ICCD Normativa BDI 4.00: CA/CAO/CAOS

Interpretazione del sesso
type: Class
subclass of: Interpretazione
subclass of: Restriction
  on property: è interpretazione del sesso di
  some values from: CulturalEntity
subclass of: Restriction
  on property: sesso stimato
  some values from: Literal
comment: Questa classe rappresenta la stima del sesso di un reperto antropologico.
comment: This class represents the interpretation of the sex of an anthropological material. @en
label: Sex interpretation @en
version info: stabile
version info: stable @en
iccd norm tag: ICCD Normativa AT: DA/STS

Occasione legata alla socialità quotidiana
type: Class
subclass of: Occasione
comment: Questa classe rappresenta un'occasione connessa alla socialità quotidiana (balli, caffè, veglie, osterie)
comment: This class represents a circumstance related to social interaction (dances, pubs, wakes) @en
label: Social interaction circumstance @en
version info: stabile
version info: stable @en
iccd norm tag: ICCD Normativa BDI 4.00: CA/CAO/CAOQ

Fonti e documenti
type: Class
subclass of: Documentazione
subclass of: Restriction
  on property: foglio
  all values from: Literal
comment: Questa classe rappresenta le fonti e i documenti testuali editi e inediti relativi a un oggetto, per esempio a un bene culturale.
comment: This class represents source and document related to an object, e.g. a cultural property. @en
label: Source and document @en
version info: stabile
version info: stable @en
iccd norm tag: ICCD Normativa Trasversale 4.00: DO/FNT

Specie
type: Class
subclass of: Concept
subclass of: Restriction
  on property: è specie in
  some values from: Tassonomia biologica
comment: Questa classe rappresenta uno dei livelli di classificazione di una tassonomia biologica, ovvero la specie.
comment: This class represents one level of a biological taxon, the species. @en
label: Species @en
deprecated: true
version info: stabile
version info: stable @en
iccd norm tag: ICCD Normativa AT: OG/OGS/OGSN

Unità stratigrafica
type: Class
subclass of: Location
subclass of: Restriction
  on property: è unità stratigrafica di
  all values from: Scavo archeologico
comment: Questa classe rappresenta l'unità stratigrafica dalla quale può provenire un bene culturale.
comment: This class represents a stratigraphic unit from which a cultural property may come from. @en
label: Stratigraphic unit @en
version info: stabile
version info: stable @en
iccd norm tag: ICCD Normativa Trasversale 4.00: RE/DSC/DSCU

Soggetto
type: Class
subclass of: Topic
subclass of: Restriction
  on property: è soggetto di
  some values from: Thing
comment: Questa classe rappresenta il soggetto rappresentato da un bene culturale o il suo motivo decorativo.
comment: This class represents the subject of a cultural property, or its ornamental motif. @en
label: Subject @en
version info: stabile
version info: stable @en
iccd norm tag: ICCD Normativa Trasversale: DA/AID/AIDI - Normativa F: SG/SGT/SGTI - Altre normative di versioni precedenti alla 4.00: OG/SGT/SGTI - ICCD Normative F, RA, SMO, PST, S, OAC, OA, MI, D, NU: RO/ROF/ROFS

Sottospecie
type: Class
subclass of: Concept
subclass of: Restriction
  on property: è sottospecie in
  some values from: Tassonomia biologica
comment: Questa classe rappresenta uno dei livelli di classificazione di una tassonomia biologica, ovvero la sottospecie.
comment: This class represents one level of a biological taxon, the subspecies. @en
label: Subspecies @en
deprecated: true
version info: stabile
version info: stable @en
iccd norm tag: ICCD Normativa AT: OG/OGS/OGST

Indagine
type: Class
subclass of: Activity
subclass of: Restriction
  on property: è indagine su
  some values from: CulturalEntity
description: An example of usage of one of the subclasses of the class 'Survey' is the following: resource:ArchaeologicalExcavation/0500590557-survey-1 a cd:ArchaeologicalExcavation ; rdfs:label "Archaeological excavation 1 of cultural property 0500590557: Monselice, via Valli"@en ; cd:hasActivityResponsible resource:Agent/sba ; cd:hasStratigraphicUnit resource:StratigraphicUnit/325 ; cd:hasSurveyMethod resource:SurveyMethod/scavo-stratigrafico ; cd:hasSurveyMotivation resource:SurveyMotivation/opere-pubbliche ; cd:hasSurveyScientificDirector resource:Agent/bianchin-citton-elodia ; core:hasAgentRole resource:AgentRole/0500590557-archaeological-excavation-1-activity-responsible , resource:AgentRole/0500590557-archaeological-excavation-1-scientific-director ; tiapit:time "2004" . @en
description: Un esempio d'uso di una delle sottoclassi della classe "Indagine" è il seguente: resource:ArchaeologicalExcavation/0500590557-survey-1 a cd:ArchaeologicalExcavation ; rdfs:label "Scavo archeologico 1 del bene 0500590557: Monselice, via Valli"@it ; cd:hasActivityResponsible resource:Agent/sba ; cd:hasStratigraphicUnit resource:StratigraphicUnit/325 ; cd:hasSurveyMethod resource:SurveyMethod/scavo-stratigrafico ; cd:hasSurveyMotivation resource:SurveyMotivation/opere-pubbliche ; cd:hasSurveyScientificDirector resource:Agent/bianchin-citton-elodia ; core:hasAgentRole resource:AgentRole/0500590557-archaeological-excavation-1-activity-responsible , resource:AgentRole/0500590557-archaeological-excavation-1-scientific-director ; tiapit:time "2004" .
comment: Questa classe rappresenta un'indagine effettuata su un bene culturale. Per indagine, si intende un'attività che riguarda il bene, effettuata per la sua individuazione (nel caso dei beni archeologici), per il suo studio e per l'approfondimento delle sue caratteristiche tecniche (indagini di scavo, di ricognizione, indagini geognostiche, analisi di vario genere e tipo, etc.). Questa classe viene specializzata in sottoclassi, per la rappresentazione di tipologie di indagini specifiche.
comment: This class represents a survey carried out on a cultural property, that is an activity related to a cultural property and carried out for its identification, study or observation of its technical characteristics. @en
label: Survey @en
version info: stabile
version info: stable @en
iccd norm tag: ICCD Normativa Trasversale 4.00: RE; CM/ISP - ICCD Normative NU, RA, BNB, MA, CA: RS/ALB - ICCD Normativa AT 3.00: IN/INI - ICCD Normativa SM: DR

Immagine di indagine
type: Class
subclass of: Object
subclass of: Restriction
  on property: è immagine di indagine
  some values from: Fotointerpretazione e fotorestituzione
subclass of: Restriction
  on property: ha tipo di immagine di indagine
  all values from: Tipo di immagine di indagine
subclass of: Restriction
  on property: identificativo immagine di indagine
  all values from: Literal
comment: Questa classe rappresenta l'immagine presa in esame nel corso di una fotointerpretazione o fotorestituzione.
comment: This class represents the image analysed during a photo interpretation or rendering survey. @en
label: Survey Image @en
version info: stabile
version info: stable @en
iccd norm tag: ICCD Normativa Trasversale 4.00: RE/FOI/FOIT + FOID

Tipo di immagine di indagine
type: Class
subclass of: Type
comment: Questa classe rappresenta un tipo di immagine analizzata in una indagine di fotointerpretazione e restituzione (fotografia aerea o fotografia satellitare).
comment: This class represents the type of image analysed during a photo interpretation or rendering survey (aerial photograph, satellite photograph). @en
label: Survey image type @en
version info: stabile
version info: stable @en
iccd norm tag: ICCD Normativa Trasversale 4.00: RE/FOI/FOIT

Metodo di indagine
type: Class
subclass of: Method
subclass of: Restriction
  on property: è metodo di indagine di
  some values from: Indagine
comment: Questa classe rappresenta il metodo di scavo archeologico o di ricognizione archeologica adottato nel corso dell'indagine. (es.: sondaggio, per strati stratigrafici, occasionale, sistematico, etc.)
comment: This class represents the archeological survey method adopted. @en
label: Survey method @en
version info: stabile
version info: stable @en
iccd norm tag: ICCD Normativa Trasversale 4.00: RE/RCG/RCGM; RE/DSC/DSCM

Motivo di indagine
type: Class
subclass of: Description
subclass of: Restriction
  on property: è motivo di indagine di
  some values from: Indagine
comment: Questa classe rappresenta il motivo principale che ha determinato una ricognizione archeologica o uno scavo archeologico.
comment: This class represents the main motivation of a survey. @en
label: Survey Motivation @en
version info: stabile
version info: stable @en

Titolo
type: Class
subclass of: Object
subclass of: Restriction
  on property: è titolo di
  some values from: Thing
subclass of: Restriction
  on property: ha criterio interpretativo
  all values from: Criterio interpretativo
subclass of: Restriction
  on property: ha tipo di titolo
  all values from: Tipo di Titolo
subclass of: Restriction
  on property: specifications
  all values from: Literal
comment: Questa classe rappresenta il titolo di un oggetto. Nel caso del dominio dei beni culturali, può rappresentare il titolo del soggetto di un bene culturale o di un'opera collegata a un bene culturale in quanto sua fase preparatoria o finale o in quanto pubblicazione contenente una stampa, oppure il titolo di una serie fotografica, etc.
comment: This class represents the title of an object, e.g. the title of the subject represented by a cultural property, or the title of a photographic series, etc. @en
label: Title @en
version info: stabile
version info: stable @en
iccd norm tag: ICCD Normativa Trasversale: DA/AID/AIDN (titolo alternativo); DA/AID/AIDT (titolo) - Normativa S e MI: OG/SGT/SGTP (titolo proprio); Normativa F: SG/SGL/SGLA (titolo attribuito); SG/SGL/SGLT (titolo proprio); SG/SGL/SGLL (titolo parallelo); - Altre normative di versioni precedenti alla 4.00: OG/SGT/SGTR (titolo parallelo); OG/SGT/SGTT (titolo); ICCD Normativa S 3: RO/ADL/ADLT

Tipo di Titolo
type: Class
subclass of: Type
comment: Questa classe rappresenta il tipo di titolo di un oggetto (es.: originario, alternativo).
comment: This class represents the type of an object title (e.g. original, alternative) @en
label: Title Type @en
version info: stabile
version info: stable @en
iccd norm tag: ICCD Normativa Trasversale: DA/AID/AIDN; DA/AID/AIDT - Normativa S e MI: OG/SGT/SGTP Normativa F: SG/SGL/SGLA; SG/SGL/SGLT; SG/SGL/SGLL - Altre normative di versioni precedenti alla 4.00: OG/SGT/SGTR; OG/SGT/SGTT - Normative VeAC e AT: DO/BSE/BSET e BSEC.

Deposizione funeraria
type: Class
subclass of: Object
subclass of: Restriction
  on property: è deposizione funeraria di
  some values from: Scavo archeologico
comment: Questa classe rappresenta una deposizione funeraria.
comment: This class represents a tomb. @en
label: Tomb @en
version info: stabile
version info: stable @en
iccd norm tag: ICCD Normativa Trasversale 4.00: RE/DSC/DSCS

Strumento urbanistico-territoriale
type: Class
subclass of: Object
subclass of: Restriction
  on property: è strumento urbanistico-territoriale di
  some values from: CulturalEntity
subclass of: Restriction
  on property: ha intervento ammesso
  all values from: Intervento ammesso
subclass of: Restriction
  on property: ha ente che ha emanato il provvedimento
  all values from: Agent
comment: Questa classe rappresenta uno strumento urbanistico-territoriale, ovvero un piano regolatore generale e particolareggiato o un piano paesaggistico che interessa un bene culturale.
comment: This class represents a urban planning instrument, related to a cultural property. @en
label: Urban planning instrument @en
version info: stabile
version info: stable @en
iccd norm tag: ICCD Normativa Trasversale 4.00: TU/STU

Uso
type: Class
subclass of: Description
subclass of: Restriction
  on property: ha funzione d'uso
  some values from: Funzione d'uso
subclass of: Restriction
  on property: è uso di
  some values from: CulturalEntity
subclass of: Restriction
  on property: ha circostanza
  all values from: Occasione
subclass of: Restriction
  on property: ha tipo d'uso
  all values from: Tipo d'uso
subclass of: Restriction
  on property: ha specifiche del tipo d'uso
  all values from: Specifiche del tipo d'uso
subclass of: Restriction
  on property: modalità di uso
  all values from: Literal
subclass of: Restriction
  on property: funzione d'uso
  all values from: Literal
comment: Questa classe rappresenta l'uso del bene, che può variare nel corso del tempo, a seconda delle diverse occasioni e delle parti utilizzate del bene.
comment: This class represents the use of a cultural property, that can change over time, depending on the circumstances and on which parts of the cultural property are used. @en
label: Use @en
version info: stabile
version info: stable @en
iccd norm tag: ICCD Normativa Trasversale 4.00: UT

Funzione d'uso
type: Class
subclass of: Role
subclass of: Restriction
  on property: funzione d'uso
  some values from: Literal
comment: Questa classe rappresenta la funzione d'uso che ha un oggetto.
comment: This class represents the use function of an object. @en
label: Use function @en
version info: stabile
version info: stable @en
iccd norm tag: ICCD Normativa Trasversale: UT/UTU/UTUF; LC/LDC/LDCF; LA/PRC/PRCF - BDM 2.00:UT/UTF - PST 3.01: DA/UTF

Tipo d'uso
type: Class
subclass of: Type
comment: Questa classe rappresenta il tipo di uso del bene (attuale, precedente, storico o dato non disponibile).
comment: This class represents the type of use of a cultural property (current, previous, historical) @en
label: Use type @en
version info: stabile
version info: stable @en
iccd norm tag: ICCD Normativa Trasversale: UT/UTU/UTUT

Specifiche del tipo d'uso
type: Class
subclass of: Type
comment: Questa classe rappresenta le specifiche sul tipo di uso del bene (reimpiego, edilizio, epigrafico, ornamentale, strumentale, strutturale).
comment: This class represents the specification of the type of use of a cultural property (e.g. building, ornamental, structural, instrumental) @en
label: Use type specification @en
version info: stabile
version info: stable @en
iccd norm tag: ICCD Normativa Trasversale: UT/UTU/UTUS

Categoria sociale dell'utente
type: Class
subclass of: Category
comment: Questa classe rappresenta la categoria sociale a cui appartiene l'utente del bene.
comment: This class represents the social category of a user (e.g. of a cultural property) @en
label: User social category @en
version info: stabile
version info: stable @en
iccd norm tag: ICCD Normative BDM 2.00: UT/UTN/UTNC

Occasione legata al lavoro
type: Class
subclass of: Occasione
comment: Questa classe rappresenta un'occasione connessa al lavoro (es.: panificazione, agricoltura)
comment: This class represents a circumstance related to work (e.g.: agriculture, bakery) @en
label: Work circumstance @en
version info: stabile
version info: stable @en
iccd norm tag: ICCD Normativa BDI 4.00: CA/CAO/CAOL

Occasione legata al ciclo dell'anno
type: Class
subclass of: Occasione
comment: Questa classe rappresenta un'occasione legata ai cicli dell'anno (es.: equinozio autunno, capodanno, Quaresima, Ramadan, carnevale, etc.)
comment: This class represents a circumstance related to year cycles (e.g.: autumnal equinox, New Year's Eve, Lent, Ramadan, carnival, etc.) @en
label: Year cycle circumstance @en
version info: stabile
version info: stable @en
iccd norm tag: ICCD Normativa BDI 4.00: CA/CAO/CAOA

Bibliografia di corredo
type: NamedIndividual
type: Genere della bibliografia
comment: Questo individuo rappresenta la definizione (vocabolario chiuso) relativa al genere di bibliografia che riguarda in modo più generico il contesto in cui si è venuto a trovare il bene nel corso della sua storia.
comment: This individual represents the definition relative to the genre of bibliography. @en
label: Accompanying bibliography @en
version info: stabile
version info: stable @en

Fotografia aerea
type: NamedIndividual
type: Tipo di immagine di indagine
label: Aerial photograph @en

Titolo alternativo
type: NamedIndividual
type: Tipo di Titolo
comment: Rappresenta un altro titolo noto del soggetto, in alternativa o in aggiunta al titolo più noto o accreditato.
comment: Represents subject's alternative title. @en
label: Alternative title @en
iccd norm tag: ICCD Normativa Trasversale: DA/AID/AIDN

Origine antropica
type: NamedIndividual
type: Origine dell'anomalia
label: Anthropic origin @en

Documentazione allegata
type: NamedIndividual
type: Genere della documentazione
comment: Questo individuo rappresenta la definizione (vocabolario chiuso) della documentazione acclusa alla scheda di catalogo.
comment: This individual represents documenation definition included inside catalog. @en
label: Attached documentation @en
version info: stabile
version info: stable @en

Titolo attribuito
type: NamedIndividual
type: Tipo di Titolo
comment: Rappresenta un titolo attribuito di una fotografia, cioè un titolo desunto, se possibile, da fonti archivistiche, bibliografiche, orali o iconografiche (altri esemplari della stessa immagine) oppure creato in base al contenuto dell'immagine (o della serie di immagini; è necessario nei casi in cui siano del tutto assenti titoli sul/nel documento, o su materiali ad esso complementari, e nel caso in cui tali titoli risultino errati.
comment: Represents an attributed title of a photograph, that is a title taken from archival, bibliographic, oral or iconographic sources, or created based on picture contents. @en
label: Attributed title @en
iccd norm tag: Normativa F: SG/SGL/SGLA - Normativa FF: se PA/PAC/PACG = 'attribuita'

Uso edilizio
type: NamedIndividual
type: Specifiche del tipo d'uso
comment: Questo individuo rappresenta le specifiche d'uso edilizio di un bene.
comment: This individual represents cultural entity building use specifications. @en
label: Building use @en
version info: stabile
version info: stable @en

Occasione civile
type: NamedIndividual
type: Tipo di circostanza
label: Civil circumstance @en

Bibliografia di confronto
type: NamedIndividual
type: Genere della bibliografia
comment: Questo individuo rappresenta la definizione (vocabolario chiuso) relativa al genere di bibliografia utilizzata per confronti (stilistici, tipologici, ecc.).
comment: This individual represents the definition relative to the kind of bibliography used for comparisons. @en
label: Comparative bibliography @en
version info: stabile
version info: stable @en

Uso attuale
type: NamedIndividual
type: Tipo d'uso
comment: Questo individuo rappresenta l'uso attuale di un bene.
comment: This individual represents cultural entity current use. @en
label: Current use @en
version info: stabile
version info: stable @en

Discreta affidabilità
type: NamedIndividual
type: Affidabilità
label: Decent reliability @en

Conferma di avvenuta spedizione
type: NamedIndividual
type: Tipo di certificazione di esportazione o importazione
label: Delivery confirmation certification @en
version info: stabile
version info: stable @en

Datazione diversa
type: NamedIndividual
type: Tipo di datazione alternativa
comment: Questo individuo rappresenta un tipo di datazione differente rispetto a quella presente nelle informazioni della cronologia del bene in esame.
comment: This individual represents a different type of dating than the one present in cultural entity's chronological information. @en
label: Different dating @en
version info: stabile
version info: stable @en
iccd norm tag: ICCD Normativa Trasversale: DT/ADT/ADTT. @en

Epigrafico
type: NamedIndividual
type: Specifiche del tipo d'uso
comment: Questo individuo rappresenta le specifiche d'uso epigrafico di un bene.
comment: This individual represents cultural entity's epigraphic use. @en
label: Epigraphic @en
version info: stabile
version info: stable @en

Ottima affidabilità
type: NamedIndividual
type: Affidabilità
label: Excellent reliability @en

Documentazione esistente
type: NamedIndividual
type: Genere della documentazione
comment: Questo individuo rappresenta la definizione (vocabolario chiuso) della documentazione che viene solo citata: non è acclusa alla scheda di catalogo, ma si trova presso un luogo di conservazione (Archivio, Biblioteca, ecc.), anche “virtuale”, come nel caso delle risorse disponibili sul web e consultabili on line.
comment: This individual represents documentation definition that is only mentioned. @en
label: Existing documentation @en
version info: stabile
version info: stable @en

Attestato di libera circolazione
type: NamedIndividual
type: Tipo di certificazione di esportazione o importazione
label: Free movement certification @en
version info: stabile
version info: stable @en

Buona affidabilità
type: NamedIndividual
type: Affidabilità
label: Good reliability @en

Uso storico
type: NamedIndividual
type: Tipo d'uso
comment: Questo individuo rappresenta l'uso storico di un bene.
comment: This individual represents cultural enity's historical use. @en
label: Historical use @en
version info: stabile
version info: stable @en

Titolo storicizzato
type: NamedIndividual
type: Tipo di Titolo
label: Historicized title @en
iccd norm tag: ICCD Normativa FF: se PA/PAC/PACG = 'storicizzata'

Certificato di avvenuta importazione
type: NamedIndividual
type: Tipo di certificazione di esportazione o importazione
label: Import confirmation certification @en
version info: stabile
version info: stable @en

Strumentale
type: NamedIndividual
type: Specifiche del tipo d'uso
comment: Questo individuo rappresenta le specifiche d'uso strumentale di un bene.
comment: This individual represents cultural entity instrumental use specifications. @en
label: Instrumental @en
version info: provvisorio
version info: stable @en

Scarsa affidabilità
type: NamedIndividual
type: Affidabilità
label: Insufficient reliability @en

Anomalia lineare
type: NamedIndividual
type: Tipo di anomalia
label: Line anomaly @en

Titolo principale
type: NamedIndividual
type: Tipo di Titolo
comment: Questo individuo rappresenta il titolo principale di una pubblicazione.
comment: This individual represents publication main title. @en
label: Main title @en
iccd norm tag: ICCD Normative VeAC e AT 3.01: DO/BSE/BSET

Origine naturale
type: NamedIndividual
type: Origine dell'anomalia
label: Natural origin @en

Datazione superata
type: NamedIndividual
type: Tipo di datazione alternativa
comment: Questo individuo rappresenta il tipo di datazione superata rispetto a quella presente nelle informazioni relative alla cronologia del bene in esame.
comment: This individual represents an obsolete dating. @en
label: Obsolete dating @en
version info: stabile
version info: stable @en
iccd norm tag: ICCD Normativa Trasversale: DT/ADT/ADTT.

Titolo originario
type: NamedIndividual
type: Tipo di Titolo
label: Original title @en
iccd norm tag: ICCD Normativa FF: se PA/PAC/PACG = 'originaria'

Ornamentale
type: NamedIndividual
type: Specifiche del tipo d'uso
comment: Questo individuo rappresenta le specifiche d'uso ornamentale di un bene.
comment: This individual represents cultural entity's ornamental use specifications. @en
label: Ornamental @en
version info: stabile
version info: stable @en

Altro metodo di datazione
type: NamedIndividual
type: Tipo di datazione alternativa
comment: Questo individuo rappresenta un tipo di metodo diverso di datazione rispetto a quella presente nelle informazioni della cronologia del bene in esame.
comment: This individual represents a different type of dating method than the one present in cultural entity's chronological information. @en
label: Other method of dating @en
version info: stabile
version info: stable @en
iccd norm tag: ICCD Normativa Trasversale: DT/ADT/ADTT.

Titolo parallelo
type: NamedIndividual
type: Tipo di Titolo
comment: I represents a parallel title, that is main title translated into other languages and presented as equivalent. @en
comment: Rappresenta un titolo parallelo, cioè lo stesso titolo principale tradotto in altre lingue e presentato come equivalente.
label: Parallel title @en
iccd norm tag: Normativa F: SG/SGL/SGLL - Normative S e MI: OG/SGT/SGTR

Licenza di esportazione definitiva
type: NamedIndividual
type: Tipo di certificazione di esportazione o importazione
label: Permanent export license @en
version info: stabile
version info: stable @en

Anomalia puntuale
type: NamedIndividual
type: Tipo di anomalia
label: Point anomaly @en

Anomalia areale
type: NamedIndividual
type: Tipo di anomalia
label: Polygon anomaly @en

Uso precedente
type: NamedIndividual
type: Tipo d'uso
comment: Questo individuo rappresenta l'uso precedente di un bene.
comment: This individual represents cultural enity's previous use. @en
label: Previous use @en
version info: stabile
version info: stable @en

Titolo proprio
type: NamedIndividual
type: Tipo di Titolo
comment: It represents the title proper to subject of a print, an engraved matrix or a photograph. @en
comment: Rappresenta il titolo proprio del soggetto di una stampa, di una matrice incisa o di una fotografia. Per titolo proprio di una stampa si intende il titolo principale nella forma in cui appare sulla stampa o sulla matrice stessa. Per titolo proprio (principale) di una fotografia, si intende nella forma in cui appare nell'immagine (o su uno dei suoi supporti, o nelle schede a campi testuali, o nei commenti sonori presenti all'interno del file contenente l'immagine digitale). Per la normativa F, Il titolo proprio include anche ogni eventuale titolo alternativo (altre denominazioni dell'opera che appaiano insieme al titolo principale) e, facoltativamente, i complementi del titolo proprio (ossia sottotitoli od ulteriori indicazioni che contribuiscono a qualificare più specificamente il contenuto dell'immagine).
label: Proper title @en
version info: stabile
version info: stable @en
iccd norm tag: Normative S e MI: OG/SGT/SGTP - Normativa F: SFG/SGL/SGLT

Occasione religiosa
type: NamedIndividual
type: Tipo di circostanza
label: Religious circumstance @en

Fotografia satellitare
type: NamedIndividual
type: Tipo di immagine di indagine
label: Satellite photograph @en

Titolo secondario
type: NamedIndividual
type: Tipo di Titolo
comment: Questo individuo rappresenta il tipo di titolo secondario di una pubblicazione.
comment: This individual represents publication's secondary title. @en
label: Secondary title @en
iccd norm tag: ICCD Normative VeAC e AT 3.01: DO/BSE/BSEC

Bibliografia specifica
type: NamedIndividual
type: Genere della bibliografia
comment: Questo individuo rappresenta la definizione relativa al genere di bibliografia che riguarda in modo specifico il bene in esame.
comment: This individual represents the definition related to the kind of bibliography that specifically concerns the subject under examination. @en
label: Specific bibliography @en
version info: stabile
version info: stable @en

Uso strutturale
type: NamedIndividual
type: Specifiche del tipo d'uso
comment: Questo individuo rappresenta le specifiche d'uso strutturale di un bene.
comment: This individual represents cultural entity's structural use specifications. @en
label: Structural use @en
version info: stabile
version info: stable @en

Licenza di esportazione temporanea
type: NamedIndividual
type: Tipo di certificazione di esportazione o importazione
label: Temporary export license @en
label: provvisoria
label: unstable @en

Attestato di circolazione temporanea
type: NamedIndividual
type: Tipo di certificazione di esportazione o importazione
label: Temporary movement certification @en
version info: stabile
version info: stable @en

Origine incerta
type: NamedIndividual
type: Origine dell'anomalia
label: Uncertain origin @en

Tipo di uso non disponibile
type: NamedIndividual
type: Tipo d'uso
comment: Questo individuo rappresenta la mancanza di dati disponibili relativamente al tipo di uso di un bene.
comment: This individual represents the lack of available data regarding the type of use of a cultural entity. @en
label: Use type unavailable @en
version info: stabile
version info: stable @en