META-SHARE ontology
type: Ontology
version IRI: http://w3id.org/meta-share/meta-share/2.0.0
prior version: MetaShareRights.ttl#
creator: Philipp Cimiano
creator: Dimitris Galanis
preferred namespace prefix: ms
creator: John P. McCrae
creator: Jorge Gracia
description: Meta-Share ontology v2. The ontology caters for the description of Language resources (corpora, lexical/conceptual resources, models, grammars, etc. and language processing tools and services) for Language Technology needs. It is also related to the OMTD-SHARE ontology (http://w3id.org/meta-share/omtd-share/) which caters for specific features (LT operation/area, data format, method, annotation type).
creator: john.mccr.ae
creator: Marta Villegas
preferred namespace uri: http://w3id.org/meta-share/meta-share/
creator: Victor Rodriguez Doncel
license: cc-by4.0
version info: v2.0.0 pre-release
prior version: ontology
creator: Katerina Gkirtzou
modified: 2020-03-20
creator: Penny Labropoulou
type: NamedIndividual

has identifier
type: ObjectProperty
domain: Thing
range: Identifier
comment: Associates an entity to an identifier, i.e. a string used to uniquely identify it

uses identifier scheme
type: ObjectProperty
domain: Identifier
range: IdentifierScheme
comment: Indicates the scheme used to provide the identifier for an entity

LT area
type: ObjectProperty
domain: Class
  union of: Division
  union of: Document
  union of: Group
  union of: Organization
  union of: Person
  union of: Project
range: Operation
comment: Introduces a Language Technology-related area associated with the activities or domain of interest of an entity
alternative label: Language Technology area

LT tool/service related to
type: ObjectProperty
sub property of: is related to
inverse of: is related to LT tool/service
domain: Language Technology tool/service
range: Data language resource
comment: Links a tool/service (the one being described) to a language resource that bears some relation to it

metadata record related to
type: ObjectProperty
sub property of: is related to
inverse of: is related to metadata record
domain: Metadata record
range: Class
  union of: Language Resource
  union of: Metadata record
comment: Links an external metadata record that has some relation with the metadata record of the resource being described or the resource itself

access rights
type: ObjectProperty
domain: Distribution
range: Access rights statement
comment: Specifies the rights for accessing the distributable form(s) of a language resource (preferrably in accordance to a formalised vocabulary)

accesses
type: ObjectProperty
sub property of: LT tool/service related to
inverse of: is accessed by
domain: Language Technology tool/service
range: Class
  union of: Data language resource
  union of: Media part
comment: Links a tool/service B that is (or can be) used for accessing LR A (e.g., a corpus workbench, s/w for lexicon access) to the LR A

actor related to
type: ObjectProperty
sub property of: is related to
inverse of: is related to actor
domain: Actor
range: Language Resource
comment: Links actors to a language resource with which they have some relation

actual use
type: ObjectProperty
domain: Language Resource
range: Actual use
comment: Provides information on how the resource has been used (e.g., in a project, for a publication, for testing a tool/service, etc.)

address
type: ObjectProperty
domain: Class
  union of: Affiliation
  union of: Division
  union of: Group
  union of: Organization
  union of: Person
range: Address
comment: Links to the physical address of an organization, group or person represented as a set of distinct elements (street, number, zip code, city, etc.)

affiliated organization
type: ObjectProperty
domain: Affiliation
range: Organization
comment: Specifies the organization that a person is affiliated with or works for

affiliation
type: ObjectProperty
domain: Person
range: Affiliation
comment: Introduces information on an organization to whom the person is affiliated and the data relevant to this relation (i.e. position, email, etc.)

age group
type: ObjectProperty
domain: Participant
range: Age group
comment: The age group to which the participant belongs

age group of participants
type: ObjectProperty
domain: Class
  union of: Corpus audio part
  union of: Corpus image part
  union of: Corpus text numerical part
  union of: Corpus video part
range: Age group
comment: The age range of the group of participants

annotated element
type: ObjectProperty
domain: Annotation
range: Annotated element
comment: Specifies the elements annotated at each annotation level

annotation
type: ObjectProperty
domain: Corpus part
range: Annotation
comment: Links a corpus to its annotated part(s)

annotation mode
type: ObjectProperty
sub property of: process mode
domain: Annotation
range: Process mode
comment: Indicates whether the resource is annotated manually or by automatic processes

annotation report
type: ObjectProperty
sub property of: is documented by
inverse of: documents annotation
domain: Annotation
range: Document
comment: Links to a report describing the annotation process, tool, method, etc. of the language resource

annotation resource
type: ObjectProperty
sub property of: depends on
inverse of: is annotation resource of
domain: Class
  union of: Machine Learning model
  union of: Input content resource
  union of: Language Technology tool/service
range: Lexical/Conceptual resource
comment: Specifies the annotation resource used for annotating a corpus or that has been used for the input resource of a tool/service or that should be used (dependency) for the annotation

annotation schema
type: ObjectProperty
sub property of: depends on
inverse of: is annotation schema of
domain: Class
  union of: Machine Learning model
  union of: Input content resource
  union of: Language Technology tool/service
range: Lexical/Conceptual resource
comment: The annotation schema used for annotating a resource or for the input resource (if annotated) of a tool/service or that should be used (dependency) for the annotation

annotation type
type: ObjectProperty
domain: Annotation
range: AnnotationType
comment: Specifies the annotation type of the annotated version(s) of a resource or the annotation type a tool/ service requires or produces as an output

annotator
type: ObjectProperty
sub property of: is related to actor
inverse of: is annotator of
domain: Annotation
range: Actor
comment: Identifies the person or organisation responsible for the annotation of a resource

audience
type: ObjectProperty
domain: Class
  union of: Corpus audio part
  union of: Corpus video part
range: Audience
comment: Indicates the intended audience size of a multimedia resource

detailed audio format
type: ObjectProperty
domain: Class
  union of: Corpus audio part
  union of: Lexical/Conceptual resource audio part
range: Detailed audio format
comment: Specifies the features of the format of the audio part of a language resource

audio quality measure included
type: ObjectProperty
domain: Detailed audio format
range: Audio quality measure included
comment: Specifies the audio quality measures

author
type: ObjectProperty
domain: Document
range: Person
comment: Introduces the details for a person that has created the document being described

availability
type: ObjectProperty
domain: Distribution
range: Availability
comment: Specifies the availability status of the resource

base item
type: ObjectProperty
domain: N-gram model
range: Base item
comment: Type of item that is represented in the n-gram resource

body part
type: ObjectProperty
domain: Class
  union of: Dynamic element
  union of: Static element
range: Body part
comment: Specifies the body parts visible in the video or image part of the resource

byte order
type: ObjectProperty
domain: Detailed audio format
range: Byte order
comment: Specifies the byte order of 2 or more bytes sample

capturing device type
type: ObjectProperty
domain: Class
  union of: Corpus audio part
  union of: Corpus image part
  union of: Corpus text numerical part
  union of: Corpus video part
range: Capturing device type
comment: Provides information on the type of the transducers through which the data is captured

capturing environment
type: ObjectProperty
domain: Class
  union of: Corpus audio part
  union of: Corpus image part
  union of: Corpus text numerical part
  union of: Corpus video part
range: Capturing environment
comment: Specifies the type of the capturing environment

character encoding
type: ObjectProperty
domain: Text feature
range: Character encoding
comment: Specifies the character encoding used for a language resource data distribution

cites
type: ObjectProperty
sub property of: document related to
inverse of: is cited by
domain: Document
range: Language Resource
comment: Links to the language resource(s) that a publication includes in its citations

colour space
type: ObjectProperty
domain: Class
  union of: Detailed image format
  union of: Detailed video format
range: Colour space
comment: Defines the colour space for the video

compatible lexicon type
type: ObjectProperty
domain: Language description
range: Compatible lexicon type
comment: Specifies the type of (external) lexicon that can be used with the grammar

complies with
type: ObjectProperty
domain: Class
  union of: Language Resource
  union of: Metadata record
range: Standard/Best practice
comment: Specifies the vocabulary/standard/best practice to which a resource is compliant with

compression name
type: ObjectProperty
domain: Class
  union of: Detailed audio format
  union of: Detailed image format
  union of: Detailed video format
range: Compression name
comment: The name of the compression applied

condition of use
type: ObjectProperty
domain: Licence
range: Condition of use
comment: Links a licence with a specific condition/term of use imposed for accessing a language resource. It is an optional element and only to be taken as providing brief human readable information on the fact that the language resource is provided under a specific set of conditions. These correspond to the most frequently used conditions imposed by the licensor (via the specified licence). The proper exposition of all conditions and possible exceptions is to be found inside the licence text. Depositors should, hence, carefully choose the values of this field to match the licence chosen and users should carefully read that licence before using the language resource.

conforms to
type: ObjectProperty
domain: Classification
range: Classification scheme
comment: Specifies the vocabulary/scheme to which a value (e.g., as of text genre, domain, etc.) conforms to

contact
type: ObjectProperty
sub property of: is related to actor
inverse of: is contact for
domain: Language Resource
range: Actor
comment: Specifies the data of the person/organization/group that can be contacted for information about a language resource

contributor
type: ObjectProperty
domain: Document
range: Person
comment: Introduces the details for a person that has contributed in some way to the production of a document or resource

conversational type
type: ObjectProperty
domain: Class
  union of: Corpus audio part
  union of: Corpus video part
range: Conversational type
comment: Specifies the conversational type of a multimedia resource

coordinator
type: ObjectProperty
domain: Project
range: Organization
comment: Introduces the organization that coordinates the project being described
alternative label: co-ordinator

corpus subclass
type: ObjectProperty
domain: Corpus
range: Corpus subclass
comment: Introduces a classification of corpora into types (used for descriptive reasons)

cost
type: ObjectProperty
domain: Class
  union of: Distribution
  union of: Project
range: Cost
comment: Introduces the cost for accessing a resource or the overall budget of a project, formally described as a set of amount and currency unit

country
type: ObjectProperty
domain: Address
range: Country
comment: Introduces the name of the country mentioned in the postal address of a person or organization as defined in the list of values of ISO 3166

country of registration
type: ObjectProperty
domain: Class
  union of: Division
  union of: Organization
range: Country
comment: Introduces the country in which an organization was officially registered for the first time as a legal entity

creation mode
type: ObjectProperty
sub property of: process mode
domain: Class
  union of: Lexical/Conceptual resource
  union of: Media part
range: Process mode
comment: Specifies whether the resource was created automatically or in a manual or interactive mode

currency
type: ObjectProperty
domain: Cost
range: Currency
comment: Specifies the currency used for describing the cost of a resource

data format
type: ObjectProperty
domain: Class
  union of: Detailed audio format
  union of: Text feature
  union of: Numerical text feature
  union of: Detailed image format
  union of: Parameter
  union of: Detailed video format
range: DataFormat
comment: Indicates the format(s) of a data resource

dependent language resource
type: ObjectProperty
sub property of: is related to Language Resource
inverse of: depends on
domain: Language Resource
range: Language Resource
comment: Links to LR B that requires LR A (the one being described) for its operation or that has been processed with LR A

depends on
type: ObjectProperty
sub property of: is related to Language Resource
type: SymmetricProperty
domain: Language Resource
range: Language Resource
comment: Links to LR B that is required for the operation of LR A (the one being described) or that has been used in its processing
alternative label: supporting resource

type of described entity
type: ObjectProperty
domain: Metadata record
range: type of described entity
comment: Links to the entity that is being described by a metadata record
note: foaf:primaryTopic in DCAT

describes
type: ObjectProperty
sub property of: documents
inverse of: is described by
domain: Document
range: Language Resource
comment: Links to the language resource(s) that are described (contents, operation, etc.) in a document

displays
type: ObjectProperty
sub property of: LT tool/service related to
inverse of: is displayed by
domain: Language Technology tool/service
range: Class
  union of: Data language resource
  union of: Media part
comment: Links a tool/service B that is (or can be) used to display LR A (e.g., a tool for visualizing relations in a lexicon, or annotations in a corpus) to the LR A
alternative label: visualises
alternative label: visualizes

distribution
type: ObjectProperty
domain: Language Resource
range: Distribution
comment: Links a language resource to the various forms with which it is distributed

audio feature
type: ObjectProperty
domain: Dataset distribution
range: Audio feature
comment: Links to a feature that can be used for describing distinct distributable forms of audio resources/parts

distribution form
type: ObjectProperty
domain: Distribution
range: Distribution form
comment: Specifies the form (medium/channel) with which a resource is distributed (delivered or provided access to)

image feature
type: ObjectProperty
domain: Dataset distribution
range: Image feature
comment: Links to a feature that can be used for describing distinct distributable forms of image resources/parts

distribution rights holder
type: ObjectProperty
sub property of: is related to actor
inverse of: is distribution rights holder of
domain: Distribution
range: Actor
comment: Identifies a person or an organization that holds the distribution rights. The range and scope of distribution rights is defined in the distribution agreement. The distributor in most cases only has a limited licence to distribute the work and collect royalties on behalf of the licensor or the IPR holder and cannot give to any recipient of the work permissions that exceed the scope of the distribution agreement (e.g., to allow uses of the work that are not defined in the distribution agreement)

text feature
type: ObjectProperty
domain: Dataset distribution
range: Text feature
comment: Links to a feature that can be used for describing distinct distributable forms of text resources/parts

numerical text feature
type: ObjectProperty
domain: Dataset distribution
range: Numerical text feature
comment: Links to a feature that can be used for describing distinct distributable forms of numerical text resources/parts

video feature
type: ObjectProperty
domain: Dataset distribution
range: Video feature
comment: Links to a feature that can be used for describing distinct distributable forms of video resources/parts

division category
type: ObjectProperty
domain: Division
range: Division category
comment: Classifies the division of an organization according to a controlled vocabulary

document related to
type: ObjectProperty
sub property of: is related to
inverse of: is related to document
domain: Document
range: Class
  union of: Language Resource
  union of: Project
comment: Links to the entity (language resource, project, part of a language resource) that is somehow related to the document that is described

document type
type: ObjectProperty
domain: Document
range: Document type
comment: Specifies the type of the document (e.g., article, book, etc.) provided with or related to the language resource

documentation type
type: ObjectProperty
domain: Document
range: Documentation type
comment: Classifies the documentation vis-a-vis its relation with the language resource (e.g., general publication, user manual, url for online help, etc.)

documents
type: ObjectProperty
sub property of: document related to
inverse of: is documented by
domain: Document
range: Language Resource
comment: Links a document to a language resource (e.g., research paper describing its contents or its use in a project, user manual, etc.)

documents annotation
type: ObjectProperty
sub property of: documents
domain: Document
range: Annotation
comment: Links a report to the annotation process, tool, method, etc. of a language resource that it describes

documents evaluation
type: ObjectProperty
sub property of: documents
inverse of: evaluation report
domain: Document
range: Evaluation
comment: Links a report to the evaluation process, tool, method, etc. of the tool or service it purports to describe

documents guidelines
type: ObjectProperty
sub property of: documents
inverse of: guidelines
domain: Document
range: Class
  union of: Annotation
  union of: Language Resource
comment: Links the guidelines used for the creation or annotation of a language resource to this language resource

documents usage
type: ObjectProperty
sub property of: documents
inverse of: usage report
domain: Document
range: Actual use
comment: Links a document (e.g., research article, report) describing the use of a language resource (e.g., in a project, application, experiment or use case) to the data of this use

documents validation
type: ObjectProperty
sub property of: documents
inverse of: validation report
domain: Document
range: Validation
comment: Links a document with detailed information on the validation process and results to the data of this validation

domain
type: ObjectProperty
domain: Class
  union of: Actor
  union of: Division
  union of: Document
  union of: Language Resource
  union of: Input content resource
  union of: Project
range: Domain
comment: Identifies the domain according to which an entity is classified

duration of audio
type: ObjectProperty
domain: Dataset distribution
range: Duration of audio
comment: Specifies the duration of the audio recording including silences, music, pauses, etc.

duration of effective speech
type: ObjectProperty
domain: Dataset distribution
range: Duration of audio
comment: Specifies the duration of effective speech of the audio (part of a) resource

duration unit
type: ObjectProperty
domain: Duration of audio
range: Duration unit
comment: Specifies the unit used for measuring the duration of a resource

dynamic element
type: ObjectProperty
domain: Class
  union of: Corpus video part
  union of: Language description video part
  union of: Lexical/Conceptual resource video part
range: Dynamic element
comment: Groups information on the dynamic elements that are represented in the video part of the resource
note: it was like this in MS-OWL v1, although it's not multiple; helps to organise the elements though

EC max contribution
type: ObjectProperty
domain: Project
range: Cost
comment: Introduces the maximum amount of money contributed from EC funds

editor
type: ObjectProperty
domain: Document
range: Person
comment: Introduces the details for a person that has edited the document being described

edits
type: ObjectProperty
sub property of: LT tool/service related to
inverse of: is edited by
domain: Language Technology tool/service
range: Class
  union of: Data language resource
  union of: Media part
comment: Links a tool/service B that is (or can be) used for editing LR A (the one being described) to LR A

encoding level
type: ObjectProperty
domain: Class
  union of: Language description
  union of: Lexical/Conceptual resource
range: Encoding level
comment: Classifies the contents of a lexical/conceptual resource or language description as regards the linguistic level of analysis it caters for

evaluation
type: ObjectProperty
domain: Language Technology tool/service
range: Evaluation
comment: Provides information on the evaluation process and results for a tool/service

evaluation criterion
type: ObjectProperty
domain: Evaluation
range: Evaluation criterion
comment: Defines the criterion(s) of the evaluation of a tool

evaluation level
type: ObjectProperty
domain: Evaluation
range: Evaluation level
comment: Indicates the evaluation level

evaluation measure
type: ObjectProperty
domain: Evaluation
range: Evaluation measure
comment: Defines whether the evaluation measure is human or automatic

evaluation report
type: ObjectProperty
sub property of: is documented by
domain: Evaluation
range: Document
comment: Links to a report describing the evaluation process, tool, method, etc. of the tool or service

evaluation type
type: ObjectProperty
domain: Evaluation
range: Evaluation type
comment: Indicates the evaluation type

evaluator
type: ObjectProperty
sub property of: is related to actor
inverse of: is evaluator of
domain: Evaluation
range: Actor
comment: Describes the person or organization that evaluated the tool or service

external reference
type: ObjectProperty
domain: Lexical/Conceptual resource
range: Lexical/Conceptual resource
comment: Provides reference to another resource to which the lexicalConceptualResource is linked (e.g., link to a wordnet or ontology)

extratextual information
type: ObjectProperty
domain: Lexical/Conceptual resource
range: Extratextual information
comment: Indicates the extratextual information contained in a lexical/conceptual resource; it can be used as an alternative to the representation of the audio, image, video, etc. part(s) of the resource when these are not considered important enough to fully describe

extratextual information unit
type: ObjectProperty
domain: Lexical/Conceptual resource
range: Extratextual information unit
comment: Indicates the unit on which the extratextual information is attached to in the lexical conceptual resource

framework
type: ObjectProperty
domain: Language Technology tool/service
range: Framework
comment: Specifies the implementation framework used for developing and running a tool/service

function
type: ObjectProperty
domain: Language Technology tool/service
range: Operation
comment: Specifies the operation/function/task that a software object performs
alternative label: operation
alternative label: task

funder
type: ObjectProperty
sub property of: is related to actor
inverse of: is funder of
domain: Project
range: Actor
comment: Identifies the person or organization or group that has financed the project

funding country
type: ObjectProperty
domain: Project
range: Country
comment: Specifies the name of the funding country, in case of national funding as mentioned in ISO3166

funded by
type: ObjectProperty
sub property of: is related to project
inverse of: is funding project of
domain: Language Resource
range: Project
comment: Links a language resource to the project that has funded its creation, enrichment, extension, etc.
alternative label: funding project

funding type
type: ObjectProperty
domain: Project
range: Funding type
comment: Specifies the type of funding of a project with regard to the source of the funding

genre
type: ObjectProperty
domain: Corpus part
range: Genre
comment: Links a language resource (part) to the genre it belongs to

grammatical phenomena coverage
type: ObjectProperty
domain: Language description
range: Grammatical phenomena coverage
comment: Gives an indication of the grammatical phenomena covered by the grammar

guidelines
type: ObjectProperty
sub property of: is documented by
domain: Class
  union of: Annotation
  union of: Language Resource
range: Document
type: NamedIndividual
type: Documentation type
comment: Links to the document used as guidelines for the creation or annotation of a corpus

has aligned version
type: ObjectProperty
sub property of: has version
inverse of: is aligned version of
domain: Corpus
range: Corpus
comment: Links to a corpus B which contains an aligned version of corpus A (the one being described)

has analysed
type: ObjectProperty
sub property of: LT tool/service related to
inverse of: is analysed by
domain: Language Technology tool/service
range: Class
  union of: Data language resource
  union of: Media part
comment: Links a tool/service B that is (or can be or has been) used for analysing LR A (e.g., a statistical tool) to LR A

has annotated
type: ObjectProperty
sub property of: LT tool/service related to
inverse of: is annotated by
domain: Language Technology tool/service
range: Annotation
comment: Links a tool/service B that has been used for annotating LR A (e.g., a tagger, NER, etc.) to LR A

has annotated version
type: ObjectProperty
sub property of: has version
inverse of: is annotated version of
domain: Corpus
range: Corpus
comment: Links to a corpus B which contains the annotations of corpus A (the one being described)

has archived
type: ObjectProperty
sub property of: LT tool/service related to
inverse of: is archived by
domain: Language Technology tool/service
range: Data language resource
comment: Links a tool/service B that is (or can be or has been) used for archiving LR A to LR A

has converted version
type: ObjectProperty
sub property of: has version
inverse of: is converted version of
domain: Data language resource
range: Data language resource
comment: Links to LR B that has been used for creating LR A (the one being described) through a conversion procedure, e.g., a PDF to text conversion

has created
type: ObjectProperty
sub property of: LT tool/service related to
inverse of: is created by
domain: Language Technology tool/service
range: Class
  union of: Data language resource
  union of: Media part
comment: Links a tool/service B that is (or can be or has been) used for creating LR A to LR A

has division
type: ObjectProperty
inverse of: is division of
domain: Organization
range: Division
comment: Links an organization to the division(s) (e.g., company branch, university faculty or department, etc.) it consists of

has elicited
type: ObjectProperty
sub property of: LT tool/service related to
inverse of: is elicited by
domain: Language Technology tool/service
range: Class
  union of: Data language resource
  union of: Media part
comment: Links a tool/service B that is (or can be or has been) used for eliciting LR A to LR A

has evaluated
type: ObjectProperty
sub property of: LT tool/service related to
inverse of: is evaluated by
domain: Language Technology tool/service
range: Evaluation
comment: Links a tool/service that has been used for evaluating an LR A to the data of this evaluation

has metadata
type: ObjectProperty
sub property of: is related to metadata record
inverse of: is metadata of
domain: Language Resource
range: Metadata record
comment: Links to an external metadata record that describes the same language resource in another catalogue, repository, etc.

has original source
type: ObjectProperty
sub property of: is related to Language Resource
inverse of: has outcome
domain: Class
  union of: Language Resource
  union of: Media part
range: Language Resource
comment: Links a language resource to the original source that has been used for its creation, where it's derived or elicited from

has outcome
type: ObjectProperty
sub property of: is related to Language Resource
domain: Actual use
range: Language Resource
comment: Links to LR B which is created / extracted from LR A (the one being described), i.e. LR A has been used as the basis/initial/source material for LR B
alternative label: is source of

has part
type: ObjectProperty
sub property of: is related to Language Resource
inverse of: is part of
domain: Language Resource
range: Language Resource
comment: Links to LR B which is contained in LR A (the one being described), e.g., a monolingual corpus part of a bilingual corpus

has recorded
type: ObjectProperty
sub property of: LT tool/service related to
inverse of: is recorded by
domain: Language Technology tool/service
range: Class
  union of: Corpus audio part
  union of: Corpus text numerical part
  union of: Corpus video part
comment: Links a tool/service to the data of the language resource (e.g., audio or video part of a corpus) it has recorded

has subset
type: ObjectProperty
domain: Media part
range: Subset
comment: Links to a subset of the resource that is described in order to add specific information on the subset (e.g. size per language for multilingual corpora, size per domain for lexica with multiple domains, etc.)
note: introduced to cater for all sizePer properties; decided not to use the isPartOf because I wanted to keep this for "whole" language resources

has validated
type: ObjectProperty
sub property of: LT tool/service related to
inverse of: is validated by
domain: Language Technology tool/service
range: Validation
comment: Links a tool/service B that is (or can be) used for validating LR A to the data of this validation

has version
type: ObjectProperty
sub property of: is related to Language Resource
inverse of: is version of
domain: Language Resource
range: Language Resource
comment: Links to LR B that is a version of LR A (the one being described)

address (head office)
type: ObjectProperty
sub property of: address
domain: Class
  union of: Affiliation
  union of: Division
  union of: Group
  union of: Organization
range: Address
comment: Links to the physical address of the head office of an organization or group represented as a set of distinct elements (street, zip code, city, etc.)

hearing impairment of participants
type: ObjectProperty
domain: Class
  union of: Corpus audio part
  union of: Corpus image part
  union of: Corpus text numerical part
  union of: Corpus video part
range: Hearing impairment of participants
comment: Specifies whether the group of participants contains persons with hearing impairments

detailed image format
type: ObjectProperty
domain: Dataset distribution
range: Detailed image format
comment: Provides information on each of the format(s) of the image part of a resource

input content resource
type: ObjectProperty
domain: Language Technology tool/service
range: Input content resource
comment: Specifies the requirements set by a tool/service for the (content) resource that it processes

intended application
type: ObjectProperty
domain: Language Resource
range: Operation
comment: Specifies an LT application for which the language resource has been created or for which it can be used or is recommended to be used

interactivity
type: ObjectProperty
domain: Class
  union of: Corpus audio part
  union of: Corpus video part
range: Interactivity
comment: Indicates the level of conversational interaction between speakers (for audio component) or participants (for video component)

IPR holder
type: ObjectProperty
sub property of: is related to actor
inverse of: is IPR holder of
domain: Language Resource
range: Actor
comment: A person or an organization who holds the full Intellectual Property Rights (Copyright, trademark, etc.) that subsist in the resource. The IPR holder could be different from the creator that may have assigned the rights to the IPR holder (e.g., an author as a creator assigns her rights to the publisher who is the IPR holder) and the distributor that holds a specific licence (i.e. a permission) to distribute the work via a specific distributor.
alternative label: intellectual property rights holder
alternative label: rights holder

is accessed by
type: ObjectProperty
sub property of: is related to LT tool/service
domain: Class
  union of: Data language resource
  union of: Media part
range: Language Technology tool/service
comment: Links to a tool/service B that is (or can be) used for accessing LR A (the one being described), e.g., a corpus workbench, s/w for lexicon access
alternative label: access tool

is aligned version of
type: ObjectProperty
sub property of: is version of
domain: Corpus
range: Corpus
comment: Links to a corpus B which is the aligned version of corpus A (the one being described)

is analysed by
type: ObjectProperty
sub property of: is related to LT tool/service
domain: Class
  union of: Data language resource
  union of: Media part
range: Language Technology tool/service
comment: Links to a tool/service B that is (or can be or has been) used for analysing LR A (the one being described), e.g., a statistical tool
alternative label: analysis tool

is annotated by
type: ObjectProperty
sub property of: is related to LT tool/service
domain: Annotation
range: Language Technology tool/service
comment: Links to a tool/service B that has been used for annotating LR A (the one being described), e.g., a tagger, NER, etc.
alternative label: annotation tool

is annotated version of
type: ObjectProperty
sub property of: is version of
domain: Corpus
range: Corpus
comment: Links to a corpus B which is the raw corpus that has been annotated (corpus A, the one being described)

is annotation resource of
type: ObjectProperty
sub property of: dependent language resource
domain: Lexical/Conceptual resource
range: Class
  union of: Machine Learning model
  union of: Input content resource
  union of: Language Technology tool/service
comment: Links an annotation resource to the corpus where it has been used for annotating or to data of an annotation tool/service that has been or can be combined with

is annotation schema of
type: ObjectProperty
sub property of: dependent language resource
domain: Lexical/Conceptual resource
range: Class
  union of: Machine Learning model
  union of: Input content resource
  union of: Language Technology tool/service
comment: Links an annotation schema to the corpus where it has been used for annotating or to data of an annotation tool/service that has been or can be combined with

is annotator of
type: ObjectProperty
sub property of: actor related to
domain: Actor
range: Annotation
comment: Identifies the resource(s) that have been annotated by the person/organization

is archived by
type: ObjectProperty
sub property of: is related to LT tool/service
domain: Data language resource
range: Language Technology tool/service
comment: Links to a tool/service B that is (or can be or has been) used for archiving LR A (the one being described)
alternative label: archiving tool

is cited by
type: ObjectProperty
sub property of: is related to document
domain: Language Resource
range: Document
comment: Links to a publication that cites the language resource described

is combined with
type: ObjectProperty
sub property of: is related to Language Resource
type: SymmetricProperty
domain: Language Resource
range: Language Resource
comment: Links to a LR B that has been used together with LR A (the one being described) to create LR C, e.g., two monolingual wordnets/corpora aligned to produce a bilingual resource

is compatible with
type: ObjectProperty
sub property of: depends on
type: SymmetricProperty
domain: Language Resource
range: Language Resource
comment: Links to a LR B that can be used together with LR A (the one being described), e.g., a lexicon that is compatible with a grammar

is contact for
type: ObjectProperty
sub property of: actor related to
domain: Actor
range: Language Resource
comment: Links to the language resource(s) for which the person/organization/group can be contacted for further information

is continuation of
type: ObjectProperty
sub property of: is version of
inverse of: is continued by
domain: Language Resource
range: Language Resource
comment: Links to LR B that forms the basis of LR A (the one being described) upon which it has continued to extend / enrich

is continued by
type: ObjectProperty
sub property of: has version
domain: Language Resource
range: Language Resource
comment: Links to a LR B that extends / continues / enriches LR A (the one being described)

is converted version of
type: ObjectProperty
sub property of: is version of
domain: Data language resource
range: Data language resource
comment: Links to LR B that has been the outcome of a conversion procedure from LR A (the one being described), e.g., a PDF to text conversion

is created by
type: ObjectProperty
sub property of: is related to LT tool/service
domain: Class
  union of: Data language resource
  union of: Media part
range: Language Technology tool/service
comment: Links to a tool/service B that has been used for creating LR A (the one being described)
alternative label: creation tool
alternative label: derivation tool

is described by
type: ObjectProperty
sub property of: is documented by
domain: Language Resource
range: Document
comment: Links to a document that describes the contents or operation of a language resource

is displayed by
type: ObjectProperty
sub property of: is related to LT tool/service
domain: Class
  union of: Data language resource
  union of: Media part
range: Language Technology tool/service
comment: Links to a tool/service B that is (or can be) used to display LR A (the one being described), e.g., a tool for visualizing relations in a lexicon, or annotations in a corpus
alternative label: display tool
alternative label: visualization tool

is distribution rights holder of
type: ObjectProperty
sub property of: actor related to
domain: Actor
range: Distribution
comment: Identifies the language resource for which a person or an organization holds the distribution rights. The range and scope of distribution rights is defined in the distribution agreement. The distributor in most cases only has a limited licence to distribute the work and collect royalties on behalf of the licensor or the IPR holder and cannot give to any recipient of the work permissions that exceed the scope of the distribution agreement (e.g., to allow uses of the work that are not defined in the distribution agreement)

is division of
type: ObjectProperty
domain: Division
range: Organization
comment: Links a division (e.g., company branch, university department or faculty) to the organization to which it belongs

is documented by
type: ObjectProperty
sub property of: is related to document
domain: Language Resource
range: Document
comment: Links a language resource to a document (e.g., research paper describing its contents or its use in a project, user manual, etc.) or any other form of documentation (e.g., a URL with support information) that is related to the resource
alternative label: documentation report

is edited by
type: ObjectProperty
sub property of: is related to LT tool/service
domain: Class
  union of: Data language resource
  union of: Media part
range: Language Technology tool/service
comment: Links to a tool/service B that is (or can be) used for editing LR A (the one being described)
alternative label: editing tool

is elicited by
type: ObjectProperty
sub property of: is related to LT tool/service
domain: Class
  union of: Data language resource
  union of: Media part
range: Language Technology tool/service
comment: Links to a tool/service B that is (or can be or has been) used for eliciting LR A (the one being described)
alternative label: elicitation tool

is evaluated by
type: ObjectProperty
sub property of: is related to LT tool/service
domain: Evaluation
range: Language Technology tool/service
comment: Links to a tool/service B that has been used to evaluate LR A (the one being described)
alternative label: evaluation tool

is evaluator of
type: ObjectProperty
sub property of: actor related to
domain: Actor
range: Evaluation
comment: Identifies the tool or service(s) that a person or organization that has evaluated

is exact match with
type: ObjectProperty
sub property of: is related to Language Resource
type: SymmetricProperty
domain: Language Resource
range: Language Resource
comment: Links to LR B that has the same contents with LR A; they may have different names or the same name and be stored on different locations
alternative label: is identical with
alternative label: is same as

is funder of
type: ObjectProperty
sub property of: actor related to
domain: Actor
range: Project
comment: Links to the projects) that the person/organization has financed

is funding project of
type: ObjectProperty
sub property of: project related to
domain: Project
range: Language Resource
comment: Links a project to the language resource(s) that it has funded (e.g., creation, enrichment, extension, etc.)

is IPR holder of
type: ObjectProperty
sub property of: actor related to
domain: Actor
range: Language Resource
comment: Links to the resource(s) for which a person or an organization holds the full Intellectual Property Rights (Copyright, trademark, etc.). The IPR holder could be different from the creator that may have assigned the rights to the IPR holder (e.g., an author as a creator assigns her rights to the publisher who is the IPR holder) and the distributor that holds a specific licence (i.e. a permission) to distribute the work via a specific distributor.

is licensor of
type: ObjectProperty
sub property of: actor related to
inverse of: licensor
domain: Actor
range: Distribution
comment: Links to the resource(s) which a person or organisation is legally eligible to license and actually licenses. The licensor could be different from the creator, the distributor or the IPR holder. The licensor has the necessary rights or licences to license the work and is the party that actually licenses the resource that is distributed via the specific channel. She will have obtained the necessary rights or licences from the IPR holder and she may have a distribution agreement with a distributor that disseminates the work under a set of conditions defined in the specific licence and collects revenue on the licensor's behalf. The attribution of the creator, separately from the attribution of the licensor, may be part of the licence under which the resource is distributed (as e.g., is the case with Creative Commons Licences).

is ML model of
type: ObjectProperty
sub property of: dependent language resource
inverse of: ML model
domain: Machine Learning model
range: Language Technology tool/service
comment: Specifies the tool/service with which the ML model can be combined in order to perform the desired task
alternative label: is Machine Learning model of

is metadata creator of
type: ObjectProperty
sub property of: actor related to
inverse of: metadata creator
domain: Person
range: Metadata record
comment: Links to the metadata record(s) that a person has created

is metadata curator of
type: ObjectProperty
sub property of: actor related to
inverse of: metadata curator
domain: Person
range: Metadata record
comment: Links to the metadata record(s) for which a person is responsible for creating, updating, enriching, etc.

is metadata of
type: ObjectProperty
sub property of: metadata record related to
domain: Metadata record
range: Language Resource
comment: Links an external metadata record (from another catalogue, repository, etc.) to the language resource described

is part of
type: ObjectProperty
sub property of: is related to Language Resource
domain: Language Resource
range: Language Resource
comment: Links to LR B which contains LR A (the one being described), e.g., a bilingual corpus that includes a monolingual corpus

is part with
type: ObjectProperty
sub property of: is related to Language Resource
type: SymmetricProperty
domain: Language Resource
range: Language Resource
comment: Links to LR B that together with LR A (the one being described) are parts of LR C

participant in
type: ObjectProperty
sub property of: actor related to
inverse of: participating organization
domain: Organization
range: Project
comment: Identifies the project(s) where an organization has officially participated or participates in
example: European Language Technology Project, Machine Translation for Elderly People, ...

is queried by
type: ObjectProperty
sub property of: is related to LT tool/service
inverse of: queries
domain: Data language resource
range: Language Technology tool/service
comment: Links to a tool/service B that is (or can be) used for querying LR A (the one being described)
alternative label: query tool

is recorded by
type: ObjectProperty
sub property of: is related to LT tool/service
domain: Class
  union of: Corpus audio part
  union of: Corpus text numerical part
  union of: Corpus video part
range: Language Technology tool/service
comment: Links to a tool/service that has been used for recording a video or audio corpus part
alternative label: recording platform software
alternative label: recording tool

is recorder of
type: ObjectProperty
sub property of: actor related to
inverse of: recorder
domain: Actor
range: Class
  union of: Corpus audio part
  union of: Corpus text numerical part
  union of: Corpus video part
comment: Links to the audio or video part of the resource(s) that a person/organization has recorded

is related to
type: ObjectProperty
domain: Class
  union of: type of described entity
  union of: Metadata record
range: Class
  union of: Actor
  union of: Document
  union of: Language Resource
comment: Identifies a relation holding between two language resources or a language resource and a document or actor or, in general, a satellite entity

is related to actor
type: ObjectProperty
sub property of: is related to
domain: Class
  union of: Distribution
  union of: Language Resource
  union of: Metadata record
range: Actor
comment: Links to the data of an actor that bears some relation to the language resource that is described

is related to document
type: ObjectProperty
sub property of: is related to
domain: Class
  union of: Language Resource
  union of: Project
range: Document
comment: Links to a document that is somehow related to the entity that is described

is related to Language Resource
type: ObjectProperty
sub property of: is related to
domain: Class
  union of: Division
  union of: Document
  union of: Group
  union of: Language Resource
  union of: Organization
  union of: Person
  union of: Project
range: Language Resource
comment: Links to a language resource that holds a relation with the entity being described (without further specification of the relation type)

is related to LT tool/service
type: ObjectProperty
sub property of: is related to
domain: Data language resource
range: Language Technology tool/service
comment: Links to a tool/service B that bears some relation to LR A (the one being described)

is related to metadata record
type: ObjectProperty
sub property of: is related to
domain: Class
  union of: Language Resource
  union of: Metadata record
range: Metadata record
comment: Links to an external metadata record that has some relation with the metadata record of the resource being described or the resource itself

is related to project
type: ObjectProperty
sub property of: is related to
inverse of: project related to
domain: Language Resource
range: Project
comment: Links to a project that has some relation with the language resource that is described (e.g., has funded its creation)

is replaced with
type: ObjectProperty
sub property of: has version
inverse of: replaces
domain: Language Resource
range: Language Resource
comment: Links to LR B that is a newer version of LR A (the one being described) and replaces it

is required language resource by
type: ObjectProperty
sub property of: dependent language resource
inverse of: requires language resource
domain: Class
  union of: Language description
  union of: Lexical/Conceptual resource
range: Class
  union of: Language description
  union of: Input content resource
  union of: Language Technology tool/service
comment: Links to a language resource that is required for the operation of a tool/service or computational grammar

is resource creator of
type: ObjectProperty
sub property of: actor related to
inverse of: resource creator
domain: Actor
range: Language Resource
comment: Links to the language resource(s) that a person/organization has created

is resource provider of
type: ObjectProperty
sub property of: actor related to
inverse of: resource provider
domain: Actor
range: Language Resource
comment: Links to a resource for which the person/organization is responsible of providing, curating and maintaining

is reviewed by
type: ObjectProperty
sub property of: is documented by
inverse of: reviews
domain: Language Resource
range: Document
comment: Links to a document that contains the review of LR A (the one being described)
alternative label: review

is similar to
type: ObjectProperty
sub property of: is related to Language Resource
type: SymmetricProperty
domain: Language Resource
range: Language Resource
comment: Links to LR B that bears resemblances to LR A (the one being described), e.g., they have been built with the same theoretical principles or are the same with different formats or processed at the same level with different tools
alternative label: is similar with

is typesystem of
type: ObjectProperty
sub property of: dependent language resource
inverse of: typesystem
domain: Lexical/Conceptual resource
range: Class
  union of: Machine Learning model
  union of: Input content resource
  union of: Language Technology tool/service
comment: Links a typesystem to the corpus where it has been used for annotating or to data of an annotation tool/service that has been or can be combined with

is usage project of
type: ObjectProperty
sub property of: project related to
inverse of: usage project
domain: Project
range: Actual use
comment: Links a project where a language resource has been used to this LR

is validated by
type: ObjectProperty
sub property of: is related to LT tool/service
domain: Validation
range: Language Technology tool/service
comment: Links to a tool/service B that is (or can be) used for validating LR A (the one being described)
alternative label: validation tool

is validator of
type: ObjectProperty
sub property of: actor related to
inverse of: validator
domain: Actor
range: Validation
comment: Links person(s), group(s) or organization(s) that have performed a specific validation of a language resource to the data of this validation

is version of
type: ObjectProperty
sub property of: is related to Language Resource
domain: Language Resource
range: Language Resource
comment: Links to LR B that is a version (corrected, annotated, enriched, processed, etc.) of LR A (the one being described)

language variety
type: ObjectProperty
domain: Class
  union of: Corpus audio part
  union of: Corpus image part
  union of: Corpus text part
  union of: Corpus video part
  union of: Language description image part
  union of: Language description text part
  union of: Language description video part
  union of: Lexical/Conceptual resource audio part
  union of: Lexical/Conceptual resource image part
  union of: Lexical/Conceptual resource text part
  union of: Lexical/Conceptual resource video part
range: Language variety
comment: Relates a language resource that contains segments in a language variety (e.g., dialect, jargon) to it
note: in MS we have language variety attached to language; check if this is ok; introduce a class Language after deciding on how to treat languages

language variety type
type: ObjectProperty
domain: Language variety
range: Language variety type
comment: Specifies the type of the language variety

LCR subclass
type: ObjectProperty
domain: Lexical/Conceptual resource
range: LCR subclass
comment: Introduces a classification of lexical/conceptual resources into types (used for descriptive reasons)

language description task
type: ObjectProperty
domain: Language description
range: Language description task
comment: Specifies the task performed by the language description

licence category
type: ObjectProperty
domain: Licence
range: Licence category
comment: Categorises a licence according to a classification scheme

licence
type: ObjectProperty
sub property of: license
domain: Distribution
range: Licence
comment: Links the distribution (distributable form) of a language resource to the licence or terms of use/service (a specific legal document) with which it is distributed

licensor
type: ObjectProperty
sub property of: is related to actor
domain: Distribution
range: Person
comment: The person or organisation who is legally eligible to license and actually licenses the resource. The licensor could be different from the creator, the distributor or the IPR holder. The licensor has the necessary rights or licences to license the work and is the party that actually licenses the resource that is distributed via the specific channel. She will have obtained the necessary rights or licences from the IPR holder and she may have a distribution agreement with a distributor that disseminates the work under a set of conditions defined in the specific licence and collects revenue on the licensor's behalf. The attribution of the creator, separately from the attribution of the licensor, may be part of the licence under which the resource is distributed (as e.g., is the case with Creative Commons Licences).

linguality type
type: ObjectProperty
domain: Media part
range: Linguality type
comment: Indicates whether the resource includes one, two or more languages

linguistic information
type: ObjectProperty
domain: Lexical/Conceptual resource
range: Content type
comment: Provides a more detailed account of the linguistic information contained in the lexical/conceptual resource

link to other media
type: ObjectProperty
domain: Class
  union of: Corpus part
  union of: Language description part
range: Link to other media
comment: Describes the linking between different media parts of a resource (how they interact with or link to each other)

media part
type: ObjectProperty
domain: Language Resource
range: Media part
comment: Links a language resource to the parts it consists of (e.g., an oral corpus with the audio and its transcribed text part)

media type
type: ObjectProperty
domain: Class
  union of: Media part
  union of: Processing resource type
range: Media type
comment: Specifies the media type of a language resource (the physical medium of the contents representation) or of the input/output of a language processing tool/service; each media type is described through a distinctive set of technical features; a language resource may consist of different media parts

member of association
type: ObjectProperty
domain: Class
  union of: Division
  union of: Organization
  union of: Person
range: Organization
comment: Links to an association or network that the organization or person is member of

membership institution
type: ObjectProperty
domain: Distribution
range: Membership institution
comment: Introduces an institution with members that can benefit from specific conditions on the use of a resource (e.g. discount, unlimited access, etc.)

metadata creator
type: ObjectProperty
sub property of: is related to actor
domain: Metadata record
range: Person
comment: Introduces the person who has created the metadata record

metadata curator
type: ObjectProperty
sub property of: is related to actor
domain: Metadata record
range: Person
comment: A person responsible for the creation, update, enrichment, etc. of a metadata record describing an entity

method
type: ObjectProperty
domain: Class
  union of: Machine Learning model
  union of: Language Technology tool/service
range: TdmMethod
comment: Specifies the method used for the development of a tool/service or the ML model

metric
type: ObjectProperty
domain: Performance indicator
range: Metric
comment: Identifies the metric used for the evaluation of the tool/service

ML model
type: ObjectProperty
sub property of: depends on
domain: Language Technology tool/service
range: Machine Learning model
comment: Specifies the ML model that must be used together with the tool/service to perform the desired task

modality type
type: ObjectProperty
domain: Media part
range: Modality type
comment: Specifies the type of the modality represented in the resource or processed by a tool/service

multilinguality type
type: ObjectProperty
domain: Media part
range: Multilinguality type
comment: Indicates whether the resource (part) is parallel, comparable or mixed

national max contribution
type: ObjectProperty
domain: Project
range: Cost
comment: Introduces the maximum amount of money contributed from national funds

naturality
type: ObjectProperty
domain: Class
  union of: Corpus audio part
  union of: Corpus video part
range: Naturality
comment: Specifies the level of naturality for multimodal/multimedia resources

noise level
type: ObjectProperty
domain: Class
  union of: Corpus audio part
  union of: Lexical/Conceptual resource audio part
range: Noise level
comment: Specifies the level of background noise

non-speech item
type: ObjectProperty
domain: Class
  union of: Corpus audio part
  union of: Lexical/Conceptual resource audio part
range: Non-speech item
comment: Specifies the distinct non-speech elements that maybe included in the audio part of a corpus or lexical/conceptual resource

operating system
type: ObjectProperty
domain: Language Technology tool/service
range: operating system
comment: Specifies the operating system on which a software object can run

organization legal status
type: ObjectProperty
domain: Organization
range: Organization legal status
comment: Classifies an organization according to its legal status

organization role
type: ObjectProperty
domain: Class
  union of: Division
  union of: Group
  union of: Organization
range: Organization role
comment: Classifies an organization according to its role/mission

origin
type: ObjectProperty
domain: Participant
range: Origin
comment: Specifies the relation of the language of a participant with respect to the acquisition stage

origin of participants
type: ObjectProperty
domain: Class
  union of: Corpus audio part
  union of: Corpus image part
  union of: Corpus text numerical part
  union of: Corpus video part
range: Origin
comment: Specifies the relation of the language of the group of participants with respect to the acquisition stage

other media
type: ObjectProperty
domain: Link to other media
range: Media type
comment: Specifies the media types that are linked to the media type described within the same resource

address (other offices)
type: ObjectProperty
sub property of: address
domain: Class
  union of: Affiliation
  union of: Division
  union of: Group
  union of: Organization
range: Address
comment: Links to the physical address of an office (other than the principal one) of an organization or group represented as a set of distinct elements (street, zip code, city, etc.)

output resource
type: ObjectProperty
domain: Language Technology tool/service
range: Input content resource
comment: Specifies the output results of a tool/service, i.e. the features of the processed (content) resource

parameter
type: ObjectProperty
domain: Language Technology tool/service
range: Parameter
comment: Introduces a parameter used for running a tool/service

parameter type
type: ObjectProperty
domain: Parameter
range: Parameter type
comment: Classifies the parameter according to a specific (not yet standardised) typing system (e.g., whether it's boolean, string, integer, a document, mapping, etc.)

participant
type: ObjectProperty
domain: Class
  union of: Corpus audio part
  union of: Corpus image part
  union of: Corpus text numerical part
  union of: Corpus video part
range: Participant
comment: Introduces descriptive characteristics of a person that has participated in the audio, video, sensorimotor (textNumerical) part of the resource

participating organization
type: ObjectProperty
sub property of: is related to actor
domain: Project
range: Organization
comment: Indicates the organization(s) that participate (or have participated) in a project

performance indicator
type: ObjectProperty
domain: Evaluation
range: Performance indicator
comment: Describes the performance indicator used for the evaluation of a tool/service

previous annotation types policy
type: ObjectProperty
domain: Language Technology tool/service
range: Previous annotation types policy
comment: Specifies the policy that a tool/service has with respect to the annotation types included in the annotated resource that it takes as input (i.e. whether it keeps, modifies or drops them in the output resource)

process mode
type: ObjectProperty
domain: Thing
range: Process mode
comment: Specifies the type of processing performed on a language resource

processing resource type
type: ObjectProperty
domain: Input content resource
range: Processing resource type
comment: Specifies the resource type that a tool/service takes as input or produces as output

project related to
type: ObjectProperty
sub property of: is related to
domain: Project
range: Language Resource
comment: Links a project to the language resource(s) it has some relation with (e.g., funded the creation of)

quality
type: ObjectProperty
domain: Detailed image format
range: Quality
comment: Specifies the quality level of image resource

queries
type: ObjectProperty
sub property of: LT tool/service related to
domain: Language Technology tool/service
range: Data language resource
comment: Links a tool/service B that is (or can be) used for querying LR A to LR A

raster or vector graphics
type: ObjectProperty
domain: Detailed image format
range: Raster or vector graphics
comment: Indicates if the image is stored as raster or vector graphics

recorder
type: ObjectProperty
sub property of: is related to actor
domain: Class
  union of: Corpus audio part
  union of: Corpus text numerical part
  union of: Corpus video part
range: Actor
comment: Links to the recorder(s) of the audio or video part of the resource

recording device type
type: ObjectProperty
domain: Class
  union of: Corpus audio part
  union of: Corpus text numerical part
  union of: Corpus video part
range: Recording device type
comment: Specifies the nature of the recording platform hardware and the storage medium

recording environment
type: ObjectProperty
domain: Class
  union of: Corpus audio part
  union of: Corpus text numerical part
  union of: Corpus video part
range: Recording environment
comment: Specifies where the recording took place

recording quality
type: ObjectProperty
domain: Detailed audio format
range: Recording quality
comment: Indicates the audio or video recording quality

related language resource
type: ObjectProperty
domain: Relation
range: Language Resource
comment: Identifies the language resource with which a relation is holding with the one being described

related lexicon type
type: ObjectProperty
domain: Language description
range: Related lexicon type
comment: Indicates the type of the lexica that must or can be used with the grammar

relation
type: ObjectProperty
domain: Language Resource
range: Relation
comment: Links a language resource to other related resources specifying also the type of relation

replaces
type: ObjectProperty
sub property of: is version of
domain: Language Resource
range: Language Resource
comment: Links to LR B that is an older version of LR A (the one being described) and has been replaced by it

required hardware
type: ObjectProperty
domain: Class
  union of: Language description
  union of: Language Technology tool/service
range: Required hardware
comment: Specifies the type of hardware required for running a tool and/or computational grammar

requires language resource
type: ObjectProperty
sub property of: depends on
domain: Class
  union of: Language description
  union of: Input content resource
  union of: Language Technology tool/service
range: Class
  union of: Language description
  union of: Lexical/Conceptual resource
comment: Links to LR B that is required for the operation of a tool/service or computational grammar (the one that is described)

resolution
type: ObjectProperty
domain: Class
  union of: Detailed image format
  union of: Detailed video format
range: Resolution
comment: Groups together information on the image resolution

resolution standard
type: ObjectProperty
domain: Resolution
range: Resolution standard
comment: Specifies the standard to which the resolution conforms

resource creator
type: ObjectProperty
sub property of: is related to actor
domain: Language Resource
range: Actor
comment: Links a resource to the person, group or organisation that has created the resource

resource provider
type: ObjectProperty
sub property of: is related to actor
domain: Language Resource
range: Actor
comment: The person/organization responsible for providing, curating, maintaining and making available (publishing) the resource

reviews
type: ObjectProperty
sub property of: documents
domain: Document
range: Language Resource
comment: Links a document to the language resource it reviews

scenario type
type: ObjectProperty
domain: Class
  union of: Corpus audio part
  union of: Corpus video part
range: Scenario type
comment: Indicates the task defined for the conversation or the interaction of participants

scene illumination
type: ObjectProperty
domain: Class
  union of: Corpus audio part
  union of: Corpus image part
  union of: Corpus text numerical part
  union of: Corpus video part
range: Scene illumination
comment: Provides information on the illumination of the scene
note: needed for audio?

segmentation level
type: ObjectProperty
domain: Annotation
range: Segmentation level
comment: Specifies the segmentation unit in terms of which the resource has been segmented or the level of segmentation a tool/service requires/outputs

sex
type: ObjectProperty
domain: Participant
range: Sex
comment: Specifies the sex of a participant (either of the two major forms of individuals that occur in many species and that are distinguished respectively as female or male especially on the basis of their reproductive organs and structures [https://www.merriam-webster.com/dictionary/sex])
note: check with sociologists?

sex of participants
type: ObjectProperty
domain: Class
  union of: Corpus audio part
  union of: Corpus image part
  union of: Corpus text numerical part
  union of: Corpus video part
range: Sex
comment: Specifies the sex of the participants (either of the two major forms of individuals that occur in many species and that are distinguished respectively as female or male especially on the basis of their reproductive organs and structures [https://www.merriam-webster.com/dictionary/sex])
note: check with sociologists?

sign convention
type: ObjectProperty
domain: Detailed audio format
range: Sign convention
comment: Indicates the binary representation of numbers

signal encoding
type: ObjectProperty
domain: Corpus audio part
range: Signal encoding
comment: Specifies the encoding the audio type uses

size
type: ObjectProperty
domain: Dataset distribution
range: Size
comment: Specifies the size of a countable entity with regard to the SizeUnit measurement in form of a number

size per annotation
type: ObjectProperty
sub property of: size per subset
range: Size
comment: Provides information on size for the annotated parts of the resource

size per audio classification
type: ObjectProperty
sub property of: size per subset
range: Size
comment: The size of the audio subparts of the resource in terms of classification criteria

size per audio format
type: ObjectProperty
sub property of: size per subset
range: Size
comment: Used to give info on size of parts of a resource that differ as to the format

size per character encoding
type: ObjectProperty
sub property of: size per subset
range: Size
comment: Provides information on the size of the resource parts with different character encoding

size per domain
type: ObjectProperty
sub property of: size per subset
range: Size
comment: Specifies the size of resource parts per domain

size per geographic coverage
type: ObjectProperty
sub property of: size per subset
range: Size
comment: Provides information on size per geographically distinct section of the resource

size per image classification
type: ObjectProperty
sub property of: size per subset
range: Size
comment: Provides information on size of parts with different image classification

size per image format
type: ObjectProperty
sub property of: size per subset
range: Size
comment: Used to give info on size of parts of a resource that differ as to the format

size per language
type: ObjectProperty
sub property of: size per subset
range: Size
comment: Provides information on the size per language component

size per language variety
type: ObjectProperty
sub property of: size per subset
range: Size
comment: Provides information on the size per language variety component

size per modality
type: ObjectProperty
sub property of: size per subset
range: Size
comment: Provides information on the size per modality component

size per subset
type: ObjectProperty
domain: Subset
range: Size
comment: Indicates the size of a subset of a language resource

size per text classification
type: ObjectProperty
sub property of: size per subset
range: Size
comment: Provides information on size of resource parts with different text classification

size per text format
type: ObjectProperty
sub property of: size per subset
range: Size
comment: Provides information on the size of the resource parts with different format

size per textNumerical format
type: ObjectProperty
sub property of: size per subset
range: Size
comment: Gives information on the size of textNumerical resource parts with different format

size per time coverage
type: ObjectProperty
sub property of: size per subset
range: Size
comment: Provides information on size per time period represented in the resource

size per validation
type: ObjectProperty
sub property of: size per subset
range: Size
comment: Specifies the size of the validated part of a resource

size per video classification
type: ObjectProperty
sub property of: size per subset
range: Size
comment: Used to give info on size of parts with different video classification

size per video format
type: ObjectProperty
sub property of: size per subset
range: Size
comment: Used to give info on size of parts of a resource that differ as to the format

size unit
type: ObjectProperty
domain: Size
range: Size unit
comment: Specifies the unit that is used when providing information on the size of the resource or of resource parts

social media occupational account
type: ObjectProperty
domain: Class
  union of: Division
  union of: Group
  union of: Organization
  union of: Person
  union of: Project
range: Social media occupational account
comment: Introduces the social media or occupational account details of an entity

social media occupational account type
type: ObjectProperty
domain: Social media occupational account
range: Social media account occupational type
comment: Specifies the type of the social media or occupational account

source channel
type: ObjectProperty
domain: Class
  union of: Corpus audio part
  union of: Corpus text numerical part
  union of: Corpus video part
range: Source channel
comment: Specifies the source channel of the recording of a multimedia resource

source channel type
type: ObjectProperty
domain: Class
  union of: Corpus audio part
  union of: Corpus text numerical part
  union of: Corpus video part
range: Source channel type
comment: Specifies the type of the source channel

source metadata record
type: ObjectProperty
sub property of: is related to metadata record
inverse of: target metadata record
domain: Metadata record
range: Metadata record
comment: Links, in some cases (e.g., harvesting, population from other catalogues, conversion from other metadata records, etc.), to the metadata record that has been used as the basis for the creation of the metadata record

sourceOfMetadataRecord
type: ObjectProperty
domain: Metadata record
range: Catalog
comment: Refers to the entity (repository, catalogue, archive, etc.) from which the metadata record has been imported into the new catalogue
note: for now dcat:catalog

speaking impairment of participants
type: ObjectProperty
domain: Class
  union of: Corpus audio part
  union of: Corpus image part
  union of: Corpus text numerical part
  union of: Corpus video part
range: Speaking impairment of participants
comment: Indicates whether the group of participants contains persons with speaking impairments

speech influence
type: ObjectProperty
domain: Class
  union of: Corpus audio part
  union of: Corpus image part
  union of: Corpus text numerical part
  union of: Corpus video part
range: Speech influence
comment: Specifies the factors influencing speech

speech item
type: ObjectProperty
domain: Class
  union of: Corpus audio part
  union of: Lexical/Conceptual resource audio part
range: Speech item
comment: Specifies the distinct elements that are pronounced and annotated as such

static element
type: ObjectProperty
domain: Class
  union of: Corpus image part
  union of: Language description image part
  union of: Lexical/Conceptual resource image part
range: Static element
comment: Groups information on the static elements visible on images

subject
type: ObjectProperty
domain: Class
  union of: Corpus part
  union of: Document
  union of: Project
range: Subject
comment: Specifies the subject/topic of a language resource
alternative label: topic

support type
type: ObjectProperty
domain: Language Resource
range: Support type
comment: Specifies whether some type of support (commercial, free, etc.) is provided for the resource installation or use

tagset
type: ObjectProperty
domain: Class
  union of: Annotation
  union of: Machine Learning model
range: Lexical/Conceptual resource
comment: The tagset used for annotating a resource or for the input resource (if annotated) of a tool/service or that should be used (dependency) for the annotation

target metadata record
type: ObjectProperty
sub property of: metadata record related to
domain: Metadata record
range: Metadata record
comment: Links, in some cases (e.g., harvesting, population from other catalogues, conversion from other metadata records, etc.), an external metadata record that has been used as the basis for the creation of the internal metadata record to this internal metadata record

text included in image
type: ObjectProperty
domain: Class
  union of: Corpus image part
  union of: Language description image part
  union of: Lexical/Conceptual resource image part
range: Text included in image
comment: Provides information on the type of text that may be on the image

text included in video
type: ObjectProperty
domain: Class
  union of: Corpus video part
  union of: Language description video part
  union of: Lexical/Conceptual resource video part
range: Text included in video
comment: Indicates if any text and what type is present in or in conjunction with the video

detailed numerical text format
type: ObjectProperty
domain: Corpus text numerical part
range: DataFormat
comment: Groups information on the format(s) of the textNumerical part of the resource

text type
type: ObjectProperty
domain: Corpus text part
range: Text type
comment: Specifies the text type (e.g., factual, literary, etc.) according to which a text corpus (part) is classified

TRL
type: ObjectProperty
domain: Language Technology tool/service
range: TRL
comment: Specifies the TRL (Technology Readiness Level) of the technology according to the measurement system defined by the EC
alternative label: Technology Readiness Level

typesystem
type: ObjectProperty
sub property of: depends on
domain: Class
  union of: Machine Learning model
  union of: Input content resource
  union of: Language Technology tool/service
range: Lexical/Conceptual resource
comment: Specifies the typesystem (preferrably through an identifier or URL) that has been used for the annotation of a resource or that is required for the input resource of a tool/service or that should be used (dependency) for the annotation or used in the training of a ML model

usage project
type: ObjectProperty
sub property of: is related to project
domain: Actual use
range: Project
comment: Links to a project in which the language resource has been used

usage report
type: ObjectProperty
sub property of: is documented by
domain: Actual use
range: Document
comment: Links to a document (e.g., research article, report) describing a project, application, experiment or use case where the language resource has been used

used in application
type: ObjectProperty
domain: Actual use
range: Operation
comment: Specifies an LT application where the language resource has been used in

user type
type: ObjectProperty
domain: Distribution
range: User type
comment: Used to identify the type of user of the resource (affiliated with a commercial vs. academic institution); it is usually associated with licensing or pricing conditions on the use of a resource

validation
type: ObjectProperty
domain: Language Resource
range: Validation
comment: Provides information on each of the the validation procedure(s) a language resource may have undergone (e.g., formal validation of the whole resource, content validation of one part of the resource, etc.).

validation extent
type: ObjectProperty
domain: Validation
range: Validation extent
comment: Specifies the coverage of the language resource that has been validated

validation mode
type: ObjectProperty
sub property of: process mode
domain: Validation
range: Process mode
comment: Specifies the type of processing applied for the validation of the language resource

validation report
type: ObjectProperty
sub property of: is documented by
domain: Validation
range: Document
comment: Links to a document with detailed information on the validation process and results

validation type
type: ObjectProperty
domain: Validation
range: Validation type
comment: Specifies the type of validation that has been performed on a language resource

validator
type: ObjectProperty
sub property of: is related to actor
domain: Validation
range: Actor
comment: Links a validation to the person(s), group(s) or organization(s) that have performed a specific validation of a language resource

version type
type: ObjectProperty
domain: Class
  union of: Document
  union of: Language Resource
range: Version type
comment: Links scholarly works (mainly) to a type of versioning vocabulary related to the publication process
note: If we think this shouldn' be used for LRTs, remove from XSD's

detailed video format
type: ObjectProperty
domain: Dataset distribution
range: Detailed video format
comment: Groups information on the format(s) of a resource; repeated if parts of the resource are in different formats
note: see how data formats, audio & video formats will be handled; must be on distribution

visual modelling
type: ObjectProperty
domain: Class
  union of: Detailed image format
  union of: Detailed video format
range: Visual modelling
comment: Specifies the dimensional form applied on the video or image part(s) of a corpus

vocal tract condition
type: ObjectProperty
domain: Participant
range: Vocal tract condition
comment: Provides information on the vocal tract conditions that may influence the speech of the participant

web service type
type: ObjectProperty
domain: Software distribution
range: Web service type
comment: Identifies the type of a web service in accordance to a classification vocabulary that refers to the web service communication protocols
note: try to restrict with instance "webService" on DistributionForm

abstract
type: DatatypeProperty
domain: Document
range: langString
comment: Introduces a summary of the contents of a document

access location
type: DatatypeProperty
sub property of: distribution location
domain: Distribution
range: anyURI
comment: A URL where the resource can be accessed from; it can be used for landing pages or for cases where the resource is accessible via an interface, i.e. cases where the resource itself is not provided with a direct link for downloading

actual use details
type: DatatypeProperty
domain: Actual use
range: langString
comment: Describes in free text specific use cases or situations where the language resource has been used

additional h/w requirements
type: DatatypeProperty
domain: Software distribution
range: string
comment: Specifies hardware requirements that are needed for running a tool/service
alternative label: additional hardware requirements

address
type: DatatypeProperty
domain: Address
range: langString
comment: The street and the number of the postal address of a person or organization

age
type: DatatypeProperty
domain: Participant
range: int
comment: Age of a person

age range end of participants
type: DatatypeProperty
domain: Class
  union of: Corpus audio part
  union of: Corpus image part
  union of: Corpus text numerical part
  union of: Corpus video part
range: int
comment: End of age range of the group of participants

age range start of participants
type: DatatypeProperty
domain: Class
  union of: Corpus audio part
  union of: Corpus image part
  union of: Corpus text numerical part
  union of: Corpus video part
range: int
comment: Start of age range of the group of participants

algorithm
type: DatatypeProperty
domain: Machine Learning model
range: langString
comment: Identifies the training algorithm used for the model (e.g., maximum entropy, svm, etc.)

algorithm details
type: DatatypeProperty
domain: Machine Learning model
range: langString
comment: Provides a detailed description of the algorithm, incl. info on whether it's supervised or not

alias
type: DatatypeProperty
domain: Participant
range: langString
comment: Introduces a name used for a participant of a multimedia resource instead of his/her real one

alternative title
type: DatatypeProperty
sub property of: alternative
domain: Document
range: langString
comment: Introduces an alternative title (e.g. short title) used for the document being described

amount
type: DatatypeProperty
domain: Class
  union of: Cost
  union of: Size
range: float
comment: Specifies the number of units that constitute anything that can be measured (e.g. size of a data resource or cost, etc.)

annotation end date
type: DatatypeProperty
domain: Annotation
range: date
comment: The date in which the annotation process has ended

annotation mode details
type: DatatypeProperty
domain: Annotation
range: langString
comment: Provides further information on annotation process

annotation standoff
type: DatatypeProperty
domain: Annotation
range: boolean
comment: Indicates whether the annotation is created inline or in a stand-off fashion

annotation start date
type: DatatypeProperty
domain: Annotation
range: date
comment: The date in which the annotation process has started

anonymization details
type: DatatypeProperty
domain: Data language resource
range: langString
comment: If the resource has been anonymized, this field can be used for entering more information, e.g., tool or method used for the anonymization, by whom it has been performed, whether there was any check of the results, etc.

anonymized
type: DatatypeProperty
domain: Data language resource
range: boolean
comment: Indicates whether the language resource has been anonymized

artifact part
type: DatatypeProperty
domain: Static element
range: langString
comment: Indicates the parts of the artifacts represented in the image corpus

attached lexicon position
type: DatatypeProperty
domain: Language description
range: langString
comment: Indicates the position of the lexicon, if attached to the grammar

attribution text
type: DatatypeProperty
domain: Distribution
range: langString
comment: The text that must be quoted for attribution purposes when using a resource - for cases where a resource is provided with a restriction on attribution

availability end date
type: DatatypeProperty
domain: Distribution
range: date
comment: Specifies the end date of availability of a resource - only for cases where a resource is available for a restricted time period.

availability start date
type: DatatypeProperty
domain: Distribution
range: date
comment: Specifies the start date of availability of a resource - only for cases where a resource is available for a restricted time period.

bibliographic record
type: DatatypeProperty
domain: Document
range: string
comment: Specifies in the form of free text a set of bibliographic data (a bibliographic record) preferrably in bibtex form

body movement
type: DatatypeProperty
domain: Dynamic element
range: langString
comment: Indicates the body parts that move in the video part of the resource

book title
type: DatatypeProperty
sub property of: title
domain: Document
range: langString
comment: Introduces the human readable text that is used as the title of a book (differentiating from the title of an article)

capturing details
type: DatatypeProperty
domain: Class
  union of: Corpus audio part
  union of: Corpus image part
  union of: Corpus text numerical part
  union of: Corpus video part
range: langString
comment: Provides further information on the capturing method and procedure

capturing device type details
type: DatatypeProperty
domain: Class
  union of: Corpus audio part
  union of: Corpus image part
  union of: Corpus text numerical part
  union of: Corpus video part
range: langString
comment: Provides further information on the capturing device

category label
type: DatatypeProperty
sub property of: title
domain: Classification
range: langString
comment: Introduces a human readable name (label) by which a classification category (e.g. text type, text genre, domain, etc.) is known

citation text
type: DatatypeProperty
domain: Language Resource
range: langString
comment: Provides the text that must be quoted for citation purposes when using a language resource

city
type: DatatypeProperty
domain: Address
range: langString
comment: The name of the city, town or village as mentioned in the postal address of a person or organization

colour depth
type: DatatypeProperty
domain: Class
  union of: Detailed image format
  union of: Detailed video format
range: int
comment: The number of bits used to represent the colour of a single pixel

command
type: DatatypeProperty
domain: Software distribution
range: string
comment: Specifies a command line used to invoke a software component

compressed
type: DatatypeProperty
domain: Class
  union of: Detailed audio format
  union of: Detailed image format
  union of: Detailed video format
range: boolean
comment: Whether the audio, video or image is compressed or not

compression loss
type: DatatypeProperty
domain: Class
  union of: Detailed audio format
  union of: Detailed image format
  union of: Detailed video format
range: boolean
comment: Whether there is loss due to compression

conference
type: DatatypeProperty
domain: Document
range: langString
comment: Introduces the name of the conference where the document being described was presented

copyright notice
type: DatatypeProperty
domain: Distribution
range: langString
comment: Introduces a free text statement that may be included with the language resource, usually containing the name(s) of copyright holders and licensing terms

creation details
type: DatatypeProperty
domain: Class
  union of: Lexical/Conceptual resource
  union of: Media part
range: langString
comment: Provides additional information on the creation of a language resource

creation end date
type: DatatypeProperty
domain: Language Resource
range: date
comment: The date in which the process of creating a resource was completed

creation start date
type: DatatypeProperty
domain: Language Resource
range: date
comment: The date in which the process of creating the resource started
note: how do we handle cases where a resource was created, for instance, in 2000? Is this the start or end date?

default value
type: DatatypeProperty
domain: Parameter
range: string
comment: Used for parameters that take a list of values in order to indicate the default value(s)

demo location
type: DatatypeProperty
domain: Software distribution
range: anyURI
comment: Specifies the URL where a user can access the demo of a tool/service

description
type: DatatypeProperty
sub property of: description
domain: Language Resource
range: langString
comment: Introduces a short free-text account that provides information about the resource (e.g., function, contents, technical information, etc.)
note: Add some link to datacite:hasDescription and descriptionType:abstract (always for language resources). The rest of the values of descriptionType make sense mainly for publications, but this handling allows easier extension at a later time. But note that there is no class datacite:Description; descriptionType is in range of anything that "hasDescriptionType"

dialect accent
type: DatatypeProperty
domain: Participant
range: langString
comment: Provides information on the dialect accent of the participant

dialect accent of participants
type: DatatypeProperty
domain: Class
  union of: Corpus audio part
  union of: Corpus image part
  union of: Corpus text numerical part
  union of: Corpus video part
range: langString
comment: Provides information on the dialect accent of the group of participants

digest
type: DatatypeProperty
domain: Software distribution
range: string
comment: Links a docker image to the sha256 hash (used for selecting the appropriate version)

discipline
type: DatatypeProperty
domain: Class
  union of: Division
  union of: Group
  union of: Organization
  union of: Person
range: langString
comment: Introduces an academic field of study or research area that a person, group or organization is expert in
alternative label: area of expertise
alternative label: research area
example: computer programming, translation and interpreting, linguistics, ...

discussion URL
type: DatatypeProperty
domain: Language Resource
range: anyURI
comment: Links to a URL where there's a discussion thread (e.g., user forum) about a resource

distractor
type: DatatypeProperty
domain: Dynamic element
range: langString
comment: Identifies any distractors visible in the resource

distribution location
type: DatatypeProperty
domain: Distribution
range: anyURI
comment: A URL point from which a language resource can be directly accessed (downloaded or executed)

division alternative name
type: DatatypeProperty
sub property of: alternative
domain: Division
range: langString
comment: Introduces an alternative name (other than the short name) used for a division

division name
type: DatatypeProperty
sub property of: title
domain: Division
range: langString
comment: The official title of a unit of an organization (e.g., faculty or department of a university, department of a research organization or private company, etc.)

division short name
type: DatatypeProperty
sub property of: alternative
domain: Division
range: langString
comment: Introduces the short name (abbreviation, acronym, etc.) used for the division of an organization

docker download location
type: DatatypeProperty
sub property of: download location
domain: Language Technology tool/service
range: string
comment: A location where the software in the form of a docker image can be downloaded from

download location
type: DatatypeProperty
sub property of: distribution location
domain: Distribution
range: anyURI
comment: A URL where the language resource (mainly data but also downloadable software programmes or forms) can be downloaded from
note: rule: must be filled in when SoftwareDistributionForm = downloadable; must not be filled in for web services; optional in all other cases

edition
type: DatatypeProperty
domain: Document
range: string
comment: Introduces the number of the edition for the document that has been described

education level
type: DatatypeProperty
domain: Participant
range: langString
comment: Provides information on the education level of the participant

email
type: DatatypeProperty
domain: Class
  union of: Affiliation
  union of: Division
  union of: Group
  union of: Organization
  union of: Person
range: string
comment: Points to the email address of a person, organization or group

evaluated
type: DatatypeProperty
domain: Language Technology tool/service
range: boolean
comment: Indicates whether the tool or service has been evaluated

evaluation details
type: DatatypeProperty
domain: Evaluation
range: langString
comment: Provides further information on the evaluation process of a tool or service

event description
type: DatatypeProperty
domain: Static element
range: langString
comment: Provides description of any events represented in the image corpus

execution location
type: DatatypeProperty
sub property of: distribution location
domain: Software distribution
range: anyURI
comment: A URL where the resource (mainly software) can be directly executed
note: rule: must be filled in when SoftwareDistributionMedium = webService; otherwise, not to be filled in

eye movement
type: DatatypeProperty
domain: Dynamic element
range: langString
comment: Indicates the movement of the eyes visible in the resource

face expression
type: DatatypeProperty
domain: Class
  union of: Dynamic element
  union of: Static element
range: langString
comment: Indicates the facial expressions visible in the resource

face view
type: DatatypeProperty
domain: Class
  union of: Dynamic element
  union of: Static element
range: langString
comment: Indicates the view of the face(s) that appear in the video or on the image part of the resource

factor
type: DatatypeProperty
domain: N-gram model
range: string
comment: A factor that has been used for the n-gram resource

fax number
type: DatatypeProperty
domain: Class
  union of: Division
  union of: Group
  union of: Organization
  union of: Person
range: string
comment: Introduces the fax number of a person, group or organization; recommended format: +_international code_city code_number without spaces
example: +123456789012

fee
type: DatatypeProperty
domain: Distribution
range: langString
comment: Describes in free the costs that are required to use the resource, a fragment of the resource or to use a tool or service
note: pricing policy can be a more generic concept; discuss if we want to formalise this

fidelity
type: DatatypeProperty
domain: Detailed video format
range: boolean
comment: Defines whether blur is present in the moving sequences

formalism
type: DatatypeProperty
domain: Class
  union of: Language description
  union of: Language Technology tool/service
range: langString
comment: Specifies the formalism (bibliographic reference, URL, name) used for the creation/enrichment of the resource (grammar or tool/service)

frame rate
type: DatatypeProperty
domain: Detailed video format
range: int
comment: The number of frames per second

funding scheme category
type: DatatypeProperty
domain: Project
range: string
comment: Introduces a category (usually defined by the funding authority) of the funding scheme to which a project complies

geographic coverage
type: DatatypeProperty
domain: Class
  union of: Corpus
  union of: Language description
  union of: Lexical/Conceptual resource
  union of: Subset
range: langString
comment: Indicates the geographic region that the content of a resource is about; for countries, recommended use of ISO-3166
note: string or Location (iso3166) and geographic coordinates?

geographic distribution of participants
type: DatatypeProperty
domain: Class
  union of: Corpus audio part
  union of: Corpus image part
  union of: Corpus text numerical part
  union of: Corpus video part
range: langString
comment: Gives information on the geographic distribution of the participants

gesture
type: DatatypeProperty
domain: Dynamic element
range: langString
comment: Indicates the type of gestures visible in the resource

given name
type: DatatypeProperty
domain: Person
range: langString
comment: Introduces the given name (also known as "first name") of a person
alternative label: first name
alternative label: forename

gold standard location
type: DatatypeProperty
sub property of: has URL
domain: Evaluation
range: anyURI
comment: Links to the URL where a gold standard resource can be found in order to be used for evaluation purposes

grant number
type: DatatypeProperty
domain: Project
range: string
comment: Specifies an identification number usually issued by the funding authority and referring uniquely to the project that has received the funding

hand arm movement
type: DatatypeProperty
domain: Dynamic element
range: langString
comment: Indicates the movement of hands and/or arms visible in the resource

hand manipulation
type: DatatypeProperty
domain: Dynamic element
range: langString
comment: Gives information on the manipulation of objects by hand

head movement
type: DatatypeProperty
domain: Dynamic element
range: langString
comment: Indicates the movements of the head visible in the resource

hearing impairment
type: DatatypeProperty
domain: Participant
range: langString
comment: Provides information on any hearing impairment the participant may have

height
type: DatatypeProperty
domain: Participant
range: int
comment: Provides information on the height of the participant in cm

home page
type: DatatypeProperty
sub property of: has URL
domain: Person
range: anyURI
comment: Links to a URL that includes information on a person (e.g., CV, publications, communication information, etc.)

honorific prefix
type: DatatypeProperty
domain: Person
range: langString
comment: Introduces a honorific prefix (or title) such as Dr./Mr/Ms. that precedes the name of a person
alternative label: title

image
type: DatatypeProperty
domain: Person
range: anyURI
comment: Links to a URL with an image file (e.g., a photo, or cartoon image) that is used for identifying a person (e.g., on a home page)

implementation language
type: DatatypeProperty
domain: Language Technology tool/service
range: string
comment: The programming language(s) used for the development of a tool/service, which is needed for running the tools/services, in case no executables are available

interaction
type: DatatypeProperty
domain: Class
  union of: Corpus audio part
  union of: Corpus video part
range: langString
comment: Specifies the parts that interact in an audio or video component

interactive media
type: DatatypeProperty
domain: Dynamic element
range: langString
comment: Any interactive media visible in the resource

interannotator agreement
type: DatatypeProperty
domain: Annotation
range: langString
comment: Provides information on the inter-annotator agreement and the methods/metrics applied

interpolated
type: DatatypeProperty
domain: N-gram model
range: boolean
comment: Specifies whether the n-gram resource is interpolated (Interpolated language models are constructed by 2 or more corpora and each corpus is represented in the model according to a predefined weight)

intra-annotator agreement
type: DatatypeProperty
domain: Annotation
range: langString
comment: Provides information on the intra-annotator agreement and the methods/metrics applied

is factored
type: DatatypeProperty
domain: N-gram model
range: boolean
comment: Specifies whether the model is factored or not

journal
type: DatatypeProperty
domain: Document
range: langString
comment: Introduces the name of the journal where the document being described has been published

keyword
type: DatatypeProperty
domain: Class
  union of: Division
  union of: Document
  union of: Group
  union of: Language Resource
  union of: Organization
  union of: Person
  union of: Project
range: langString
comment: Introduces a word or phrase considered important for the description of an entity and thus used to index or classify it
alternative label: keyphrase
example: crisis management, speech synthesis, subtitling, ...

landing page
type: DatatypeProperty
sub property of: has URL
domain: Language Resource
range: anyURI
comment: Links to a web page that provides additional information about a language resource (e.g., its contents, acknowledgements, link to the access location, etc.)
note: dcat:landingPage has range foaf:Document and is a subproperty of foaf:page; no distinction is made between physical and electronic documents. so I'm not sure what the most appropriate relation is for us

landscape part
type: DatatypeProperty
domain: Static element
range: langString
comment: Indicates the landscape parts represented in the image corpus

language
type: DatatypeProperty
domain: Class
  union of: Corpus audio part
  union of: Corpus image part
  union of: Corpus text part
  union of: Corpus video part
  union of: Language description image part
  union of: Language description text part
  union of: Language description video part
  union of: Lexical/Conceptual resource audio part
  union of: Lexical/Conceptual resource image part
  union of: Lexical/Conceptual resource text part
  union of: Lexical/Conceptual resource video part
range: anyURI
comment: Specifies the language that is used in the resource or supported by the tool/service
note: in the xsd, we have the full BCP47 recommendation combination, in ontology as a uri (to link with an ontology)

language dependent
type: DatatypeProperty
domain: Language Technology tool/service
range: boolean
comment: Indicates whether the operation of the tool or service is language dependent or not

language variety name
type: DatatypeProperty
domain: Language variety
range: langString
comment: A textual string used for referring to a language variety

legend
type: DatatypeProperty
domain: Class
  union of: Corpus audio part
  union of: Lexical/Conceptual resource audio part
range: langString
comment: Introduces the legend of the soundtrack

licence/terms of use/service name
type: DatatypeProperty
sub property of: alternative
domain: Licence
range: langString
comment: Introduces an alternative name (other than the short name) used for a licence or terms of use

licence/terms of use/service name
type: DatatypeProperty
sub property of: title
domain: Licence
range: langString
comment: The name by which a legal document (e.g., licence, terms of use, terms of service) is known

licence/Terms of use/service short name
type: DatatypeProperty
sub property of: alternative
domain: Licence
range: langString
comment: Introduces the short name (abbreviation, acronym, etc.) used for a licence or terms of use document

licence/terms of use/service URL
type: DatatypeProperty
sub property of: has URL
domain: Licence
range: anyURI
comment: Links to the URL where the text of a licence/terms of use/service is found

logo
type: DatatypeProperty
domain: Class
  union of: Division
  union of: Group
  union of: Language Resource
  union of: Licence
  union of: Organization
  union of: Project
range: anyURI
comment: Links to a symbol or graphic object used to identify an entity; please, add a URL with an image file
example: https://www.logo.eu

mailing list name
type: DatatypeProperty
domain: Language Resource
range: string
comment: Indicates the name of a mailing list used in relation to a language resource

measure
type: DatatypeProperty
domain: Performance indicator
range: float
comment: Defines the measure calculated for the metric

media type details
type: DatatypeProperty
domain: Link to other media
range: langString
comment: Provides further information on the way the media types are linked and/or synchronized with each other within the same resource

metadata creation date
type: DatatypeProperty
domain: Metadata record
range: date
comment: Specifies the date when the metadata record was first created

metadata last date updated
type: DatatypeProperty
domain: Metadata record
range: date
comment: Specifies the date when the last update of the metadata record was made

metalanguage
type: DatatypeProperty
domain: Class
  union of: Language description image part
  union of: Language description text part
  union of: Language description video part
  union of: Lexical/Conceptual resource audio part
  union of: Lexical/Conceptual resource image part
  union of: Lexical/Conceptual resource text part
  union of: Lexical/Conceptual resource video part
range: anyURI
comment: Specifies the language that is used as support for the resource (e.g., a grammar of French described in English or a French dictionary with English definitions)
note: in the xsd, this is expressed with a BCP47 combination while in the ontology as a URI (to link with an ontology)

ML framework
type: DatatypeProperty
domain: Machine Learning model
range: string
comment: Specifies the framework that has been used for developing a model (e.g. keras, tensorflow, etc.)
alternative label: Machine Learning framework

modality type details
type: DatatypeProperty
domain: Media part
range: langString
comment: Provides further information on the modalities represented in a language resource

model variant
type: DatatypeProperty
domain: Machine Learning model
range: string
comment: Introduces a label that can be used to identify the variant of a ML model

multi-value
type: DatatypeProperty
domain: Parameter
range: boolean
comment: Specifies whether the parameter takes a list of values

multilinguality type details
type: DatatypeProperty
domain: Media part
range: langString
comment: Provides further information on multilinguality of a resource in free text

number of participants
type: DatatypeProperty
domain: Class
  union of: Corpus audio part
  union of: Corpus image part
  union of: Corpus text numerical part
  union of: Corpus video part
range: int
comment: The number of the persons participating in the audio or video part of the resource

number of tracks
type: DatatypeProperty
domain: Detailed audio format
range: int
comment: Specifies the number of audio channels
note: In MS it's a controlled vocabulary (1, 2, 4, 8) but I think it's too much

number of trained speakers
type: DatatypeProperty
domain: Class
  union of: Corpus audio part
  union of: Corpus image part
  union of: Corpus text numerical part
  union of: Corpus video part
range: int
comment: The number of participants that have been trained for the specific task

optional
type: DatatypeProperty
domain: Parameter
range: boolean
comment: Specifies whether the parameter is mandatory or optional

order
type: DatatypeProperty
domain: N-gram model
range: int
comment: Specifies the maximum number of items in the sequence

organization alternative name
type: DatatypeProperty
sub property of: alternative
domain: Organization
range: langString
comment: Introduces an alternative name (other than the official title or the short name) used for an organization

organization description
type: DatatypeProperty
sub property of: description
domain: Class
  union of: Division
  union of: Group
  union of: Organization
range: langString
comment: Introduces a short free-text account that provides information on an organization

organization description
type: DatatypeProperty
domain: Static element
range: langString
comment: Provides description of the organizations that may appear in the image corpus

organization name
type: DatatypeProperty
sub property of: title
domain: Class
  union of: Group
  union of: Organization
range: langString
comment: The official title of an organization

organization short name
type: DatatypeProperty
sub property of: alternative
domain: Class
  union of: Group
  union of: Organization
range: langString
comment: Introduces the short name (abbreviation, acronym, etc.) used for an organization

original source description
type: DatatypeProperty
domain: Class
  union of: Lexical/Conceptual resource
  union of: Media part
  union of: Language Technology tool/service
range: langString
comment: A description in free text of the source material that has been used for the creation of a language data resource

output
type: DatatypeProperty
domain: Language description
range: langString
comment: Indicates whether the output of the operation of the grammar is a statement of grammaticality (grammatical/ungrammatical) or structures (interpretation of the input)

pages
type: DatatypeProperty
domain: Document
range: string
comment: Introduces the range of pages (preferrably with a dash between) on which a document is printed

parameter description
type: DatatypeProperty
domain: Parameter
range: langString
comment: Provides a short account of he parameter (e.g., function it performs, input / output requirements, etc.) in free text

parameter label
type: DatatypeProperty
domain: Parameter
range: langString
comment: Introduces a short free text used to show to the user for the parameter

parameter name
type: DatatypeProperty
domain: Parameter
range: string
comment: Introduces a free text used to identify the parameter

perplexity
type: DatatypeProperty
domain: N-gram model
range: float
comment: Provides information on the perplexity derived from running on test set taken from the same corpus

person description
type: DatatypeProperty
domain: Static element
range: langString
comment: Provides descriptive features for the persons represented in the image corpus

personal data details
type: DatatypeProperty
domain: Data language resource
range: langString
comment: If the resource includes personal data, this field can be used for entering more information, e.g., whether special handling of the resource is required (e.g., anonymization, further request for use, etc.)

personal data included
type: DatatypeProperty
domain: Data language resource
range: boolean
comment: Specifies whether the language resource contains personal data (mainly in the sense falling under the GDPR)

place of birth
type: DatatypeProperty
domain: Participant
range: langString
comment: The place in which the participant has been born

place of childhood
type: DatatypeProperty
domain: Participant
range: langString
comment: The place in which the participant lived as a child

place of living
type: DatatypeProperty
domain: Participant
range: langString
comment: The place of living of a participant

place of second education
type: DatatypeProperty
domain: Participant
range: langString
comment: Specifies the place of the secondary education of the participant

poses per subject
type: DatatypeProperty
domain: Dynamic element
range: int
comment: Indicates the number of poses per subject that participates in the video part of the resource

position
type: DatatypeProperty
domain: Affiliation
range: langString
comment: The position or the title of a person if affiliated to an organization

profession
type: DatatypeProperty
domain: Participant
range: langString
comment: Provides information on the participant's profession

project alternative name
type: DatatypeProperty
sub property of: alternative
domain: Project
range: langString
comment: Introduces an alternative name (other than the short name) used for a project

project end date
type: DatatypeProperty
domain: Project
range: date
comment: The end date of a project

project name
type: DatatypeProperty
sub property of: title
domain: Project
range: langString
comment: The official title of a project
alternative label: project title

project report
type: DatatypeProperty
domain: Project
range: langString
comment: Links to a report issued by a project

project short name
type: DatatypeProperty
sub property of: alternative
domain: Project
range: langString
comment: Introduces a short name (e.g., acronym, abbreviated form) by which a project is known

project start date
type: DatatypeProperty
domain: Project
range: date
comment: The starting date of a project

project summary
type: DatatypeProperty
domain: Project
range: langString
comment: Introduces a short description (in free text) of the main objectives, mission or contents of the project

publication date
type: DatatypeProperty
sub property of: issued
domain: Class
  union of: Distribution
  union of: Document
  union of: Language Resource
range: date
comment: Specifies the date when a language resource has been made available to the public
note: problem: when is the first publication date if a resource has been made available through zenodo, meta-share, clarin, etc.?? How can this be propagated? Important for citation purposes should we also differentiate between distributions? e.g., a csv published at a different time from a database?

publisher
type: DatatypeProperty
domain: Document
range: langString
comment: Introduces the name of an organization that has published the document being described

quantization
type: DatatypeProperty
domain: Detailed audio format
range: int
comment: The number of bits for each audio sample
note: In MS it's a controlled vocabulary (8, 16, 24, 32, 64) but I found it too much

recording device type details
type: DatatypeProperty
domain: Class
  union of: Corpus audio part
  union of: Corpus text numerical part
  union of: Corpus video part
range: langString
comment: Free text description of the recording device

recording platform software
type: DatatypeProperty
domain: Class
  union of: Corpus audio part
  union of: Corpus text numerical part
  union of: Corpus video part
range: string
comment: Specifies the software used for the recording platform

region
type: DatatypeProperty
domain: Address
range: langString
comment: The name of the region, county or department as mentioned in the postal address of a person or organization

register
type: DatatypeProperty
domain: Corpus text part
range: langString
comment: Specifies the type of register (any of the varieties of a language that a speaker uses in a particular social context [Merriam-Webster]) of the contents of a language resource

related call
type: DatatypeProperty
domain: Project
range: string
comment: Specifies the Call for proposals to which a project was submitted

related programme
type: DatatypeProperty
domain: Project
range: string
comment: Specifies the funding programme to which a project was submitted
alternative label: program

related subprogramme
type: DatatypeProperty
domain: Project
range: string
comment: Specifies the funding subprogramme to which a project was submitted

relation type
type: DatatypeProperty
domain: Relation
range: langString
comment: Describes in a free text statement a relation holding between two Language Resources not yet covered by the schema

requires software
type: DatatypeProperty
domain: Class
  union of: Language description
  union of: Language Technology tool/service
range: string
comment: Specifies software tools or libraries that are required for the operation of a tool/service or computational grammar
note: left as a data property - it's for more general software than language processing tools, so difficult to restrict

resource name
type: DatatypeProperty
sub property of: title
domain: Language Resource
range: langString
comment: Introduces a human-readable name or title by which the resource is known
alternative label: resource title
example: British National Corpus

resource short name
type: DatatypeProperty
sub property of: alternative
domain: Language Resource
range: langString
comment: Introduces a short form (e.g., abbreviation, acronym, etc.) used to refer to a language resource

revision
type: DatatypeProperty
domain: Class
  union of: Language Resource
  union of: Metadata record
range: langString
comment: Provides an account of the revisions in free text or a link to a document with revisions

robustness
type: DatatypeProperty
domain: Language description
range: langString
comment: Introduces a free text statement on the robustness of the grammar (how well the grammar can cope with misspelt/unknown, etc. input, i.e. whether it can produce even partial interpretations of the input)

running environment details
type: DatatypeProperty
domain: Class
  union of: Language description
  union of: Language Technology tool/service
range: langString
comment: Provides further information on the running environment of a tool/service or of a language description

running time
type: DatatypeProperty
domain: Language Technology tool/service
range: string
comment: Gives information on the running time of a tool or service

samples location
type: DatatypeProperty
sub property of: has URL
domain: Class
  union of: Data language resource
  union of: Input content resource
range: anyURI
comment: Links a resource to a url (or url's) with samples of a data resource or of the input of output resource of a tool/service

sampling rate
type: DatatypeProperty
domain: Detailed audio format
range: int
comment: Specifies the format of files contained in the resource in Hertz

sensitive data details
type: DatatypeProperty
domain: Data language resource
range: langString
comment: If the resource includes sensitive data, this field can be used for entering more information, e.g., whether special handling of the resource is required (e.g., anonymization, further request for use, etc.)

sensitive data included
type: DatatypeProperty
domain: Data language resource
range: boolean
comment: Specifies whether the language resource contains sensitive data (e.g., medical/health-related, etc.) and thus requires special handling

sensor technology
type: DatatypeProperty
domain: Class
  union of: Corpus audio part
  union of: Corpus image part
  union of: Corpus text numerical part
  union of: Corpus video part
range: string
comment: Specifies the type of image sensor or the sensing method used in the camera or the image-capture device

series
type: DatatypeProperty
domain: Document
range: langString
comment: Introduces the title of the series of a book/journal where the document being described has been published

service adapter download location
type: DatatypeProperty
sub property of: download location
domain: Language Technology tool/service
range: string
comment: Τhe URL where the docker image of the service adapter can be downloaded from

service offered
type: DatatypeProperty
domain: Class
  union of: Division
  union of: Group
  union of: Organization
  union of: Person
range: langString
comment: Lists the service(s) offered by an organization or person

shallowness
type: DatatypeProperty
domain: Language description
range: langString
comment: Introduces a free text statement on the shallowness of the grammar (how deep the syntactic analysis performed by the grammar can be)

short bio
type: DatatypeProperty
sub property of: description
domain: Person
range: langString
comment: Introduces a free text that can be used as a short bio for a person

size height
type: DatatypeProperty
domain: Resolution
range: int
comment: The frame height in pixels

size width
type: DatatypeProperty
domain: Resolution
range: int
comment: The frame width in pixels

smoking habit
type: DatatypeProperty
domain: Participant
range: langString
comment: Provides information on whether the participant smokes and on his/her smoking habits in general

smoothing
type: DatatypeProperty
domain: N-gram model
range: string
comment: The technique used for giving unseen items some probability

source channel details
type: DatatypeProperty
domain: Class
  union of: Corpus audio part
  union of: Corpus text numerical part
  union of: Corpus video part
range: langString
comment: Provides information on the details of the channel equipment used (brand, type, etc.) in free text

source channel name
type: DatatypeProperty
domain: Class
  union of: Corpus audio part
  union of: Corpus text numerical part
  union of: Corpus video part
range: langString
comment: Introduces the name of the source channel through which the recording has been made

speaking impairment
type: DatatypeProperty
domain: Participant
range: langString
comment: Provides information on any speaking impairment the participant may have

startup
type: DatatypeProperty
domain: Class
  union of: Division
  union of: Organization
range: boolean
comment: Indicates whether a company is a startup

status
type: DatatypeProperty
domain: Project
range: string
comment: Specifies the status in which a project is found in the course of a funding process (e.g. approved, signed, under negotiation, etc.)

subtitle
type: DatatypeProperty
sub property of: alternative
domain: Document
range: langString
comment: Introduces a secondary title used for a document

surname
type: DatatypeProperty
domain: Person
range: langString
comment: Introduces the surname (i.e. the name shared by members of a family, also known as "family name" or "last name") of a person
alternative label: family name
alternative label: last name

synchronized with audio
type: DatatypeProperty
domain: Link to other media
range: boolean
comment: Whether the media part described is synchronized with audio within the same resource

synchronized with image
type: DatatypeProperty
domain: Link to other media
range: boolean
comment: Whether the media part described is synchronized with image within the same resource

synchronized with text
type: DatatypeProperty
domain: Link to other media
range: boolean
comment: Whether video, text and textNumerical media type is synchronized with text within the same resource

synchronized with textNumerical
type: DatatypeProperty
domain: Link to other media
range: boolean
comment: Whether the media part described is synchronized with textNumerical within the same resource

synchronized with video
type: DatatypeProperty
domain: Link to other media
range: boolean
comment: Whether the media part described is synchronized with video within the same resource

synthetic data
type: DatatypeProperty
domain: Corpus part
range: boolean
comment: Specifies whether the contents of a corpus have been artificially generated (e.g., using a Machine Translation or NLG system) rather than having been created by humans (authentic/original data)

telephone number
type: DatatypeProperty
domain: Class
  union of: Division
  union of: Group
  union of: Organization
  union of: Person
range: string
type: NamedIndividual
type: Speech item
example: +123456789012
comment: Introduces the telephone number of a person, group or organization; recommended format: +_international code_city code_number without spaces

theoretic model
type: DatatypeProperty
domain: Class
  union of: Annotation
  union of: Language description
  union of: Lexical/Conceptual resource
range: langString
comment: Indicates the theoretic model applied for the creation/enrichment of the resource, by name and/or by reference (URL or bibliographic reference) to informative material about the theoretic model used

thing description
type: DatatypeProperty
domain: Static element
range: langString
comment: Provides description of the things represented in the image corpus

time coverage
type: DatatypeProperty
domain: Class
  union of: Corpus
  union of: Language description
  union of: Lexical/Conceptual resource
  union of: Subset
range: langString
comment: Indicates the time period that the content of a resource is about

title
type: DatatypeProperty
sub property of: title
domain: Document
range: langString
comment: Introduces a human-readable text (typically short) used as a name for referring to the document being described

trained speaker
type: DatatypeProperty
domain: Participant
range: boolean
comment: Provides information on whether the participant is trained in a specific task

training corpus details
type: DatatypeProperty
domain: Machine Learning model
range: langString
comment: Provides a detailed description of the training corpus (e.g., size, number of features, etc.)

type of element
type: DatatypeProperty
domain: Class
  union of: Dynamic element
  union of: Static element
range: langString
comment: Specifies the type of objects or people represented in the video or image part of the resource

type of image content
type: DatatypeProperty
domain: Class
  union of: Corpus image part
  union of: Language description image part
  union of: Lexical/Conceptual resource image part
range: langString
comment: The main types of object or people represented in the image corpus

type of textNumerical content
type: DatatypeProperty
domain: Corpus text numerical part
range: langString
comment: Specifies the content that is represented in the textNumerical part of the resource

type of video content
type: DatatypeProperty
domain: Class
  union of: Corpus video part
  union of: Language description video part
  union of: Lexical/Conceptual resource video part
range: langString
comment: Main type of object or people represented in the video

unit of measure
type: DatatypeProperty
domain: Performance indicator
range: string
comment: Identifies the unit of measure used in the calculation of the metric (for the evaluation of a tool/service)

update frequency
type: DatatypeProperty
domain: Language Resource
range: langString
comment: Specifies the frequency with which the resource is updated

has URL
type: DatatypeProperty
domain: Thing
range: anyURI
comment: Links to a URL

user query
type: DatatypeProperty
domain: Corpus
range: string
comment: Introduces a query performed by a user that has resulted in the creation of the resource being described (e.g. a dataset created with a query aggregating texts from a database, or subset of a lexical resource, or a virtual collection of sentences from online corpora)

validated
type: DatatypeProperty
domain: Language Resource
range: boolean
comment: Specifies whether the resource has undergone a formal validation process

validation details
type: DatatypeProperty
domain: Validation
range: langString
comment: Provides additional information in the form of free text about the validation process of a language resource

version
type: DatatypeProperty
sub property of: hasVersion
domain: Language Resource
range: string
comment: Associates a language resource with a pattern that indicates its version; the recommended way is to follow the semantic versioning guidelines (http://semver.org) and use a numeric pattern of the form major_version.minor_version.patch

version date
type: DatatypeProperty
domain: Language Resource
range: date
comment: Identifies the date associated with the version of the language resource being described (as a recommendation, of the latest update of the particular version)

volume
type: DatatypeProperty
domain: Document
range: string
comment: Introduces the number used for the volume of a journal or a series of publications

website
type: DatatypeProperty
sub property of: has URL
domain: Class
  union of: Division
  union of: Group
  union of: Organization
  union of: Project
range: anyURI
comment: Links to a URL that acts as the primary page (like a table of contents) introducing information about an organization (e.g., products, contact information, etc.) or project
alternative label: home page

weight
type: DatatypeProperty
domain: Participant
range: int
comment: Provides information on the weight of the participant

weighted grammar
type: DatatypeProperty
domain: Language description
range: boolean
comment: Indicates whether the grammar contains numerical weights (incl. probabilities)

zip code
type: DatatypeProperty
domain: Address
range: string
comment: The zip code of the postal address of a person or organization

Funder identfier scheme
type: Class
subclass of: AgentIdentifierScheme
comment: The name of the scheme used to identify a funder

Organization identifier
type: Class
subclass of: AgentIdentifier
subclass of: Restriction
  on property: uses identifier scheme
  all values from: Organization identifier scheme
comment: A string used to uniquely identify an organization
alternative label: Organisation identifier

Organization identifier scheme
type: Class
subclass of: AgentIdentifierScheme
comment: The name of the scheme used to identify an organization

Person identifier
type: Class
subclass of: AgentIdentifier
subclass of: Restriction
  on property: uses identifier scheme
  all values from: Person identfier scheme
comment: A string (e.g., PID, DOI, internal to an organization, etc.) used to uniquely identify a person

Person identfier scheme
type: Class
subclass of: AgentIdentifierScheme
comment: The name of the scheme used to identify a person

Resource identifier scheme
type: Class
subclass of: IdentifierScheme
comment: The name of the scheme used to identify a resource

Access rights statement
type: Class
subclass of: Restriction
  on property: has identifier
  all values from: Access rights statement identifier
comment: A formal statement indicative of licensing terms for the use of a resource (e.g., open access, free to read, etc.); its semantics should be clear, preferably formally expressed and documented at a URL

Access rights statement identifier
type: Class
subclass of: Identifier
subclass of: Restriction
  on property: conforms to
  all values from: Access rights statement scheme
comment: A string used to uniquely identify an access rights statement according to a specific scheme

Access rights statement scheme
type: Class
subclass of: Classification scheme
comment: The name of the scheme according to which an access rights statement is assigned to a distribution

Actor
type: Class
subclass of: type of described entity
subclass of: Agent
comment: A person, organization or group that participates in an event or process
note: Changed to subclass of foaf:agent because according to its definition (An agent (eg. person, group, software or physical artifact)), it might include entities that we do not consider at this time actors

Actual use
type: Class
comment: Any activity where a language resource has been used (e.g., in a project, in an experiment, for a publication, etc.)

Address
type: Class
comment: The physical address of an organization, group or person expressed in the form of distinct elements (street address, zip code, city, etc.)

Affiliation
type: Class
comment: Information the organization that a person works for (e.g., a company) or is affiliated with (e.g., university, etc.) and the data that are specific to this relation (e.g., position, professional contact information, etc.)

Age group
type: Class
comment: The age group to which the participant belongs

Annotated element
type: Class
comment: A type of element that can be annotated and may differ depending on the annotation level

Annotation
type: Class
comment: The part of a corpus that contains annotations (interpretative linguistic information grounded in a knowledge resource that is added manually or automatically to a text or corpus respectively)

Application
type: Class
subclass of: Language Technology tool/service
comment: Any software program (or group of programs seen as a whole) intended for the end-user and addressing one or multiple related user needs.

Audience
type: Class
comment: Indication of the intended audience size of a multimedia resource

Detailed audio format
type: Class
comment: The format of the audio part of a multimedia resource

Audio genre
type: Class
subclass of: Genre
subclass of: Restriction
  on property: has identifier
  all values from: Audio genre identifier
subclass of: Restriction
  on property: genre
  all values from: Corpus audio part
comment: A classification of audio parts based on extra-linguistic and internal linguistic criteria and reflected on the audio style, form or content

Audio genre classification scheme
type: Class
subclass of: Classification scheme
comment: A classification scheme devised for audio genres by an organization/authority

Audio genre identifier
type: Class
subclass of: Identifier
subclass of: Restriction
  on property: conforms to
  all values from: Audio genre classification scheme
comment: A string used to uniquely identify an audio genre according to a specific classification scheme

Audio quality measure included
type: Class
comment: The audio quality measures included in audio format

Audio type
type: Class
subclass of: Content type
comment: A type of content included in a language resource pertaining to the audio level

Availability
type: Class
comment: Availability status of the resource; conditionsOfUse can be further used to indicate the specific terms of availability
note: Is there a point of keeping it? makes sense only for "under negotiation" and 'availableThroughOtherDistributors' [change the value]; maybe also "availableThroughOwnerOnly"???

Base item
type: Class
comment: Type of item that is represented in the n-gram resource

Body part
type: Class
comment: The body parts visible in the video or image part of the resource

Byte order
type: Class
comment: The byte order of 2 or more bytes sample

Capturing device type
type: Class
comment: The type of transducers through which the data is captured

Capturing environment
type: Class
comment: The type of the capturing environment in terms of complexity

Character encoding
type: Class
comment: The name of the character encoding used in the resource or accepted by the tool/service

Classification
type: Class
comment: A type of classifying (arranging in groups/categories) language resources

Classification scheme
type: Class
comment: Scheme used for the classification of a language resource based on various criteria (e.g., domains, text types, genres, etc.)

Colour space
type: Class
comment: The colour space for the video and image part(s) of a resource

Compatible lexicon type
type: Class
comment: A classification into types for lexical lexicon that can be used with the grammar being described

Component
type: Class
subclass of: Language Technology tool/service
comment: A piece of software typically intended for a specific technical purpose, such as a particular implementation of a part-of-speech tagger (e.g TreeTagger), a tree parsing program (e.g., mstparser), etc. It is wrapped in a standard way within a particular component-oriented framework such as UIMA, GATE, etc. or as a specific type of web service.

Compression name
type: Class
comment: The name of the compression applied

Condition of use
type: Class
replaces: restrictionsOfUse
comment: A condition imposed via a specified licence on the use of a language resource (e.g., non-commercial use, no derivatives, etc.)

Content type
type: Class
comment: A more detailed account of the linguistic information contained in the lexical/conceptual resource
note: could we organise them hierarchically? for those that are used for annotation, align with annotationType values? or can we use annotationType together with these values as range for the property? add definitions to all instances

Conversational type
type: Class
comment: Classification of the conversation included in a multimedia resource based on the number of participants

Corpus
type: Class
subclass of: Data language resource
subclass of: Restriction
  on property: distribution
  all values from: Dataset distribution
comment: A structured collection of pieces of data (textual, audio, video, multimodal/multimedia, etc.) typically of considerable size and selected according to criteria external to the data (e.g., size, type of language, type of text producers or expected audience, etc.) to represent as comprehensively as possible the object of study

Corpus audio part
type: Class
subclass of: Corpus part
comment: The part of a corpus (or whole corpus) that consists of audio segments

Corpus image part
type: Class
subclass of: Corpus part
comment: The part of a corpus (or whole corpus) that consists of images (e.g., g a corpus of photographs and their captions)

Corpus part
type: Class
subclass of: Media part
comment: A part/segment of a corpus based on its media type classification

Corpus subclass
type: Class
comment: A classification of corpora into types (used for descriptive reasons)

Corpus text numerical part
type: Class
subclass of: Corpus part
comment: The part of a corpus (or whole corpus) that consists of sets of textual representations of measurements and observations linked to sensorimotor recordings

Corpus text part
type: Class
subclass of: Corpus part
comment: The part of a corpus (or a whole corpus) that consists of textual segments (e.g., a corpus of publications, or transcriptions of an oral corpus, or subtitles, etc.)

Corpus video part
type: Class
subclass of: Corpus part
comment: The part of a corpus (or whole corpus) that consists of video files (e.g., a corpus of film documentaries)

Cost
type: Class
comment: The cost for accessing a resource formally desribed as a set of amount and currency unit

Country
type: Class
comment: The name of a country preferrably according to ISO 639
note: add here the dataset from EU NAL

Currency
type: Class
comment: Any system of money used in a particular country

Data language resource
type: Class
subclass of: Language Resource
comment: A resource composed of linguistic material used to assist and augment language processing applications, but also, in a broader sense, in language and language-mediated research studies and applications; examples include data sets (textual, multimodal/multimedia and lexical data, grammars, language models, etc.) in machine readable form

Dataset distribution
type: Class
subclass of: Distribution
subclass of: Restriction
  on property: distribution form
  all values from: Dataset distribution form
comment: Any form with which a dataset is distributed, such as a downloadable form in a specific format (e.g., spreadsheet, plain text, etc.) or an API with which it can be accessed

Dataset distribution form
type: Class
subclass of: Distribution form
comment: The form (medium/channel) used for distributing a language resource consisting of data (e.g., a corpus, a lexicon, etc.)

type of described entity
type: Class
comment: The (type of) entity that is being described by a metadata record

Distribution
type: Class
comment: Any form with which a language resource is distributed; for software, this can refer to web services, executable or code files, etc.; for datasets, it can be a downloadable form in a specific format (e.g., spreadsheet, plain text, etc.) or an API with which it can be accessed

Audio feature
type: Class
comment: A feature that can be used for describing distinct distributable forms of audio resources/parts

Distribution form
type: Class
comment: Τhe form used for distributing (delivering or providing access) to the resource

Image feature
type: Class
comment: A feature that can be used for describing distinct distributable forms of image resources/parts

Text feature
type: Class
comment: A feature that can be used for describing distinct distributable forms of text resources/parts

Numerical text feature
type: Class
comment: A feature that can be used for describing distinct distributable forms of numerical text resources/parts

Video feature
type: Class
comment: A feature that can be used for describing distinct distributable forms of video resources/parts

Division
type: Class
comment: Section of a larger organization (e.g., school, faculty, department of a university, department or branch of a company, etc.)

Division category
type: Class
comment: A controlled vocabulary used for classifying divisions

Document
type: Class
subclass of: type of described entity
comment: A piece of written, printed, or electronic matter that is primarily intended for reading

Document identifier
type: Class
subclass of: ResourceIdentifier
subclass of: Restriction
  on property: uses identifier scheme
  all values from: Document identifier scheme
comment: A string (e.g., PID, DOI, internal to an organization, etc.) used to uniquely identify a document (mainly intended for published documents)

Document identifier scheme
type: Class
subclass of: Resource identifier scheme
comment: A scheme according to which an identifier is assigned by the authority that issues it (e.g., DOI, PubMed Central, etc.) specifically for publications

Document type
type: Class
comment: A classification vocabulary for documents (e.g., article, book, etc.)

Documentation type
type: Class
comment: The type of the documentation vis-a-vis its relation with the language resource (e.g., general publication, user manual, etc.)

Domain
type: Class
subclass of: Classification
subclass of: Restriction
  on property: has identifier
  all values from: Domain identifier
comment: A particular field of thought, activity, or interest related to a language resource, organization or person activities, etc.
example: health, law, banking, ...
note: Adapted from https://www.collinsdictionary.com/dictionary/english/domain

Domain classification scheme
type: Class
subclass of: Classification scheme
comment: A classification scheme devised by an authority for domains

Domain identifier
type: Class
subclass of: Identifier
subclass of: Restriction
  on property: conforms to
  all values from: Domain classification scheme
comment: A string used to uniquely identify a domain according to a specific classification scheme

Duration of audio
type: Class
comment: The time that an audio or video recording, etc. lasts

Duration unit
type: Class
comment: A unit for measuring duration of audio / video parts

Dynamic element
type: Class
comment: Element represented in the video part of a resource

Encoding level
type: Class
comment: The linguistic level of analysis a lexical/conceptual resource or language description caters for as represented in its contents

Evaluation
type: Class
comment: Each of the procedures and outcomes followed for evaluating the performance and other features of a tool/service

Evaluation criterion
type: Class
comment: The criterion of the evaluation of a tool

Evaluation level
type: Class
comment: The evaluation level

Evaluation measure
type: Class
comment: The evaluation measure (human or automatic)

Evaluation type
type: Class
comment: Indicates the type of evaluation performed on a tool/service

Extratextual information
type: Class
comment: The non-textual information contained in a lexical/conceptual resouce (e.g., images, videos, audios, etc.); it can be used as an alternative to fully describing them as a proper part of the resource when they are not as important as the textual part (e.g., cases of a dictionary with images attached to some lemmas)

Extratextual information unit
type: Class
comment: The unit on which the extratextual information in a lexical/conceptual resource is attached

Framework
type: Class
comment: The implementation framework used for developing and running a tool/service

Funding type
type: Class
comment: A classification of the funding of a project with regard to the source of the funds

Genre
type: Class
subclass of: Classification
comment: A way of classifying a language resource with regard to the style, form and content

Grammar
type: Class
subclass of: Language description
comment: A set of rules governing what strings are valid or allowable in a language or text [https://en.oxforddictionaries.com/definition/grammar]

Grammatical phenomena coverage
type: Class
comment: An indication of the grammatical phenomena covered by the grammar

Group
type: Class
comment: A set of persons related to some aspect of a language resource, that do not have a legal status (e.g., a group of software developers working on the same software)

Group identifier
type: Class
subclass of: AgentIdentifier
subclass of: Restriction
  on property: uses identifier scheme
  all values from: Organization identifier scheme
comment: A string used to uniquely identify a group

Hearing impairment of participants
type: Class
comment: Whether the group of participants contains persons with hearing impairments

Detailed image format
type: Class
comment: The format used for the image part of a resource

Image genre
type: Class
subclass of: Genre
subclass of: Restriction
  on property: has identifier
  all values from: Image genre identifier
subclass of: Restriction
  on property: genre
  all values from: Corpus image part
comment: A category of images characterized by a particular style, form, or content according to a specific classification scheme

Image genre classification scheme
type: Class
subclass of: Classification scheme
comment: A classification scheme devised by an authority for image genres

Image genre identifier
type: Class
subclass of: Identifier
subclass of: Restriction
  on property: conforms to
  all values from: Image genre classification scheme
comment: A string used to uniquely identify an image genre according to a specific classification scheme

Interactivity
type: Class
comment: The level of conversational interaction between speakers (for audio component) or participants (for video component)

LCR subclass
type: Class
comment: A classification of lexical/conceptual resources into types (used for descriptive reasons)

Language description task
type: Class
comment: Identifies the task performed by the language description
note: add links to omtd-share operations

Language Resource identifier
type: Class
subclass of: ResourceIdentifier
subclass of: Restriction
  on property: uses identifier scheme
  all values from: LR identifier scheme
comment: A string (e.g., PID, DOI, internal to an organization, etc.) used to uniquely identify a language resource

LR identifier scheme
type: Class
subclass of: Resource identifier scheme
comment: The name of the scheme according to which the LRT identifier is assigned by the authority that issues it (e.g., DOI, ISLRN, etc.)
alternative label: Language Resource identifier scheme

Language description
type: Class
subclass of: Data language resource
subclass of: Restriction
  on property: distribution
  all values from: Dataset distribution
comment: A resource that describes a language or some aspect(s) of a language via a systematic documentation of linguistic structures

Language description image part
type: Class
subclass of: Language description part
comment: The part (or whole set) of a language description that consists of images (e.g., a grammar part with photos or images for sign languages)

Language description part
type: Class
subclass of: Media part
comment: A part/segment of a language description based on its media type classification

Language description text part
type: Class
subclass of: Language description part
comment: The textual part (or whole set) of a language description

Language description video part
type: Class
subclass of: Language description part
comment: The part (or whole set) of a language description that consists of videos (e.g., a grammar part with videos for sign languages)

Language model
type: Class
subclass of: Language description
comment: A statistical language model is a probability distribution over sequences of words. Given such a sequence, say of length m, it assigns a probability P (w1, ..., wm) to the whole sequence. [from Wikipedia (https://en.wikipedia.org/wiki/Language_model)]
alternative label: Statistical language model

Language Resource
type: Class
subclass of: type of described entity
subclass of: Restriction
  on property: has identifier
  all values from: Language Resource identifier
comment: A resource composed of linguistic material used in the construction, improvement and/or evaluation of language processing applications, but also, in a broader sense, in language and language-mediated research studies and applications; the term is used with a broader meaning, encompassing (a) data sets (textual, multimodal/multimedia and lexical data, grammars, language models, etc.) in machine readable form, and (b) tools/technologies/services used for their processing and management.
alternative label: LR

Language variety
type: Class
comment: A particular linguistic system used in a specific region or by a social group

Language variety type
type: Class
comment: A classification for language varieties

Lemma type
type: Class
subclass of: Content type
comment: A type of content included in a language resource pertaining to the lemma

Lexical/Conceptual resource
type: Class
subclass of: Data language resource
subclass of: Restriction
  on property: distribution
  all values from: Dataset distribution
subclass of: Restriction
  on property: media part
  all values from: Lexical/ Conceptual resource part
comment: A resource organised on the basis of lexical or conceptual entries (lexical items, terms, concepts, etc.) with their supplementary information (e.g., grammatical, semantic, statistical information, etc.)

Lexical/Conceptual resource audio part
type: Class
subclass of: Lexical/ Conceptual resource part
comment: The part (or whole set of) a lexical/conceptual resource that consists of audio elements (e.g., a set of audio files for a lexicon)

Lexical/Conceptual resource image part
type: Class
subclass of: Lexical/ Conceptual resource part
comment: A part (or whole set of) a lexical/conceptual resource that consists of images (e.g., a set of images used for a lexicon)

Lexical/ Conceptual resource part
type: Class
subclass of: Media part
comment: A part/segment of a lexical/conceptual resource based on its media type classification

Lexical/Conceptual resource text part
type: Class
subclass of: Lexical/ Conceptual resource part
comment: A part (or whole set) of a lexical/conceptual resource that consists of textual elements

Lexical/Conceptual resource video part
type: Class
subclass of: Lexical/ Conceptual resource part
comment: The part (or whole set) of a lexical/conceptual resource that consists of videos (e.g., a set of video files for the lexicon of a sign language)

Licence category
type: Class
subclass of: Restriction
  on property: conforms to
  all values from: Licence category scheme
comment: A classification scheme for licences

Licence category scheme
type: Class
comment: The name of the scheme according to which a category is assigned to a licence

Licence identifier
type: Class
subclass of: ResourceIdentifier
subclass of: Restriction
  on property: uses identifier scheme
  all values from: Licence identifier scheme
comment: A string used to uniquely identify a licence

Licence identifier scheme
type: Class
subclass of: Resource identifier scheme
comment: The name of the scheme according to which an identifier is assigned to a licence by the authority that issues it

Licence
type: Class
subclass of: License
subclass of: type of described entity
subclass of: Restriction
  on property: has identifier
  all values from: Licence identifier
comment: A legal document (licence or terms of use/service) with which the language resource is distributed
note: Kanella test
note: Until now, this included an enumerated list of individuals; I think it's better to treat them as proper entities with name, identifier, etc. This means that for the editors we need to - add a set of well known licences using the SPDX codes (https://spdx.org/licenses/) and any set already in RDF form (e.g., https://github.com/creativecommons/cc.licenserdf/tree/master/cc/licenserdf/licenses and Victor's list) with our own extra elements - allow them to add a new licence with the specific elements that we want - add the clarin licence categories & conditions of use with the ODRL representation Note: I have created a file with the CC-rdf licences and its ontology so that I can edit them and add the supplementary features => under MS ontologies, file testrdflicencesCC.txt

Linguality type
type: Class
comment: Classification of a resource (part) based on the number of languages it includes

Link to other media
type: Class
comment: The links between different media parts of a multimedia resource

Machine Learning model
type: Class
subclass of: Language description
comment: The model artifact that is created through a training process involving an ML algorithm (that is, the learning algorithm) and the training data to learn from.
alternative label: ML model

Media part
type: Class
comment: A part of a language resource based on the media type it belongs to (e.g., text, audio, video parts of a corpus or lexicon)

Media type
type: Class
comment: A classification of language resource parts based on the physical medium they are available in (e.g., text, video, audio)

Membership institution
type: Class
comment: An institution with members that can benefit from specific conditions on the use of a resource (e.g. discount, unlimited access, etc.)

Metadata record
type: Class
equivalent class: CatalogRecord
subclass of: Restriction
  on property: complies with
  all values from: Metadata schema
comment: A set of formalized structured information used to describe the contents, structure, function, etc., of an entity, usually according to a specific set of rules (metadata schema)

Metadata record identifier
type: Class
subclass of: ResourceIdentifier
subclass of: Restriction
  on property: uses identifier scheme
  all values from: Metadata record identifier scheme
comment: A string (e.g., PID, DOI, internal to an organization, etc.) used to uniquely identify a metadata record

Metadata record identifier scheme
type: Class
subclass of: Resource identifier scheme
comment: The name of the scheme according to which the metadata record identifier is assigned by the authority that issues it (e.g., DOI, URL, etc.)

Metadata schema
type: Class
comment: A formal set of metadata elements organized in a specific way

Metric
type: Class
comment: The metric used for the evaluation of the tool/service

Modality type
type: Class
comment: A classification of modalities represented in the resource or processed by a tool/service

Morphological type
type: Class
subclass of: Content type
comment: A type of content included in a language resource pertaining to the morphological level

Multilinguality type
type: Class
comment: A classification of a bi/multilingual resource (part) into parallel, comparable or mixed

N-gram model
type: Class
subclass of: Language description
comment: A language model consisting of n-grams, i.e., specific sequences of a number of words

Naturality
type: Class
comment: The level of naturality for multimodal/multimedia resources

Neural network
type: Class
subclass of: Machine Learning model
comment: A set of algorithms, modeled loosely after the human brain, designed to recognize patterns [adapted from https://skymind.ai/wiki/neural-network]

Noise level
type: Class
comment: The level of background noise

Non-speech item
type: Class
comment: A non-speech element that maybe included in the audio corpus or lexical/conceptual resource

operating system
type: Class
comment: The operating system on which the software is compatible with

Organization
type: Class
subclass of: Organization
comment: A company or other group of people that works together for a particular purpose [https://dictionary.cambridge.org/dictionary/english/organization]
alternative label: Organisation

Organization legal status
type: Class
comment: A classification vocabulary for organizations as legal entities

Organization role
type: Class
comment: A vocabulary for classifying organizations according to their role in relation to Language Technology

Origin
type: Class
comment: The relation of the language of the group of participants with respect to the acquisition stage

Parameter
type: Class
comment: A a special kind of variable in computer programming language that is used to pass information between functions or procedures [from https://www.techopedia.com/definition/3725/parameter-param]

Parameter type
type: Class
comment: A specific (not yet standardised) typing system for parameters (e.g., whether it's boolean, string, integer, a document, mapping, etc.)

Participant
type: Class
subclass of: Person
comment: A person that has participated in the recording of the audio, video, sensorimotor (textNumerical) part of the resource

Performance indicator
type: Class
comment: The performance indicator used in the evaluation of a software given in the form of the metric used and reporting on the measure and unit of measure for this

Person
type: Class
subclass of: Person
subclass of: Restriction
  on property: has identifier
  all values from: Person identifier
comment: A human being
note: Subclass of foaf to exclude imaginary persons

Previous annotation types policy
type: Class
comment: Policy types that a tool/service has with respect to the annotation types included in the annotated resource that it takes as input (i.e. whether it keeps, modifies or drops them in the output resource)

Process mode
type: Class
comment: Classification of the mode of operation applied when processing a resource

Input content resource
type: Class
comment: A set of requirements posed on the resource that is input for processing by a tool/service

Processing resource type
type: Class
comment: The type of the resource that a tool/service takes as input or produces as output
note: Unsure of the values for audio/video files

Project
type: Class
subclass of: type of described entity
subclass of: Project
subclass of: Restriction
  on property: has identifier
  all values from: Project identifier
comment: A set of operations undertaken as a whole by an individual or organization and related to some aspect of the lifecycle of the language resource (e.g., funding, deployment, etc.)

Project identifier
type: Class
subclass of: ResourceIdentifier
subclass of: Restriction
  on property: uses identifier scheme
  all values from: Project identifier scheme
comment: A string (e.g., PID, internal to an organization, issued by the funding authority, etc.) used to uniquely identify a project

Project identifier scheme
type: Class
subclass of: Resource identifier scheme
comment: The name of the scheme according to which an identifier is assigned to a project by the authority that issues it

Quality
type: Class
comment: The quality level of image part(s) of a resource

Raster or vector graphics
type: Class
comment: Type of graphics of the image part(s) of a resource

Recording device type
type: Class
comment: The nature of the recording platform hardware and the storage medium

Recording environment
type: Class
comment: A setting where the recording of a multimedia resource took place

Recording quality
type: Class
comment: Indication of the audio or video recording quality

Related lexicon type
type: Class
comment: Indicates the type for the lexica that must or can be used with the grammar

Relation
type: Class
comment: A relation holding between two language resources (e.g., a raw corpus and its annotated version, the annotation tool used for it, etc.)

Repository identifier
type: Class
subclass of: AgentIdentifier
subclass of: Restriction
  on property: uses identifier scheme
  all values from: Repository identifier scheme
comment: A string (e.g., PID, DOI, internal to an organization, etc.) used to uniquely identify a repository

Repository identifier scheme
type: Class
subclass of: AgentIdentifierScheme
comment: The name of the scheme used to identify a repository

Required hardware
type: Class
comment: Type of hardware required for running a tool and/or computational grammar

Resolution
type: Class
comment: The image resolution used for the video/image part(s) of a resource

Resolution standard
type: Class
comment: The standard to which the resolution conforms

Scenario type
type: Class
comment: A classification of the task defined for the conversation or the interaction of participants in a multimedia resource

Scene illumination
type: Class
comment: Information on the illumination of the scene

Segmentation level
type: Class
comment: The level at which a resource may be segmented (e.g., clause, word, unit, etc.)

Semantic type
type: Class
subclass of: Content type
comment: A type of content included in a language resource pertaining to the semantic level

Sex
type: Class
comment: Either of the two major forms of individuals that occur in many species and that are distinguished respectively as female or male especially on the basis of their reproductive organs and structures [https://www.merriam-webster.com/dictionary/sex]

Sign convention
type: Class
comment: Binary representation of numbers

Signal encoding
type: Class
comment: The encoding of the audio type of a multimedia resource

Size
type: Class
comment: The size of the resource with regard to the SizeUnit measurement in form of a number

Size unit
type: Class
comment: The unit of measurement used for determining and describing the size of a resource (part)

Social media occupational account
type: Class
comment: The details for the social media or occupational account of a person or organization

Social media account occupational type
type: Class
comment: A list of social media

Software distribution
type: Class
subclass of: Distribution
subclass of: Restriction
  on property: distribution form
  all values from: Software distribution form
comment: Any form with which software is distributed (e.g., web services, executable or code files, etc.)

Software distribution form
type: Class
subclass of: Distribution form
comment: The medium, delivery channel or form (e.g., source code, API, web service, etc.) through which a software object is distributed

Source channel
type: Class
comment: Information on the source channel

Source channel type
type: Class
comment: Type of the source channel

Speaking impairment of participants
type: Class
comment: Whether the group of participants contains persons withwith speakingimpairments

Speech genre
type: Class
subclass of: Genre
subclass of: Restriction
  on property: has identifier
  all values from: Speech genre identifier
subclass of: Restriction
  on property: genre
  all values from: Corpus audio part
comment: A category for the conventionalized discourse of the speech part of a language resource, based on extra-linguistic and internal linguistic criteria

Speech genre classification scheme
type: Class
subclass of: Classification scheme
comment: A classification scheme used for speech genres devised by an authority or organization

Speech genre identifier
type: Class
subclass of: Identifier
subclass of: Restriction
  on property: conforms to
  all values from: Speech genre classification scheme
comment: A string used to uniquely identify a speech genre according to a specific classification scheme

Speech influence
type: Class
comment: A factor influencing speech

Speech item
type: Class
comment: An element contained in an audio recording that is pronounced and annotated as such

Standard/Best practice
type: Class
comment: A standard or best practice widely used to which the lexical/conceptual resource or corpus conforms to
note: some of these are only formats rather than standards; how can we distinguish?

Static element
type: Class
comment: The static elements visible on images

Subject
type: Class
subclass of: Classification
comment: A situation, event, thing, etc. that is discussed in the contents of a language resource
alternative label: Topic

Subject classification scheme
type: Class
subclass of: Classification scheme
comment: A classification scheme used for subjects/topics devised by an authority or organization

Subject identifier
type: Class
subclass of: Identifier
subclass of: Restriction
  on property: conforms to
  all values from: Subject classification scheme
comment: A string used to uniquely identify a subject according to a specific classification scheme

Subset
type: Class
comment: A subset of a language resource in terms of a specific parameter (e.g., per domain, time coverage, linguistic level of representation, etc.)

Support type
type: Class
comment: The type of support provided for the use of a resource

Syntactic type
type: Class
subclass of: Content type
comment: A type of content included in a language resource pertaining to the syntactic level

Syntactico-semantic type
type: Class
subclass of: Content type
comment: A type of content included in a language resource pertaining to the syntactico-semantic level

TRL
type: Class
comment: An indicator of the maturity level of particular technologies according to a measurement system defined by EC [adapted from https://ec.europa.eu/info/funding-tenders/opportunities/portal/screen/support/faq/2890]
alternative label: Technology Readiness Level

Text genre
type: Class
subclass of: Genre
subclass of: Restriction
  on property: has identifier
  all values from: Text genre identifier
subclass of: Restriction
  on property: genre
  all values from: Corpus text part
comment: A category of text characterized by a particular style, form, or content according to a specific classification scheme

Text genre classification scheme
type: Class
subclass of: Classification scheme
comment: A classification scheme used for text genres devised by an authority or organization

Text genre identifier
type: Class
subclass of: Identifier
subclass of: Restriction
  on property: conforms to
  all values from: Text genre classification scheme
comment: A string used to uniquely identify a text genre according to a specific classification scheme

Text included in image
type: Class
comment: Provides information on the type of text that may be on the image

Text included in video
type: Class
comment: The presence or not of text in or in conjunction with the video and, if yes, the type

TextNumerical format
type: Class
comment: The format(s) of the textNumerical part of the resource

Text type
type: Class
subclass of: Classification
subclass of: Restriction
  on property: has identifier
  all values from: Text type identifier
comment: An abstract category designed to characterize the main structure of a particular text or one of its parts according to its dominant properties [from https://www.lhn.uni-hamburg.de/node/121.html]

Text type classification scheme
type: Class
subclass of: Classification scheme
comment: A classification scheme used for text types devised by an authority or organization

Text type identifier
type: Class
subclass of: Identifier
subclass of: Restriction
  on property: conforms to
  all values from: Text type classification scheme
comment: A string used to uniquely identify a text type according to a specific classification scheme

Language Technology tool/service
type: Class
subclass of: Language Resource
comment: A tool/service/any piece of software that performs language processing and/or any Language Technology related operation.
alternative label: LT tool/service

Translation type
type: Class
subclass of: Content type
comment: A type of content included in a language resource relevant to the translation procedure

Usage type
type: Class
subclass of: Content type
comment: A type of content included in a language resource encoding usage information

User type
type: Class
comment: Classification type for users of a language resource; usually required for assessing the licensing or pricing policies for the use of the resource

Validation
type: Class
comment: Each of the procedures and outcomes followed for validating a language resource, i.e. confirming that its contents/structure/operation is as claimed after careful examination

Validation extent
type: Class
comment: The resource coverage in terms of validated data

Validation type
type: Class
comment: Classification of validation that indicates whether the validation was made on the contents or on formal aspects of the resource

Version type
type: Class
comment: A type of versioning vocabulary used mainly for works (e.g., scholarly articles, books, etc.) that go through a formal review process before final publication, marked with major changes across the versions
note: When the COAR vocabulary is published (cf. https://www.coar-repositories.org/activities/repository-interoperability/coar-vocabularies/version-type-vocabulary/) check again

Detailed video format
type: Class
backward compatible with: The format of a video (part of a) resource

Video genre
type: Class
subclass of: Genre
subclass of: Restriction
  on property: has identifier
  all values from: Video genre identifier
subclass of: Restriction
  on property: genre
  all values from: Corpus video part
comment: A classification of video parts based on extra-linguistic and internal linguistic criteria and reflected on the video style, form or content

Video genre classification scheme
type: Class
subclass of: Classification scheme
comment: A classification scheme devised by an authority for video genres

Video genre identifier
type: Class
subclass of: Identifier
subclass of: Restriction
  on property: conforms to
  all values from: Video genre classification scheme
comment: A string used to uniquely identify a video genre according to a specific classification scheme

Visual modelling
type: Class
comment: The dimensional form applied on the video or image part(s) of a corpus

Vocal tract condition
type: Class
comment: The vocal tract condition that may influence the speech of the participant

Web service type
type: Class
comment: A classification of web services based on the protocol used for accessing them

Word embedding
type: Class
subclass of: Machine Learning model
comment: Word embedding is the collective name for a set of language modeling and feature learning techniques in natural language processing where words or phrases from the vocabulary are mapped to vectors of real numbers. [wikipedia]

ARK
type: NamedIndividual
type: Document identifier scheme
type: LR identifier scheme
comment: Archival Resource Key

ArXiv
type: NamedIndividual
type: Document identifier scheme
type: LR identifier scheme
comment: Identifier for ArXiv (http://arxiv.org/), a open access repository of preprints, having the format arXiv:1207.2147.

bibcode
type: NamedIndividual
type: Document identifier scheme
type: LR identifier scheme
comment: It is the Astrophysics Data System bibliographic codes, a standardized 19 character identifier according to the syntax "yyyyjjjjjvvvvmppppa".

DOI
type: NamedIndividual
type: Organization identifier scheme
type: Document identifier scheme
type: LR identifier scheme
comment: Digital Object Identifier scheme (https://www.doi.org/)

Handle
type: NamedIndividual
type: Document identifier scheme
type: LR identifier scheme
type: Metadata record identifier scheme
type: Repository identifier scheme
comment: the Handle system

ISBN
type: NamedIndividual
type: Document identifier scheme
type: LR identifier scheme
comment: International Standard Book Number

OpenID
type: NamedIndividual
type: Person identfier scheme
comment: OpenID is an open standard that describes how users can be authenticated in a decentralized manner, eliminating the need for centralized registration services.

ORCID
type: NamedIndividual
type: Person identfier scheme
comment: Open Researcher and Contributor Identifier.

PURL
type: NamedIndividual
type: Document identifier scheme
type: LR identifier scheme
type: Metadata record identifier scheme
comment: Persistent Uniform Resource Locator

ResearcherID
type: NamedIndividual
type: Person identfier scheme
comment: ResearcherID is an identifying system for scientific authors created and owned by Thomson Reuters.

UPC
type: NamedIndividual
type: Document identifier scheme
type: LR identifier scheme
comment: Universal Product Code

URL
type: NamedIndividual
type: Document identifier scheme
type: LR identifier scheme
type: Metadata record identifier scheme
comment: Uniform Resource Locator

URN
type: NamedIndividual
type: Document identifier scheme
type: LR identifier scheme
type: Metadata record identifier scheme
comment: Uniform Resource Name

ADPCM
type: NamedIndividual
type: Signal encoding
alternative label: Adaptive differential pulse-code modulation

ANC domain classification system
type: NamedIndividual
type: Domain classification scheme
alternative label: American National Corpus domain classification system

ANC genre classification scheme
type: NamedIndividual
type: Text genre classification scheme
alternative label: American National Corpus genre classification scheme

ART
type: NamedIndividual
type: Metric
alternative label: Average Response Time

AlvisNLP
type: NamedIndividual
type: Framework

BML
type: NamedIndividual
type: Standard/Best practice
has URL: http://www.mindmakers.org/projects/bml-1-0/wiki#Introduction
alternative label: Behavior Markup Language
alternative label: Behaviour Markup Language

BNC domain classification system
type: NamedIndividual
type: Domain classification scheme
alternative label: British National Corpus domain classification system

BNC text type classification scheme
type: NamedIndividual
type: Text type classification scheme

Big5
type: NamedIndividual
type: Character encoding

Big5-HKSCS
type: NamedIndividual
type: Character encoding

Big5_Solaris
type: NamedIndividual
type: Character encoding

CD-ROM
type: NamedIndividual
type: Dataset distribution form
comment: CD-ROM refers to a kind of distribution medium used for delivering a language resource; intended for resources delivered on CD-ROM

CDMA
type: NamedIndividual
type: Source channel type

CES
type: NamedIndividual
type: Standard/Best practice
has URL: https://www.cs.vassar.edu/CES/
alternative label: Corpus Encoding Standard

CMYK
type: NamedIndividual
type: Colour space

COAR Rights Statement Scheme
type: NamedIndividual
type: Access rights statement scheme
comment: COAR access rights vocabulary (http://vocabularies.coar-repositories.org/documentation/access_rights/)

CORE
type: NamedIndividual
type: Metadata record identifier scheme

Caffe
type: NamedIndividual
type: Framework

CLARIN_EL text type classification scheme
type: NamedIndividual
type: Text type classification scheme

CLARIN-EL domain classification
type: NamedIndividual
type: Domain classification scheme

CLARIN licence category scheme
type: NamedIndividual
type: Licence category scheme

Cp037
type: NamedIndividual
type: Character encoding

Cp1006
type: NamedIndividual
type: Character encoding

Cp1025
type: NamedIndividual
type: Character encoding

Cp1026
type: NamedIndividual
type: Character encoding

Cp1046
type: NamedIndividual
type: Character encoding

Cp1047
type: NamedIndividual
type: Character encoding

Cp1097
type: NamedIndividual
type: Character encoding

Cp1098
type: NamedIndividual
type: Character encoding

Cp1112
type: NamedIndividual
type: Character encoding

Cp1122
type: NamedIndividual
type: Character encoding

Cp1123
type: NamedIndividual
type: Character encoding

Cp1124
type: NamedIndividual
type: Character encoding

Cp1140
type: NamedIndividual
type: Character encoding

Cp1141
type: NamedIndividual
type: Character encoding

Cp1142
type: NamedIndividual
type: Character encoding

Cp1143
type: NamedIndividual
type: Character encoding

Cp1144
type: NamedIndividual
type: Character encoding

Cp1145
type: NamedIndividual
type: Character encoding

Cp1146
type: NamedIndividual
type: Character encoding

Cp1147
type: NamedIndividual
type: Character encoding

Cp1148
type: NamedIndividual
type: Character encoding

Cp1149
type: NamedIndividual
type: Character encoding

Cp1381
type: NamedIndividual
type: Character encoding

Cp1383
type: NamedIndividual
type: Character encoding

Cp273
type: NamedIndividual
type: Character encoding

Cp277
type: NamedIndividual
type: Character encoding

Cp278
type: NamedIndividual
type: Character encoding

Cp280
type: NamedIndividual
type: Character encoding

Cp284
type: NamedIndividual
type: Character encoding

Cp285
type: NamedIndividual
type: Character encoding

Cp297
type: NamedIndividual
type: Character encoding

Cp33722
type: NamedIndividual
type: Character encoding

Cp420
type: NamedIndividual
type: Character encoding

Cp424
type: NamedIndividual
type: Character encoding

Cp437
type: NamedIndividual
type: Character encoding

Cp500
type: NamedIndividual
type: Character encoding

Cp737
type: NamedIndividual
type: Character encoding

Cp775
type: NamedIndividual
type: Character encoding

Cp838
type: NamedIndividual
type: Character encoding

Cp850
type: NamedIndividual
type: Character encoding

Cp852
type: NamedIndividual
type: Character encoding

Cp855
type: NamedIndividual
type: Character encoding

Cp856
type: NamedIndividual
type: Character encoding

Cp857
type: NamedIndividual
type: Character encoding

Cp858
type: NamedIndividual
type: Character encoding

Cp860
type: NamedIndividual
type: Character encoding

Cp861
type: NamedIndividual
type: Character encoding

Cp862
type: NamedIndividual
type: Character encoding

Cp863
type: NamedIndividual
type: Character encoding

Cp864
type: NamedIndividual
type: Character encoding

Cp865
type: NamedIndividual
type: Character encoding

Cp866
type: NamedIndividual
type: Character encoding

Cp868
type: NamedIndividual
type: Character encoding

Cp869
type: NamedIndividual
type: Character encoding

Cp870
type: NamedIndividual
type: Character encoding

Cp871
type: NamedIndividual
type: Character encoding

Cp874
type: NamedIndividual
type: Character encoding

Cp875
type: NamedIndividual
type: Character encoding

Cp918
type: NamedIndividual
type: Character encoding

Cp921
type: NamedIndividual
type: Character encoding

Cp922
type: NamedIndividual
type: Character encoding

Cp930
type: NamedIndividual
type: Character encoding

Cp933
type: NamedIndividual
type: Character encoding

Cp935
type: NamedIndividual
type: Character encoding

Cp937
type: NamedIndividual
type: Character encoding

Cp939
type: NamedIndividual
type: Character encoding

Cp942
type: NamedIndividual
type: Character encoding

Cp942C
type: NamedIndividual
type: Character encoding

Cp943
type: NamedIndividual
type: Character encoding

Cp943C
type: NamedIndividual
type: Character encoding

Cp948
type: NamedIndividual
type: Character encoding

Cp949
type: NamedIndividual
type: Character encoding

Cp949C
type: NamedIndividual
type: Character encoding

Cp950
type: NamedIndividual
type: Character encoding

Cp964
type: NamedIndividual
type: Character encoding

Cp970
type: NamedIndividual
type: Character encoding

DAT
type: NamedIndividual
type: Recording device type

DDC384
type: NamedIndividual
type: Domain identifier
conforms to: DDC

DDC388
type: NamedIndividual
type: Domain identifier
conforms to: DDC

DDC630
type: NamedIndividual
type: Domain identifier
conforms to: DDC

DDC659
type: NamedIndividual
type: Domain identifier
conforms to: DDC

DDC
type: NamedIndividual
type: Domain classification scheme
has URL: https://www.oclc.org/en/dewey/resources/summaries.html
alternative label: Dewey Decimal Classification

DK-5
type: NamedIndividual
type: Domain classification scheme
has URL: http://metadata.dk/dk5-as-linked-data
alternative label: Danish Decimal Classification 5th edition

DVB-C
type: NamedIndividual
type: Source channel type

DVB-S
type: NamedIndividual
type: Source channel type

DVB-T
type: NamedIndividual
type: Source channel type

DVD-R
type: NamedIndividual
type: Dataset distribution form
comment: Value for data distribution medium, used for language resources delivered on a DVD-R

EAGLES
type: NamedIndividual
type: Standard/Best practice
has URL: http://www.ilc.cnr.it/EAGLES/browse.html

ELG-SHARE
type: NamedIndividual
type: Standard/Best practice

ELG domain classification
type: NamedIndividual
type: Domain classification scheme

ELRA
type: NamedIndividual
type: Membership institution
comment: European Language Resources Association (www.elra.eu)

EMA
type: NamedIndividual
type: Source channel

EmotionML
type: NamedIndividual
type: Standard/Best practice
has URL: https://www.w3.org/TR/2009/WD-emotionml-20091029/
alternative label: EML
alternative label: Emotion Markup Language

EMMA
type: NamedIndividual
type: Standard/Best practice
has URL: https://www.w3.org/TR/emma/
alternative label: Extensible MultiModal Annotation markup language

EUC-JP
type: NamedIndividual
type: Character encoding

EUC-KR
type: NamedIndividual
type: Character encoding

EUROVOC
type: NamedIndividual
type: Domain classification scheme
has URL: https://eur-lex.europa.eu/browse/eurovoc.html

GATE
type: NamedIndividual
type: Framework

GB18030
type: NamedIndividual
type: Character encoding

GBK
type: NamedIndividual
type: Character encoding

GMX
type: NamedIndividual
type: Standard/Best practice
has URL: https://xtm.cloud/manuals/gmx-v/GMX-V-2.0.html
alternative label: Global information management Metrics eXchange

GSM
type: NamedIndividual
type: Source channel type

Galaxy
type: NamedIndividual
type: Framework

GrAF
type: NamedIndividual
type: Standard/Best practice
has URL: http://www.xces.org/ns/GrAF/1.0/
alternative label: Graph Annotation Framework

H2O
type: NamedIndividual
type: Framework

HD.1080
type: NamedIndividual
type: Resolution standard

HD.720
type: NamedIndividual
type: Resolution standard

HamNoSys
type: NamedIndividual
type: Standard/Best practice
has URL: https://www.sign-lang.uni-hamburg.de/dgs-korpus/index.php/hamnosys-97.html
alternative label: Hamburg Sign Language Notation System

ISCII91
type: NamedIndividual
type: Character encoding

ISDN
type: NamedIndividual
type: Source channel type

ISO-2022-JP
type: NamedIndividual
type: Character encoding

ISO-2022-KR
type: NamedIndividual
type: Character encoding

ISO-8859-1
type: NamedIndividual
type: Character encoding

ISO-8859-15
type: NamedIndividual
type: Character encoding

ISO-8859-2
type: NamedIndividual
type: Character encoding

ISO-8859-3
type: NamedIndividual
type: Character encoding

ISO-8859-4
type: NamedIndividual
type: Character encoding

ISO-8859-5
type: NamedIndividual
type: Character encoding

ISO-8859-6
type: NamedIndividual
type: Character encoding

ISO-8859-7
type: NamedIndividual
type: Character encoding

ISO-8859-8
type: NamedIndividual
type: Character encoding

ISO-8859-9
type: NamedIndividual
type: Character encoding

ISO-8860-13
type: NamedIndividual
type: Character encoding

ISO12620
type: NamedIndividual
type: Standard/Best practice
has URL: http://www.datcatinfo.net/#/
has URL: http://www.iso.org/sites/dcr-redirect/dcr.html
alternative label: DCR
alternative label: Data Category Repository

ISO16642
type: NamedIndividual
type: Standard/Best practice
has URL: http://xml.coverpages.org/ISO16642-200207.pdf
alternative label: TMF
alternative label: Terminological Markup Framework

ISO 9001:1987
type: NamedIndividual
type: Standard/Best practice
comment: Quality systems -- Model for quality assurance in design/development, production, installation and servicing

ISO2022_CN_CNS
type: NamedIndividual
type: Character encoding

ISO2022_CN_GB
type: NamedIndividual
type: Character encoding

ISO 26162
type: NamedIndividual
type: Standard/Best practice
has URL: https://www.iso.org/standard/43427.html
alternative label: Systems to manage terminology, knowledge and content

ISO 30042
type: NamedIndividual
type: Standard/Best practice
has URL: https://www.iso.org/standard/45797.html
alternative label: TBX
alternative label: TermBase eXchange

ISO704
type: NamedIndividual
type: Standard/Best practice
has URL: https://www.iso.org/standard/38109.html
alternative label: Terminology work

Ink ML
type: NamedIndividual
type: Standard/Best practice
has URL: https://www.w3.org/TR/InkML/
alternative label: Ink Markup Language

JISAutoDetect
type: NamedIndividual
type: Character encoding

KOI8-R
type: NamedIndividual
type: Character encoding

Keras
type: NamedIndividual
type: Framework

LAF
type: NamedIndividual
type: Standard/Best practice
has URL: https://www.iso.org/standard/37326.html
alternative label: ISO 24612
alternative label: Linguistic Annotation Framework

LDC
type: NamedIndividual
type: Membership institution
comment: Linguistic Data Consortium

LMF
type: NamedIndividual
type: Standard/Best practice
has URL: http://www.lexicalmarkupframework.org/
alternative label: Lexical Markup Framework

LT integrator
type: NamedIndividual
type: Organization role
alternative label: Language Technology integrator

LT supplier
type: NamedIndividual
type: Organization role
alternative label: Language Technology supplier

LT user
type: NamedIndividual
type: Organization role
alternative label: Language Technology user

MAD
type: NamedIndividual
type: Metric
alternative label: Mean Annotations per Document

MAF
type: NamedIndividual
type: Standard/Best practice
has URL: https://www.iso.org/standard/51934.html
alternative label: ISO 24611
alternative label: Morpho-syntactic Annotation Framework

MDTV
type: NamedIndividual
type: Metric
alternative label: Mean Time per Document Volume

META-SHARE
type: NamedIndividual
type: Membership institution

MLIF
type: NamedIndividual
type: Standard/Best practice
has URL: https://www.iso.org/standard/37330.html
alternative label: ISO 24616
alternative label: Multilingual Information Framework

MMI
type: NamedIndividual
type: Standard/Best practice
has URL: https://www.w3.org/TR/mmi-framework/
alternative label: Multi-Modal Interaction framework

MS874
type: NamedIndividual
type: Character encoding

META-SHARE speech genre classification scheme
type: NamedIndividual
type: Speech genre classification scheme

META-SHARE audio genre classification scheme
type: NamedIndividual
type: Audio genre classification scheme

MTBF
type: NamedIndividual
type: Metric
alternative label: Mean Time Between Failures

MTSA
type: NamedIndividual
type: Metric
alternative label: Mean Time Seek Annotations

MTTR
type: NamedIndividual
type: Metric
alternative label: Mean Time To Repair

MULTEXT
type: NamedIndividual
type: Standard/Best practice
has URL: https://tei-c.org/activities/projects/multilingual-text-tools-and-corpora-multext/

MUMIN
type: NamedIndividual
type: Standard/Best practice
has URL: https://cst.dk/mumin/
alternative label: MUltiModal INterfaces

MXNet
type: NamedIndividual
type: Framework

MacArabic
type: NamedIndividual
type: Character encoding

MacCentralEurope
type: NamedIndividual
type: Character encoding

MacCroatian
type: NamedIndividual
type: Character encoding

MacCyrillic
type: NamedIndividual
type: Character encoding

MacDingbat
type: NamedIndividual
type: Character encoding

MacGreek
type: NamedIndividual
type: Character encoding

MacHebrew
type: NamedIndividual
type: Character encoding

MacIceland
type: NamedIndividual
type: Character encoding

MacRoman
type: NamedIndividual
type: Character encoding

MacRomania
type: NamedIndividual
type: Character encoding

MacSymbol
type: NamedIndividual
type: Character encoding

MacThai
type: NamedIndividual
type: Character encoding

MacTurkish
type: NamedIndividual
type: Character encoding

MacUkraine
type: NamedIndividual
type: Character encoding

MeSH
type: NamedIndividual
type: Subject classification scheme
has URL: http://www.openclinical.org/medTermMesh.html
alternative label: Medical Subject Headings

Microsoft Cognitive Toolkit
type: NamedIndividual
type: Framework

NLM classification scheme
type: NamedIndividual
type: Subject classification scheme
comment: Classification scheme of the National Library of Medicine (https://www.nlm.nih.gov/class/)

OAXAL
type: NamedIndividual
type: Standard/Best practice
has URL: https://www.oasis-open.org/committees/tc_home.php
alternative label: OASIS Open Architecture for XML Authoring and Localization Reference Model

OMTD-SHARE rights statement scheme
type: NamedIndividual
type: Access rights statement scheme

OpenAIRE
type: NamedIndividual
type: Metadata record identifier scheme
type: Project identifier scheme

PAROLE_genre classification scheme
type: NamedIndividual
type: Text genre classification scheme

PAROLE_topic classification scheme
type: NamedIndividual
type: Subject classification scheme

PyTorch
type: NamedIndividual
type: Framework

REST
type: NamedIndividual
type: Web service type

RGB
type: NamedIndividual
type: Colour space

Rights_Statements_Org scheme
type: NamedIndividual
type: Access rights statement scheme

SNR
type: NamedIndividual
type: Audio quality measure included

SOAP
type: NamedIndividual
type: Web service type

SPDX
type: NamedIndividual
type: Licence identifier scheme
has URL: https://spdx.org/licenses/
comment: Value for LicenceIdentifierScheme referring to the codes (identifiers) for licences used by SPDX (https://spdx.org/licenses/))

SRX
type: NamedIndividual
type: Standard/Best practice
has URL: https://www.gala-global.org/srx-20-april-7-2008
alternative label: Segmentation Rules eXchange

Scikit-Learn
type: NamedIndividual
type: Framework

Semantic Annotation Framework
type: NamedIndividual
type: Standard/Best practice

SemAF-DA
type: NamedIndividual
type: Standard/Best practice
has URL: https://www.iso.org/standard/76443.html
alternative label: Semantic Annotation Framework - Dialogue Acts

SemAF-DS
type: NamedIndividual
type: Standard/Best practice
has URL: https://www.iso.org/obp/ui/#iso:std:iso:ts:24617:-5:ed-1:v1:en
alternative label: Semantic Annotation Framework - Discourse Structure

SemAF-NE
type: NamedIndividual
type: Standard/Best practice
has URL: http://semanticweb.kaist.ac.kr/research/tc37sc4/new_doc/iso_tc37_sc4_N796_wg2_proposed_WD_24617-3_SemAF-NE.pdf
alternative label: Semantic Annotation Framework - Named Entities

SemAF-SR
type: NamedIndividual
type: Standard/Best practice
has URL: https://www.iso.org/standard/56866.html
alternative label: Semantic Annotation Framework - Semantic Roles

Shift_JIS
type: NamedIndividual
type: Character encoding

SynAF
type: NamedIndividual
type: Standard/Best practice
has URL: https://www.iso.org/standard/62508.html
alternative label: Syntactic Annotation Framework

T-H pair
type: NamedIndividual
type: Size unit

TBX
type: NamedIndividual
type: Standard/Best practice
has URL: https://www.tbxinfo.net/tbx-about/
alternative label: TermBase eXchange

TEI
type: NamedIndividual
type: Standard/Best practice
has URL: https://tei-c.org/
alternative label: Text Encoding Initiative

TEI P3
type: NamedIndividual
type: Standard/Best practice
has URL: https://www.tei-c.org/Vault/GL/P3/index.htm
alternative label: Text Encoding Initiative P3

TEI P4
type: NamedIndividual
type: Standard/Best practice
has URL: https://tei-c.org/Vault/P4/doc/html/
alternative label: Text Encoding Initiative P4

TEI P5
type: NamedIndividual
type: Standard/Best practice
has URL: https://tei-c.org/guidelines/p5/
alternative label: Text Encoding Initiative P5

TIS-620
type: NamedIndividual
type: Character encoding

TMX
type: NamedIndividual
type: Standard/Best practice
has URL: http://www.opentag.com/tmx.htm
alternative label: Translation Memory eXchange

TST-Centrale
type: NamedIndividual
type: Membership institution

TensorFlow
type: NamedIndividual
type: Framework

3D
type: NamedIndividual
type: Visual modelling

3G
type: NamedIndividual
type: Source channel type

TimeML
type: NamedIndividual
type: Standard/Best practice
has URL: http://www.timeml.org/
alternative label: Time Markup Language

2D
type: NamedIndividual
type: Visual modelling

UDC
type: NamedIndividual
type: Domain classification scheme
has URL: http://www.udcc.org/
alternative label: Universal Decimal Classification

UIMA
type: NamedIndividual
type: Framework

US-ASCII
type: NamedIndividual
type: Character encoding

UTF-16
type: NamedIndividual
type: Character encoding

UTF-16BE
type: NamedIndividual
type: Character encoding

UTF-16LE
type: NamedIndividual
type: Character encoding

UTF-8
type: NamedIndividual
type: Character encoding

VGA
type: NamedIndividual
type: Resolution standard

VOIP
type: NamedIndividual
type: Source channel type

XCES
type: NamedIndividual
type: Standard/Best practice
has URL: http://www.xces.org/
alternative label: Corpus Encoding Standard for XML

XLIFF
type: NamedIndividual
type: Standard/Best practice
has URL: http://docs.oasis-open.org/xliff/v1.2/os/xliff-core.html
alternative label: XML Localization Interchange File Format

YUV
type: NamedIndividual
type: Colour space

A-law
type: NamedIndividual
type: Signal encoding

AAC
type: NamedIndividual
type: Compression name
alternative label: Advanced Audio Coding

abbreviation
type: NamedIndividual
type: Lemma type

academic
type: NamedIndividual
type: User type
comment: Value for 'user type' reserved for individuals affiliated to academir or, in general, educational or research institutions and the respective organisations

academic
type: NamedIndividual
type: Licence category
conforms to: CLARIN licence category scheme
alternative label: ACA

academic institution
type: NamedIndividual
type: Organization legal status

academic text
type: NamedIndividual
type: Text type
has identifier: ClarinEl TT001

academic user
type: NamedIndividual
type: Condition of use

accentuation
type: NamedIndividual
type: Audio type

accepted
type: NamedIndividual
type: Version type
comment: Value for 'Version type' used for versions as accepted for publication (following a reviewing process that may have introduced changes from the submitted version)

accessible through interface
type: NamedIndividual
type: Dataset distribution form
comment: Value for distribution medium, used for corpora and lexical/conceptual resources that can be accessed via a human-intended interface (e.g., corpus workbench, lexicon browsing interface, etc.)

accessible through query
type: NamedIndividual
type: Dataset distribution form
comment: Value for dataset distribution medium, used for lexical/conceptual resources that can be accessed via a SPARQL endpoint

administrative text
type: NamedIndividual
type: Text type
has identifier: ClarinEl TT008

adult
type: NamedIndividual
type: Age group

advertising
type: NamedIndividual
type: Text genre
has identifier: PAROLE G002

Advertising & Public Relations
type: NamedIndividual
type: Domain
has identifier: DDC659

Agriculture
type: NamedIndividual
type: Domain
has identifier: DDC630
comment: The science, art, or practice of cultivating the soil, producing crops, and raising livestock and in varying degrees the preparation and marketing of the resulting products [https://www.merriam-webster.com/dictionary/agriculture]

air traffic control
type: NamedIndividual
type: Speech genre
has identifier: MS SG001

airflow
type: NamedIndividual
type: Source channel

alcohol
type: NamedIndividual
type: Speech influence

analysis
type: NamedIndividual
type: Language description task

anaphora
type: NamedIndividual
type: Grammatical phenomena coverage

anaphora resolution
type: NamedIndividual
type: Language description task

Android
type: NamedIndividual
type: operating system

anechoic chamber
type: NamedIndividual
type: Recording environment

animal vocalization
type: NamedIndividual
type: Audio genre
has identifier: MS AG006

Animals (Zoology)
type: NamedIndividual
type: Domain
has identifier: DDC590

annotated corpus
type: NamedIndividual
type: Corpus subclass
comment: A corpus that has been processed and thus includes the raw data and the automatic or manual annotations that have been added to them

annotation scheme
type: NamedIndividual
type: LCR subclass
comment: A set of elements and values designed to annotate data. It usually consists in a formal representation. It aims to represent a specific level of information, such as morphological features of words, syntactic dependency relations between phrases, discourse level information, etc. It can consist of a flat structure of elements and values (e.g., part-of-speech tags) or it can be more complex with interrelated elements (e.g., specific morphological features to be used for each part-of-speech).

annotations corpus
type: NamedIndividual
type: Corpus subclass
comment: A corpus of annotations without the raw data

antonym
type: NamedIndividual
type: Semantic type

API specification
type: NamedIndividual
type: Documentation type
comment: Value for 'Documentation type' used for the specification description of an API

application word
type: NamedIndividual
type: Speech item

Applied Physics
type: NamedIndividual
type: Domain
has identifier: DDC621

Architecture
type: NamedIndividual
type: Domain
has identifier: DDC720

arm
type: NamedIndividual
type: Body part

article
type: NamedIndividual
type: Size unit

article
type: NamedIndividual
type: Document type
comment: An article from a journal or magazine

Arts & Recreation
type: NamedIndividual
type: Domain
has identifier: DDC700

aspect
type: NamedIndividual
type: Morphological type

assisted
type: NamedIndividual
type: Naturality

association
type: NamedIndividual
type: Organization legal status

Astronomy
type: NamedIndividual
type: Domain
has identifier: DDC520

altrac
type: NamedIndividual
type: Compression name

attached
type: NamedIndividual
type: Related lexicon type

attribution
type: NamedIndividual
type: Condition of use
type: Set
comment: Value for 'ConditionOfUse' that states that the use of a language resource must acknowledge it with an attribution note usually according to terms specified in the licensing document
permission:
  duty:
    action: Attribution

audio
type: NamedIndividual
type: Media type
comment: Value for 'MediaType' for the form of a language resource (part) composed of or relating to sound(s)

automatic
type: NamedIndividual
type: Process mode
comment: Value for 'Process mode' and its subclasses used for fully automatic processes where the results of the process have undergone no manual edits

automatic
type: NamedIndividual
type: Evaluation measure

auxiliary
type: NamedIndividual
type: Morphological type

available
type: NamedIndividual
type: Availability
comment: For resources available through the infrastructure

available through other distributors
type: NamedIndividual
type: Availability
comment: For resources that are available through other distribution channels

avi
type: NamedIndividual
type: Compression name

background noise
type: NamedIndividual
type: Audio quality measure included

background noise
type: NamedIndividual
type: Annotated element

banking
type: NamedIndividual
type: Domain
has identifier: ELG Domain014

Big Endian
type: NamedIndividual
type: Byte order

bigram
type: NamedIndividual
type: Size unit

bilingual
type: NamedIndividual
type: Linguality type
comment: Value for 'Linguality type' for resource (parts) which include material in two languages

Biochemistry
type: NamedIndividual
type: Domain
has identifier: DDC572

Biology
type: NamedIndividual
type: Domain
has identifier: DDC570

black box
type: NamedIndividual
type: Evaluation type

blog text
type: NamedIndividual
type: Text type
has identifier: ClarinEl TT002

bluRay
type: NamedIndividual
type: Dataset distribution form
comment: bluRay refers to a kind of distribution/access medium used for delivering a language resource; intended for resources delivered on bluRay disks

body gesture
type: NamedIndividual
type: Modality type
comment: Value for 'ModalityType' for body gestures represented in a language resource

book
type: NamedIndividual
type: Document type

booklet
type: NamedIndividual
type: Document type

boolean
type: NamedIndividual
type: Parameter type

branch
type: NamedIndividual
type: Division category

broadcast news
type: NamedIndividual
type: Speech genre
has identifier: MS SG009

business
type: NamedIndividual
type: Domain
has identifier: ELG Domain011

byte
type: NamedIndividual
type: Size unit

call-in
type: NamedIndividual
type: Speech genre
has identifier: MS SG002

camcorder
type: NamedIndividual
type: Source channel

camera
type: NamedIndividual
type: Capturing device type

caption
type: NamedIndividual
type: Text included in image

caption
type: NamedIndividual
type: Text included in video

capture time
type: NamedIndividual
type: Text included in image

case
type: NamedIndividual
type: Morphological type

chat text
type: NamedIndividual
type: Text type
has identifier: ClarinEl TT014

Chemical Engineering
type: NamedIndividual
type: Domain
has identifier: DDC660

Chemistry
type: NamedIndividual
type: Domain
has identifier: DDC540

child
type: NamedIndividual
type: Age group

chunking
type: NamedIndividual
type: Language description task

class
type: NamedIndividual
type: Size unit

clause
type: NamedIndividual
type: Segmentation level

clause structure
type: NamedIndividual
type: Grammatical phenomena coverage

clipping rate
type: NamedIndividual
type: Audio quality measure included

clitic form
type: NamedIndividual
type: Lemma type
alternative label: inflectional form

close talk microphone
type: NamedIndividual
type: Capturing device type

closed public place
type: NamedIndividual
type: Recording environment

collocation
type: NamedIndividual
type: Usage type

combination of modalities
type: NamedIndividual
type: Modality type
comment: Value for 'ModalityType' for language resources that include various modalities

Commerce (Trade)
type: NamedIndividual
type: Domain
has identifier: DDC381

commercial
type: NamedIndividual
type: User type
comment: Value for 'user type' reserved for individuals affiliated with a commercial institution and the respective organisations

commercial
type: NamedIndividual
type: Non-speech item
comment: Value for non-speech item, used for commercials (advertisements)

commercial support
type: NamedIndividual
type: Support type

commercial user
type: NamedIndividual
type: Condition of use

communicate
type: NamedIndividual
type: concept
comment: The Assigner permits/prohibits the Assignees to communicate the Asset to the public

Communications
type: NamedIndividual
type: Domain
has identifier: DDC384

comparable
type: NamedIndividual
type: Multilinguality type
comment: Value for 'Multilinguality type' for resource parts or resources that consist of the similar text segments in two or more languages (e.g., a corpus of legislation texts in Greek and English)

compatible
type: NamedIndividual
type: Related lexicon type

complex
type: NamedIndividual
type: Capturing environment

component
type: NamedIndividual
type: Parameter type

compound
type: NamedIndividual
type: Lemma type

computational lexicon
type: NamedIndividual
type: LCR subclass
comment: A lexicon which is intended for computational purposes and thus contains words associated with information relevant for the specific purposes

Computer Science, Information & General Works
type: NamedIndividual
type: Domain
has identifier: DDC000

concept
type: NamedIndividual
type: Size unit

conference room
type: NamedIndividual
type: Recording environment

Construction of Buildings
type: NamedIndividual
type: Domain
has identifier: DDC690

consulting firm
type: NamedIndividual
type: Organization role

content
type: NamedIndividual
type: Validation type
comment: Value for 'Validation type' indicating that the validation is performed on the contents of the resource

conversation
type: NamedIndividual
type: Speech genre
has identifier: MS SG012

coordination
type: NamedIndividual
type: Grammatical phenomena coverage

cordis
type: NamedIndividual
type: Project identifier scheme
alternative label: rcn

corpora
type: NamedIndividual
type: Parameter type

corpus
type: NamedIndividual
type: Processing resource type
comment: Value for 'Resource type' for corpora, i.e. sets of datafiles (e.g., texts, audio recordings, videos, images, photographs, etc.)

credit card number
type: NamedIndividual
type: Speech item

cross-reference
type: NamedIndividual
type: Semantic type

cross talk
type: NamedIndividual
type: Audio quality measure included

culture
type: NamedIndividual
type: Domain
has identifier: Clarin Domain004

data
type: NamedIndividual
type: Parameter type

data evaluator
type: NamedIndividual
type: Organization role

daylight
type: NamedIndividual
type: Scene illumination

debate
type: NamedIndividual
type: Speech genre
has identifier: MS SG013

defence
type: NamedIndividual
type: Domain
has identifier: ELG Domain010

definition
type: NamedIndividual
type: Semantic type
alternative label: gloss

parsing of definitions
type: NamedIndividual
type: Language description task

degree
type: NamedIndividual
type: Morphological type

demo resource
type: NamedIndividual
type: Documentation type
comment: Value for 'DocumentationType' used for demos of a resource available usually through the internet (e.g., video demos)

dental prosthesis
type: NamedIndividual
type: Vocal tract condition

department
type: NamedIndividual
type: Division category

derivation
type: NamedIndividual
type: Morphological type

diagnostic
type: NamedIndividual
type: Evaluation level

dialect
type: NamedIndividual
type: Language variety type
comment: Value for 'LanguageVarietyType' used for a particular form of a language which is peculiar to a specific region or social group

dialogue
type: NamedIndividual
type: Conversational type

dictionary
type: NamedIndividual
type: LCR subclass
comment: A book or electronic resource that contains a list of words (usually in alphabetical order) and explains their meanings, or gives a word for them in another language and other information (e.g., spelling, pronunciation, etc.)

diphone
type: NamedIndividual
type: Segmentation level

diphone
type: NamedIndividual
type: Size unit

disaster management
type: NamedIndividual
type: Domain
has identifier: ELG Domain005

discourse marker
type: NamedIndividual
type: Annotated element

discussion
type: NamedIndividual
type: Text genre
has identifier: PAROLE G005

discussion forum
type: NamedIndividual
type: Support type

docker image
type: NamedIndividual
type: Software distribution form
comment: Value for software distribution form, used for software objects distributed as Docker images, i.e. packaged together with all their dependencies and ready to be executed

document
type: NamedIndividual
type: Parameter type

domain
type: NamedIndividual
type: Semantic type

downloadable
type: NamedIndividual
type: Dataset distribution form
comment: Value for distribution medium, used for language resources that can be downloaded from a remote location

draft
type: NamedIndividual
type: Version type
comment: Value for 'Version type' used for versions during the writing up process

drop
type: NamedIndividual
type: Previous annotation types policy

DV
type: NamedIndividual
type: Recording device type

EAN 13
type: NamedIndividual
type: Document identifier scheme
has URL: https://en.wikipedia.org/wiki/International_Article_Number
comment: Value for resourceIdentifierSchemeName, referring to EAN (International Article Number, also known as European Article Number) and more specifically to the EAN 13 standard (cf. https://en.wikipedia.org/wiki/International_Article_Number)
alternative label: European Article Number 13 standard

Earth Sciences & Geology
type: NamedIndividual
type: Domain
has identifier: DDC550

Economics
type: NamedIndividual
type: Domain
has identifier: DDC330

Education
type: NamedIndividual
type: Domain
has identifier: DDC370

e-ISSN
type: NamedIndividual
type: Document identifier scheme
has URL: https://en.wikipedia.org/wiki/International_Standard_Serial_Number
comment: Value for resourceIdentifierSchemeName, referring to the e-ISSN (electronic International Standard Serial Number, https://en.wikipedia.org/wiki/International_Standard_Serial_Number)

elderly
type: NamedIndividual
type: Age group

element
type: NamedIndividual
type: Size unit

ELG
type: NamedIndividual
type: AgentIdentifierScheme
type: Funder identfier scheme
type: Organization identifier scheme
type: Person identfier scheme
type: Document identifier scheme
type: LR identifier scheme
type: Licence identifier scheme
type: Metadata record identifier scheme
type: Project identifier scheme
type: Repository identifier scheme
comment: European Language Grid identifier scheme (used for internal purposes)

elicited
type: NamedIndividual
type: Naturality

email text
type: NamedIndividual
type: Text type
has identifier: ClarinEl TT016

embedded microphone
type: NamedIndividual
type: Capturing device type

emotional expressive
type: NamedIndividual
type: Speech genre
has identifier: MS SG007

encyclopaedic text
type: NamedIndividual
type: Text type
has identifier: ClarinEl TT003

energy
type: NamedIndividual
type: Domain
has identifier: ELG Domain002

Energy
type: NamedIndividual
type: Domain
has identifier: Clarin Domain001

Engineering
type: NamedIndividual
type: Domain
has identifier: DDC620

entry
type: NamedIndividual
type: Size unit

Environment
type: NamedIndividual
type: Domain
has identifier: Clarin Domain002

EU funds
type: NamedIndividual
type: Funding type
comment: Value for 'Funding type' for projects with EU funds

euro
type: NamedIndividual
type: Currency

evaluation use
type: NamedIndividual
type: Condition of use
comment: Value for 'ConditionOfUse' that states that the language resource can only be used for evaluation purposes
note: add odrl

event type
type: NamedIndividual
type: Semantic type

example
type: NamedIndividual
type: Extratextual information unit

example
type: NamedIndividual
type: Usage type

executable code
type: NamedIndividual
type: Software distribution form
comment: Value for software distribution form, used for software objects available as binary files already compiled and ready to be executed

expression
type: NamedIndividual
type: Size unit

extrinsic
type: NamedIndividual
type: Evaluation criterion

face
type: NamedIndividual
type: Body part

face to face conversation
type: NamedIndividual
type: Text type
has identifier: ClarinEl TT013
alternative label: face-to-face conversation

facebook
type: NamedIndividual
type: Social media account occupational type

facial expression
type: NamedIndividual
type: Modality type
comment: Value for 'ModalityType' for facial expressions represented in a language resource

faculty
type: NamedIndividual
type: Division category

farfield microphone
type: NamedIndividual
type: Capturing device type

feature
type: NamedIndividual
type: Text genre
has identifier: PAROLE G001

female
type: NamedIndividual
type: Sex

few
type: NamedIndividual
type: Audience

fiction
type: NamedIndividual
type: Text genre
has identifier: PAROLE G006

file
type: NamedIndividual
type: Size unit

file
type: NamedIndividual
type: Processing resource type

finance
type: NamedIndividual
type: Domain
has identifier: ELG Domain016

5-gram
type: NamedIndividual
type: Size unit

fix
type: NamedIndividual
type: Scene illumination

FLAC
type: NamedIndividual
type: Compression name
alternative label: Free Lossless Audio Codec

flash
type: NamedIndividual
type: Recording device type

float
type: NamedIndividual
type: Parameter type

floating point
type: NamedIndividual
type: Sign convention

foot
type: NamedIndividual
type: Body part

foreign affairs
type: NamedIndividual
type: Domain
has identifier: ELG Domain012

formal
type: NamedIndividual
type: Validation type
comment: Value for 'Validation type' indicating that the validation is performed on formal aspects of the resource (e.g., size, syntactic validation, etc.)

4-gram
type: NamedIndividual
type: Size unit

frame
type: NamedIndividual
type: Segmentation level

frame
type: NamedIndividual
type: Size unit

FrameNet
type: NamedIndividual
type: Compatible lexicon type
type: LCR subclass
comment: A lexical database based on annotating examples of how words are used in actual texts in accordance to the notion of 'semantic frame' (schematic representation of a situation involving various participants, props and other conceptual roles); originally built for English and extended to other languages according to the same design principles

free speech
type: NamedIndividual
type: Speech item

free support
type: NamedIndividual
type: Support type

frequency
type: NamedIndividual
type: Usage type

frog story
type: NamedIndividual
type: Scenario type

full
type: NamedIndividual
type: Validation extent

funding authority
type: NamedIndividual
type: Organization legal status

galaxy workflow
type: NamedIndividual
type: Software distribution form
comment: Value for software distribution form, used for software workflows created with the Galaxy workflow engine

gb
type: NamedIndividual
type: Size unit
alternative label: gigabyte

gender
type: NamedIndividual
type: Morphological type

General
type: NamedIndividual
type: Domain
has identifier: Clarin Domain003

general documentation
type: NamedIndividual
type: Documentation type
comment: Value for 'Documentation type' used for documents that describe a language resource or some aspect of it

generation
type: NamedIndividual
type: Language description task

Geography & Travel
type: NamedIndividual
type: Domain
has identifier: DDC910

GitHub
type: NamedIndividual
type: Social media account occupational type

GitLab
type: NamedIndividual
type: Social media account occupational type

glass box
type: NamedIndividual
type: Evaluation type

Google Chrome OS
type: NamedIndividual
type: operating system

Graphic Arts & Decorative Arts
type: NamedIndividual
type: Domain
has identifier: DDC740

graphic card
type: NamedIndividual
type: Required hardware

GRID
type: NamedIndividual
type: Organization identifier scheme
has URL: https://www.grid.ac/
comment: GRID identifier scheme (Global Research Identifier Database, https://www.grid.ac/)

group
type: NamedIndividual
type: Division category

hand
type: NamedIndividual
type: Body part

hard disk
type: NamedIndividual
type: Dataset distribution form
comment: Value for data distribution medium, used for resources that are delivered on a hard disk

hard disk
type: NamedIndividual
type: Recording device type

Hardware & Household Appliances
type: NamedIndividual
type: Domain
has identifier: DDC683

head
type: NamedIndividual
type: Body part

health
type: NamedIndividual
type: Domain
has identifier: ELG Domain009

high
type: NamedIndividual
type: Recording quality

high
type: NamedIndividual
type: Quality

high
type: NamedIndividual
type: Noise level

History
type: NamedIndividual
type: Domain
has identifier: DDC900

Home & Family Management
type: NamedIndividual
type: Domain
has identifier: DDC640

hour
type: NamedIndividual
type: Duration unit

hour
type: NamedIndividual
type: Size unit

human
type: NamedIndividual
type: Evaluation measure

human non speech
type: NamedIndividual
type: Audio genre
has identifier: MS AG001

hyperbaric
type: NamedIndividual
type: Speech influence

hyperonym
type: NamedIndividual
type: Semantic type

hyponym
type: NamedIndividual
type: Semantic type

iOS
type: NamedIndividual
type: operating system

idiomatic expression
type: NamedIndividual
type: Size unit

image
type: NamedIndividual
type: Media type
comment: Value for 'Media type' for the for of a language resource (part) consisting of visual representations (e.g., pictures, photos)

image
type: NamedIndividual
type: Extratextual information

image
type: NamedIndividual
type: Size unit

impact
type: NamedIndividual
type: Evaluation level

in book
type: NamedIndividual
type: Document type

in car
type: NamedIndividual
type: Recording environment

in collection
type: NamedIndividual
type: Document type

in proceedings
type: NamedIndividual
type: Document type

included
type: NamedIndividual
type: Related lexicon type

incorporate
type: NamedIndividual
type: concept
comment: The Assigner permits/prohibits the Assignees to incorporate the Asset unmodified into a Collective Work.
broader transitive: use

industrial
type: NamedIndividual
type: Recording environment

inflection
type: NamedIndividual
type: Morphological type

inform licensor
type: NamedIndividual
type: Condition of use
type: Set
comment: Value for 'ConditionOfUse' which states that users must inform the licensor as to the kind of use they intend to make of the resource
permission:
  duty:
    action: Notify

information
type: NamedIndividual
type: Text genre
has identifier: PAROLE G003

ingested record
type: NamedIndividual
type: Size unit

installation manual
type: NamedIndividual
type: Documentation type
comment: Value for 'Documentation type' used for documents that contain instructions on how to install a software

institute
type: NamedIndividual
type: Division category

instruction
type: NamedIndividual
type: Text genre
has identifier: PAROLE G004

instrumental music
type: NamedIndividual
type: Audio genre
has identifier: MS AG005

insurance
type: NamedIndividual
type: Domain
has identifier: ELG Domain006

integer
type: NamedIndividual
type: Parameter type

interactive
type: NamedIndividual
type: Process mode
comment: Value for 'Process mode' and its subclasses used for processes that include some interaction between the processing tool and the human agent performing the process

interactive
type: NamedIndividual
type: Interactivity

internal record
type: NamedIndividual
type: Size unit

internet
type: NamedIndividual
type: Source channel

interview
type: NamedIndividual
type: Text type
has identifier: ClarinEl TT006

interview
type: NamedIndividual
type: Speech genre
has identifier: MS SG006

intrinsic
type: NamedIndividual
type: Evaluation criterion

irregular form
type: NamedIndividual
type: Morphological type

ISLRN
type: NamedIndividual
type: LR identifier scheme
has URL: http://www.islrn.org
comment: Value for LRTIdentifierScheme referring to ISLRN (International Standard Language Resource Number, http://www.islrn.org/)

isolated digit
type: NamedIndividual
type: Speech item

isolated word
type: NamedIndividual
type: Speech item

ISSN
type: NamedIndividual
type: Document identifier scheme
has URL: http://www.issn.org
comment: Value for resourceIdentifierSchemeName, referring to the ISSN (International Standard Serial Number, http://www.issn.org/)
alternative label: International Standard Serial Number

issue tracker
type: NamedIndividual
type: Documentation type
comment: Value for 'DocumentationType' for issue-tracking tools used by software developers usually available through a dedicated web page

ISTC
type: NamedIndividual
type: Document identifier scheme
has URL: http://www.istc-international.org/
comment: Value for resourceIdentifierSchemeName, referring to the ISTC (International Standard Text Code, http://www.istc-international.org/)
alternative label: International Standard Text Code

item
type: NamedIndividual
type: Size unit

jargon
type: NamedIndividual
type: Language variety type
comment: Value for 'LanguageVarietyType' used for a particular type of language mainly used in a specific context (e.g., by a professional or social group) which may not be well understood outside that context

journalistic text
type: NamedIndividual
type: Text type
has identifier: ClarinEl TT018

kilobyte
type: NamedIndividual
type: Size unit
alternative label: kb

keep
type: NamedIndividual
type: Previous annotation types policy

keyword
type: NamedIndividual
type: Size unit

laboratory
type: NamedIndividual
type: Division category

Language
type: NamedIndividual
type: Domain
has identifier: DDC400

language description
type: NamedIndividual
type: Processing resource type
comment: Value for 'Resource type' for language descriptions, e.g., grammars, machine learning models, etc., i.e. language resources that formally describe a language

language engineering research use
type: NamedIndividual
type: Condition of use
replaces: Value for 'ConditionOfUse' which states that the resource can only be used for research purposes in the Language Enginnering / Language Technology domain.

language service provider
type: NamedIndividual
type: Organization role

large company
type: NamedIndividual
type: Organization legal status

large membrane microphone
type: NamedIndividual
type: Capturing device type

large public
type: NamedIndividual
type: Audience

laryngograph
type: NamedIndividual
type: Source channel

laryngograph
type: NamedIndividual
type: Capturing device type

lavalier microphone
type: NamedIndividual
type: Capturing device type

Law
type: NamedIndividual
type: Domain
has identifier: DDC340

law
type: NamedIndividual
type: Domain
has identifier: ELG Domain018

lecture
type: NamedIndividual
type: Speech genre
has identifier: MS SG010

lecture room
type: NamedIndividual
type: Recording environment

leg
type: NamedIndividual
type: Body part

lemma
type: NamedIndividual
type: Lemma type

lemma
type: NamedIndividual
type: Extratextual information unit

letter
type: NamedIndividual
type: Base item

letter
type: NamedIndividual
type: Text type
has identifier: ClarinEl TT004

lexical/conceptual resource
type: NamedIndividual
type: Processing resource type
comment: Value for 'Processing resource type' for lexical and conceptual resources (e.g., lexica, ontologies, gazetteers, terminological lists, dictionaries, thesauri, etc.)

lexical type
type: NamedIndividual
type: Size unit

lexical unit
type: NamedIndividual
type: Extratextual information unit

lexicon
type: NamedIndividual
type: LCR subclass
comment: (a list of) all the words used in a particular language or subject, or a dictionary [https://dictionary.cambridge.org/dictionary/english/lexicon]

library
type: NamedIndividual
type: Software distribution form
comment: Value for software distribution form, used for software objects in the form of libraries (e.g. Java, python libraries)

LCC
type: NamedIndividual
type: Domain classification scheme
alternative label: Library of Congress classification system

LCSH
type: NamedIndividual
type: Subject classification scheme
alternative label: Library of Congress Subject Headings

life sciences
type: NamedIndividual
type: Domain
has identifier: Clarin Domain005
comment: A branch of science (such as biology, medicine, and sometimes anthropology or sociology) that deals with living organisms and life processes —usually used in plural

linear PCM
type: NamedIndividual
type: Signal encoding

Linguistics
type: NamedIndividual
type: Domain
has identifier: DDC410

linkedIn
type: NamedIndividual
type: Social media account occupational type

Linux
type: NamedIndividual
type: operating system

LISSN
type: NamedIndividual
type: Document identifier scheme
comment: Value for resourceIdentifierSchemeName, referring to the linking ISSN or ISSN-L
alternative label: ISSN-L

literary text
type: NamedIndividual
type: Text type
has identifier: ClarinEl TT012

Literature, Rhetoric & Criticism
type: NamedIndividual
type: Domain
has identifier: DDC800

Little Endian
type: NamedIndividual
type: Byte order

low
type: NamedIndividual
type: Recording quality

low
type: NamedIndividual
type: Quality

low
type: NamedIndividual
type: Noise level

LSID
type: NamedIndividual
type: Document identifier scheme
has URL: http://www.webcitation.org/getfile
comment: Value for resourceIdentifierSchemeName, referring to the LSID (Life Sciences Identifier, http://www.webcitation.org/getfile?fileid=27fcd073ea70199946ace15c6868520be2cab2ab)
alternative label: Life Sciences Identifier

MAC-OS
type: NamedIndividual
type: operating system

Machine Readable Dictionary
type: NamedIndividual
type: LCR subclass
comment: a dictionary usually meant for humans in a form that a computer can process
alternative label: MRD

male
type: NamedIndividual
type: Sex

Management & Public Relations
type: NamedIndividual
type: Domain
has identifier: DDC650

manual
type: NamedIndividual
type: Process mode
comment: Value for 'Process mode' and its subclasses used for processes that are performed manually

manual
type: NamedIndividual
type: Document type

Manufacturing
type: NamedIndividual
type: Domain
has identifier: DDC670

map task
type: NamedIndividual
type: Scenario type

mapping of resources
type: NamedIndividual
type: LCR subclass
comment: a resource consisting of mapping values and/or rules between two resources

masters thesis
type: NamedIndividual
type: Document type

Mathematics
type: NamedIndividual
type: Domain
has identifier: DDC510

maven
type: NamedIndividual
type: LR identifier scheme
has URL: https://maven.apache.org/pom.html#Maven_Coordinates
comment: Value for LRTIdentifierScheme referring to the Maven coordinates (cf. Maven POM, https://maven.apache.org/pom.html#Maven_Coordinates)

mb
type: NamedIndividual
type: Size unit
alternative label: megabyte

media
type: NamedIndividual
type: Domain
has identifier: ELG Domain008

medication
type: NamedIndividual
type: Speech influence

Medicine & Health
type: NamedIndividual
type: Domain
has identifier: DDC610

medium
type: NamedIndividual
type: Recording quality

medium
type: NamedIndividual
type: Quality

medium
type: NamedIndividual
type: Noise level

meeting
type: NamedIndividual
type: Speech genre
has identifier: MS SG011

meeting proceedings
type: NamedIndividual
type: Text type
has identifier: ClarinEl TT009

member of association
type: NamedIndividual
type: Condition of use

meronym
type: NamedIndividual
type: Semantic type

META-SHARE
type: NamedIndividual
type: LR identifier scheme
has URL: http://www.meta-share.org
comment: Value for LRTIdentifierScheme referring to the identifier assigned by META-SHARE (http://www.meta-share.org/)
note: in MS, we had MetaShareId and not the scheme; in general, discuss the use of "local resource identifier scheme" from DataCite as a value

microphone
type: NamedIndividual
type: Required hardware

microphone
type: NamedIndividual
type: Capturing device type

microphone array
type: NamedIndividual
type: Capturing device type

minute
type: NamedIndividual
type: Size unit

minute
type: NamedIndividual
type: Duration unit

mispronunciation
type: NamedIndividual
type: Annotated element

mixed
type: NamedIndividual
type: Process mode
comment: Value for 'Process mode' and its subclasses used for mixed processes, usually involving an automatic processing followed by human edits

mixed
type: NamedIndividual
type: Hearing impairment of participants

mixed
type: NamedIndividual
type: Speaking impairment of participants

modify
type: NamedIndividual
type: Previous annotation types policy

money amount
type: NamedIndividual
type: Speech item

monolingual
type: NamedIndividual
type: Linguality type
comment: Value for 'Linguality type' for resource (parts) which include material in one language

monologue
type: NamedIndividual
type: Conversational type

mood
type: NamedIndividual
type: Morphological type

morphological lexicon
type: NamedIndividual
type: Compatible lexicon type
type: LCR subclass
comment: a lexicon with morphological information associated with its entries

morphology
type: NamedIndividual
type: Encoding level
comment: Value for 'EncodingLevel' for the particular linguistic level that relates to the study of word formation (such as inflection, derivation and compounding)

mouth
type: NamedIndividual
type: Body part

mov
type: NamedIndividual
type: Compression name

mp3
type: NamedIndividual
type: Compression name

mpeg
type: NamedIndividual
type: Compression name

mpg
type: NamedIndividual
type: Compression name

mu-law
type: NamedIndividual
type: Signal encoding

multi-word unit
type: NamedIndividual
type: Size unit
alternative label: multi-word expression

multi-word unit
type: NamedIndividual
type: Lemma type
alternative label: multi-word expression

multilingual
type: NamedIndividual
type: Linguality type
comment: Value for 'Linguality type' for resource (parts) which include material in three or more languages

multilingual single text
type: NamedIndividual
type: Multilinguality type
comment: Value for 'Multilinguality type' for resource parts or resources that consist of segments including text in two or more languages (e.g., the transcription of a European Parliament session with MPs speaking in their native language)

multilogue
type: NamedIndividual
type: Conversational type

multiple sources
type: NamedIndividual
type: Scene illumination

music
type: NamedIndividual
type: Non-speech item

Music
type: NamedIndividual
type: Domain
has identifier: DDC780

narrative
type: NamedIndividual
type: Speech genre
has identifier: MS SG008

national funds
type: NamedIndividual
type: Funding type
comment: Value for 'Funding type' for projects funded by national authorities

national security
type: NamedIndividual
type: Domain
has identifier: ELG Domain015

native
type: NamedIndividual
type: Origin

natural
type: NamedIndividual
type: Naturality

natural number
type: NamedIndividual
type: Speech item

neologism
type: NamedIndividual
type: Size unit

network
type: NamedIndividual
type: Organization legal status

News, Media, Journalism & Publishing
type: NamedIndividual
type: Domain
has identifier: DDC070

no
type: NamedIndividual
type: Speaking impairment of participants

no derivatives
type: NamedIndividual
type: Condition of use
type: Set
comment: Value for 'ConditionOfUse' which states that the users of the resource are not allowed to share derivatives of the resource
prohibition:
  action: DerivativeWorks

no
type: NamedIndividual
type: Hearing impairment of participants

no redistribution
type: NamedIndividual
type: Condition of use
comment: Value for 'ConditionOfUse' which states that users are not allowed to redistribute the resource
prohibition:
  action: Reproduction

noise
type: NamedIndividual
type: Non-speech item

noise
type: NamedIndividual
type: Audio genre
has identifier: MS AG002

non-commercial use
type: NamedIndividual
type: Condition of use
type: Set
comment: Value for 'ConditionOfUse' which states that the language resource cannot be used for commercial purposes, i.e. where there is some direct profit from using it
prohibition:
  action: CommercialUse

non fiction
type: NamedIndividual
type: Text genre
has identifier: PAROLE G008

non interactive
type: NamedIndividual
type: Interactivity

nonNative
type: NamedIndividual
type: Origin

none
type: NamedIndividual
type: Body part

none
type: NamedIndividual
type: Text included in video

none
type: NamedIndividual
type: Text included in image

none
type: NamedIndividual
type: Audience

none
type: NamedIndividual
type: Related lexicon type

none
type: NamedIndividual
type: Required hardware

note
type: NamedIndividual
type: Non-speech item

note
type: NamedIndividual
type: Usage type

recognition of noun phrases
type: NamedIndividual
type: Language description task

NP structure
type: NamedIndividual
type: Grammatical phenomena coverage
alternative label: Structure of noun phrases

number
type: NamedIndividual
type: Morphological type

OAI
type: NamedIndividual
type: LR identifier scheme
has URL: http://www.openarchives.org/OAI/2.0/guidelines-oai-identifier.htm
comment: Value for LRTIdentifierScheme referring to the OAI identifier (Open Archives Initiative, http://www.openarchives.org/OAI/2.0/guidelines-oai-identifier.htm)

OCR system
type: NamedIndividual
type: Required hardware

office
type: NamedIndividual
type: Recording environment

official
type: NamedIndividual
type: Text genre
has identifier: PAROLE G009

Ogg Vorbis
type: NamedIndividual
type: Compression name

OMTD
type: NamedIndividual
type: LR identifier scheme
type: Metadata record identifier scheme
has URL: https://services.openminted.eu/home
comment: Value for LRTIdentifierScheme referring to the identifier assigned by the OpenMinTeD platform (https://services.openminted.eu/home)

OMTD-Docker
type: NamedIndividual
type: LR identifier scheme
has URL: https://guidelines.openminted.eu/components_resourceIdentifier.html
comment: Value for LRTIdentifierScheme referring to the recommended by OpenMinTeD use of identifiers for Docker images uploaded to the registry (https://guidelines.openminted.eu/components_resourceIdentifier.html)

online help URL
type: NamedIndividual
type: Documentation type
comment: Value for 'Documentation type' for the online help site of a language resource

online educational game
type: NamedIndividual
type: Scenario type

only META-SHARE members
type: NamedIndividual
type: Condition of use
type: Set
comment: Value for 'ConditionsOfUse' which states that the language resource can only be used by members of the MetaShare network
note: should we also add something more generic for restricting a resource to specific group members (as for spatial constraint)? and I don't think the odrl is ok.
permission:
  constraint:
    operator: eq
    recipient: only META-SHARE members

ontology
type: NamedIndividual
type: Compatible lexicon type
type: LCR subclass
comment: a set of concepts and categories in a subject area or domain that shows their properties and the relations between them [https://en.oxforddictionaries.com/definition/ontology]

open access
type: NamedIndividual
type: Access rights statement
has identifier: omtdAccess2
comment: The free and online availability of literature, which allows to read, download, copy, distribute, print, search, or link to the ful text, crawl articles for indexing, pass them as data to software, or use them for any other useful purpose. An availability that is granted without financial, legal, or technical barriers other than those inseparable from gaining access to the internet itself, and those related to giving authors control over the integrity of their work and the right to be properly acknowledged and cited.

open public place
type: NamedIndividual
type: Recording environment

OS-independent
type: NamedIndividual
type: operating system

other
type: NamedIndividual
type: Funder identfier scheme
type: Organization identifier scheme
type: Person identfier scheme
type: Annotated element
type: Audio genre
type: Audio genre classification scheme
type: Audio quality measure included
type: Base item
type: Capturing device type
type: Compatible lexicon type
type: Compression name
type: Condition of use
type: Content type
type: Currency
type: Dataset distribution form
type: Division category
type: Document identifier scheme
type: Document type
type: Domain
type: Domain classification scheme
type: Encoding level
type: Extratextual information
type: Extratextual information unit
type: Framework
type: Funding type
type: Grammatical phenomena coverage
type: Image genre classification scheme
type: Interactivity
type: LCR subclass
type: Language description task
type: LR identifier scheme
type: Language variety type
type: Licence identifier scheme
type: Membership institution
type: Metadata record identifier scheme
type: Metric
type: Modality type
type: Multilinguality type
type: Naturality
type: Non-speech item
type: operating system
type: Organization legal status
type: Organization role
type: Parameter type
type: Processing resource type
type: Project identifier scheme
type: Recording device type
type: Recording environment
type: Repository identifier scheme
type: Required hardware
type: Scenario type
type: Scene illumination
type: Segmentation level
type: Signal encoding
type: Size unit
type: Social media account occupational type
type: Software distribution form
type: Source channel
type: Source channel type
type: Speech genre
type: Speech genre classification scheme
type: Speech influence
type: Speech item
type: Standard/Best practice
type: Subject classification scheme
type: Support type
type: Text genre
type: Text genre classification scheme
type: Text type
type: Text type classification scheme
type: Video genre classification scheme
type: Vocal tract condition
type: Web service type
comment: Value used when none of the recommended values of an element is appropriate for an item

output text
type: NamedIndividual
type: Processing resource type

overlapping
type: NamedIndividual
type: Interactivity

own funds
type: NamedIndividual
type: Funding type
comment: Value for 'Funding type' for self-funded projects

Painting
type: NamedIndividual
type: Domain
has identifier: DDC750

Paleontology
type: NamedIndividual
type: Domain
has identifier: DDC560

paper copy
type: NamedIndividual
type: Dataset distribution form
comment: Value for data distribution medium, used for language resources that are delivered in paper format

paragraph
type: NamedIndividual
type: Segmentation level

parallel
type: NamedIndividual
type: Multilinguality type
comment: Value for 'Multilinguality type' for resource parts or resources that consist of the equivalent text segments in two or more languages (e.g., an original and its translation equivalents)

parsing
type: NamedIndividual
type: Language description task

part of speech
type: NamedIndividual
type: Morphological type

partial
type: NamedIndividual
type: Validation extent

pear story
type: NamedIndividual
type: Scenario type

Penn treebank
type: NamedIndividual
type: Standard/Best practice
has URL: https://link.springer.com/chapter/10.1007/978-94-010-0201-1_1

person
type: NamedIndividual
type: Morphological type

pharmaceutics
type: NamedIndividual
type: Domain
has identifier: ELG Domain003

PhD thesis
type: NamedIndividual
type: Document type

Philosophy
type: NamedIndividual
type: Domain
has identifier: DDC100

phoneme
type: NamedIndividual
type: Base item

phoneme
type: NamedIndividual
type: Segmentation level

phoneme
type: NamedIndividual
type: Size unit

phonetic unit
type: NamedIndividual
type: Size unit

phonetically balanced sentence
type: NamedIndividual
type: Speech item

phonetically rich sentence
type: NamedIndividual
type: Speech item

phonetically rich word
type: NamedIndividual
type: Speech item

phonetics
type: NamedIndividual
type: Encoding level
comment: Value for 'EncodingLevel' for the particular linguistic level that relates to the study of speech sounds

phonology
type: NamedIndividual
type: Encoding level
comment: Value for 'EncodingLevel' for the particular linguistic level that relates to the study of speech sounds that constitute the fundamental components of a language

Photography, Computer Art, Film, Video
type: NamedIndividual
type: Domain
has identifier: DDC770

phrase
type: NamedIndividual
type: Segmentation level

Physics
type: NamedIndividual
type: Domain
has identifier: DDC530

plain
type: NamedIndividual
type: Capturing environment

planned
type: NamedIndividual
type: Naturality

Plants
type: NamedIndividual
type: Domain
has identifier: DDC580

plugin
type: NamedIndividual
type: Software distribution form
comment: Value for software distribution form, used for software objects in the form of plugins (e.g. Chrome browser extension)

PMCID
type: NamedIndividual
type: Document identifier scheme
has URL: https://www.ncbi.nlm.nih.gov/pmc/pmctopmid/
comment: Value for resourceIdentifierSchemeName, referring to the PMCID (PubMed Central Identifier, https://www.ncbi.nlm.nih.gov/pmc/pmctopmid/)
alternative label: PubMed Central Identifier

PMID
type: NamedIndividual
type: Document identifier scheme
has URL: https://www.ncbi.nlm.nih.gov/pmc/pmctopmid/
comment: Value for resourceIdentifierSchemeName, referring to the PMID (PubMed Identifier, https://www.ncbi.nlm.nih.gov/pmc/pmctopmid/)
alternative label: PubMed Identifier

Political Science
type: NamedIndividual
type: Domain
has identifier: DDC320

politics
type: NamedIndividual
type: Domain
has identifier: ELG Domain017

PP attachment
type: NamedIndividual
type: Grammatical phenomena coverage
alternative label: Attachment of Prepositional phrases

pragmatics
type: NamedIndividual
type: Encoding level
comment: Value for 'EncodingLevel' for the particular linguistic level of analysis that studies the relationship of sentences to the environment in which they occur

Prague treebank
type: NamedIndividual
type: Standard/Best practice
has URL: http://ufal.mff.cuni.cz/pdt2.0/
alternative label: PDT
alternative label: Prague Dependency Treebank

predicate
type: NamedIndividual
type: Size unit

presentation
type: NamedIndividual
type: Speech genre
has identifier: MS SG003

private
type: NamedIndividual
type: Text genre
has identifier: PAROLE G007

proceedings
type: NamedIndividual
type: Document type

prompted
type: NamedIndividual
type: Naturality

proper noun
type: NamedIndividual
type: Speech item

prosodic boundary
type: NamedIndividual
type: Segmentation level

Psychology
type: NamedIndividual
type: Domain
has identifier: DDC150

public
type: NamedIndividual
type: Licence category
conforms to: CLARIN licence category scheme
alternative label: PUB

public administration
type: NamedIndividual
type: Domain
has identifier: ELG Domain007

Public Administration
type: NamedIndividual
type: Domain
has identifier: DDC351

public organization
type: NamedIndividual
type: Organization legal status

publication
type: NamedIndividual
type: Documentation type
comment: Value for 'Documentation type' used for published documents about a language resource (mainly meant for documents that describe the resource itself rather than its deployment)

publication for citation
type: NamedIndividual
type: Documentation type
comment: Value for 'Documentation type' for a published document describing the language resource and which is recommended by the resource creator(s) to be used for citation purposes when the resource is mentioned in another publication

published
type: NamedIndividual
type: Version type
comment: Value for 'Version type' used for versions as published in digital or print form

published record
type: NamedIndividual
type: Size unit

publishing
type: NamedIndividual
type: Domain
has identifier: ELG Domain001

qualia structure
type: NamedIndividual
type: Semantic type

question
type: NamedIndividual
type: Size unit

question answer
type: NamedIndividual
type: Speech genre
has identifier: MS SG004

radio
type: NamedIndividual
type: Source channel

raster
type: NamedIndividual
type: Raster or vector graphics

raw corpus
type: NamedIndividual
type: Corpus subclass
comment: The form of the corpus that has not been enriched with annotations

re3data
type: NamedIndividual
type: Repository identifier scheme

read speech
type: NamedIndividual
type: Naturality

real audio
type: NamedIndividual
type: Compression name

redeposit
type: NamedIndividual
type: Condition of use
type: Set
comment: Value for 'ConditionsOfUse' which states that users are encouraged to deposit any modified versions of the resource they make to the distribution channel through which they have acquired the resource
permission:
  duty:
    action: redeposit

reflexivity
type: NamedIndividual
type: Morphological type

register
type: NamedIndividual
type: Usage type

Religion
type: NamedIndividual
type: Domain
has identifier: DDC200

request plan
type: NamedIndividual
type: Condition of use
comment: Value for 'ConditionOfUse' that states that the licensor requires the submission of a research plan in order to grant access to the language resource

research organization
type: NamedIndividual
type: Organization role

research use
type: NamedIndividual
type: Condition of use
comment: Value for 'ConditionOfUse' stating that the resource can be used only for research purposes
note: add ODRL

restricted
type: NamedIndividual
type: Licence category
conforms to: CLARIN licence category scheme
alternative label: RES

restricted access
type: NamedIndividual
type: Access rights statement
has identifier: omtdAccess1
comment: Access is subject to restrictions or controls regarding users (e.g., limited to researchers or members of a specific group) or use (e.g., for research only, noncommercial use, etc.); subscription or registration may also be required and access may incur financial costs

review
type: NamedIndividual
type: Text type
has identifier: ClarinEl TT017

role play
type: NamedIndividual
type: Scenario type

roundtable
type: NamedIndividual
type: Speech genre
has identifier: MS SG005

rule
type: NamedIndividual
type: Size unit

samples
type: NamedIndividual
type: Documentation type
comment: Value for 'DocumentationType' used for samples of a language resource

scene
type: NamedIndividual
type: Segmentation level

scholarly communication
type: NamedIndividual
type: Domain
has identifier: Clarin Domain006
comment: Scholarly communication can be defined as “the system through which research and other scholarly writings are created, evaluated for quality, disseminated to the scholarly community, and preserved for future use. The system includes both formal means of communication, such as publication in peer-reviewed journals, and informal channels, such as electronic listservs.” (Association of College & Research Libraries, “Principles and Strategies for the Reform of Scholarly Communication 1,” 2003)

school
type: NamedIndividual
type: Division category

Science
type: NamedIndividual
type: Domain
has identifier: DDC500

Scopus ID
type: NamedIndividual
type: Person identfier scheme
comment: Value for personIdentifierSchemeName, referring to the Scopus identifier for authors (https://www.scopus.com)

script
type: NamedIndividual
type: Text type
has identifier: ClarinEl TT010

Sculpture, Ceramics and Metalwork
type: NamedIndividual
type: Domain
has identifier: DDC730

second
type: NamedIndividual
type: Size unit

second
type: NamedIndividual
type: Duration unit

semantic class
type: NamedIndividual
type: Semantic type

semantic feature
type: NamedIndividual
type: Semantic type
alternative label: semantic trait

semantic relation
type: NamedIndividual
type: Semantic type

semantic role
type: NamedIndividual
type: Semantic type

semantic unit
type: NamedIndividual
type: Extratextual information unit

semantic unit
type: NamedIndividual
type: Size unit

semantics
type: NamedIndividual
type: Encoding level
comment: Value for 'EncodingLevel' for the particular linguistic level of analysis that relates to the meaning of a word, phrase, etc.

semi-interactive
type: NamedIndividual
type: Interactivity

semi-planned
type: NamedIndividual
type: Naturality

sentence
type: NamedIndividual
type: Segmentation level

sentence
type: NamedIndividual
type: Size unit

share alike
type: NamedIndividual
type: Condition of use
type: Set
comment: Value for 'ConditionOfUse' that states that the derivatives of the language resource must be distributed with the same or a compatible licence
permission:
  duty:
    action: ShareALike

shorten
type: NamedIndividual
type: Compression name

shot
type: NamedIndividual
type: Segmentation level

shot
type: NamedIndividual
type: Size unit

sign language
type: NamedIndividual
type: Modality type
comment: Value for 'ModalityType' for sign languages represented in a language resource

signal
type: NamedIndividual
type: Segmentation level

signed integer
type: NamedIndividual
type: Sign convention

single source
type: NamedIndividual
type: Scene illumination

sleep deprivation
type: NamedIndividual
type: Speech influence

SME
type: NamedIndividual
type: Organization legal status

Social Problems & Social Services
type: NamedIndividual
type: Domain
has identifier: DDC360

Social Sciences
type: NamedIndividual
type: Domain
has identifier: DDC300
comment: The social sciences are academic disciplines concerned with the study of the social life of human groups and individuals including anthropology, economics, geography, history, political science, psychology, social studies, and sociology. The social sciences consist of the scientific study of the human aspects of the world.[https://en.wikipedia.org/wiki/Category:Social_sciences

society
type: NamedIndividual
type: Organization legal status

Sociology & Anthropology
type: NamedIndividual
type: Domain
has identifier: DDC301

some
type: NamedIndividual
type: Audience

song
type: NamedIndividual
type: Audio genre
has identifier: MS AG004

sound
type: NamedIndividual
type: Non-speech item

Sound blaster card
type: NamedIndividual
type: Recording device type

sound recording
type: NamedIndividual
type: Extratextual information

source and executable code
type: NamedIndividual
type: Software distribution form
comment: Value for software distribution form, used for software that is available from the same location both as source code and executable program

source code
type: NamedIndividual
type: Software distribution form
comment: Value for software distribution form, used for software objects in the form of source code, i.e. as files with the commands ready to be compiled or assembled into an executable computer program

spatial constraint
type: NamedIndividual
type: Condition of use
comment: Value for 'ConditionsOfUse' which is used for resources with spatial restrictions, e.g., in cases where the content is available or can be used only at a single location, center, or site

speaker noise
type: NamedIndividual
type: Annotated element

special hardware equipment
type: NamedIndividual
type: Required hardware

speech
type: NamedIndividual
type: Audio genre
has identifier: MS AG003

spoken language
type: NamedIndividual
type: Modality type
comment: Value for 'ModalityType' for language resources including spoken language words and expressions

spontaneous
type: NamedIndividual
type: Naturality

Sports, Games & Entertainment
type: NamedIndividual
type: Domain
has identifier: DDC790

standardization body
type: NamedIndividual
type: Organization role

statistical property
type: NamedIndividual
type: Content type

Statistics
type: NamedIndividual
type: Domain
has identifier: DDC310

string
type: NamedIndividual
type: Parameter type

studio
type: NamedIndividual
type: Recording environment

studio equipment
type: NamedIndividual
type: Capturing device type

subcategorization frame
type: NamedIndividual
type: Syntactic type

submitted
type: NamedIndividual
type: Version type
comment: Value for 'Version type' used for versions as submitted for publication

subsidiary
type: NamedIndividual
type: Division category

subtitle
type: NamedIndividual
type: Text included in video

subtitle
type: NamedIndividual
type: Text included in image

subtitle
type: NamedIndividual
type: Text type
has identifier: ClarinEl TT015

syllable
type: NamedIndividual
type: Base item

syllable
type: NamedIndividual
type: Segmentation level

syllable
type: NamedIndividual
type: Size unit

synonym
type: NamedIndividual
type: Semantic type

synset
type: NamedIndividual
type: Size unit

syntactic unit
type: NamedIndividual
type: Extratextual information unit

syntactic unit
type: NamedIndividual
type: Size unit

syntactico-semantic link
type: NamedIndividual
type: Syntactico-semantic type

syntax
type: NamedIndividual
type: Encoding level
comment: Value for 'EncodingLevel' for the particular linguistic level that relates to the study of the structure of linguistic units (phrases, sentences)

system evaluator
type: NamedIndividual
type: Organization role

tagset
type: NamedIndividual
type: Compatible lexicon type
type: LCR subclass
comment: a flat list of valid values (tags) designed to annotate data; it usually corresponds to a specific annotation type or set of annotation types

VHS tape
type: NamedIndividual
type: Recording device type

terabyte
type: NamedIndividual
type: Size unit
alternative label: tb

technical report
type: NamedIndividual
type: Document type

technical text
type: NamedIndividual
type: Text type
has identifier: ClarinEl TT011

technological
type: NamedIndividual
type: Evaluation level

Technology
type: NamedIndividual
type: Domain
has identifier: DDC600

teenager
type: NamedIndividual
type: Age group

telecommunications
type: NamedIndividual
type: Domain
has identifier: ELG Domain004

telephone
type: NamedIndividual
type: Source channel

telephone conversation
type: NamedIndividual
type: Text type
has identifier: ClarinEl TT005

fixed telephone
type: NamedIndividual
type: Capturing device type

IP telephone
type: NamedIndividual
type: Capturing device type

mobile telephone
type: NamedIndividual
type: Capturing device type

tempo
type: NamedIndividual
type: Non-speech item

tense
type: NamedIndividual
type: Morphological type

term
type: NamedIndividual
type: Size unit

terminological resource
type: NamedIndividual
type: LCR subclass
comment: A lexical resource that lists concepts pertaining to a specific domain
alternative label: term list

text
type: NamedIndividual
type: Media type
comment: Value for 'MediaType' for the written or printed form of a language resource (part)

text
type: NamedIndividual
type: Size unit

numerical text
type: NamedIndividual
type: Media type

thesaurus
type: NamedIndividual
type: LCR subclass
comment: A reference work that lists words grouped together according to similarity of meaning (containing synonyms and sometimes antonyms) [https://en.wikipedia.org/wiki/Thesaurus]

parsing of titles
type: NamedIndividual
type: Language description task

token
type: NamedIndividual
type: Size unit

token
type: NamedIndividual
type: Segmentation level

training resource
type: NamedIndividual
type: Documentation type
comment: Value for 'DocumentationType' used for the training material of a resource (e.g., video tutorials, screencasts, guided tours, etc.)

training use
type: NamedIndividual
type: Condition of use
comment: Value for 'ConditionOfUse' which states that the resource can only be used for training purposes
note: add ODRL representation

phonetic transcription
type: NamedIndividual
type: Audio type

translation equivalent
type: NamedIndividual
type: Translation type

translation unit
type: NamedIndividual
type: Size unit
alternative label: tu

transport
type: NamedIndividual
type: Recording environment

Transportation
type: NamedIndividual
type: Domain
has identifier: DDC388

travel industry
type: NamedIndividual
type: Domain
has identifier: ELG Domain013

trigram
type: NamedIndividual
type: Size unit

TRL1
type: NamedIndividual
type: TRL
comment: Basic principles observed

TRL2
type: NamedIndividual
type: TRL
comment: Technology concept formulated

TRL3
type: NamedIndividual
type: TRL
comment: Experimental proof of concept

TRL4
type: NamedIndividual
type: TRL
comment: Technology validated in lab

TRL5
type: NamedIndividual
type: TRL
comment: Technology validated in relevant environment (industrially relevant environment in the case of key enabling technologies)

TRL6
type: NamedIndividual
type: TRL
comment: Technology demonstrated in relevant environment (industrially relevant environment in the case of key enabling technologies)

TRL7
type: NamedIndividual
type: TRL
comment: System prototype demonstration in operational environment

TRL8
type: NamedIndividual
type: TRL
comment: System complete and qualified

TRL9
type: NamedIndividual
type: TRL
comment: Actual system proven in operational environment (competitive manufacturing in the case of key enabling technologies; or in space)

troponym
type: NamedIndividual
type: Semantic type

truncation
type: NamedIndividual
type: Annotated element

turn
type: NamedIndividual
type: Size unit

tv
type: NamedIndividual
type: Source channel

tweet
type: NamedIndividual
type: Text type
has identifier: ClarinEl TT007

twitter
type: NamedIndividual
type: Social media account occupational type

typesystem
type: NamedIndividual
type: LCR subclass
comment: A set of elements designed to annotate data; it typically contains only a list of annotation types, i.e. specific labels that are used for the annotation (e.g., part-of-speech, person, organization, etc.), and is usually inbuilt in the annotation software

under negotiation
type: NamedIndividual
type: Availability
comment: For resources whose availability is still pending.

unigram
type: NamedIndividual
type: Size unit

unit
type: NamedIndividual
type: Size unit

unit
type: NamedIndividual
type: Division category

UNIX
type: NamedIndividual
type: operating system

unknown
type: NamedIndividual
type: Origin

unknown
type: NamedIndividual
type: Sex

unpublished
type: NamedIndividual
type: Document type

unsigned integer
type: NamedIndividual
type: Sign convention

unspecified
type: NamedIndividual
type: Funder identfier scheme
type: Organization identifier scheme
type: Person identfier scheme
type: Annotated element
type: Audio genre
type: Audio genre classification scheme
type: Audio quality measure included
type: Base item
type: Capturing device type
type: Compatible lexicon type
type: Compression name
type: Condition of use
type: Content type
type: Corpus subclass
type: Currency
type: Dataset distribution form
type: Division category
type: Document identifier scheme
type: Document type
type: Documentation type
type: Domain
type: Domain classification scheme
type: Encoding level
type: Extratextual information
type: Extratextual information unit
type: Framework
type: Funding type
type: Grammatical phenomena coverage
type: Image genre classification scheme
type: Interactivity
type: LCR subclass
type: Language description task
type: LR identifier scheme
type: Language variety type
type: Licence identifier scheme
type: Membership institution
type: Metadata record identifier scheme
type: Metric
type: Modality type
type: Multilinguality type
type: Naturality
type: Non-speech item
type: operating system
type: Organization legal status
type: Organization role
type: Parameter type
type: Processing resource type
type: Project identifier scheme
type: Recording device type
type: Recording environment
type: Repository identifier scheme
type: Required hardware
type: Scenario type
type: Scene illumination
type: Segmentation level
type: Signal encoding
type: Size unit
type: Social media account occupational type
type: Software distribution form
type: Source channel
type: Source channel type
type: Speech genre
type: Speech genre classification scheme
type: Speech influence
type: Speech item
type: Standard/Best practice
type: Subject classification scheme
type: Support type
type: Text genre
type: Text genre classification scheme
type: Text type
type: Text type classification scheme
type: Video genre classification scheme
type: Vocal tract condition
type: Web service type
comment: Value used for mandatory elements whose value is unknown or cannot be specified

updated
type: NamedIndividual
type: Version type
comment: Value for 'Version type' used for versions that have been updated vis-a-vis the previous published version

url
type: NamedIndividual
type: Parameter type

usage
type: NamedIndividual
type: Evaluation level

user identified
type: NamedIndividual
type: Condition of use
comment: Value for 'ConditionOfUse' which states that the resource can only be accessed by identified/authenticated users

user input text
type: NamedIndividual
type: Processing resource type

user manual
type: NamedIndividual
type: Documentation type
comment: Value for 'Documentation type' for documents that include instructions and examples on the usage of a tool/service (or resource in general)

utterance
type: NamedIndividual
type: Segmentation level

utterance
type: NamedIndividual
type: Size unit

variable
type: NamedIndividual
type: Scene illumination

variant
type: NamedIndividual
type: Lemma type

VCV sequence
type: NamedIndividual
type: Speech item

vector
type: NamedIndividual
type: Raster or vector graphics

very high
type: NamedIndividual
type: Recording quality

very high
type: NamedIndividual
type: Quality

very low
type: NamedIndividual
type: Recording quality

very low
type: NamedIndividual
type: Quality

video
type: NamedIndividual
type: Media type
comment: Value for 'Media type' for the audiovisual form of a language resource (part)

video
type: NamedIndividual
type: Extratextual information

voice
type: NamedIndividual
type: Modality type
comment: Value for 'ModalityType' for voice

voice
type: NamedIndividual
type: Morphological type

webcam
type: NamedIndividual
type: Source channel

web service
type: NamedIndividual
type: Software distribution form
comment: Value for software distribution form, used for software objects that can be accessed through remote invocation typically using some REST-style APIs or SOAP protocols

webcam
type: NamedIndividual
type: Capturing device type

whole body
type: NamedIndividual
type: Body part

Windows
type: NamedIndividual
type: operating system

windows-1250
type: NamedIndividual
type: Character encoding

windows-1251
type: NamedIndividual
type: Character encoding

windows-1252
type: NamedIndividual
type: Character encoding

windows-1253
type: NamedIndividual
type: Character encoding

windows-1254
type: NamedIndividual
type: Character encoding

windows-1255
type: NamedIndividual
type: Character encoding

windows-1256
type: NamedIndividual
type: Character encoding

windows-1257
type: NamedIndividual
type: Character encoding

windows-1258
type: NamedIndividual
type: Character encoding

windows-31j
type: NamedIndividual
type: Character encoding

wizard of Oz
type: NamedIndividual
type: Scenario type

word
type: NamedIndividual
type: Base item

word
type: NamedIndividual
type: Segmentation level

word
type: NamedIndividual
type: Extratextual information unit

word
type: NamedIndividual
type: Size unit

word game
type: NamedIndividual
type: Scenario type

word group
type: NamedIndividual
type: Segmentation level

WordNet
type: NamedIndividual
type: Compatible lexicon type
type: LCR subclass
type: Standard/Best practice
comment: A lexical database originally created for English and extended to other languages, which groups words into sets of synonyms called synsets, provides short definitions and usage examples, and records a number of relations among these synonym sets or their members

wordlist
type: NamedIndividual
type: Compatible lexicon type
type: LCR subclass
comment: A written collection of all words derived from a particular source, or sharing some other characteristic [https://www.yourdictionary.com/wordlist]

workflow file
type: NamedIndividual
type: Software distribution form
comment: Value for software distribution form, used for software workflows that are made available in the form of the workflow description file

written language
type: NamedIndividual
type: Modality type
comment: Value for 'ModalityType' for texts with written language

x-EUC-CN
type: NamedIndividual
type: Character encoding

x-EUC-JP-LINUX
type: NamedIndividual
type: Character encoding

x-EUC-TW
type: NamedIndividual
type: Character encoding

x-MS950-HKSCS
type: NamedIndividual
type: Character encoding

x-mswin-936
type: NamedIndividual
type: Character encoding

x-windows-949
type: NamedIndividual
type: Character encoding

x-windows-950
type: NamedIndividual
type: Character encoding

yes
type: NamedIndividual
type: Speaking impairment of participants

yes
type: NamedIndividual
type: Hearing impairment of participants

yes/no question
type: NamedIndividual
type: Speech item

youtube
type: NamedIndividual
type: Social media account occupational type

4:2:2
type: NamedIndividual
type: Colour space

LicenseInfo
comment: Links a resource to the licence under which it is distributed; values are taken from a list of standard licences

Available Through Other Distributor
replaces: notAvailableThroughMetashare
comment: For resources that are documented in the catalogue but the contents of which can only be accessed through other distribution channels.

licenseInfo
comment: Links a resource to the licence under which it is distributed; values are taken from a list of standard licences

Copyright Not Evaluated

Copyright Undetermined

embargoed access
comment: Embargoed access refers to a resource that is metadata only access until released for open access on a certain date. Embargoes can be required by publishers and funders policies, or set by the author (e.g such as in the case of theses and dissertations).

In Copyright

In Copyright - EU Orphan Work

In Copyright - Educational Use Permitted

In Copyright - Non-Commercial Use Permitted

In Copyright - Rights-holder(s) Unlocatable or Unidentifiable

metadata only access
comment: Metadata only access refers to a resource in which access is limited to metadata only. The resource itself is described by the metadata, but neither is directly available through the system or platform nor can be referenced to an open access copy in an external journal or trustworthy archive.

No Copyright - Other Known Legal Restrictions

No Copyright - Contractual Restrictions

No Copyright - Non-Commercial Use Only

No Copyright - United States

No Known Copyright

open access
comment: Open access refers to a resource that is immediately and permanently online, and free for all on the Web, without financial and technical barriers.The resource is either stored in the repository or referenced to an external journal or trustworthy archive.

restricted access
comment: Restricted access refers to a resource that is available in a system but with some type of restriction for full open access. This type of access can occur in a number of different situations. Some examples are described below: The user must log-in to the system in order to access the resource The user must send an email to the author or system administrator to access the resource Access to the resource is restricted to a specific community (e.g., limited to a university community)