Funder identfier scheme
type: Class
comment: The name of the scheme used to identify a funder
subclass of: AgentIdentifierScheme

Organization identifier
type: Class
comment: A string used to uniquely identify an organization
subclass of: AgentIdentifier
subclass of: Restriction
  all values from: Organization identifier scheme
  on property: uses identifier scheme
alternative label: Organisation identifier

Organization identifier scheme
type: Class
comment: The name of the scheme used to identify an organization
subclass of: AgentIdentifierScheme

Person identifier
type: Class
comment: A string (e.g., PID, DOI, internal to an organization, etc.) used to uniquely identify a person
subclass of: AgentIdentifier
subclass of: Restriction
  all values from: Person identfier scheme
  on property: uses identifier scheme

Person identfier scheme
type: Class
comment: The name of the scheme used to identify a person
subclass of: AgentIdentifierScheme

Resource identifier scheme
type: Class
comment: The name of the scheme used to identify a resource
subclass of: IdentifierScheme

ARK
type: Document identifier scheme
type: LR identifier scheme
type: NamedIndividual
comment: Archival Resource Key

ArXiv
type: Document identifier scheme
type: LR identifier scheme
type: NamedIndividual
comment: Identifier for ArXiv (http://arxiv.org/), a open access repository of preprints, having the format arXiv:1207.2147.

bibcode
type: Document identifier scheme
type: LR identifier scheme
type: NamedIndividual
comment: It is the Astrophysics Data System bibliographic codes, a standardized 19 character identifier according to the syntax "yyyyjjjjjvvvvmppppa".

DOI
type: Organization identifier scheme
type: Document identifier scheme
type: LR identifier scheme
type: NamedIndividual
comment: Digital Object Identifier scheme (https://www.doi.org/)

Handle
type: Document identifier scheme
type: LR identifier scheme
type: Metadata record identifier scheme
type: Repository identifier scheme
type: NamedIndividual
comment: the Handle system

has identifier
type: ObjectProperty
comment: Associates an entity to an identifier, i.e. a string used to uniquely identify it
domain: Thing
range: Identifier

ISBN
type: Document identifier scheme
type: LR identifier scheme
type: NamedIndividual
comment: International Standard Book Number

OpenID
type: Person identfier scheme
type: NamedIndividual
comment: OpenID is an open standard that describes how users can be authenticated in a decentralized manner, eliminating the need for centralized registration services.

ORCID
type: Person identfier scheme
type: NamedIndividual
comment: Open Researcher and Contributor Identifier.

PURL
type: Document identifier scheme
type: LR identifier scheme
type: Metadata record identifier scheme
type: NamedIndividual
comment: Persistent Uniform Resource Locator

ResearcherID
type: Person identfier scheme
type: NamedIndividual
comment: ResearcherID is an identifying system for scientific authors created and owned by Thomson Reuters.

UPC
type: Document identifier scheme
type: LR identifier scheme
type: NamedIndividual
comment: Universal Product Code

URL
type: Document identifier scheme
type: LR identifier scheme
type: Metadata record identifier scheme
type: NamedIndividual
comment: Uniform Resource Locator

URN
type: Document identifier scheme
type: LR identifier scheme
type: Metadata record identifier scheme
type: NamedIndividual
comment: Uniform Resource Name

uses identifier scheme
type: ObjectProperty
comment: Indicates the scheme used to provide the identifier for an entity
domain: Identifier
range: IdentifierScheme

META-SHARE ontology
description: Meta-Share ontology v2. The ontology caters for the description of Language resources (corpora, lexical/conceptual resources, models, grammars, etc. and language processing tools and services) for Language Technology needs. It is also related to the OMTD-SHARE ontology (http://w3id.org/meta-share/omtd-share/) which caters for specific features (LT operation/area, data format, method, annotation type).
creator: john.mccr.ae
creator: Dimitris Galanis
creator: John P. McCrae
creator: Jorge Gracia
creator: Katerina Gkirtzou
creator: Marta Villegas
creator: Penny Labropoulou
creator: Philipp Cimiano
creator: Victor Rodriguez Doncel
license: cc-by4.0
modified: 2020-03-20
preferred namespace prefix: ms
preferred namespace uri: http://w3id.org/meta-share/meta-share/
type: NamedIndividual
type: Ontology
prior version: ontology
prior version: MetaShareRights.ttl#
version IRI: http://w3id.org/meta-share/meta-share/2.0.0
version info: v2.0.0 pre-release

Copyright Not Evaluated

Copyright Undetermined

embargoed access
comment: Embargoed access refers to a resource that is metadata only access until released for open access on a certain date. Embargoes can be required by publishers and funders policies, or set by the author (e.g such as in the case of theses and dissertations).

In Copyright

In Copyright - EU Orphan Work

In Copyright - Educational Use Permitted

In Copyright - Non-Commercial Use Permitted

In Copyright - Rights-holder(s) Unlocatable or Unidentifiable

metadata only access
comment: Metadata only access refers to a resource in which access is limited to metadata only. The resource itself is described by the metadata, but neither is directly available through the system or platform nor can be referenced to an open access copy in an external journal or trustworthy archive.

No Copyright - Other Known Legal Restrictions

No Copyright - Contractual Restrictions

No Copyright - Non-Commercial Use Only

No Copyright - United States

No Known Copyright

open access
comment: Open access refers to a resource that is immediately and permanently online, and free for all on the Web, without financial and technical barriers.The resource is either stored in the repository or referenced to an external journal or trustworthy archive.

restricted access
comment: Restricted access refers to a resource that is available in a system but with some type of restriction for full open access. This type of access can occur in a number of different situations. Some examples are described below: The user must log-in to the system in order to access the resource The user must send an email to the author or system administrator to access the resource Access to the resource is restricted to a specific community (e.g., limited to a university community)

4:2:2
type: Colour space
type: NamedIndividual

ADPCM
type: Signal encoding
type: NamedIndividual
alternative label: Adaptive differential pulse-code modulation

ANC domain classification system
type: Domain classification scheme
type: NamedIndividual
alternative label: American National Corpus domain classification system

ANC genre classification scheme
type: Text genre classification scheme
type: NamedIndividual
alternative label: American National Corpus genre classification scheme

ART
type: Metric
type: NamedIndividual
alternative label: Average Response Time

Access rights statement
type: Class
comment: A formal statement indicative of licensing terms for the use of a resource (e.g., open access, free to read, etc.); its semantics should be clear, preferably formally expressed and documented at a URL
subclass of: Restriction
  all values from: Access rights statement identifier
  on property: has identifier

Access rights statement identifier
type: Class
comment: A string used to uniquely identify an access rights statement according to a specific scheme
subclass of: Identifier
subclass of: Restriction
  all values from: Access rights statement scheme
  on property: conforms to

Access rights statement scheme
type: Class
comment: The name of the scheme according to which an access rights statement is assigned to a distribution
subclass of: Classification scheme

Actor
type: Class
comment: A person, organization or group that participates in an event or process
subclass of: type of described entity
subclass of: Agent
note: Changed to subclass of foaf:agent because according to its definition (An agent (eg. person, group, software or physical artifact)), it might include entities that we do not consider at this time actors

Actual use
type: Class
comment: Any activity where a language resource has been used (e.g., in a project, in an experiment, for a publication, etc.)

Address
type: Class
comment: The physical address of an organization, group or person expressed in the form of distinct elements (street address, zip code, city, etc.)

Affiliation
type: Class
comment: Information the organization that a person works for (e.g., a company) or is affiliated with (e.g., university, etc.) and the data that are specific to this relation (e.g., position, professional contact information, etc.)

Age group
type: Class
comment: The age group to which the participant belongs

AlvisNLP
type: Framework
type: NamedIndividual

Annotated element
type: Class
comment: A type of element that can be annotated and may differ depending on the annotation level

Annotation
type: Class
comment: The part of a corpus that contains annotations (interpretative linguistic information grounded in a knowledge resource that is added manually or automatically to a text or corpus respectively)

Application
type: Class
comment: Any software program (or group of programs seen as a whole) intended for the end-user and addressing one or multiple related user needs.
subclass of: Language Technology tool/service

Audience
type: Class
comment: Indication of the intended audience size of a multimedia resource

Detailed audio format
type: Class
comment: The format of the audio part of a multimedia resource

Audio genre
type: Class
comment: A classification of audio parts based on extra-linguistic and internal linguistic criteria and reflected on the audio style, form or content
subclass of: Genre
subclass of: Restriction
  all values from: Audio genre identifier
  on property: has identifier
subclass of: Restriction
  all values from: Corpus audio part
  on property: genre

Audio genre classification scheme
type: Class
comment: A classification scheme devised for audio genres by an organization/authority
subclass of: Classification scheme

Audio genre identifier
type: Class
comment: A string used to uniquely identify an audio genre according to a specific classification scheme
subclass of: Identifier
subclass of: Restriction
  all values from: Audio genre classification scheme
  on property: conforms to

Audio quality measure included
type: Class
comment: The audio quality measures included in audio format

Audio type
type: Class
comment: A type of content included in a language resource pertaining to the audio level
subclass of: Content type

Availability
type: Class
comment: Availability status of the resource; conditionsOfUse can be further used to indicate the specific terms of availability
note: Is there a point of keeping it? makes sense only for "under negotiation" and 'availableThroughOtherDistributors' [change the value]; maybe also "availableThroughOwnerOnly"???

BML
has URL: http://www.mindmakers.org/projects/bml-1-0/wiki#Introduction
type: Standard/Best practice
type: NamedIndividual
alternative label: Behavior Markup Language
alternative label: Behaviour Markup Language

BNC domain classification system
type: Domain classification scheme
type: NamedIndividual
alternative label: British National Corpus domain classification system

BNC text type classification scheme
type: Text type classification scheme
type: NamedIndividual

Base item
type: Class
comment: Type of item that is represented in the n-gram resource

Big5
type: Character encoding
type: NamedIndividual

Big5-HKSCS
type: Character encoding
type: NamedIndividual

Big5_Solaris
type: Character encoding
type: NamedIndividual

Body part
type: Class
comment: The body parts visible in the video or image part of the resource

Byte order
type: Class
comment: The byte order of 2 or more bytes sample

CD-ROM
type: Dataset distribution form
type: NamedIndividual
comment: CD-ROM refers to a kind of distribution medium used for delivering a language resource; intended for resources delivered on CD-ROM

CDMA
type: Source channel type
type: NamedIndividual

CES
has URL: https://www.cs.vassar.edu/CES/
type: Standard/Best practice
type: NamedIndividual
alternative label: Corpus Encoding Standard

CMYK
type: Colour space
type: NamedIndividual

COAR Rights Statement Scheme
type: Access rights statement scheme
type: NamedIndividual
comment: COAR access rights vocabulary (http://vocabularies.coar-repositories.org/documentation/access_rights/)

CORE
type: Metadata record identifier scheme
type: NamedIndividual

Caffe
type: Framework
type: NamedIndividual

Capturing device type
type: Class
comment: The type of transducers through which the data is captured

Capturing environment
type: Class
comment: The type of the capturing environment in terms of complexity

Character encoding
type: Class
comment: The name of the character encoding used in the resource or accepted by the tool/service

CLARIN_EL text type classification scheme
type: Text type classification scheme
type: NamedIndividual

CLARIN-EL domain classification
type: Domain classification scheme
type: NamedIndividual

CLARIN licence category scheme
type: Licence category scheme
type: NamedIndividual

Classification
type: Class
comment: A type of classifying (arranging in groups/categories) language resources

Classification scheme
type: Class
comment: Scheme used for the classification of a language resource based on various criteria (e.g., domains, text types, genres, etc.)

Colour space
type: Class
comment: The colour space for the video and image part(s) of a resource

Compatible lexicon type
type: Class
comment: A classification into types for lexical lexicon that can be used with the grammar being described

Component
type: Class
comment: A piece of software typically intended for a specific technical purpose, such as a particular implementation of a part-of-speech tagger (e.g TreeTagger), a tree parsing program (e.g., mstparser), etc. It is wrapped in a standard way within a particular component-oriented framework such as UIMA, GATE, etc. or as a specific type of web service.
subclass of: Language Technology tool/service

Compression name
type: Class
comment: The name of the compression applied

Condition of use
replaces: restrictionsOfUse
type: Class
comment: A condition imposed via a specified licence on the use of a language resource (e.g., non-commercial use, no derivatives, etc.)

Content type
type: Class
comment: A more detailed account of the linguistic information contained in the lexical/conceptual resource
note: could we organise them hierarchically? for those that are used for annotation, align with annotationType values? or can we use annotationType together with these values as range for the property? add definitions to all instances

Conversational type
type: Class
comment: Classification of the conversation included in a multimedia resource based on the number of participants

Corpus
type: Class
comment: A structured collection of pieces of data (textual, audio, video, multimodal/multimedia, etc.) typically of considerable size and selected according to criteria external to the data (e.g., size, type of language, type of text producers or expected audience, etc.) to represent as comprehensively as possible the object of study
subclass of: Data language resource
subclass of: Restriction
  all values from: Dataset distribution
  on property: distribution

Corpus audio part
type: Class
comment: The part of a corpus (or whole corpus) that consists of audio segments
subclass of: Corpus part

Corpus image part
type: Class
comment: The part of a corpus (or whole corpus) that consists of images (e.g., g a corpus of photographs and their captions)
subclass of: Corpus part

Corpus part
type: Class
comment: A part/segment of a corpus based on its media type classification
subclass of: Media part

Corpus subclass
type: Class
comment: A classification of corpora into types (used for descriptive reasons)

Corpus text numerical part
type: Class
comment: The part of a corpus (or whole corpus) that consists of sets of textual representations of measurements and observations linked to sensorimotor recordings
subclass of: Corpus part

Corpus text part
type: Class
comment: The part of a corpus (or a whole corpus) that consists of textual segments (e.g., a corpus of publications, or transcriptions of an oral corpus, or subtitles, etc.)
subclass of: Corpus part

Corpus video part
type: Class
comment: The part of a corpus (or whole corpus) that consists of video files (e.g., a corpus of film documentaries)
subclass of: Corpus part

Cost
type: Class
comment: The cost for accessing a resource formally desribed as a set of amount and currency unit

Country
type: Class
comment: The name of a country preferrably according to ISO 639
note: add here the dataset from EU NAL

Cp037
type: Character encoding
type: NamedIndividual

Cp1006
type: Character encoding
type: NamedIndividual

Cp1025
type: Character encoding
type: NamedIndividual

Cp1026
type: Character encoding
type: NamedIndividual

Cp1046
type: Character encoding
type: NamedIndividual

Cp1047
type: Character encoding
type: NamedIndividual

Cp1097
type: Character encoding
type: NamedIndividual

Cp1098
type: Character encoding
type: NamedIndividual

Cp1112
type: Character encoding
type: NamedIndividual

Cp1122
type: Character encoding
type: NamedIndividual

Cp1123
type: Character encoding
type: NamedIndividual

Cp1124
type: Character encoding
type: NamedIndividual

Cp1140
type: Character encoding
type: NamedIndividual

Cp1141
type: Character encoding
type: NamedIndividual

Cp1142
type: Character encoding
type: NamedIndividual

Cp1143
type: Character encoding
type: NamedIndividual

Cp1144
type: Character encoding
type: NamedIndividual

Cp1145
type: Character encoding
type: NamedIndividual

Cp1146
type: Character encoding
type: NamedIndividual

Cp1147
type: Character encoding
type: NamedIndividual

Cp1148
type: Character encoding
type: NamedIndividual

Cp1149
type: Character encoding
type: NamedIndividual

Cp1381
type: Character encoding
type: NamedIndividual

Cp1383
type: Character encoding
type: NamedIndividual

Cp273
type: Character encoding
type: NamedIndividual

Cp277
type: Character encoding
type: NamedIndividual

Cp278
type: Character encoding
type: NamedIndividual

Cp280
type: Character encoding
type: NamedIndividual

Cp284
type: Character encoding
type: NamedIndividual

Cp285
type: Character encoding
type: NamedIndividual

Cp297
type: Character encoding
type: NamedIndividual

Cp33722
type: Character encoding
type: NamedIndividual

Cp420
type: Character encoding
type: NamedIndividual

Cp424
type: Character encoding
type: NamedIndividual

Cp437
type: Character encoding
type: NamedIndividual

Cp500
type: Character encoding
type: NamedIndividual

Cp737
type: Character encoding
type: NamedIndividual

Cp775
type: Character encoding
type: NamedIndividual

Cp838
type: Character encoding
type: NamedIndividual

Cp850
type: Character encoding
type: NamedIndividual

Cp852
type: Character encoding
type: NamedIndividual

Cp855
type: Character encoding
type: NamedIndividual

Cp856
type: Character encoding
type: NamedIndividual

Cp857
type: Character encoding
type: NamedIndividual

Cp858
type: Character encoding
type: NamedIndividual

Cp860
type: Character encoding
type: NamedIndividual

Cp861
type: Character encoding
type: NamedIndividual

Cp862
type: Character encoding
type: NamedIndividual

Cp863
type: Character encoding
type: NamedIndividual

Cp864
type: Character encoding
type: NamedIndividual

Cp865
type: Character encoding
type: NamedIndividual

Cp866
type: Character encoding
type: NamedIndividual

Cp868
type: Character encoding
type: NamedIndividual

Cp869
type: Character encoding
type: NamedIndividual

Cp870
type: Character encoding
type: NamedIndividual

Cp871
type: Character encoding
type: NamedIndividual

Cp874
type: Character encoding
type: NamedIndividual

Cp875
type: Character encoding
type: NamedIndividual

Cp918
type: Character encoding
type: NamedIndividual

Cp921
type: Character encoding
type: NamedIndividual

Cp922
type: Character encoding
type: NamedIndividual

Cp930
type: Character encoding
type: NamedIndividual

Cp933
type: Character encoding
type: NamedIndividual

Cp935
type: Character encoding
type: NamedIndividual

Cp937
type: Character encoding
type: NamedIndividual

Cp939
type: Character encoding
type: NamedIndividual

Cp942
type: Character encoding
type: NamedIndividual

Cp942C
type: Character encoding
type: NamedIndividual

Cp943
type: Character encoding
type: NamedIndividual

Cp943C
type: Character encoding
type: NamedIndividual

Cp948
type: Character encoding
type: NamedIndividual

Cp949
type: Character encoding
type: NamedIndividual

Cp949C
type: Character encoding
type: NamedIndividual

Cp950
type: Character encoding
type: NamedIndividual

Cp964
type: Character encoding
type: NamedIndividual

Cp970
type: Character encoding
type: NamedIndividual

Currency
type: Class
comment: Any system of money used in a particular country

DAT
type: Recording device type
type: NamedIndividual

DDC384
conforms to: DDC
type: Domain identifier
type: NamedIndividual

DDC388
conforms to: DDC
type: Domain identifier
type: NamedIndividual

DDC630
conforms to: DDC
type: Domain identifier
type: NamedIndividual

DDC659
conforms to: DDC
type: Domain identifier
type: NamedIndividual

DDC
has URL: https://www.oclc.org/en/dewey/resources/summaries.html
type: Domain classification scheme
type: NamedIndividual
alternative label: Dewey Decimal Classification

DK-5
has URL: http://metadata.dk/dk5-as-linked-data
type: Domain classification scheme
type: NamedIndividual
alternative label: Danish Decimal Classification 5th edition

DVB-C
type: Source channel type
type: NamedIndividual

DVB-S
type: Source channel type
type: NamedIndividual

DVB-T
type: Source channel type
type: NamedIndividual

DVD-R
type: Dataset distribution form
type: NamedIndividual
comment: Value for data distribution medium, used for language resources delivered on a DVD-R

Data language resource
type: Class
comment: A resource composed of linguistic material used to assist and augment language processing applications, but also, in a broader sense, in language and language-mediated research studies and applications; examples include data sets (textual, multimodal/multimedia and lexical data, grammars, language models, etc.) in machine readable form
subclass of: Language Resource

Dataset distribution
type: Class
comment: Any form with which a dataset is distributed, such as a downloadable form in a specific format (e.g., spreadsheet, plain text, etc.) or an API with which it can be accessed
subclass of: Distribution
subclass of: Restriction
  all values from: Dataset distribution form
  on property: distribution form

Dataset distribution form
type: Class
comment: The form (medium/channel) used for distributing a language resource consisting of data (e.g., a corpus, a lexicon, etc.)
subclass of: Distribution form

type of described entity
type: Class
comment: The (type of) entity that is being described by a metadata record

Distribution
type: Class
comment: Any form with which a language resource is distributed; for software, this can refer to web services, executable or code files, etc.; for datasets, it can be a downloadable form in a specific format (e.g., spreadsheet, plain text, etc.) or an API with which it can be accessed

Audio feature
type: Class
comment: A feature that can be used for describing distinct distributable forms of audio resources/parts

Distribution form
type: Class
comment: Τhe form used for distributing (delivering or providing access) to the resource

Image feature
type: Class
comment: A feature that can be used for describing distinct distributable forms of image resources/parts

Text feature
type: Class
comment: A feature that can be used for describing distinct distributable forms of text resources/parts

Numerical text feature
type: Class
comment: A feature that can be used for describing distinct distributable forms of numerical text resources/parts

Video feature
type: Class
comment: A feature that can be used for describing distinct distributable forms of video resources/parts

Division
type: Class
comment: Section of a larger organization (e.g., school, faculty, department of a university, department or branch of a company, etc.)

Division category
type: Class
comment: A controlled vocabulary used for classifying divisions

Document
type: Class
comment: A piece of written, printed, or electronic matter that is primarily intended for reading
subclass of: type of described entity

Document identifier
type: Class
comment: A string (e.g., PID, DOI, internal to an organization, etc.) used to uniquely identify a document (mainly intended for published documents)
subclass of: ResourceIdentifier
subclass of: Restriction
  all values from: Document identifier scheme
  on property: uses identifier scheme

Document identifier scheme
type: Class
comment: A scheme according to which an identifier is assigned by the authority that issues it (e.g., DOI, PubMed Central, etc.) specifically for publications
subclass of: Resource identifier scheme

Document type
type: Class
comment: A classification vocabulary for documents (e.g., article, book, etc.)

Documentation type
type: Class
comment: The type of the documentation vis-a-vis its relation with the language resource (e.g., general publication, user manual, etc.)

Domain
type: Class
comment: A particular field of thought, activity, or interest related to a language resource, organization or person activities, etc.
subclass of: Classification
subclass of: Restriction
  all values from: Domain identifier
  on property: has identifier
example: health, law, banking, ...
note: Adapted from https://www.collinsdictionary.com/dictionary/english/domain

Domain classification scheme
type: Class
comment: A classification scheme devised by an authority for domains
subclass of: Classification scheme

Domain identifier
type: Class
comment: A string used to uniquely identify a domain according to a specific classification scheme
subclass of: Identifier
subclass of: Restriction
  all values from: Domain classification scheme
  on property: conforms to

Duration of audio
type: Class
comment: The time that an audio or video recording, etc. lasts

Duration unit
type: Class
comment: A unit for measuring duration of audio / video parts

Dynamic element
type: Class
comment: Element represented in the video part of a resource

EAGLES
has URL: http://www.ilc.cnr.it/EAGLES/browse.html
type: Standard/Best practice
type: NamedIndividual

ELG-SHARE
type: Standard/Best practice
type: NamedIndividual

ELG domain classification
type: Domain classification scheme
type: NamedIndividual

ELRA
type: Membership institution
type: NamedIndividual
comment: European Language Resources Association (www.elra.eu)

EMA
type: Source channel
type: NamedIndividual

EmotionML
has URL: https://www.w3.org/TR/2009/WD-emotionml-20091029/
type: Standard/Best practice
type: NamedIndividual
alternative label: EML
alternative label: Emotion Markup Language

EMMA
has URL: https://www.w3.org/TR/emma/
type: Standard/Best practice
type: NamedIndividual
alternative label: Extensible MultiModal Annotation markup language

EUC-JP
type: Character encoding
type: NamedIndividual

EUC-KR
type: Character encoding
type: NamedIndividual

EUROVOC
has URL: https://eur-lex.europa.eu/browse/eurovoc.html
type: Domain classification scheme
type: NamedIndividual

Encoding level
type: Class
comment: The linguistic level of analysis a lexical/conceptual resource or language description caters for as represented in its contents

Evaluation
type: Class
comment: Each of the procedures and outcomes followed for evaluating the performance and other features of a tool/service

Evaluation criterion
type: Class
comment: The criterion of the evaluation of a tool

Evaluation level
type: Class
comment: The evaluation level

Evaluation measure
type: Class
comment: The evaluation measure (human or automatic)

Evaluation type
type: Class
comment: Indicates the type of evaluation performed on a tool/service

Extratextual information
type: Class
comment: The non-textual information contained in a lexical/conceptual resouce (e.g., images, videos, audios, etc.); it can be used as an alternative to fully describing them as a proper part of the resource when they are not as important as the textual part (e.g., cases of a dictionary with images attached to some lemmas)

Extratextual information unit
type: Class
comment: The unit on which the extratextual information in a lexical/conceptual resource is attached

Framework
type: Class
comment: The implementation framework used for developing and running a tool/service

Funding type
type: Class
comment: A classification of the funding of a project with regard to the source of the funds

GATE
type: Framework
type: NamedIndividual

GB18030
type: Character encoding
type: NamedIndividual

GBK
type: Character encoding
type: NamedIndividual

GMX
has URL: https://xtm.cloud/manuals/gmx-v/GMX-V-2.0.html
type: Standard/Best practice
type: NamedIndividual
alternative label: Global information management Metrics eXchange

GSM
type: Source channel type
type: NamedIndividual

Galaxy
type: Framework
type: NamedIndividual

Genre
type: Class
comment: A way of classifying a language resource with regard to the style, form and content
subclass of: Classification

GrAF
has URL: http://www.xces.org/ns/GrAF/1.0/
type: Standard/Best practice
type: NamedIndividual
alternative label: Graph Annotation Framework

Grammar
type: Class
comment: A set of rules governing what strings are valid or allowable in a language or text [https://en.oxforddictionaries.com/definition/grammar]
subclass of: Language description

Grammatical phenomena coverage
type: Class
comment: An indication of the grammatical phenomena covered by the grammar

Group
type: Class
comment: A set of persons related to some aspect of a language resource, that do not have a legal status (e.g., a group of software developers working on the same software)

Group identifier
type: Class
comment: A string used to uniquely identify a group
subclass of: AgentIdentifier
subclass of: Restriction
  all values from: Organization identifier scheme
  on property: uses identifier scheme

H2O
type: Framework
type: NamedIndividual

HD.1080
type: Resolution standard
type: NamedIndividual

HD.720
type: Resolution standard
type: NamedIndividual

HamNoSys
has URL: https://www.sign-lang.uni-hamburg.de/dgs-korpus/index.php/hamnosys-97.html
type: Standard/Best practice
type: NamedIndividual
alternative label: Hamburg Sign Language Notation System

Hearing impairment of participants
type: Class
comment: Whether the group of participants contains persons with hearing impairments

ISCII91
type: Character encoding
type: NamedIndividual

ISDN
type: Source channel type
type: NamedIndividual

ISO-2022-JP
type: Character encoding
type: NamedIndividual

ISO-2022-KR
type: Character encoding
type: NamedIndividual

ISO-8859-1
type: Character encoding
type: NamedIndividual

ISO-8859-15
type: Character encoding
type: NamedIndividual

ISO-8859-2
type: Character encoding
type: NamedIndividual

ISO-8859-3
type: Character encoding
type: NamedIndividual

ISO-8859-4
type: Character encoding
type: NamedIndividual

ISO-8859-5
type: Character encoding
type: NamedIndividual

ISO-8859-6
type: Character encoding
type: NamedIndividual

ISO-8859-7
type: Character encoding
type: NamedIndividual

ISO-8859-8
type: Character encoding
type: NamedIndividual

ISO-8859-9
type: Character encoding
type: NamedIndividual

ISO-8860-13
type: Character encoding
type: NamedIndividual

ISO12620
has URL: http://www.datcatinfo.net/#/
has URL: http://www.iso.org/sites/dcr-redirect/dcr.html
type: Standard/Best practice
type: NamedIndividual
alternative label: DCR
alternative label: Data Category Repository

ISO16642
has URL: http://xml.coverpages.org/ISO16642-200207.pdf
type: Standard/Best practice
type: NamedIndividual
alternative label: TMF
alternative label: Terminological Markup Framework

ISO 9001:1987
type: Standard/Best practice
type: NamedIndividual
comment: Quality systems -- Model for quality assurance in design/development, production, installation and servicing

ISO2022_CN_CNS
type: Character encoding
type: NamedIndividual

ISO2022_CN_GB
type: Character encoding
type: NamedIndividual

ISO 26162
has URL: https://www.iso.org/standard/43427.html
type: Standard/Best practice
type: NamedIndividual
alternative label: Systems to manage terminology, knowledge and content

ISO 30042
has URL: https://www.iso.org/standard/45797.html
type: Standard/Best practice
type: NamedIndividual
alternative label: TBX
alternative label: TermBase eXchange

ISO704
has URL: https://www.iso.org/standard/38109.html
type: Standard/Best practice
type: NamedIndividual
alternative label: Terminology work

Detailed image format
type: Class
comment: The format used for the image part of a resource

Image genre
type: Class
comment: A category of images characterized by a particular style, form, or content according to a specific classification scheme
subclass of: Genre
subclass of: Restriction
  all values from: Image genre identifier
  on property: has identifier
subclass of: Restriction
  all values from: Corpus image part
  on property: genre

Image genre classification scheme
type: Class
comment: A classification scheme devised by an authority for image genres
subclass of: Classification scheme

Image genre identifier
type: Class
comment: A string used to uniquely identify an image genre according to a specific classification scheme
subclass of: Identifier
subclass of: Restriction
  all values from: Image genre classification scheme
  on property: conforms to

Ink ML
has URL: https://www.w3.org/TR/InkML/
type: Standard/Best practice
type: NamedIndividual
alternative label: Ink Markup Language

Interactivity
type: Class
comment: The level of conversational interaction between speakers (for audio component) or participants (for video component)

JISAutoDetect
type: Character encoding
type: NamedIndividual

KOI8-R
type: Character encoding
type: NamedIndividual

Keras
type: Framework
type: NamedIndividual

LAF
has URL: https://www.iso.org/standard/37326.html
type: Standard/Best practice
type: NamedIndividual
alternative label: ISO 24612
alternative label: Linguistic Annotation Framework

LCR subclass
type: Class
comment: A classification of lexical/conceptual resources into types (used for descriptive reasons)

LDC
type: Membership institution
type: NamedIndividual
comment: Linguistic Data Consortium

Language description task
type: Class
comment: Identifies the task performed by the language description
note: add links to omtd-share operations

LMF
has URL: http://www.lexicalmarkupframework.org/
type: Standard/Best practice
type: NamedIndividual
alternative label: Lexical Markup Framework

Language Resource identifier
type: Class
comment: A string (e.g., PID, DOI, internal to an organization, etc.) used to uniquely identify a language resource
subclass of: ResourceIdentifier
subclass of: Restriction
  all values from: LR identifier scheme
  on property: uses identifier scheme

LR identifier scheme
type: Class
comment: The name of the scheme according to which the LRT identifier is assigned by the authority that issues it (e.g., DOI, ISLRN, etc.)
subclass of: Resource identifier scheme
alternative label: Language Resource identifier scheme

LT area
type: ObjectProperty
comment: Introduces a Language Technology-related area associated with the activities or domain of interest of an entity
domain: Class
  union of: Division
  union of: Document
  union of: Group
  union of: Organization
  union of: Person
  union of: Project
range: Operation
alternative label: Language Technology area

LT integrator
type: Organization role
type: NamedIndividual
alternative label: Language Technology integrator

LT supplier
type: Organization role
type: NamedIndividual
alternative label: Language Technology supplier

LT user
type: Organization role
type: NamedIndividual
alternative label: Language Technology user

Language description
type: Class
comment: A resource that describes a language or some aspect(s) of a language via a systematic documentation of linguistic structures
subclass of: Data language resource
subclass of: Restriction
  all values from: Dataset distribution
  on property: distribution

Language description image part
type: Class
comment: The part (or whole set) of a language description that consists of images (e.g., a grammar part with photos or images for sign languages)
subclass of: Language description part

Language description part
type: Class
comment: A part/segment of a language description based on its media type classification
subclass of: Media part

Language description text part
type: Class
comment: The textual part (or whole set) of a language description
subclass of: Language description part

Language description video part
type: Class
comment: The part (or whole set) of a language description that consists of videos (e.g., a grammar part with videos for sign languages)
subclass of: Language description part

Language model
type: Class
comment: A statistical language model is a probability distribution over sequences of words. Given such a sequence, say of length m, it assigns a probability P (w1, ..., wm) to the whole sequence. [from Wikipedia (https://en.wikipedia.org/wiki/Language_model)]
subclass of: Language description
alternative label: Statistical language model

Language Resource
type: Class
comment: A resource composed of linguistic material used in the construction, improvement and/or evaluation of language processing applications, but also, in a broader sense, in language and language-mediated research studies and applications; the term is used with a broader meaning, encompassing (a) data sets (textual, multimodal/multimedia and lexical data, grammars, language models, etc.) in machine readable form, and (b) tools/technologies/services used for their processing and management.
subclass of: type of described entity
subclass of: Restriction
  all values from: Language Resource identifier
  on property: has identifier
alternative label: LR

Language variety
type: Class
comment: A particular linguistic system used in a specific region or by a social group

Language variety type
type: Class
comment: A classification for language varieties

Lemma type
type: Class
comment: A type of content included in a language resource pertaining to the lemma
subclass of: Content type

Lexical/Conceptual resource
type: Class
comment: A resource organised on the basis of lexical or conceptual entries (lexical items, terms, concepts, etc.) with their supplementary information (e.g., grammatical, semantic, statistical information, etc.)
subclass of: Data language resource
subclass of: Restriction
  all values from: Dataset distribution
  on property: distribution
subclass of: Restriction
  all values from: Lexical/ Conceptual resource part
  on property: media part

Lexical/Conceptual resource audio part
type: Class
comment: The part (or whole set of) a lexical/conceptual resource that consists of audio elements (e.g., a set of audio files for a lexicon)
subclass of: Lexical/ Conceptual resource part

Lexical/Conceptual resource image part
type: Class
comment: A part (or whole set of) a lexical/conceptual resource that consists of images (e.g., a set of images used for a lexicon)
subclass of: Lexical/ Conceptual resource part

Lexical/ Conceptual resource part
type: Class
comment: A part/segment of a lexical/conceptual resource based on its media type classification
subclass of: Media part

Lexical/Conceptual resource text part
type: Class
comment: A part (or whole set) of a lexical/conceptual resource that consists of textual elements
subclass of: Lexical/ Conceptual resource part

Lexical/Conceptual resource video part
type: Class
comment: The part (or whole set) of a lexical/conceptual resource that consists of videos (e.g., a set of video files for the lexicon of a sign language)
subclass of: Lexical/ Conceptual resource part

Licence category
type: Class
comment: A classification scheme for licences
subclass of: Restriction
  all values from: Licence category scheme
  on property: conforms to

Licence category scheme
type: Class
comment: The name of the scheme according to which a category is assigned to a licence

Licence identifier
type: Class
comment: A string used to uniquely identify a licence
subclass of: ResourceIdentifier
subclass of: Restriction
  all values from: Licence identifier scheme
  on property: uses identifier scheme

Licence identifier scheme
type: Class
comment: The name of the scheme according to which an identifier is assigned to a licence by the authority that issues it
subclass of: Resource identifier scheme

Licence
type: Class
comment: A legal document (licence or terms of use/service) with which the language resource is distributed
subclass of: License
subclass of: type of described entity
subclass of: Restriction
  all values from: Licence identifier
  on property: has identifier
note: Kanella test
note: Until now, this included an enumerated list of individuals; I think it's better to treat them as proper entities with name, identifier, etc. This means that for the editors we need to - add a set of well known licences using the SPDX codes (https://spdx.org/licenses/) and any set already in RDF form (e.g., https://github.com/creativecommons/cc.licenserdf/tree/master/cc/licenserdf/licenses and Victor's list) with our own extra elements - allow them to add a new licence with the specific elements that we want - add the clarin licence categories & conditions of use with the ODRL representation Note: I have created a file with the CC-rdf licences and its ontology so that I can edit them and add the supplementary features => under MS ontologies, file testrdflicencesCC.txt

LicenseInfo
comment: Links a resource to the licence under which it is distributed; values are taken from a list of standard licences

Linguality type
type: Class
comment: Classification of a resource (part) based on the number of languages it includes

Link to other media
type: Class
comment: The links between different media parts of a multimedia resource

LT tool/service related to
type: ObjectProperty
comment: Links a tool/service (the one being described) to a language resource that bears some relation to it
domain: Language Technology tool/service
range: Data language resource
sub property of: is related to
inverse of: is related to LT tool/service

MAD
type: Metric
type: NamedIndividual
alternative label: Mean Annotations per Document

MAF
has URL: https://www.iso.org/standard/51934.html
type: Standard/Best practice
type: NamedIndividual
alternative label: ISO 24611
alternative label: Morpho-syntactic Annotation Framework

metadata record related to
type: ObjectProperty
comment: Links an external metadata record that has some relation with the metadata record of the resource being described or the resource itself
domain: Metadata record
range: Class
  union of: Language Resource
  union of: Metadata record
sub property of: is related to
inverse of: is related to metadata record

MDTV
type: Metric
type: NamedIndividual
alternative label: Mean Time per Document Volume

META-SHARE
type: Membership institution
type: NamedIndividual

MLIF
has URL: https://www.iso.org/standard/37330.html
type: Standard/Best practice
type: NamedIndividual
alternative label: ISO 24616
alternative label: Multilingual Information Framework

Machine Learning model
type: Class
comment: The model artifact that is created through a training process involving an ML algorithm (that is, the learning algorithm) and the training data to learn from.
subclass of: Language description
alternative label: ML model

MMI
has URL: https://www.w3.org/TR/mmi-framework/
type: Standard/Best practice
type: NamedIndividual
alternative label: Multi-Modal Interaction framework

MS874
type: Character encoding
type: NamedIndividual

META-SHARE speech genre classification scheme
type: Speech genre classification scheme
type: NamedIndividual

META-SHARE audio genre classification scheme
type: Audio genre classification scheme
type: NamedIndividual

MTBF
type: Metric
type: NamedIndividual
alternative label: Mean Time Between Failures

MTSA
type: Metric
type: NamedIndividual
alternative label: Mean Time Seek Annotations

MTTR
type: Metric
type: NamedIndividual
alternative label: Mean Time To Repair

MULTEXT
has URL: https://tei-c.org/activities/projects/multilingual-text-tools-and-corpora-multext/
type: Standard/Best practice
type: NamedIndividual

MUMIN
has URL: https://cst.dk/mumin/
type: Standard/Best practice
type: NamedIndividual
alternative label: MUltiModal INterfaces

MXNet
type: Framework
type: NamedIndividual

MacArabic
type: Character encoding
type: NamedIndividual

MacCentralEurope
type: Character encoding
type: NamedIndividual

MacCroatian
type: Character encoding
type: NamedIndividual

MacCyrillic
type: Character encoding
type: NamedIndividual

MacDingbat
type: Character encoding
type: NamedIndividual

MacGreek
type: Character encoding
type: NamedIndividual

MacHebrew
type: Character encoding
type: NamedIndividual

MacIceland
type: Character encoding
type: NamedIndividual

MacRoman
type: Character encoding
type: NamedIndividual

MacRomania
type: Character encoding
type: NamedIndividual

MacSymbol
type: Character encoding
type: NamedIndividual

MacThai
type: Character encoding
type: NamedIndividual

MacTurkish
type: Character encoding
type: NamedIndividual

MacUkraine
type: Character encoding
type: NamedIndividual

MeSH
has URL: http://www.openclinical.org/medTermMesh.html
type: Subject classification scheme
type: NamedIndividual
alternative label: Medical Subject Headings

Media part
type: Class
comment: A part of a language resource based on the media type it belongs to (e.g., text, audio, video parts of a corpus or lexicon)

Media type
type: Class
comment: A classification of language resource parts based on the physical medium they are available in (e.g., text, video, audio)

Membership institution
type: Class
comment: An institution with members that can benefit from specific conditions on the use of a resource (e.g. discount, unlimited access, etc.)

Metadata record
type: Class
comment: A set of formalized structured information used to describe the contents, structure, function, etc., of an entity, usually according to a specific set of rules (metadata schema)
subclass of: Restriction
  all values from: Metadata schema
  on property: complies with
equivalent class: CatalogRecord

Metadata record identifier
type: Class
comment: A string (e.g., PID, DOI, internal to an organization, etc.) used to uniquely identify a metadata record
subclass of: ResourceIdentifier
subclass of: Restriction
  all values from: Metadata record identifier scheme
  on property: uses identifier scheme

Metadata record identifier scheme
type: Class
comment: The name of the scheme according to which the metadata record identifier is assigned by the authority that issues it (e.g., DOI, URL, etc.)
subclass of: Resource identifier scheme

Metadata schema
type: Class
comment: A formal set of metadata elements organized in a specific way

Metric
type: Class
comment: The metric used for the evaluation of the tool/service

Microsoft Cognitive Toolkit
type: Framework
type: NamedIndividual

Modality type
type: Class
comment: A classification of modalities represented in the resource or processed by a tool/service

Morphological type
type: Class
comment: A type of content included in a language resource pertaining to the morphological level
subclass of: Content type

Multilinguality type
type: Class
comment: A classification of a bi/multilingual resource (part) into parallel, comparable or mixed

N-gram model
type: Class
comment: A language model consisting of n-grams, i.e., specific sequences of a number of words
subclass of: Language description

NLM classification scheme
type: Subject classification scheme
type: NamedIndividual
comment: Classification scheme of the National Library of Medicine (https://www.nlm.nih.gov/class/)

Naturality
type: Class
comment: The level of naturality for multimodal/multimedia resources

Neural network
type: Class
comment: A set of algorithms, modeled loosely after the human brain, designed to recognize patterns [adapted from https://skymind.ai/wiki/neural-network]
subclass of: Machine Learning model

Noise level
type: Class
comment: The level of background noise

Non-speech item
type: Class
comment: A non-speech element that maybe included in the audio corpus or lexical/conceptual resource

OAXAL
has URL: https://www.oasis-open.org/committees/tc_home.php
type: Standard/Best practice
type: NamedIndividual
alternative label: OASIS Open Architecture for XML Authoring and Localization Reference Model

OMTD-SHARE rights statement scheme
type: Access rights statement scheme
type: NamedIndividual

OpenAIRE
type: Metadata record identifier scheme
type: Project identifier scheme
type: NamedIndividual

operating system
type: Class
comment: The operating system on which the software is compatible with

Organization
type: Class
comment: A company or other group of people that works together for a particular purpose [https://dictionary.cambridge.org/dictionary/english/organization]
subclass of: Organization
alternative label: Organisation

Organization legal status
type: Class
comment: A classification vocabulary for organizations as legal entities

Organization role
type: Class
comment: A vocabulary for classifying organizations according to their role in relation to Language Technology

Origin
type: Class
comment: The relation of the language of the group of participants with respect to the acquisition stage

PAROLE_genre classification scheme
type: Text genre classification scheme
type: NamedIndividual

PAROLE_topic classification scheme
type: Subject classification scheme
type: NamedIndividual

Parameter
type: Class
comment: A a special kind of variable in computer programming language that is used to pass information between functions or procedures [from https://www.techopedia.com/definition/3725/parameter-param]

Parameter type
type: Class
comment: A specific (not yet standardised) typing system for parameters (e.g., whether it's boolean, string, integer, a document, mapping, etc.)

Participant
type: Class
comment: A person that has participated in the recording of the audio, video, sensorimotor (textNumerical) part of the resource
subclass of: Person

Performance indicator
type: Class
comment: The performance indicator used in the evaluation of a software given in the form of the metric used and reporting on the measure and unit of measure for this

Person
type: Class
comment: A human being
subclass of: Person
subclass of: Restriction
  all values from: Person identifier
  on property: has identifier
note: Subclass of foaf to exclude imaginary persons

Previous annotation types policy
type: Class
comment: Policy types that a tool/service has with respect to the annotation types included in the annotated resource that it takes as input (i.e. whether it keeps, modifies or drops them in the output resource)

Process mode
type: Class
comment: Classification of the mode of operation applied when processing a resource

Input content resource
type: Class
comment: A set of requirements posed on the resource that is input for processing by a tool/service

Processing resource type
type: Class
comment: The type of the resource that a tool/service takes as input or produces as output
note: Unsure of the values for audio/video files

Project
type: Class
comment: A set of operations undertaken as a whole by an individual or organization and related to some aspect of the lifecycle of the language resource (e.g., funding, deployment, etc.)
subclass of: type of described entity
subclass of: Project
subclass of: Restriction
  all values from: Project identifier
  on property: has identifier

Project identifier
type: Class
comment: A string (e.g., PID, internal to an organization, issued by the funding authority, etc.) used to uniquely identify a project
subclass of: ResourceIdentifier
subclass of: Restriction
  all values from: Project identifier scheme
  on property: uses identifier scheme

Project identifier scheme
type: Class
comment: The name of the scheme according to which an identifier is assigned to a project by the authority that issues it
subclass of: Resource identifier scheme

PyTorch
type: Framework
type: NamedIndividual

Quality
type: Class
comment: The quality level of image part(s) of a resource

REST
type: Web service type
type: NamedIndividual

RGB
type: Colour space
type: NamedIndividual

Raster or vector graphics
type: Class
comment: Type of graphics of the image part(s) of a resource

Recording device type
type: Class
comment: The nature of the recording platform hardware and the storage medium

Recording environment
type: Class
comment: A setting where the recording of a multimedia resource took place

Recording quality
type: Class
comment: Indication of the audio or video recording quality

Related lexicon type
type: Class
comment: Indicates the type for the lexica that must or can be used with the grammar

Relation
type: Class
comment: A relation holding between two language resources (e.g., a raw corpus and its annotated version, the annotation tool used for it, etc.)

Repository identifier
type: Class
comment: A string (e.g., PID, DOI, internal to an organization, etc.) used to uniquely identify a repository
subclass of: AgentIdentifier
subclass of: Restriction
  all values from: Repository identifier scheme
  on property: uses identifier scheme

Repository identifier scheme
type: Class
comment: The name of the scheme used to identify a repository
subclass of: AgentIdentifierScheme

Required hardware
type: Class
comment: Type of hardware required for running a tool and/or computational grammar

Resolution
type: Class
comment: The image resolution used for the video/image part(s) of a resource

Resolution standard
type: Class
comment: The standard to which the resolution conforms

Rights_Statements_Org scheme
type: Access rights statement scheme
type: NamedIndividual

SNR
type: Audio quality measure included
type: NamedIndividual

SOAP
type: Web service type
type: NamedIndividual

SPDX
has URL: https://spdx.org/licenses/
type: Licence identifier scheme
type: NamedIndividual
comment: Value for LicenceIdentifierScheme referring to the codes (identifiers) for licences used by SPDX (https://spdx.org/licenses/))

SRX
has URL: https://www.gala-global.org/srx-20-april-7-2008
type: Standard/Best practice
type: NamedIndividual
alternative label: Segmentation Rules eXchange

Scenario type
type: Class
comment: A classification of the task defined for the conversation or the interaction of participants in a multimedia resource

Scene illumination
type: Class
comment: Information on the illumination of the scene

Scikit-Learn
type: Framework
type: NamedIndividual

Segmentation level
type: Class
comment: The level at which a resource may be segmented (e.g., clause, word, unit, etc.)

Semantic Annotation Framework
type: Standard/Best practice
type: NamedIndividual

SemAF-DA
has URL: https://www.iso.org/standard/76443.html
type: Standard/Best practice
type: NamedIndividual
alternative label: Semantic Annotation Framework - Dialogue Acts

SemAF-DS
has URL: https://www.iso.org/obp/ui/#iso:std:iso:ts:24617:-5:ed-1:v1:en
type: Standard/Best practice
type: NamedIndividual
alternative label: Semantic Annotation Framework - Discourse Structure

SemAF-NE
has URL: http://semanticweb.kaist.ac.kr/research/tc37sc4/new_doc/iso_tc37_sc4_N796_wg2_proposed_WD_24617-3_SemAF-NE.pdf
type: Standard/Best practice
type: NamedIndividual
alternative label: Semantic Annotation Framework - Named Entities

SemAF-SR
has URL: https://www.iso.org/standard/56866.html
type: Standard/Best practice
type: NamedIndividual
alternative label: Semantic Annotation Framework - Semantic Roles

Semantic type
type: Class
comment: A type of content included in a language resource pertaining to the semantic level
subclass of: Content type

Sex
type: Class
comment: Either of the two major forms of individuals that occur in many species and that are distinguished respectively as female or male especially on the basis of their reproductive organs and structures [https://www.merriam-webster.com/dictionary/sex]

Shift_JIS
type: Character encoding
type: NamedIndividual

Sign convention
type: Class
comment: Binary representation of numbers

Signal encoding
type: Class
comment: The encoding of the audio type of a multimedia resource

Size
type: Class
comment: The size of the resource with regard to the SizeUnit measurement in form of a number

Size unit
type: Class
comment: The unit of measurement used for determining and describing the size of a resource (part)

Social media occupational account
type: Class
comment: The details for the social media or occupational account of a person or organization

Social media account occupational type
type: Class
comment: A list of social media

Software distribution
type: Class
comment: Any form with which software is distributed (e.g., web services, executable or code files, etc.)
subclass of: Distribution
subclass of: Restriction
  all values from: Software distribution form
  on property: distribution form

Software distribution form
type: Class
comment: The medium, delivery channel or form (e.g., source code, API, web service, etc.) through which a software object is distributed
subclass of: Distribution form

Source channel
type: Class
comment: Information on the source channel

Source channel type
type: Class
comment: Type of the source channel

Speaking impairment of participants
type: Class
comment: Whether the group of participants contains persons withwith speakingimpairments

Speech genre
type: Class
comment: A category for the conventionalized discourse of the speech part of a language resource, based on extra-linguistic and internal linguistic criteria
subclass of: Genre
subclass of: Restriction
  all values from: Speech genre identifier
  on property: has identifier
subclass of: Restriction
  all values from: Corpus audio part
  on property: genre

Speech genre classification scheme
type: Class
comment: A classification scheme used for speech genres devised by an authority or organization
subclass of: Classification scheme

Speech genre identifier
type: Class
comment: A string used to uniquely identify a speech genre according to a specific classification scheme
subclass of: Identifier
subclass of: Restriction
  all values from: Speech genre classification scheme
  on property: conforms to

Speech influence
type: Class
comment: A factor influencing speech

Speech item
type: Class
comment: An element contained in an audio recording that is pronounced and annotated as such

Standard/Best practice
type: Class
comment: A standard or best practice widely used to which the lexical/conceptual resource or corpus conforms to
note: some of these are only formats rather than standards; how can we distinguish?

Static element
type: Class
comment: The static elements visible on images

Subject
type: Class
comment: A situation, event, thing, etc. that is discussed in the contents of a language resource
subclass of: Classification
alternative label: Topic

Subject classification scheme
type: Class
comment: A classification scheme used for subjects/topics devised by an authority or organization
subclass of: Classification scheme

Subject identifier
type: Class
comment: A string used to uniquely identify a subject according to a specific classification scheme
subclass of: Identifier
subclass of: Restriction
  all values from: Subject classification scheme
  on property: conforms to

Subset
type: Class
comment: A subset of a language resource in terms of a specific parameter (e.g., per domain, time coverage, linguistic level of representation, etc.)

Support type
type: Class
comment: The type of support provided for the use of a resource

SynAF
has URL: https://www.iso.org/standard/62508.html
type: Standard/Best practice
type: NamedIndividual
alternative label: Syntactic Annotation Framework

Syntactic type
type: Class
comment: A type of content included in a language resource pertaining to the syntactic level
subclass of: Content type

Syntactico-semantic type
type: Class
comment: A type of content included in a language resource pertaining to the syntactico-semantic level
subclass of: Content type

T-H pair
type: Size unit
type: NamedIndividual

TBX
has URL: https://www.tbxinfo.net/tbx-about/
type: Standard/Best practice
type: NamedIndividual
alternative label: TermBase eXchange

TEI
has URL: https://tei-c.org/
type: Standard/Best practice
type: NamedIndividual
alternative label: Text Encoding Initiative

TEI P3
has URL: https://www.tei-c.org/Vault/GL/P3/index.htm
type: Standard/Best practice
type: NamedIndividual
alternative label: Text Encoding Initiative P3

TEI P4
has URL: https://tei-c.org/Vault/P4/doc/html/
type: Standard/Best practice
type: NamedIndividual
alternative label: Text Encoding Initiative P4

TEI P5
has URL: https://tei-c.org/guidelines/p5/
type: Standard/Best practice
type: NamedIndividual
alternative label: Text Encoding Initiative P5

TIS-620
type: Character encoding
type: NamedIndividual

TMX
has URL: http://www.opentag.com/tmx.htm
type: Standard/Best practice
type: NamedIndividual
alternative label: Translation Memory eXchange

TRL
type: Class
comment: An indicator of the maturity level of particular technologies according to a measurement system defined by EC [adapted from https://ec.europa.eu/info/funding-tenders/opportunities/portal/screen/support/faq/2890]
alternative label: Technology Readiness Level

TST-Centrale
type: Membership institution
type: NamedIndividual

TensorFlow
type: Framework
type: NamedIndividual

Text genre
type: Class
comment: A category of text characterized by a particular style, form, or content according to a specific classification scheme
subclass of: Genre
subclass of: Restriction
  all values from: Text genre identifier
  on property: has identifier
subclass of: Restriction
  all values from: Corpus text part
  on property: genre

Text genre classification scheme
type: Class
comment: A classification scheme used for text genres devised by an authority or organization
subclass of: Classification scheme

Text genre identifier
type: Class
comment: A string used to uniquely identify a text genre according to a specific classification scheme
subclass of: Identifier
subclass of: Restriction
  all values from: Text genre classification scheme
  on property: conforms to

Text included in image
type: Class
comment: Provides information on the type of text that may be on the image

Text included in video
type: Class
comment: The presence or not of text in or in conjunction with the video and, if yes, the type

TextNumerical format
type: Class
comment: The format(s) of the textNumerical part of the resource

Text type
type: Class
comment: An abstract category designed to characterize the main structure of a particular text or one of its parts according to its dominant properties [from https://www.lhn.uni-hamburg.de/node/121.html]
subclass of: Classification
subclass of: Restriction
  all values from: Text type identifier
  on property: has identifier

Text type classification scheme
type: Class
comment: A classification scheme used for text types devised by an authority or organization
subclass of: Classification scheme

Text type identifier
type: Class
comment: A string used to uniquely identify a text type according to a specific classification scheme
subclass of: Identifier
subclass of: Restriction
  all values from: Text type classification scheme
  on property: conforms to

3D
type: Visual modelling
type: NamedIndividual

3G
type: Source channel type
type: NamedIndividual

TimeML
has URL: http://www.timeml.org/
type: Standard/Best practice
type: NamedIndividual
alternative label: Time Markup Language

Language Technology tool/service
type: Class
comment: A tool/service/any piece of software that performs language processing and/or any Language Technology related operation.
subclass of: Language Resource
alternative label: LT tool/service

Translation type
type: Class
comment: A type of content included in a language resource relevant to the translation procedure
subclass of: Content type

2D
type: Visual modelling
type: NamedIndividual

UDC
has URL: http://www.udcc.org/
type: Domain classification scheme
type: NamedIndividual
alternative label: Universal Decimal Classification

UIMA
type: Framework
type: NamedIndividual

US-ASCII
type: Character encoding
type: NamedIndividual

UTF-16
type: Character encoding
type: NamedIndividual

UTF-16BE
type: Character encoding
type: NamedIndividual

UTF-16LE
type: Character encoding
type: NamedIndividual

UTF-8
type: Character encoding
type: NamedIndividual

Usage type
type: Class
comment: A type of content included in a language resource encoding usage information
subclass of: Content type

User type
type: Class
comment: Classification type for users of a language resource; usually required for assessing the licensing or pricing policies for the use of the resource

VGA
type: Resolution standard
type: NamedIndividual

VOIP
type: Source channel type
type: NamedIndividual

Validation
type: Class
comment: Each of the procedures and outcomes followed for validating a language resource, i.e. confirming that its contents/structure/operation is as claimed after careful examination

Validation extent
type: Class
comment: The resource coverage in terms of validated data

Validation type
type: Class
comment: Classification of validation that indicates whether the validation was made on the contents or on formal aspects of the resource

Version type
type: Class
comment: A type of versioning vocabulary used mainly for works (e.g., scholarly articles, books, etc.) that go through a formal review process before final publication, marked with major changes across the versions
note: When the COAR vocabulary is published (cf. https://www.coar-repositories.org/activities/repository-interoperability/coar-vocabularies/version-type-vocabulary/) check again

Detailed video format
type: Class
backward compatible with: The format of a video (part of a) resource

Video genre
type: Class
comment: A classification of video parts based on extra-linguistic and internal linguistic criteria and reflected on the video style, form or content
subclass of: Genre
subclass of: Restriction
  all values from: Video genre identifier
  on property: has identifier
subclass of: Restriction
  all values from: Corpus video part
  on property: genre

Video genre classification scheme
type: Class
comment: A classification scheme devised by an authority for video genres
subclass of: Classification scheme

Video genre identifier
type: Class
comment: A string used to uniquely identify a video genre according to a specific classification scheme
subclass of: Identifier
subclass of: Restriction
  all values from: Video genre classification scheme
  on property: conforms to

Visual modelling
type: Class
comment: The dimensional form applied on the video or image part(s) of a corpus

Vocal tract condition
type: Class
comment: The vocal tract condition that may influence the speech of the participant

Web service type
type: Class
comment: A classification of web services based on the protocol used for accessing them

Word embedding
type: Class
comment: Word embedding is the collective name for a set of language modeling and feature learning techniques in natural language processing where words or phrases from the vocabulary are mapped to vectors of real numbers. [wikipedia]
subclass of: Machine Learning model

XCES
has URL: http://www.xces.org/
type: Standard/Best practice
type: NamedIndividual
alternative label: Corpus Encoding Standard for XML

XLIFF
has URL: http://docs.oasis-open.org/xliff/v1.2/os/xliff-core.html
type: Standard/Best practice
type: NamedIndividual
alternative label: XML Localization Interchange File Format

YUV
type: Colour space
type: NamedIndividual

A-law
type: Signal encoding
type: NamedIndividual

AAC
type: Compression name
type: NamedIndividual
alternative label: Advanced Audio Coding

abbreviation
type: Lemma type
type: NamedIndividual

abstract
type: DatatypeProperty
comment: Introduces a summary of the contents of a document
domain: Document
range: langString

academic
type: User type
type: NamedIndividual
comment: Value for 'user type' reserved for individuals affiliated to academir or, in general, educational or research institutions and the respective organisations

academic
conforms to: CLARIN licence category scheme
type: Licence category
type: NamedIndividual
alternative label: ACA

academic institution
type: Organization legal status
type: NamedIndividual

academic text
has identifier: ClarinEl TT001
type: Text type
type: NamedIndividual

academic user
type: Condition of use
type: NamedIndividual

accentuation
type: Audio type
type: NamedIndividual

accepted
type: Version type
type: NamedIndividual
comment: Value for 'Version type' used for versions as accepted for publication (following a reviewing process that may have introduced changes from the submitted version)

access location
type: DatatypeProperty
comment: A URL where the resource can be accessed from; it can be used for landing pages or for cases where the resource is accessible via an interface, i.e. cases where the resource itself is not provided with a direct link for downloading
domain: Distribution
range: anyURI
sub property of: distribution location

access rights
type: ObjectProperty
comment: Specifies the rights for accessing the distributable form(s) of a language resource (preferrably in accordance to a formalised vocabulary)
domain: Distribution
range: Access rights statement

accesses
type: ObjectProperty
comment: Links a tool/service B that is (or can be) used for accessing LR A (e.g., a corpus workbench, s/w for lexicon access) to the LR A
domain: Language Technology tool/service
range: Class
  union of: Data language resource
  union of: Media part
sub property of: LT tool/service related to
inverse of: is accessed by

accessible through interface
type: Dataset distribution form
type: NamedIndividual
comment: Value for distribution medium, used for corpora and lexical/conceptual resources that can be accessed via a human-intended interface (e.g., corpus workbench, lexicon browsing interface, etc.)

accessible through query
type: Dataset distribution form
type: NamedIndividual
comment: Value for dataset distribution medium, used for lexical/conceptual resources that can be accessed via a SPARQL endpoint

actor related to
type: ObjectProperty
comment: Links actors to a language resource with which they have some relation
domain: Actor
range: Language Resource
sub property of: is related to
inverse of: is related to actor

actual use
type: ObjectProperty
comment: Provides information on how the resource has been used (e.g., in a project, for a publication, for testing a tool/service, etc.)
domain: Language Resource
range: Actual use

actual use details
type: DatatypeProperty
comment: Describes in free text specific use cases or situations where the language resource has been used
domain: Actual use
range: langString

additional h/w requirements
type: DatatypeProperty
comment: Specifies hardware requirements that are needed for running a tool/service
domain: Software distribution
range: string
alternative label: additional hardware requirements

address
type: DatatypeProperty
comment: The street and the number of the postal address of a person or organization
domain: Address
range: langString

address
type: ObjectProperty
comment: Links to the physical address of an organization, group or person represented as a set of distinct elements (street, number, zip code, city, etc.)
domain: Class
  union of: Affiliation
  union of: Division
  union of: Group
  union of: Organization
  union of: Person
range: Address

administrative text
has identifier: ClarinEl TT008
type: Text type
type: NamedIndividual

adult
type: Age group
type: NamedIndividual

advertising
has identifier: PAROLE G002
type: Text genre
type: NamedIndividual

Advertising & Public Relations
has identifier: DDC659
type: Domain
type: NamedIndividual

affiliated organization
type: ObjectProperty
comment: Specifies the organization that a person is affiliated with or works for
domain: Affiliation
range: Organization

affiliation
type: ObjectProperty
comment: Introduces information on an organization to whom the person is affiliated and the data relevant to this relation (i.e. position, email, etc.)
domain: Person
range: Affiliation

age
type: DatatypeProperty
comment: Age of a person
domain: Participant
range: int

age group
type: ObjectProperty
comment: The age group to which the participant belongs
domain: Participant
range: Age group

age group of participants
type: ObjectProperty
comment: The age range of the group of participants
domain: Class
  union of: Corpus audio part
  union of: Corpus image part
  union of: Corpus text numerical part
  union of: Corpus video part
range: Age group

age range end of participants
type: DatatypeProperty
comment: End of age range of the group of participants
domain: Class
  union of: Corpus audio part
  union of: Corpus image part
  union of: Corpus text numerical part
  union of: Corpus video part
range: int

age range start of participants
type: DatatypeProperty
comment: Start of age range of the group of participants
domain: Class
  union of: Corpus audio part
  union of: Corpus image part
  union of: Corpus text numerical part
  union of: Corpus video part
range: int

Agriculture
has identifier: DDC630
type: Domain
type: NamedIndividual
comment: The science, art, or practice of cultivating the soil, producing crops, and raising livestock and in varying degrees the preparation and marketing of the resulting products [https://www.merriam-webster.com/dictionary/agriculture]

air traffic control
has identifier: MS SG001
type: Speech genre
type: NamedIndividual

airflow
type: Source channel
type: NamedIndividual

alcohol
type: Speech influence
type: NamedIndividual

algorithm
type: DatatypeProperty
comment: Identifies the training algorithm used for the model (e.g., maximum entropy, svm, etc.)
domain: Machine Learning model
range: langString

algorithm details
type: DatatypeProperty
comment: Provides a detailed description of the algorithm, incl. info on whether it's supervised or not
domain: Machine Learning model
range: langString

alias
type: DatatypeProperty
comment: Introduces a name used for a participant of a multimedia resource instead of his/her real one
domain: Participant
range: langString

alternative title
type: DatatypeProperty
comment: Introduces an alternative title (e.g. short title) used for the document being described
domain: Document
range: langString
sub property of: alternative

amount
type: DatatypeProperty
comment: Specifies the number of units that constitute anything that can be measured (e.g. size of a data resource or cost, etc.)
domain: Class
  union of: Cost
  union of: Size
range: float

analysis
type: Language description task
type: NamedIndividual

anaphora
type: Grammatical phenomena coverage
type: NamedIndividual

anaphora resolution
type: Language description task
type: NamedIndividual

Android
type: operating system
type: NamedIndividual

anechoic chamber
type: Recording environment
type: NamedIndividual

animal vocalization
has identifier: MS AG006
type: Audio genre
type: NamedIndividual

Animals (Zoology)
has identifier: DDC590
type: Domain
type: NamedIndividual

annotated corpus
type: Corpus subclass
type: NamedIndividual
comment: A corpus that has been processed and thus includes the raw data and the automatic or manual annotations that have been added to them

annotated element
type: ObjectProperty
comment: Specifies the elements annotated at each annotation level
domain: Annotation
range: Annotated element

annotation
type: ObjectProperty
comment: Links a corpus to its annotated part(s)
domain: Corpus part
range: Annotation

annotation end date
type: DatatypeProperty
comment: The date in which the annotation process has ended
domain: Annotation
range: date

annotation mode
type: ObjectProperty
comment: Indicates whether the resource is annotated manually or by automatic processes
domain: Annotation
range: Process mode
sub property of: process mode

annotation mode details
type: DatatypeProperty
comment: Provides further information on annotation process
domain: Annotation
range: langString

annotation report
type: ObjectProperty
comment: Links to a report describing the annotation process, tool, method, etc. of the language resource
domain: Annotation
range: Document
sub property of: is documented by
inverse of: documents annotation

annotation resource
type: ObjectProperty
comment: Specifies the annotation resource used for annotating a corpus or that has been used for the input resource of a tool/service or that should be used (dependency) for the annotation
domain: Class
  union of: Machine Learning model
  union of: Input content resource
  union of: Language Technology tool/service
range: Lexical/Conceptual resource
sub property of: depends on
inverse of: is annotation resource of

annotation schema
type: ObjectProperty
comment: The annotation schema used for annotating a resource or for the input resource (if annotated) of a tool/service or that should be used (dependency) for the annotation
domain: Class
  union of: Machine Learning model
  union of: Input content resource
  union of: Language Technology tool/service
range: Lexical/Conceptual resource
sub property of: depends on
inverse of: is annotation schema of

annotation scheme
type: LCR subclass
type: NamedIndividual
comment: A set of elements and values designed to annotate data. It usually consists in a formal representation. It aims to represent a specific level of information, such as morphological features of words, syntactic dependency relations between phrases, discourse level information, etc. It can consist of a flat structure of elements and values (e.g., part-of-speech tags) or it can be more complex with interrelated elements (e.g., specific morphological features to be used for each part-of-speech).

annotation standoff
type: DatatypeProperty
comment: Indicates whether the annotation is created inline or in a stand-off fashion
domain: Annotation
range: boolean

annotation start date
type: DatatypeProperty
comment: The date in which the annotation process has started
domain: Annotation
range: date

annotation type
type: ObjectProperty
comment: Specifies the annotation type of the annotated version(s) of a resource or the annotation type a tool/ service requires or produces as an output
domain: Annotation
range: AnnotationType

annotations corpus
type: Corpus subclass
type: NamedIndividual
comment: A corpus of annotations without the raw data

annotator
type: ObjectProperty
comment: Identifies the person or organisation responsible for the annotation of a resource
domain: Annotation
range: Actor
sub property of: is related to actor
inverse of: is annotator of

anonymization details
type: DatatypeProperty
comment: If the resource has been anonymized, this field can be used for entering more information, e.g., tool or method used for the anonymization, by whom it has been performed, whether there was any check of the results, etc.
domain: Data language resource
range: langString

anonymized
type: DatatypeProperty
comment: Indicates whether the language resource has been anonymized
domain: Data language resource
range: boolean

antonym
type: Semantic type
type: NamedIndividual

API specification
type: Documentation type
type: NamedIndividual
comment: Value for 'Documentation type' used for the specification description of an API

application word
type: Speech item
type: NamedIndividual

Applied Physics
has identifier: DDC621
type: Domain
type: NamedIndividual

Architecture
has identifier: DDC720
type: Domain
type: NamedIndividual

arm
type: Body part
type: NamedIndividual

article
type: Size unit
type: NamedIndividual

article
type: Document type
type: NamedIndividual
comment: An article from a journal or magazine

artifact part
type: DatatypeProperty
comment: Indicates the parts of the artifacts represented in the image corpus
domain: Static element
range: langString

Arts & Recreation
has identifier: DDC700
type: Domain
type: NamedIndividual

aspect
type: Morphological type
type: NamedIndividual

assisted
type: Naturality
type: NamedIndividual

association
type: Organization legal status
type: NamedIndividual

Astronomy
has identifier: DDC520
type: Domain
type: NamedIndividual

altrac
type: Compression name
type: NamedIndividual

attached
type: Related lexicon type
type: NamedIndividual

attached lexicon position
type: DatatypeProperty
comment: Indicates the position of the lexicon, if attached to the grammar
domain: Language description
range: langString

attribution
type: Condition of use
type: NamedIndividual
type: Set
comment: Value for 'ConditionOfUse' that states that the use of a language resource must acknowledge it with an attribution note usually according to terms specified in the licensing document
permission:
  duty:
    action: Attribution

attribution text
type: DatatypeProperty
comment: The text that must be quoted for attribution purposes when using a resource - for cases where a resource is provided with a restriction on attribution
domain: Distribution
range: langString

audience
type: ObjectProperty
comment: Indicates the intended audience size of a multimedia resource
domain: Class
  union of: Corpus audio part
  union of: Corpus video part
range: Audience

audio
type: Media type
type: NamedIndividual
comment: Value for 'MediaType' for the form of a language resource (part) composed of or relating to sound(s)

detailed audio format
type: ObjectProperty
comment: Specifies the features of the format of the audio part of a language resource
domain: Class
  union of: Corpus audio part
  union of: Lexical/Conceptual resource audio part
range: Detailed audio format

audio quality measure included
type: ObjectProperty
comment: Specifies the audio quality measures
domain: Detailed audio format
range: Audio quality measure included

author
type: ObjectProperty
comment: Introduces the details for a person that has created the document being described
domain: Document
range: Person

automatic
type: Process mode
type: NamedIndividual
comment: Value for 'Process mode' and its subclasses used for fully automatic processes where the results of the process have undergone no manual edits

automatic
type: Evaluation measure
type: NamedIndividual

auxiliary
type: Morphological type
type: NamedIndividual

availability
type: ObjectProperty
comment: Specifies the availability status of the resource
domain: Distribution
range: Availability

availability end date
type: DatatypeProperty
comment: Specifies the end date of availability of a resource - only for cases where a resource is available for a restricted time period.
domain: Distribution
range: date

availability start date
type: DatatypeProperty
comment: Specifies the start date of availability of a resource - only for cases where a resource is available for a restricted time period.
domain: Distribution
range: date

available
type: Availability
type: NamedIndividual
comment: For resources available through the infrastructure

Available Through Other Distributor
replaces: notAvailableThroughMetashare
comment: For resources that are documented in the catalogue but the contents of which can only be accessed through other distribution channels.

available through other distributors
type: Availability
type: NamedIndividual
comment: For resources that are available through other distribution channels

avi
type: Compression name
type: NamedIndividual

background noise
type: Audio quality measure included
type: NamedIndividual

background noise
type: Annotated element
type: NamedIndividual

banking
has identifier: ELG Domain014
type: Domain
type: NamedIndividual

base item
type: ObjectProperty
comment: Type of item that is represented in the n-gram resource
domain: N-gram model
range: Base item

bibliographic record
type: DatatypeProperty
comment: Specifies in the form of free text a set of bibliographic data (a bibliographic record) preferrably in bibtex form
domain: Document
range: string

Big Endian
type: Byte order
type: NamedIndividual

bigram
type: Size unit
type: NamedIndividual

bilingual
type: Linguality type
type: NamedIndividual
comment: Value for 'Linguality type' for resource (parts) which include material in two languages

Biochemistry
has identifier: DDC572
type: Domain
type: NamedIndividual

Biology
has identifier: DDC570
type: Domain
type: NamedIndividual

black box
type: Evaluation type
type: NamedIndividual

blog text
has identifier: ClarinEl TT002
type: Text type
type: NamedIndividual

bluRay
type: Dataset distribution form
type: NamedIndividual
comment: bluRay refers to a kind of distribution/access medium used for delivering a language resource; intended for resources delivered on bluRay disks

body gesture
type: Modality type
type: NamedIndividual
comment: Value for 'ModalityType' for body gestures represented in a language resource

body movement
type: DatatypeProperty
comment: Indicates the body parts that move in the video part of the resource
domain: Dynamic element
range: langString

body part
type: ObjectProperty
comment: Specifies the body parts visible in the video or image part of the resource
domain: Class
  union of: Dynamic element
  union of: Static element
range: Body part

book
type: Document type
type: NamedIndividual

book title
type: DatatypeProperty
comment: Introduces the human readable text that is used as the title of a book (differentiating from the title of an article)
domain: Document
range: langString
sub property of: title

booklet
type: Document type
type: NamedIndividual

boolean
type: Parameter type
type: NamedIndividual

branch
type: Division category
type: NamedIndividual

broadcast news
has identifier: MS SG009
type: Speech genre
type: NamedIndividual

business
has identifier: ELG Domain011
type: Domain
type: NamedIndividual

byte
type: Size unit
type: NamedIndividual

byte order
type: ObjectProperty
comment: Specifies the byte order of 2 or more bytes sample
domain: Detailed audio format
range: Byte order

call-in
has identifier: MS SG002
type: Speech genre
type: NamedIndividual

camcorder
type: Source channel
type: NamedIndividual

camera
type: Capturing device type
type: NamedIndividual

caption
type: Text included in image
type: NamedIndividual

caption
type: Text included in video
type: NamedIndividual

capture time
type: Text included in image
type: NamedIndividual

capturing details
type: DatatypeProperty
comment: Provides further information on the capturing method and procedure
domain: Class
  union of: Corpus audio part
  union of: Corpus image part
  union of: Corpus text numerical part
  union of: Corpus video part
range: langString

capturing device type
type: ObjectProperty
comment: Provides information on the type of the transducers through which the data is captured
domain: Class
  union of: Corpus audio part
  union of: Corpus image part
  union of: Corpus text numerical part
  union of: Corpus video part
range: Capturing device type

capturing device type details
type: DatatypeProperty
comment: Provides further information on the capturing device
domain: Class
  union of: Corpus audio part
  union of: Corpus image part
  union of: Corpus text numerical part
  union of: Corpus video part
range: langString

capturing environment
type: ObjectProperty
comment: Specifies the type of the capturing environment
domain: Class
  union of: Corpus audio part
  union of: Corpus image part
  union of: Corpus text numerical part
  union of: Corpus video part
range: Capturing environment

case
type: Morphological type
type: NamedIndividual

category label
type: DatatypeProperty
comment: Introduces a human readable name (label) by which a classification category (e.g. text type, text genre, domain, etc.) is known
domain: Classification
range: langString
sub property of: title

character encoding
type: ObjectProperty
comment: Specifies the character encoding used for a language resource data distribution
domain: Text feature
range: Character encoding

chat text
has identifier: ClarinEl TT014
type: Text type
type: NamedIndividual

Chemical Engineering
has identifier: DDC660
type: Domain
type: NamedIndividual

Chemistry
has identifier: DDC540
type: Domain
type: NamedIndividual

child
type: Age group
type: NamedIndividual

chunking
type: Language description task
type: NamedIndividual

citation text
type: DatatypeProperty
comment: Provides the text that must be quoted for citation purposes when using a language resource
domain: Language Resource
range: langString

cites
type: ObjectProperty
comment: Links to the language resource(s) that a publication includes in its citations
domain: Document
range: Language Resource
sub property of: document related to
inverse of: is cited by

city
type: DatatypeProperty
comment: The name of the city, town or village as mentioned in the postal address of a person or organization
domain: Address
range: langString

class
type: Size unit
type: NamedIndividual

clause
type: Segmentation level
type: NamedIndividual

clause structure
type: Grammatical phenomena coverage
type: NamedIndividual

clipping rate
type: Audio quality measure included
type: NamedIndividual

clitic form
type: Lemma type
type: NamedIndividual
alternative label: inflectional form

close talk microphone
type: Capturing device type
type: NamedIndividual

closed public place
type: Recording environment
type: NamedIndividual

collocation
type: Usage type
type: NamedIndividual

colour depth
type: DatatypeProperty
comment: The number of bits used to represent the colour of a single pixel
domain: Class
  union of: Detailed image format
  union of: Detailed video format
range: int

colour space
type: ObjectProperty
comment: Defines the colour space for the video
domain: Class
  union of: Detailed image format
  union of: Detailed video format
range: Colour space

combination of modalities
type: Modality type
type: NamedIndividual
comment: Value for 'ModalityType' for language resources that include various modalities

command
type: DatatypeProperty
comment: Specifies a command line used to invoke a software component
domain: Software distribution
range: string

Commerce (Trade)
has identifier: DDC381
type: Domain
type: NamedIndividual

commercial
type: User type
type: NamedIndividual
comment: Value for 'user type' reserved for individuals affiliated with a commercial institution and the respective organisations

commercial
type: Non-speech item
type: NamedIndividual
comment: Value for non-speech item, used for commercials (advertisements)

commercial support
type: Support type
type: NamedIndividual

commercial user
type: Condition of use
type: NamedIndividual

communicate
type: NamedIndividual
type: concept
comment: The Assigner permits/prohibits the Assignees to communicate the Asset to the public

Communications
has identifier: DDC384
type: Domain
type: NamedIndividual

comparable
type: Multilinguality type
type: NamedIndividual
comment: Value for 'Multilinguality type' for resource parts or resources that consist of the similar text segments in two or more languages (e.g., a corpus of legislation texts in Greek and English)

compatible
type: Related lexicon type
type: NamedIndividual

compatible lexicon type
type: ObjectProperty
comment: Specifies the type of (external) lexicon that can be used with the grammar
domain: Language description
range: Compatible lexicon type

complex
type: Capturing environment
type: NamedIndividual

complies with
type: ObjectProperty
comment: Specifies the vocabulary/standard/best practice to which a resource is compliant with
domain: Class
  union of: Language Resource
  union of: Metadata record
range: Standard/Best practice

component
type: Parameter type
type: NamedIndividual

compound
type: Lemma type
type: NamedIndividual

compressed
type: DatatypeProperty
comment: Whether the audio, video or image is compressed or not
domain: Class
  union of: Detailed audio format
  union of: Detailed image format
  union of: Detailed video format
range: boolean

compression loss
type: DatatypeProperty
comment: Whether there is loss due to compression
domain: Class
  union of: Detailed audio format
  union of: Detailed image format
  union of: Detailed video format
range: boolean

compression name
type: ObjectProperty
comment: The name of the compression applied
domain: Class
  union of: Detailed audio format
  union of: Detailed image format
  union of: Detailed video format
range: Compression name

computational lexicon
type: LCR subclass
type: NamedIndividual
comment: A lexicon which is intended for computational purposes and thus contains words associated with information relevant for the specific purposes

Computer Science, Information & General Works
has identifier: DDC000
type: Domain
type: NamedIndividual

concept
type: Size unit
type: NamedIndividual

condition of use
type: ObjectProperty
comment: Links a licence with a specific condition/term of use imposed for accessing a language resource. It is an optional element and only to be taken as providing brief human readable information on the fact that the language resource is provided under a specific set of conditions. These correspond to the most frequently used conditions imposed by the licensor (via the specified licence). The proper exposition of all conditions and possible exceptions is to be found inside the licence text. Depositors should, hence, carefully choose the values of this field to match the licence chosen and users should carefully read that licence before using the language resource.
domain: Licence
range: Condition of use

conference
type: DatatypeProperty
comment: Introduces the name of the conference where the document being described was presented
domain: Document
range: langString

conference room
type: Recording environment
type: NamedIndividual

conforms to
type: ObjectProperty
comment: Specifies the vocabulary/scheme to which a value (e.g., as of text genre, domain, etc.) conforms to
domain: Classification
range: Classification scheme

Construction of Buildings
has identifier: DDC690
type: Domain
type: NamedIndividual

consulting firm
type: Organization role
type: NamedIndividual

contact
type: ObjectProperty
comment: Specifies the data of the person/organization/group that can be contacted for information about a language resource
domain: Language Resource
range: Actor
sub property of: is related to actor
inverse of: is contact for

content
type: Validation type
type: NamedIndividual
comment: Value for 'Validation type' indicating that the validation is performed on the contents of the resource

contributor
type: ObjectProperty
comment: Introduces the details for a person that has contributed in some way to the production of a document or resource
domain: Document
range: Person

conversation
has identifier: MS SG012
type: Speech genre
type: NamedIndividual

conversational type
type: ObjectProperty
comment: Specifies the conversational type of a multimedia resource
domain: Class
  union of: Corpus audio part
  union of: Corpus video part
range: Conversational type

coordination
type: Grammatical phenomena coverage
type: NamedIndividual

coordinator
type: ObjectProperty
comment: Introduces the organization that coordinates the project being described
domain: Project
range: Organization
alternative label: co-ordinator

copyright notice
type: DatatypeProperty
comment: Introduces a free text statement that may be included with the language resource, usually containing the name(s) of copyright holders and licensing terms
domain: Distribution
range: langString

cordis
type: Project identifier scheme
type: NamedIndividual
alternative label: rcn

corpora
type: Parameter type
type: NamedIndividual

corpus
type: Processing resource type
type: NamedIndividual
comment: Value for 'Resource type' for corpora, i.e. sets of datafiles (e.g., texts, audio recordings, videos, images, photographs, etc.)

corpus subclass
type: ObjectProperty
comment: Introduces a classification of corpora into types (used for descriptive reasons)
domain: Corpus
range: Corpus subclass

cost
type: ObjectProperty
comment: Introduces the cost for accessing a resource or the overall budget of a project, formally described as a set of amount and currency unit
domain: Class
  union of: Distribution
  union of: Project
range: Cost

country
type: ObjectProperty
comment: Introduces the name of the country mentioned in the postal address of a person or organization as defined in the list of values of ISO 3166
domain: Address
range: Country

country of registration
type: ObjectProperty
comment: Introduces the country in which an organization was officially registered for the first time as a legal entity
domain: Class
  union of: Division
  union of: Organization
range: Country

creation details
type: DatatypeProperty
comment: Provides additional information on the creation of a language resource
domain: Class
  union of: Lexical/Conceptual resource
  union of: Media part
range: langString

creation end date
type: DatatypeProperty
comment: The date in which the process of creating a resource was completed
domain: Language Resource
range: date

creation mode
type: ObjectProperty
comment: Specifies whether the resource was created automatically or in a manual or interactive mode
domain: Class
  union of: Lexical/Conceptual resource
  union of: Media part
range: Process mode
sub property of: process mode

creation start date
type: DatatypeProperty
comment: The date in which the process of creating the resource started
domain: Language Resource
range: date
note: how do we handle cases where a resource was created, for instance, in 2000? Is this the start or end date?

credit card number
type: Speech item
type: NamedIndividual

cross-reference
type: Semantic type
type: NamedIndividual

cross talk
type: Audio quality measure included
type: NamedIndividual

culture
has identifier: Clarin Domain004
type: Domain
type: NamedIndividual

currency
type: ObjectProperty
comment: Specifies the currency used for describing the cost of a resource
domain: Cost
range: Currency

data
type: Parameter type
type: NamedIndividual

data evaluator
type: Organization role
type: NamedIndividual

data format
type: ObjectProperty
comment: Indicates the format(s) of a data resource
domain: Class
  union of: Detailed audio format
  union of: Text feature
  union of: Numerical text feature
  union of: Detailed image format
  union of: Parameter
  union of: Detailed video format
range: DataFormat

daylight
type: Scene illumination
type: NamedIndividual

debate
has identifier: MS SG013
type: Speech genre
type: NamedIndividual

default value
type: DatatypeProperty
comment: Used for parameters that take a list of values in order to indicate the default value(s)
domain: Parameter
range: string

defence
has identifier: ELG Domain010
type: Domain
type: NamedIndividual

definition
type: Semantic type
type: NamedIndividual
alternative label: gloss

parsing of definitions
type: Language description task
type: NamedIndividual

degree
type: Morphological type
type: NamedIndividual

demo location
type: DatatypeProperty
comment: Specifies the URL where a user can access the demo of a tool/service
domain: Software distribution
range: anyURI

demo resource
type: Documentation type
type: NamedIndividual
comment: Value for 'DocumentationType' used for demos of a resource available usually through the internet (e.g., video demos)

dental prosthesis
type: Vocal tract condition
type: NamedIndividual

department
type: Division category
type: NamedIndividual

dependent language resource
type: ObjectProperty
comment: Links to LR B that requires LR A (the one being described) for its operation or that has been processed with LR A
domain: Language Resource
range: Language Resource
sub property of: is related to Language Resource
inverse of: depends on

depends on
type: ObjectProperty
type: SymmetricProperty
comment: Links to LR B that is required for the operation of LR A (the one being described) or that has been used in its processing
domain: Language Resource
range: Language Resource
sub property of: is related to Language Resource
alternative label: supporting resource

derivation
type: Morphological type
type: NamedIndividual

type of described entity
type: ObjectProperty
comment: Links to the entity that is being described by a metadata record
domain: Metadata record
range: type of described entity
note: foaf:primaryTopic in DCAT

describes
type: ObjectProperty
comment: Links to the language resource(s) that are described (contents, operation, etc.) in a document
domain: Document
range: Language Resource
sub property of: documents
inverse of: is described by

description
type: DatatypeProperty
comment: Introduces a short free-text account that provides information about the resource (e.g., function, contents, technical information, etc.)
domain: Language Resource
range: langString
sub property of: description
note: Add some link to datacite:hasDescription and descriptionType:abstract (always for language resources). The rest of the values of descriptionType make sense mainly for publications, but this handling allows easier extension at a later time. But note that there is no class datacite:Description; descriptionType is in range of anything that "hasDescriptionType"

diagnostic
type: Evaluation level
type: NamedIndividual

dialect
type: Language variety type
type: NamedIndividual
comment: Value for 'LanguageVarietyType' used for a particular form of a language which is peculiar to a specific region or social group

dialect accent
type: DatatypeProperty
comment: Provides information on the dialect accent of the participant
domain: Participant
range: langString

dialect accent of participants
type: DatatypeProperty
comment: Provides information on the dialect accent of the group of participants
domain: Class
  union of: Corpus audio part
  union of: Corpus image part
  union of: Corpus text numerical part
  union of: Corpus video part
range: langString

dialogue
type: Conversational type
type: NamedIndividual

dictionary
type: LCR subclass
type: NamedIndividual
comment: A book or electronic resource that contains a list of words (usually in alphabetical order) and explains their meanings, or gives a word for them in another language and other information (e.g., spelling, pronunciation, etc.)

digest
type: DatatypeProperty
comment: Links a docker image to the sha256 hash (used for selecting the appropriate version)
domain: Software distribution
range: string

diphone
type: Segmentation level
type: NamedIndividual

diphone
type: Size unit
type: NamedIndividual

disaster management
has identifier: ELG Domain005
type: Domain
type: NamedIndividual

discipline
type: DatatypeProperty
comment: Introduces an academic field of study or research area that a person, group or organization is expert in
domain: Class
  union of: Division
  union of: Group
  union of: Organization
  union of: Person
range: langString
alternative label: area of expertise
alternative label: research area
example: computer programming, translation and interpreting, linguistics, ...

discourse marker
type: Annotated element
type: NamedIndividual

discussion
has identifier: PAROLE G005
type: Text genre
type: NamedIndividual

discussion forum
type: Support type
type: NamedIndividual

discussion URL
type: DatatypeProperty
comment: Links to a URL where there's a discussion thread (e.g., user forum) about a resource
domain: Language Resource
range: anyURI

displays
type: ObjectProperty
comment: Links a tool/service B that is (or can be) used to display LR A (e.g., a tool for visualizing relations in a lexicon, or annotations in a corpus) to the LR A
domain: Language Technology tool/service
range: Class
  union of: Data language resource
  union of: Media part
sub property of: LT tool/service related to
inverse of: is displayed by
alternative label: visualises
alternative label: visualizes

distractor
type: DatatypeProperty
comment: Identifies any distractors visible in the resource
domain: Dynamic element
range: langString

distribution
type: ObjectProperty
comment: Links a language resource to the various forms with which it is distributed
domain: Language Resource
range: Distribution

audio feature
type: ObjectProperty
comment: Links to a feature that can be used for describing distinct distributable forms of audio resources/parts
domain: Dataset distribution
range: Audio feature

distribution form
type: ObjectProperty
comment: Specifies the form (medium/channel) with which a resource is distributed (delivered or provided access to)
domain: Distribution
range: Distribution form

image feature
type: ObjectProperty
comment: Links to a feature that can be used for describing distinct distributable forms of image resources/parts
domain: Dataset distribution
range: Image feature

distribution location
type: DatatypeProperty
comment: A URL point from which a language resource can be directly accessed (downloaded or executed)
domain: Distribution
range: anyURI

distribution rights holder
type: ObjectProperty
comment: Identifies a person or an organization that holds the distribution rights. The range and scope of distribution rights is defined in the distribution agreement. The distributor in most cases only has a limited licence to distribute the work and collect royalties on behalf of the licensor or the IPR holder and cannot give to any recipient of the work permissions that exceed the scope of the distribution agreement (e.g., to allow uses of the work that are not defined in the distribution agreement)
domain: Distribution
range: Actor
sub property of: is related to actor
inverse of: is distribution rights holder of

text feature
type: ObjectProperty
comment: Links to a feature that can be used for describing distinct distributable forms of text resources/parts
domain: Dataset distribution
range: Text feature

numerical text feature
type: ObjectProperty
comment: Links to a feature that can be used for describing distinct distributable forms of numerical text resources/parts
domain: Dataset distribution
range: Numerical text feature

video feature
type: ObjectProperty
comment: Links to a feature that can be used for describing distinct distributable forms of video resources/parts
domain: Dataset distribution
range: Video feature

division alternative name
type: DatatypeProperty
comment: Introduces an alternative name (other than the short name) used for a division
domain: Division
range: langString
sub property of: alternative

division category
type: ObjectProperty
comment: Classifies the division of an organization according to a controlled vocabulary
domain: Division
range: Division category

division name
type: DatatypeProperty
comment: The official title of a unit of an organization (e.g., faculty or department of a university, department of a research organization or private company, etc.)
domain: Division
range: langString
sub property of: title

division short name
type: DatatypeProperty
comment: Introduces the short name (abbreviation, acronym, etc.) used for the division of an organization
domain: Division
range: langString
sub property of: alternative

docker download location
type: DatatypeProperty
comment: A location where the software in the form of a docker image can be downloaded from
domain: Language Technology tool/service
range: string
sub property of: download location

docker image
type: Software distribution form
type: NamedIndividual
comment: Value for software distribution form, used for software objects distributed as Docker images, i.e. packaged together with all their dependencies and ready to be executed

document
type: Parameter type
type: NamedIndividual

document related to
type: ObjectProperty
comment: Links to the entity (language resource, project, part of a language resource) that is somehow related to the document that is described
domain: Document
range: Class
  union of: Language Resource
  union of: Project
sub property of: is related to
inverse of: is related to document

document type
type: ObjectProperty
comment: Specifies the type of the document (e.g., article, book, etc.) provided with or related to the language resource
domain: Document
range: Document type

documentation type
type: ObjectProperty
comment: Classifies the documentation vis-a-vis its relation with the language resource (e.g., general publication, user manual, url for online help, etc.)
domain: Document
range: Documentation type

documents
type: ObjectProperty
comment: Links a document to a language resource (e.g., research paper describing its contents or its use in a project, user manual, etc.)
domain: Document
range: Language Resource
sub property of: document related to
inverse of: is documented by

documents annotation
type: ObjectProperty
comment: Links a report to the annotation process, tool, method, etc. of a language resource that it describes
domain: Document
range: Annotation
sub property of: documents

documents evaluation
type: ObjectProperty
comment: Links a report to the evaluation process, tool, method, etc. of the tool or service it purports to describe
domain: Document
range: Evaluation
sub property of: documents
inverse of: evaluation report

documents guidelines
type: ObjectProperty
comment: Links the guidelines used for the creation or annotation of a language resource to this language resource
domain: Document
range: Class
  union of: Annotation
  union of: Language Resource
sub property of: documents
inverse of: guidelines

documents usage
type: ObjectProperty
comment: Links a document (e.g., research article, report) describing the use of a language resource (e.g., in a project, application, experiment or use case) to the data of this use
domain: Document
range: Actual use
sub property of: documents
inverse of: usage report

documents validation
type: ObjectProperty
comment: Links a document with detailed information on the validation process and results to the data of this validation
domain: Document
range: Validation
sub property of: documents
inverse of: validation report

domain
type: ObjectProperty
comment: Identifies the domain according to which an entity is classified
domain: Class
  union of: Actor
  union of: Division
  union of: Document
  union of: Language Resource
  union of: Input content resource
  union of: Project
range: Domain

domain
type: Semantic type
type: NamedIndividual

download location
type: DatatypeProperty
comment: A URL where the language resource (mainly data but also downloadable software programmes or forms) can be downloaded from
domain: Distribution
range: anyURI
sub property of: distribution location
note: rule: must be filled in when SoftwareDistributionForm = downloadable; must not be filled in for web services; optional in all other cases

downloadable
type: Dataset distribution form
type: NamedIndividual
comment: Value for distribution medium, used for language resources that can be downloaded from a remote location

draft
type: Version type
type: NamedIndividual
comment: Value for 'Version type' used for versions during the writing up process

drop
type: Previous annotation types policy
type: NamedIndividual

duration of audio
type: ObjectProperty
comment: Specifies the duration of the audio recording including silences, music, pauses, etc.
domain: Dataset distribution
range: Duration of audio

duration of effective speech
type: ObjectProperty
comment: Specifies the duration of effective speech of the audio (part of a) resource
domain: Dataset distribution
range: Duration of audio

duration unit
type: ObjectProperty
comment: Specifies the unit used for measuring the duration of a resource
domain: Duration of audio
range: Duration unit

DV
type: Recording device type
type: NamedIndividual

dynamic element
type: ObjectProperty
comment: Groups information on the dynamic elements that are represented in the video part of the resource
domain: Class
  union of: Corpus video part
  union of: Language description video part
  union of: Lexical/Conceptual resource video part
range: Dynamic element
note: it was like this in MS-OWL v1, although it's not multiple; helps to organise the elements though

EAN 13
has URL: https://en.wikipedia.org/wiki/International_Article_Number
type: Document identifier scheme
type: NamedIndividual
comment: Value for resourceIdentifierSchemeName, referring to EAN (International Article Number, also known as European Article Number) and more specifically to the EAN 13 standard (cf. https://en.wikipedia.org/wiki/International_Article_Number)
alternative label: European Article Number 13 standard

Earth Sciences & Geology
has identifier: DDC550
type: Domain
type: NamedIndividual

EC max contribution
type: ObjectProperty
comment: Introduces the maximum amount of money contributed from EC funds
domain: Project
range: Cost

Economics
has identifier: DDC330
type: Domain
type: NamedIndividual

edition
type: DatatypeProperty
comment: Introduces the number of the edition for the document that has been described
domain: Document
range: string

editor
type: ObjectProperty
comment: Introduces the details for a person that has edited the document being described
domain: Document
range: Person

edits
type: ObjectProperty
comment: Links a tool/service B that is (or can be) used for editing LR A (the one being described) to LR A
domain: Language Technology tool/service
range: Class
  union of: Data language resource
  union of: Media part
sub property of: LT tool/service related to
inverse of: is edited by

Education
has identifier: DDC370
type: Domain
type: NamedIndividual

education level
type: DatatypeProperty
comment: Provides information on the education level of the participant
domain: Participant
range: langString

e-ISSN
has URL: https://en.wikipedia.org/wiki/International_Standard_Serial_Number
type: Document identifier scheme
type: NamedIndividual
comment: Value for resourceIdentifierSchemeName, referring to the e-ISSN (electronic International Standard Serial Number, https://en.wikipedia.org/wiki/International_Standard_Serial_Number)

elderly
type: Age group
type: NamedIndividual

element
type: Size unit
type: NamedIndividual

ELG
type: AgentIdentifierScheme
type: Funder identfier scheme
type: Organization identifier scheme
type: Person identfier scheme
type: Document identifier scheme
type: LR identifier scheme
type: Licence identifier scheme
type: Metadata record identifier scheme
type: Project identifier scheme
type: Repository identifier scheme
type: NamedIndividual
comment: European Language Grid identifier scheme (used for internal purposes)

elicited
type: Naturality
type: NamedIndividual

email
type: DatatypeProperty
comment: Points to the email address of a person, organization or group
domain: Class
  union of: Affiliation
  union of: Division
  union of: Group
  union of: Organization
  union of: Person
range: string

email text
has identifier: ClarinEl TT016
type: Text type
type: NamedIndividual

embedded microphone
type: Capturing device type
type: NamedIndividual

emotional expressive
has identifier: MS SG007
type: Speech genre
type: NamedIndividual

encoding level
type: ObjectProperty
comment: Classifies the contents of a lexical/conceptual resource or language description as regards the linguistic level of analysis it caters for
domain: Class
  union of: Language description
  union of: Lexical/Conceptual resource
range: Encoding level

encyclopaedic text
has identifier: ClarinEl TT003
type: Text type
type: NamedIndividual

energy
has identifier: ELG Domain002
type: Domain
type: NamedIndividual

Energy
has identifier: Clarin Domain001
type: Domain
type: NamedIndividual

Engineering
has identifier: DDC620
type: Domain
type: NamedIndividual

entry
type: Size unit
type: NamedIndividual

Environment
has identifier: Clarin Domain002
type: Domain
type: NamedIndividual

EU funds
type: Funding type
type: NamedIndividual
comment: Value for 'Funding type' for projects with EU funds

euro
type: Currency
type: NamedIndividual

evaluated
type: DatatypeProperty
comment: Indicates whether the tool or service has been evaluated
domain: Language Technology tool/service
range: boolean

evaluation
type: ObjectProperty
comment: Provides information on the evaluation process and results for a tool/service
domain: Language Technology tool/service
range: Evaluation

evaluation criterion
type: ObjectProperty
comment: Defines the criterion(s) of the evaluation of a tool
domain: Evaluation
range: Evaluation criterion

evaluation details
type: DatatypeProperty
comment: Provides further information on the evaluation process of a tool or service
domain: Evaluation
range: langString

evaluation level
type: ObjectProperty
comment: Indicates the evaluation level
domain: Evaluation
range: Evaluation level

evaluation measure
type: ObjectProperty
comment: Defines whether the evaluation measure is human or automatic
domain: Evaluation
range: Evaluation measure

evaluation report
type: ObjectProperty
comment: Links to a report describing the evaluation process, tool, method, etc. of the tool or service
domain: Evaluation
range: Document
sub property of: is documented by

evaluation type
type: ObjectProperty
comment: Indicates the evaluation type
domain: Evaluation
range: Evaluation type

evaluation use
type: Condition of use
type: NamedIndividual
comment: Value for 'ConditionOfUse' that states that the language resource can only be used for evaluation purposes
note: add odrl

evaluator
type: ObjectProperty
comment: Describes the person or organization that evaluated the tool or service
domain: Evaluation
range: Actor
sub property of: is related to actor
inverse of: is evaluator of

event description
type: DatatypeProperty
comment: Provides description of any events represented in the image corpus
domain: Static element
range: langString

event type
type: Semantic type
type: NamedIndividual

example
type: Extratextual information unit
type: NamedIndividual

example
type: Usage type
type: NamedIndividual

executable code
type: Software distribution form
type: NamedIndividual
comment: Value for software distribution form, used for software objects available as binary files already compiled and ready to be executed

execution location
type: DatatypeProperty
comment: A URL where the resource (mainly software) can be directly executed
domain: Software distribution
range: anyURI
sub property of: distribution location
note: rule: must be filled in when SoftwareDistributionMedium = webService; otherwise, not to be filled in

expression
type: Size unit
type: NamedIndividual

external reference
type: ObjectProperty
comment: Provides reference to another resource to which the lexicalConceptualResource is linked (e.g., link to a wordnet or ontology)
domain: Lexical/Conceptual resource
range: Lexical/Conceptual resource

extratextual information
type: ObjectProperty
comment: Indicates the extratextual information contained in a lexical/conceptual resource; it can be used as an alternative to the representation of the audio, image, video, etc. part(s) of the resource when these are not considered important enough to fully describe
domain: Lexical/Conceptual resource
range: Extratextual information

extratextual information unit
type: ObjectProperty
comment: Indicates the unit on which the extratextual information is attached to in the lexical conceptual resource
domain: Lexical/Conceptual resource
range: Extratextual information unit

extrinsic
type: Evaluation criterion
type: NamedIndividual

eye movement
type: DatatypeProperty
comment: Indicates the movement of the eyes visible in the resource
domain: Dynamic element
range: langString

face
type: Body part
type: NamedIndividual

face expression
type: DatatypeProperty
comment: Indicates the facial expressions visible in the resource
domain: Class
  union of: Dynamic element
  union of: Static element
range: langString

face to face conversation
has identifier: ClarinEl TT013
type: Text type
type: NamedIndividual
alternative label: face-to-face conversation

face view
type: DatatypeProperty
comment: Indicates the view of the face(s) that appear in the video or on the image part of the resource
domain: Class
  union of: Dynamic element
  union of: Static element
range: langString

facebook
type: Social media account occupational type
type: NamedIndividual

facial expression
type: Modality type
type: NamedIndividual
comment: Value for 'ModalityType' for facial expressions represented in a language resource

factor
type: DatatypeProperty
comment: A factor that has been used for the n-gram resource
domain: N-gram model
range: string

faculty
type: Division category
type: NamedIndividual

farfield microphone
type: Capturing device type
type: NamedIndividual

fax number
type: DatatypeProperty
comment: Introduces the fax number of a person, group or organization; recommended format: +_international code_city code_number without spaces
domain: Class
  union of: Division
  union of: Group
  union of: Organization
  union of: Person
range: string
example: +123456789012

feature
has identifier: PAROLE G001
type: Text genre
type: NamedIndividual

fee
type: DatatypeProperty
comment: Describes in free the costs that are required to use the resource, a fragment of the resource or to use a tool or service
domain: Distribution
range: langString
note: pricing policy can be a more generic concept; discuss if we want to formalise this

female
type: Sex
type: NamedIndividual

few
type: Audience
type: NamedIndividual

fiction
has identifier: PAROLE G006
type: Text genre
type: NamedIndividual

fidelity
type: DatatypeProperty
comment: Defines whether blur is present in the moving sequences
domain: Detailed video format
range: boolean

file
type: Size unit
type: NamedIndividual

file
type: Processing resource type
type: NamedIndividual

finance
has identifier: ELG Domain016
type: Domain
type: NamedIndividual

5-gram
type: Size unit
type: NamedIndividual

fix
type: Scene illumination
type: NamedIndividual

FLAC
type: Compression name
type: NamedIndividual
alternative label: Free Lossless Audio Codec

flash
type: Recording device type
type: NamedIndividual

float
type: Parameter type
type: NamedIndividual

floating point
type: Sign convention
type: NamedIndividual

foot
type: Body part
type: NamedIndividual

foreign affairs
has identifier: ELG Domain012
type: Domain
type: NamedIndividual

formal
type: Validation type
type: NamedIndividual
comment: Value for 'Validation type' indicating that the validation is performed on formal aspects of the resource (e.g., size, syntactic validation, etc.)

formalism
type: DatatypeProperty
comment: Specifies the formalism (bibliographic reference, URL, name) used for the creation/enrichment of the resource (grammar or tool/service)
domain: Class
  union of: Language description
  union of: Language Technology tool/service
range: langString

4-gram
type: Size unit
type: NamedIndividual

frame
type: Segmentation level
type: NamedIndividual

frame
type: Size unit
type: NamedIndividual

FrameNet
type: Compatible lexicon type
type: LCR subclass
type: NamedIndividual
comment: A lexical database based on annotating examples of how words are used in actual texts in accordance to the notion of 'semantic frame' (schematic representation of a situation involving various participants, props and other conceptual roles); originally built for English and extended to other languages according to the same design principles

frame rate
type: DatatypeProperty
comment: The number of frames per second
domain: Detailed video format
range: int

framework
type: ObjectProperty
comment: Specifies the implementation framework used for developing and running a tool/service
domain: Language Technology tool/service
range: Framework

free speech
type: Speech item
type: NamedIndividual

free support
type: Support type
type: NamedIndividual

frequency
type: Usage type
type: NamedIndividual

frog story
type: Scenario type
type: NamedIndividual

full
type: Validation extent
type: NamedIndividual

function
type: ObjectProperty
comment: Specifies the operation/function/task that a software object performs
domain: Language Technology tool/service
range: Operation
alternative label: operation
alternative label: task

funder
type: ObjectProperty
comment: Identifies the person or organization or group that has financed the project
domain: Project
range: Actor
sub property of: is related to actor
inverse of: is funder of

funding authority
type: Organization legal status
type: NamedIndividual

funding country
type: ObjectProperty
comment: Specifies the name of the funding country, in case of national funding as mentioned in ISO3166
domain: Project
range: Country

funded by
type: ObjectProperty
comment: Links a language resource to the project that has funded its creation, enrichment, extension, etc.
domain: Language Resource
range: Project
sub property of: is related to project
inverse of: is funding project of
alternative label: funding project

funding scheme category
type: DatatypeProperty
comment: Introduces a category (usually defined by the funding authority) of the funding scheme to which a project complies
domain: Project
range: string

funding type
type: ObjectProperty
comment: Specifies the type of funding of a project with regard to the source of the funding
domain: Project
range: Funding type

galaxy workflow
type: Software distribution form
type: NamedIndividual
comment: Value for software distribution form, used for software workflows created with the Galaxy workflow engine

gb
type: Size unit
type: NamedIndividual
alternative label: gigabyte

gender
type: Morphological type
type: NamedIndividual

General
has identifier: Clarin Domain003
type: Domain
type: NamedIndividual

general documentation
type: Documentation type
type: NamedIndividual
comment: Value for 'Documentation type' used for documents that describe a language resource or some aspect of it

generation
type: Language description task
type: NamedIndividual

genre
type: ObjectProperty
comment: Links a language resource (part) to the genre it belongs to
domain: Corpus part
range: Genre

geographic coverage
type: DatatypeProperty
comment: Indicates the geographic region that the content of a resource is about; for countries, recommended use of ISO-3166
domain: Class
  union of: Corpus
  union of: Language description
  union of: Lexical/Conceptual resource
  union of: Subset
range: langString
note: string or Location (iso3166) and geographic coordinates?

geographic distribution of participants
type: DatatypeProperty
comment: Gives information on the geographic distribution of the participants
domain: Class
  union of: Corpus audio part
  union of: Corpus image part
  union of: Corpus text numerical part
  union of: Corpus video part
range: langString

Geography & Travel
has identifier: DDC910
type: Domain
type: NamedIndividual

gesture
type: DatatypeProperty
comment: Indicates the type of gestures visible in the resource
domain: Dynamic element
range: langString

GitHub
type: Social media account occupational type
type: NamedIndividual

GitLab
type: Social media account occupational type
type: NamedIndividual

given name
type: DatatypeProperty
comment: Introduces the given name (also known as "first name") of a person
domain: Person
range: langString
alternative label: first name
alternative label: forename

glass box
type: Evaluation type
type: NamedIndividual

gold standard location
type: DatatypeProperty
comment: Links to the URL where a gold standard resource can be found in order to be used for evaluation purposes
domain: Evaluation
range: anyURI
sub property of: has URL

Google Chrome OS
type: operating system
type: NamedIndividual

grammatical phenomena coverage
type: ObjectProperty
comment: Gives an indication of the grammatical phenomena covered by the grammar
domain: Language description
range: Grammatical phenomena coverage

grant number
type: DatatypeProperty
comment: Specifies an identification number usually issued by the funding authority and referring uniquely to the project that has received the funding
domain: Project
range: string

Graphic Arts & Decorative Arts
has identifier: DDC740
type: Domain
type: NamedIndividual

graphic card
type: Required hardware
type: NamedIndividual

GRID
has URL: https://www.grid.ac/
type: Organization identifier scheme
type: NamedIndividual
comment: GRID identifier scheme (Global Research Identifier Database, https://www.grid.ac/)

group
type: Division category
type: NamedIndividual

guidelines
type: Documentation type
type: NamedIndividual
type: ObjectProperty
comment: Links to the document used as guidelines for the creation or annotation of a corpus
domain: Class
  union of: Annotation
  union of: Language Resource
range: Document
sub property of: is documented by

hand
type: Body part
type: NamedIndividual

hand arm movement
type: DatatypeProperty
comment: Indicates the movement of hands and/or arms visible in the resource
domain: Dynamic element
range: langString

hand manipulation
type: DatatypeProperty
comment: Gives information on the manipulation of objects by hand
domain: Dynamic element
range: langString

hard disk
type: Dataset distribution form
type: NamedIndividual
comment: Value for data distribution medium, used for resources that are delivered on a hard disk

hard disk
type: Recording device type
type: NamedIndividual

Hardware & Household Appliances
has identifier: DDC683
type: Domain
type: NamedIndividual

has aligned version
type: ObjectProperty
comment: Links to a corpus B which contains an aligned version of corpus A (the one being described)
domain: Corpus
range: Corpus
sub property of: has version
inverse of: is aligned version of

has analysed
type: ObjectProperty
comment: Links a tool/service B that is (or can be or has been) used for analysing LR A (e.g., a statistical tool) to LR A
domain: Language Technology tool/service
range: Class
  union of: Data language resource
  union of: Media part
sub property of: LT tool/service related to
inverse of: is analysed by

has annotated
type: ObjectProperty
comment: Links a tool/service B that has been used for annotating LR A (e.g., a tagger, NER, etc.) to LR A
domain: Language Technology tool/service
range: Annotation
sub property of: LT tool/service related to
inverse of: is annotated by

has annotated version
type: ObjectProperty
comment: Links to a corpus B which contains the annotations of corpus A (the one being described)
domain: Corpus
range: Corpus
sub property of: has version
inverse of: is annotated version of

has archived
type: ObjectProperty
comment: Links a tool/service B that is (or can be or has been) used for archiving LR A to LR A
domain: Language Technology tool/service
range: Data language resource
sub property of: LT tool/service related to
inverse of: is archived by

has converted version
type: ObjectProperty
comment: Links to LR B that has been used for creating LR A (the one being described) through a conversion procedure, e.g., a PDF to text conversion
domain: Data language resource
range: Data language resource
sub property of: has version
inverse of: is converted version of

has created
type: ObjectProperty
comment: Links a tool/service B that is (or can be or has been) used for creating LR A to LR A
domain: Language Technology tool/service
range: Class
  union of: Data language resource
  union of: Media part
sub property of: LT tool/service related to
inverse of: is created by

has division
type: ObjectProperty
comment: Links an organization to the division(s) (e.g., company branch, university faculty or department, etc.) it consists of
domain: Organization
range: Division
inverse of: is division of

has elicited
type: ObjectProperty
comment: Links a tool/service B that is (or can be or has been) used for eliciting LR A to LR A
domain: Language Technology tool/service
range: Class
  union of: Data language resource
  union of: Media part
sub property of: LT tool/service related to
inverse of: is elicited by

has evaluated
type: ObjectProperty
comment: Links a tool/service that has been used for evaluating an LR A to the data of this evaluation
domain: Language Technology tool/service
range: Evaluation
sub property of: LT tool/service related to
inverse of: is evaluated by

has metadata
type: ObjectProperty
comment: Links to an external metadata record that describes the same language resource in another catalogue, repository, etc.
domain: Language Resource
range: Metadata record
sub property of: is related to metadata record
inverse of: is metadata of

has original source
type: ObjectProperty
comment: Links a language resource to the original source that has been used for its creation, where it's derived or elicited from
domain: Class
  union of: Language Resource
  union of: Media part
range: Language Resource
sub property of: is related to Language Resource
inverse of: has outcome

has outcome
type: ObjectProperty
comment: Links to LR B which is created / extracted from LR A (the one being described), i.e. LR A has been used as the basis/initial/source material for LR B
domain: Actual use
range: Language Resource
sub property of: is related to Language Resource
alternative label: is source of

has part
type: ObjectProperty
comment: Links to LR B which is contained in LR A (the one being described), e.g., a monolingual corpus part of a bilingual corpus
domain: Language Resource
range: Language Resource
sub property of: is related to Language Resource
inverse of: is part of

has recorded
type: ObjectProperty
comment: Links a tool/service to the data of the language resource (e.g., audio or video part of a corpus) it has recorded
domain: Language Technology tool/service
range: Class
  union of: Corpus audio part
  union of: Corpus text numerical part
  union of: Corpus video part
sub property of: LT tool/service related to
inverse of: is recorded by

has subset
type: ObjectProperty
comment: Links to a subset of the resource that is described in order to add specific information on the subset (e.g. size per language for multilingual corpora, size per domain for lexica with multiple domains, etc.)
domain: Media part
range: Subset
note: introduced to cater for all sizePer properties; decided not to use the isPartOf because I wanted to keep this for "whole" language resources

has validated
type: ObjectProperty
comment: Links a tool/service B that is (or can be) used for validating LR A to the data of this validation
domain: Language Technology tool/service
range: Validation
sub property of: LT tool/service related to
inverse of: is validated by

has version
type: ObjectProperty
comment: Links to LR B that is a version of LR A (the one being described)
domain: Language Resource
range: Language Resource
sub property of: is related to Language Resource
inverse of: is version of

head
type: Body part
type: NamedIndividual

head movement
type: DatatypeProperty
comment: Indicates the movements of the head visible in the resource
domain: Dynamic element
range: langString

address (head office)
type: ObjectProperty
comment: Links to the physical address of the head office of an organization or group represented as a set of distinct elements (street, zip code, city, etc.)
domain: Class
  union of: Affiliation
  union of: Division
  union of: Group
  union of: Organization
range: Address
sub property of: address

health
has identifier: ELG Domain009
type: Domain
type: NamedIndividual

hearing impairment
type: DatatypeProperty
comment: Provides information on any hearing impairment the participant may have
domain: Participant
range: langString

hearing impairment of participants
type: ObjectProperty
comment: Specifies whether the group of participants contains persons with hearing impairments
domain: Class
  union of: Corpus audio part
  union of: Corpus image part
  union of: Corpus text numerical part
  union of: Corpus video part
range: Hearing impairment of participants

height
type: DatatypeProperty
comment: Provides information on the height of the participant in cm
domain: Participant
range: int

high
type: Recording quality
type: NamedIndividual

high
type: Quality
type: NamedIndividual

high
type: Noise level
type: NamedIndividual

History
has identifier: DDC900
type: Domain
type: NamedIndividual

Home & Family Management
has identifier: DDC640
type: Domain
type: NamedIndividual

home page
type: DatatypeProperty
comment: Links to a URL that includes information on a person (e.g., CV, publications, communication information, etc.)
domain: Person
range: anyURI
sub property of: has URL

honorific prefix
type: DatatypeProperty
comment: Introduces a honorific prefix (or title) such as Dr./Mr/Ms. that precedes the name of a person
domain: Person
range: langString
alternative label: title

hour
type: Duration unit
type: NamedIndividual

hour
type: Size unit
type: NamedIndividual

human
type: Evaluation measure
type: NamedIndividual

human non speech
has identifier: MS AG001
type: Audio genre
type: NamedIndividual

hyperbaric
type: Speech influence
type: NamedIndividual

hyperonym
type: Semantic type
type: NamedIndividual

hyponym
type: Semantic type
type: NamedIndividual

iOS
type: operating system
type: NamedIndividual

idiomatic expression
type: Size unit
type: NamedIndividual

image
type: Media type
type: NamedIndividual
comment: Value for 'Media type' for the for of a language resource (part) consisting of visual representations (e.g., pictures, photos)

image
type: Extratextual information
type: NamedIndividual

image
type: Size unit
type: NamedIndividual

image
type: DatatypeProperty
comment: Links to a URL with an image file (e.g., a photo, or cartoon image) that is used for identifying a person (e.g., on a home page)
domain: Person
range: anyURI

detailed image format
type: ObjectProperty
comment: Provides information on each of the format(s) of the image part of a resource
domain: Dataset distribution
range: Detailed image format

impact
type: Evaluation level
type: NamedIndividual

implementation language
type: DatatypeProperty
comment: The programming language(s) used for the development of a tool/service, which is needed for running the tools/services, in case no executables are available
domain: Language Technology tool/service
range: string

in book
type: Document type
type: NamedIndividual

in car
type: Recording environment
type: NamedIndividual

in collection
type: Document type
type: NamedIndividual

in proceedings
type: Document type
type: NamedIndividual

included
type: Related lexicon type
type: NamedIndividual

incorporate
type: NamedIndividual
type: concept
comment: The Assigner permits/prohibits the Assignees to incorporate the Asset unmodified into a Collective Work.
broader transitive: use

industrial
type: Recording environment
type: NamedIndividual

inflection
type: Morphological type
type: NamedIndividual

inform licensor
type: Condition of use
type: NamedIndividual
type: Set
comment: Value for 'ConditionOfUse' which states that users must inform the licensor as to the kind of use they intend to make of the resource
permission:
  duty:
    action: Notify

information
has identifier: PAROLE G003
type: Text genre
type: NamedIndividual

ingested record
type: Size unit
type: NamedIndividual

input content resource
type: ObjectProperty
comment: Specifies the requirements set by a tool/service for the (content) resource that it processes
domain: Language Technology tool/service
range: Input content resource

installation manual
type: Documentation type
type: NamedIndividual
comment: Value for 'Documentation type' used for documents that contain instructions on how to install a software

institute
type: Division category
type: NamedIndividual

instruction
has identifier: PAROLE G004
type: Text genre
type: NamedIndividual

instrumental music
has identifier: MS AG005
type: Audio genre
type: NamedIndividual

insurance
has identifier: ELG Domain006
type: Domain
type: NamedIndividual

integer
type: Parameter type
type: NamedIndividual

intended application
type: ObjectProperty
comment: Specifies an LT application for which the language resource has been created or for which it can be used or is recommended to be used
domain: Language Resource
range: Operation

interaction
type: DatatypeProperty
comment: Specifies the parts that interact in an audio or video component
domain: Class
  union of: Corpus audio part
  union of: Corpus video part
range: langString

interactive
type: Process mode
type: NamedIndividual
comment: Value for 'Process mode' and its subclasses used for processes that include some interaction between the processing tool and the human agent performing the process

interactive
type: Interactivity
type: NamedIndividual

interactive media
type: DatatypeProperty
comment: Any interactive media visible in the resource
domain: Dynamic element
range: langString

interactivity
type: ObjectProperty
comment: Indicates the level of conversational interaction between speakers (for audio component) or participants (for video component)
domain: Class
  union of: Corpus audio part
  union of: Corpus video part
range: Interactivity

interannotator agreement
type: DatatypeProperty
comment: Provides information on the inter-annotator agreement and the methods/metrics applied
domain: Annotation
range: langString

internal record
type: Size unit
type: NamedIndividual

internet
type: Source channel
type: NamedIndividual

interpolated
type: DatatypeProperty
comment: Specifies whether the n-gram resource is interpolated (Interpolated language models are constructed by 2 or more corpora and each corpus is represented in the model according to a predefined weight)
domain: N-gram model
range: boolean

interview
has identifier: ClarinEl TT006
type: Text type
type: NamedIndividual

interview
has identifier: MS SG006
type: Speech genre
type: NamedIndividual

intra-annotator agreement
type: DatatypeProperty
comment: Provides information on the intra-annotator agreement and the methods/metrics applied
domain: Annotation
range: langString

intrinsic
type: Evaluation criterion
type: NamedIndividual

IPR holder
type: ObjectProperty
comment: A person or an organization who holds the full Intellectual Property Rights (Copyright, trademark, etc.) that subsist in the resource. The IPR holder could be different from the creator that may have assigned the rights to the IPR holder (e.g., an author as a creator assigns her rights to the publisher who is the IPR holder) and the distributor that holds a specific licence (i.e. a permission) to distribute the work via a specific distributor.
domain: Language Resource
range: Actor
sub property of: is related to actor
inverse of: is IPR holder of
alternative label: intellectual property rights holder
alternative label: rights holder

irregular form
type: Morphological type
type: NamedIndividual

is accessed by
type: ObjectProperty
comment: Links to a tool/service B that is (or can be) used for accessing LR A (the one being described), e.g., a corpus workbench, s/w for lexicon access
domain: Class
  union of: Data language resource
  union of: Media part
range: Language Technology tool/service
sub property of: is related to LT tool/service
alternative label: access tool

is aligned version of
type: ObjectProperty
comment: Links to a corpus B which is the aligned version of corpus A (the one being described)
domain: Corpus
range: Corpus
sub property of: is version of

is analysed by
type: ObjectProperty
comment: Links to a tool/service B that is (or can be or has been) used for analysing LR A (the one being described), e.g., a statistical tool
domain: Class
  union of: Data language resource
  union of: Media part
range: Language Technology tool/service
sub property of: is related to LT tool/service
alternative label: analysis tool

is annotated by
type: ObjectProperty
comment: Links to a tool/service B that has been used for annotating LR A (the one being described), e.g., a tagger, NER, etc.
domain: Annotation
range: Language Technology tool/service
sub property of: is related to LT tool/service
alternative label: annotation tool

is annotated version of
type: ObjectProperty
comment: Links to a corpus B which is the raw corpus that has been annotated (corpus A, the one being described)
domain: Corpus
range: Corpus
sub property of: is version of

is annotation resource of
type: ObjectProperty
comment: Links an annotation resource to the corpus where it has been used for annotating or to data of an annotation tool/service that has been or can be combined with
domain: Lexical/Conceptual resource
range: Class
  union of: Machine Learning model
  union of: Input content resource
  union of: Language Technology tool/service
sub property of: dependent language resource

is annotation schema of
type: ObjectProperty
comment: Links an annotation schema to the corpus where it has been used for annotating or to data of an annotation tool/service that has been or can be combined with
domain: Lexical/Conceptual resource
range: Class
  union of: Machine Learning model
  union of: Input content resource
  union of: Language Technology tool/service
sub property of: dependent language resource

is annotator of
type: ObjectProperty
comment: Identifies the resource(s) that have been annotated by the person/organization
domain: Actor
range: Annotation
sub property of: actor related to

is archived by
type: ObjectProperty
comment: Links to a tool/service B that is (or can be or has been) used for archiving LR A (the one being described)
domain: Data language resource
range: Language Technology tool/service
sub property of: is related to LT tool/service
alternative label: archiving tool

is cited by
type: ObjectProperty
comment: Links to a publication that cites the language resource described
domain: Language Resource
range: Document
sub property of: is related to document

is combined with
type: ObjectProperty
type: SymmetricProperty
comment: Links to a LR B that has been used together with LR A (the one being described) to create LR C, e.g., two monolingual wordnets/corpora aligned to produce a bilingual resource
domain: Language Resource
range: Language Resource
sub property of: is related to Language Resource

is compatible with
type: ObjectProperty
type: SymmetricProperty
comment: Links to a LR B that can be used together with LR A (the one being described), e.g., a lexicon that is compatible with a grammar
domain: Language Resource
range: Language Resource
sub property of: depends on

is contact for
type: ObjectProperty
comment: Links to the language resource(s) for which the person/organization/group can be contacted for further information
domain: Actor
range: Language Resource
sub property of: actor related to

is continuation of
type: ObjectProperty
comment: Links to LR B that forms the basis of LR A (the one being described) upon which it has continued to extend / enrich
domain: Language Resource
range: Language Resource
sub property of: is version of
inverse of: is continued by

is continued by
type: ObjectProperty
comment: Links to a LR B that extends / continues / enriches LR A (the one being described)
domain: Language Resource
range: Language Resource
sub property of: has version

is converted version of
type: ObjectProperty
comment: Links to LR B that has been the outcome of a conversion procedure from LR A (the one being described), e.g., a PDF to text conversion
domain: Data language resource
range: Data language resource
sub property of: is version of

is created by
type: ObjectProperty
comment: Links to a tool/service B that has been used for creating LR A (the one being described)
domain: Class
  union of: Data language resource
  union of: Media part
range: Language Technology tool/service
sub property of: is related to LT tool/service
alternative label: creation tool
alternative label: derivation tool

is described by
type: ObjectProperty
comment: Links to a document that describes the contents or operation of a language resource
domain: Language Resource
range: Document
sub property of: is documented by

is displayed by
type: ObjectProperty
comment: Links to a tool/service B that is (or can be) used to display LR A (the one being described), e.g., a tool for visualizing relations in a lexicon, or annotations in a corpus
domain: Class
  union of: Data language resource
  union of: Media part
range: Language Technology tool/service
sub property of: is related to LT tool/service
alternative label: display tool
alternative label: visualization tool

is distribution rights holder of
type: ObjectProperty
comment: Identifies the language resource for which a person or an organization holds the distribution rights. The range and scope of distribution rights is defined in the distribution agreement. The distributor in most cases only has a limited licence to distribute the work and collect royalties on behalf of the licensor or the IPR holder and cannot give to any recipient of the work permissions that exceed the scope of the distribution agreement (e.g., to allow uses of the work that are not defined in the distribution agreement)
domain: Actor
range: Distribution
sub property of: actor related to

is division of
type: ObjectProperty
comment: Links a division (e.g., company branch, university department or faculty) to the organization to which it belongs
domain: Division
range: Organization

is documented by
type: ObjectProperty
comment: Links a language resource to a document (e.g., research paper describing its contents or its use in a project, user manual, etc.) or any other form of documentation (e.g., a URL with support information) that is related to the resource
domain: Language Resource
range: Document
sub property of: is related to document
alternative label: documentation report

is edited by
type: ObjectProperty
comment: Links to a tool/service B that is (or can be) used for editing LR A (the one being described)
domain: Class
  union of: Data language resource
  union of: Media part
range: Language Technology tool/service
sub property of: is related to LT tool/service
alternative label: editing tool

is elicited by
type: ObjectProperty
comment: Links to a tool/service B that is (or can be or has been) used for eliciting LR A (the one being described)
domain: Class
  union of: Data language resource
  union of: Media part
range: Language Technology tool/service
sub property of: is related to LT tool/service
alternative label: elicitation tool

is evaluated by
type: ObjectProperty
comment: Links to a tool/service B that has been used to evaluate LR A (the one being described)
domain: Evaluation
range: Language Technology tool/service
sub property of: is related to LT tool/service
alternative label: evaluation tool

is evaluator of
type: ObjectProperty
comment: Identifies the tool or service(s) that a person or organization that has evaluated
domain: Actor
range: Evaluation
sub property of: actor related to

is exact match with
type: ObjectProperty
type: SymmetricProperty
comment: Links to LR B that has the same contents with LR A; they may have different names or the same name and be stored on different locations
domain: Language Resource
range: Language Resource
sub property of: is related to Language Resource
alternative label: is identical with
alternative label: is same as

is factored
type: DatatypeProperty
comment: Specifies whether the model is factored or not
domain: N-gram model
range: boolean

is funder of
type: ObjectProperty
comment: Links to the projects) that the person/organization has financed
domain: Actor
range: Project
sub property of: actor related to

is funding project of
type: ObjectProperty
comment: Links a project to the language resource(s) that it has funded (e.g., creation, enrichment, extension, etc.)
domain: Project
range: Language Resource
sub property of: project related to

is IPR holder of
type: ObjectProperty
comment: Links to the resource(s) for which a person or an organization holds the full Intellectual Property Rights (Copyright, trademark, etc.). The IPR holder could be different from the creator that may have assigned the rights to the IPR holder (e.g., an author as a creator assigns her rights to the publisher who is the IPR holder) and the distributor that holds a specific licence (i.e. a permission) to distribute the work via a specific distributor.
domain: Actor
range: Language Resource
sub property of: actor related to

is licensor of
type: ObjectProperty
comment: Links to the resource(s) which a person or organisation is legally eligible to license and actually licenses. The licensor could be different from the creator, the distributor or the IPR holder. The licensor has the necessary rights or licences to license the work and is the party that actually licenses the resource that is distributed via the specific channel. She will have obtained the necessary rights or licences from the IPR holder and she may have a distribution agreement with a distributor that disseminates the work under a set of conditions defined in the specific licence and collects revenue on the licensor's behalf. The attribution of the creator, separately from the attribution of the licensor, may be part of the licence under which the resource is distributed (as e.g., is the case with Creative Commons Licences).
domain: Actor
range: Distribution
sub property of: actor related to
inverse of: licensor

is ML model of
type: ObjectProperty
comment: Specifies the tool/service with which the ML model can be combined in order to perform the desired task
domain: Machine Learning model
range: Language Technology tool/service
sub property of: dependent language resource
inverse of: ML model
alternative label: is Machine Learning model of

is metadata creator of
type: ObjectProperty
comment: Links to the metadata record(s) that a person has created
domain: Person
range: Metadata record
sub property of: actor related to
inverse of: metadata creator

is metadata curator of
type: ObjectProperty
comment: Links to the metadata record(s) for which a person is responsible for creating, updating, enriching, etc.
domain: Person
range: Metadata record
sub property of: actor related to
inverse of: metadata curator

is metadata of
type: ObjectProperty
comment: Links an external metadata record (from another catalogue, repository, etc.) to the language resource described
domain: Metadata record
range: Language Resource
sub property of: metadata record related to

is part of
type: ObjectProperty
comment: Links to LR B which contains LR A (the one being described), e.g., a bilingual corpus that includes a monolingual corpus
domain: Language Resource
range: Language Resource
sub property of: is related to Language Resource

is part with
type: ObjectProperty
type: SymmetricProperty
comment: Links to LR B that together with LR A (the one being described) are parts of LR C
domain: Language Resource
range: Language Resource
sub property of: is related to Language Resource

participant in
type: ObjectProperty
comment: Identifies the project(s) where an organization has officially participated or participates in
domain: Organization
range: Project
sub property of: actor related to
inverse of: participating organization
example: European Language Technology Project, Machine Translation for Elderly People, ...

is queried by
type: ObjectProperty
comment: Links to a tool/service B that is (or can be) used for querying LR A (the one being described)
domain: Data language resource
range: Language Technology tool/service
sub property of: is related to LT tool/service
inverse of: queries
alternative label: query tool

is recorded by
type: ObjectProperty
comment: Links to a tool/service that has been used for recording a video or audio corpus part
domain: Class
  union of: Corpus audio part
  union of: Corpus text numerical part
  union of: Corpus video part
range: Language Technology tool/service
sub property of: is related to LT tool/service
alternative label: recording platform software
alternative label: recording tool

is recorder of
type: ObjectProperty
comment: Links to the audio or video part of the resource(s) that a person/organization has recorded
domain: Actor
range: Class
  union of: Corpus audio part
  union of: Corpus text numerical part
  union of: Corpus video part
sub property of: actor related to
inverse of: recorder

is related to
type: ObjectProperty
comment: Identifies a relation holding between two language resources or a language resource and a document or actor or, in general, a satellite entity
domain: Class
  union of: type of described entity
  union of: Metadata record
range: Class
  union of: Actor
  union of: Document
  union of: Language Resource

is related to actor
type: ObjectProperty
comment: Links to the data of an actor that bears some relation to the language resource that is described
domain: Class
  union of: Distribution
  union of: Language Resource
  union of: Metadata record
range: Actor
sub property of: is related to

is related to document
type: ObjectProperty
comment: Links to a document that is somehow related to the entity that is described
domain: Class
  union of: Language Resource
  union of: Project
range: Document
sub property of: is related to

is related to Language Resource
type: ObjectProperty
comment: Links to a language resource that holds a relation with the entity being described (without further specification of the relation type)
domain: Class
  union of: Division
  union of: Document
  union of: Group
  union of: Language Resource
  union of: Organization
  union of: Person
  union of: Project
range: Language Resource
sub property of: is related to

is related to LT tool/service
type: ObjectProperty
comment: Links to a tool/service B that bears some relation to LR A (the one being described)
domain: Data language resource
range: Language Technology tool/service
sub property of: is related to

is related to metadata record
type: ObjectProperty
comment: Links to an external metadata record that has some relation with the metadata record of the resource being described or the resource itself
domain: Class
  union of: Language Resource
  union of: Metadata record
range: Metadata record
sub property of: is related to

is related to project
type: ObjectProperty
comment: Links to a project that has some relation with the language resource that is described (e.g., has funded its creation)
domain: Language Resource
range: Project
sub property of: is related to
inverse of: project related to

is replaced with
type: ObjectProperty
comment: Links to LR B that is a newer version of LR A (the one being described) and replaces it
domain: Language Resource
range: Language Resource
sub property of: has version
inverse of: replaces

is required language resource by
type: ObjectProperty
comment: Links to a language resource that is required for the operation of a tool/service or computational grammar
domain: Class
  union of: Language description
  union of: Lexical/Conceptual resource
range: Class
  union of: Language description
  union of: Input content resource
  union of: Language Technology tool/service
sub property of: dependent language resource
inverse of: requires language resource

is resource creator of
type: ObjectProperty
comment: Links to the language resource(s) that a person/organization has created
domain: Actor
range: Language Resource
sub property of: actor related to
inverse of: resource creator

is resource provider of
type: ObjectProperty
comment: Links to a resource for which the person/organization is responsible of providing, curating and maintaining
domain: Actor
range: Language Resource
sub property of: actor related to
inverse of: resource provider

is reviewed by
type: ObjectProperty
comment: Links to a document that contains the review of LR A (the one being described)
domain: Language Resource
range: Document
sub property of: is documented by
inverse of: reviews
alternative label: review

is similar to
type: ObjectProperty
type: SymmetricProperty
comment: Links to LR B that bears resemblances to LR A (the one being described), e.g., they have been built with the same theoretical principles or are the same with different formats or processed at the same level with different tools
domain: Language Resource
range: Language Resource
sub property of: is related to Language Resource
alternative label: is similar with

is typesystem of
type: ObjectProperty
comment: Links a typesystem to the corpus where it has been used for annotating or to data of an annotation tool/service that has been or can be combined with
domain: Lexical/Conceptual resource
range: Class
  union of: Machine Learning model
  union of: Input content resource
  union of: Language Technology tool/service
sub property of: dependent language resource
inverse of: typesystem

is usage project of
type: ObjectProperty
comment: Links a project where a language resource has been used to this LR
domain: Project
range: Actual use
sub property of: project related to
inverse of: usage project

is validated by
type: ObjectProperty
comment: Links to a tool/service B that is (or can be) used for validating LR A (the one being described)
domain: Validation
range: Language Technology tool/service
sub property of: is related to LT tool/service
alternative label: validation tool

is validator of
type: ObjectProperty
comment: Links person(s), group(s) or organization(s) that have performed a specific validation of a language resource to the data of this validation
domain: Actor
range: Validation
sub property of: actor related to
inverse of: validator

is version of
type: ObjectProperty
comment: Links to LR B that is a version (corrected, annotated, enriched, processed, etc.) of LR A (the one being described)
domain: Language Resource
range: Language Resource
sub property of: is related to Language Resource

ISLRN
has URL: http://www.islrn.org
type: LR identifier scheme
type: NamedIndividual
comment: Value for LRTIdentifierScheme referring to ISLRN (International Standard Language Resource Number, http://www.islrn.org/)

isolated digit
type: Speech item
type: NamedIndividual

isolated word
type: Speech item
type: NamedIndividual

ISSN
has URL: http://www.issn.org
type: Document identifier scheme
type: NamedIndividual
comment: Value for resourceIdentifierSchemeName, referring to the ISSN (International Standard Serial Number, http://www.issn.org/)
alternative label: International Standard Serial Number

issue tracker
type: Documentation type
type: NamedIndividual
comment: Value for 'DocumentationType' for issue-tracking tools used by software developers usually available through a dedicated web page

ISTC
has URL: http://www.istc-international.org/
type: Document identifier scheme
type: NamedIndividual
comment: Value for resourceIdentifierSchemeName, referring to the ISTC (International Standard Text Code, http://www.istc-international.org/)
alternative label: International Standard Text Code

item
type: Size unit
type: NamedIndividual

jargon
type: Language variety type
type: NamedIndividual
comment: Value for 'LanguageVarietyType' used for a particular type of language mainly used in a specific context (e.g., by a professional or social group) which may not be well understood outside that context

journal
type: DatatypeProperty
comment: Introduces the name of the journal where the document being described has been published
domain: Document
range: langString

journalistic text
has identifier: ClarinEl TT018
type: Text type
type: NamedIndividual

kilobyte
type: Size unit
type: NamedIndividual
alternative label: kb

keep
type: Previous annotation types policy
type: NamedIndividual

keyword
type: DatatypeProperty
comment: Introduces a word or phrase considered important for the description of an entity and thus used to index or classify it
domain: Class
  union of: Division
  union of: Document
  union of: Group
  union of: Language Resource
  union of: Organization
  union of: Person
  union of: Project
range: langString
alternative label: keyphrase
example: crisis management, speech synthesis, subtitling, ...

keyword
type: Size unit
type: NamedIndividual

laboratory
type: Division category
type: NamedIndividual

landing page
type: DatatypeProperty
comment: Links to a web page that provides additional information about a language resource (e.g., its contents, acknowledgements, link to the access location, etc.)
domain: Language Resource
range: anyURI
sub property of: has URL
note: dcat:landingPage has range foaf:Document and is a subproperty of foaf:page; no distinction is made between physical and electronic documents. so I'm not sure what the most appropriate relation is for us

landscape part
type: DatatypeProperty
comment: Indicates the landscape parts represented in the image corpus
domain: Static element
range: langString

language
type: DatatypeProperty
comment: Specifies the language that is used in the resource or supported by the tool/service
domain: Class
  union of: Corpus audio part
  union of: Corpus image part
  union of: Corpus text part
  union of: Corpus video part
  union of: Language description image part
  union of: Language description text part
  union of: Language description video part
  union of: Lexical/Conceptual resource audio part
  union of: Lexical/Conceptual resource image part
  union of: Lexical/Conceptual resource text part
  union of: Lexical/Conceptual resource video part
range: anyURI
note: in the xsd, we have the full BCP47 recommendation combination, in ontology as a uri (to link with an ontology)

Language
has identifier: DDC400
type: Domain
type: NamedIndividual

language dependent
type: DatatypeProperty
comment: Indicates whether the operation of the tool or service is language dependent or not
domain: Language Technology tool/service
range: boolean

language description
type: Processing resource type
type: NamedIndividual
comment: Value for 'Resource type' for language descriptions, e.g., grammars, machine learning models, etc., i.e. language resources that formally describe a language

language engineering research use
replaces: Value for 'ConditionOfUse' which states that the resource can only be used for research purposes in the Language Enginnering / Language Technology domain.
type: Condition of use
type: NamedIndividual

language service provider
type: Organization role
type: NamedIndividual

language variety
type: ObjectProperty
comment: Relates a language resource that contains segments in a language variety (e.g., dialect, jargon) to it
domain: Class
  union of: Corpus audio part
  union of: Corpus image part
  union of: Corpus text part
  union of: Corpus video part
  union of: Language description image part
  union of: Language description text part
  union of: Language description video part
  union of: Lexical/Conceptual resource audio part
  union of: Lexical/Conceptual resource image part
  union of: Lexical/Conceptual resource text part
  union of: Lexical/Conceptual resource video part
range: Language variety
note: in MS we have language variety attached to language; check if this is ok; introduce a class Language after deciding on how to treat languages

language variety name
type: DatatypeProperty
comment: A textual string used for referring to a language variety
domain: Language variety
range: langString

language variety type
type: ObjectProperty
comment: Specifies the type of the language variety
domain: Language variety
range: Language variety type

large company
type: Organization legal status
type: NamedIndividual

large membrane microphone
type: Capturing device type
type: NamedIndividual

large public
type: Audience
type: NamedIndividual

laryngograph
type: Source channel
type: NamedIndividual

laryngograph
type: Capturing device type
type: NamedIndividual

lavalier microphone
type: Capturing device type
type: NamedIndividual

Law
has identifier: DDC340
type: Domain
type: NamedIndividual

law
has identifier: ELG Domain018
type: Domain
type: NamedIndividual

LCR subclass
type: ObjectProperty
comment: Introduces a classification of lexical/conceptual resources into types (used for descriptive reasons)
domain: Lexical/Conceptual resource
range: LCR subclass

language description task
type: ObjectProperty
comment: Specifies the task performed by the language description
domain: Language description
range: Language description task

lecture
has identifier: MS SG010
type: Speech genre
type: NamedIndividual

lecture room
type: Recording environment
type: NamedIndividual

leg
type: Body part
type: NamedIndividual

legend
type: DatatypeProperty
comment: Introduces the legend of the soundtrack
domain: Class
  union of: Corpus audio part
  union of: Lexical/Conceptual resource audio part
range: langString

lemma
type: Lemma type
type: NamedIndividual

lemma
type: Extratextual information unit
type: NamedIndividual

letter
type: Base item
type: NamedIndividual

letter
has identifier: ClarinEl TT004
type: Text type
type: NamedIndividual

lexical/conceptual resource
type: Processing resource type
type: NamedIndividual
comment: Value for 'Processing resource type' for lexical and conceptual resources (e.g., lexica, ontologies, gazetteers, terminological lists, dictionaries, thesauri, etc.)

lexical type
type: Size unit
type: NamedIndividual

lexical unit
type: Extratextual information unit
type: NamedIndividual

lexicon
type: LCR subclass
type: NamedIndividual
comment: (a list of) all the words used in a particular language or subject, or a dictionary [https://dictionary.cambridge.org/dictionary/english/lexicon]

library
type: Software distribution form
type: NamedIndividual
comment: Value for software distribution form, used for software objects in the form of libraries (e.g. Java, python libraries)

LCC
type: Domain classification scheme
type: NamedIndividual
alternative label: Library of Congress classification system

LCSH
type: Subject classification scheme
type: NamedIndividual
alternative label: Library of Congress Subject Headings

licence category
type: ObjectProperty
comment: Categorises a licence according to a classification scheme
domain: Licence
range: Licence category

licence
type: ObjectProperty
comment: Links the distribution (distributable form) of a language resource to the licence or terms of use/service (a specific legal document) with which it is distributed
domain: Distribution
range: Licence
sub property of: license

licence/terms of use/service name
type: DatatypeProperty
comment: Introduces an alternative name (other than the short name) used for a licence or terms of use
domain: Licence
range: langString
sub property of: alternative

licence/terms of use/service name
type: DatatypeProperty
comment: The name by which a legal document (e.g., licence, terms of use, terms of service) is known
domain: Licence
range: langString
sub property of: title

licence/Terms of use/service short name
type: DatatypeProperty
comment: Introduces the short name (abbreviation, acronym, etc.) used for a licence or terms of use document
domain: Licence
range: langString
sub property of: alternative

licence/terms of use/service URL
type: DatatypeProperty
comment: Links to the URL where the text of a licence/terms of use/service is found
domain: Licence
range: anyURI
sub property of: has URL

licenseInfo
comment: Links a resource to the licence under which it is distributed; values are taken from a list of standard licences

licensor
type: ObjectProperty
comment: The person or organisation who is legally eligible to license and actually licenses the resource. The licensor could be different from the creator, the distributor or the IPR holder. The licensor has the necessary rights or licences to license the work and is the party that actually licenses the resource that is distributed via the specific channel. She will have obtained the necessary rights or licences from the IPR holder and she may have a distribution agreement with a distributor that disseminates the work under a set of conditions defined in the specific licence and collects revenue on the licensor's behalf. The attribution of the creator, separately from the attribution of the licensor, may be part of the licence under which the resource is distributed (as e.g., is the case with Creative Commons Licences).
domain: Distribution
range: Person
sub property of: is related to actor

life sciences
has identifier: Clarin Domain005
type: Domain
type: NamedIndividual
comment: A branch of science (such as biology, medicine, and sometimes anthropology or sociology) that deals with living organisms and life processes —usually used in plural

linear PCM
type: Signal encoding
type: NamedIndividual

linguality type
type: ObjectProperty
comment: Indicates whether the resource includes one, two or more languages
domain: Media part
range: Linguality type

linguistic information
type: ObjectProperty
comment: Provides a more detailed account of the linguistic information contained in the lexical/conceptual resource
domain: Lexical/Conceptual resource
range: Content type

Linguistics
has identifier: DDC410
type: Domain
type: NamedIndividual

link to other media
type: ObjectProperty
comment: Describes the linking between different media parts of a resource (how they interact with or link to each other)
domain: Class
  union of: Corpus part
  union of: Language description part
range: Link to other media

linkedIn
type: Social media account occupational type
type: NamedIndividual

Linux
type: operating system
type: NamedIndividual

LISSN
type: Document identifier scheme
type: NamedIndividual
comment: Value for resourceIdentifierSchemeName, referring to the linking ISSN or ISSN-L
alternative label: ISSN-L

literary text
has identifier: ClarinEl TT012
type: Text type
type: NamedIndividual

Literature, Rhetoric & Criticism
has identifier: DDC800
type: Domain
type: NamedIndividual

Little Endian
type: Byte order
type: NamedIndividual

logo
type: DatatypeProperty
comment: Links to a symbol or graphic object used to identify an entity; please, add a URL with an image file
domain: Class
  union of: Division
  union of: Group
  union of: Language Resource
  union of: Licence
  union of: Organization
  union of: Project
range: anyURI
example: https://www.logo.eu

low
type: Recording quality
type: NamedIndividual

low
type: Quality
type: NamedIndividual

low
type: Noise level
type: NamedIndividual

LSID
has URL: http://www.webcitation.org/getfile
type: Document identifier scheme
type: NamedIndividual
comment: Value for resourceIdentifierSchemeName, referring to the LSID (Life Sciences Identifier, http://www.webcitation.org/getfile?fileid=27fcd073ea70199946ace15c6868520be2cab2ab)
alternative label: Life Sciences Identifier

MAC-OS
type: operating system
type: NamedIndividual

Machine Readable Dictionary
type: LCR subclass
type: NamedIndividual
comment: a dictionary usually meant for humans in a form that a computer can process
alternative label: MRD

mailing list name
type: DatatypeProperty
comment: Indicates the name of a mailing list used in relation to a language resource
domain: Language Resource
range: string

male
type: Sex
type: NamedIndividual

Management & Public Relations
has identifier: DDC650
type: Domain
type: NamedIndividual

manual
type: Process mode
type: NamedIndividual
comment: Value for 'Process mode' and its subclasses used for processes that are performed manually

manual
type: Document type
type: NamedIndividual

Manufacturing
has identifier: DDC670
type: Domain
type: NamedIndividual

map task
type: Scenario type
type: NamedIndividual

mapping of resources
type: LCR subclass
type: NamedIndividual
comment: a resource consisting of mapping values and/or rules between two resources

masters thesis
type: Document type
type: NamedIndividual

Mathematics
has identifier: DDC510
type: Domain
type: NamedIndividual

maven
has URL: https://maven.apache.org/pom.html#Maven_Coordinates
type: LR identifier scheme
type: NamedIndividual
comment: Value for LRTIdentifierScheme referring to the Maven coordinates (cf. Maven POM, https://maven.apache.org/pom.html#Maven_Coordinates)

mb
type: Size unit
type: NamedIndividual
alternative label: megabyte

measure
type: DatatypeProperty
comment: Defines the measure calculated for the metric
domain: Performance indicator
range: float

media
has identifier: ELG Domain008
type: Domain
type: NamedIndividual

media part
type: ObjectProperty
comment: Links a language resource to the parts it consists of (e.g., an oral corpus with the audio and its transcribed text part)
domain: Language Resource
range: Media part

media type
type: ObjectProperty
comment: Specifies the media type of a language resource (the physical medium of the contents representation) or of the input/output of a language processing tool/service; each media type is described through a distinctive set of technical features; a language resource may consist of different media parts
domain: Class
  union of: Media part
  union of: Processing resource type
range: Media type

media type details
type: DatatypeProperty
comment: Provides further information on the way the media types are linked and/or synchronized with each other within the same resource
domain: Link to other media
range: langString

medication
type: Speech influence
type: NamedIndividual

Medicine & Health
has identifier: DDC610
type: Domain
type: NamedIndividual

medium
type: Recording quality
type: NamedIndividual

medium
type: Quality
type: NamedIndividual

medium
type: Noise level
type: NamedIndividual

meeting
has identifier: MS SG011
type: Speech genre
type: NamedIndividual

meeting proceedings
has identifier: ClarinEl TT009
type: Text type
type: NamedIndividual

member of association
type: ObjectProperty
comment: Links to an association or network that the organization or person is member of
domain: Class
  union of: Division
  union of: Organization
  union of: Person
range: Organization

member of association
type: Condition of use
type: NamedIndividual

membership institution
type: ObjectProperty
comment: Introduces an institution with members that can benefit from specific conditions on the use of a resource (e.g. discount, unlimited access, etc.)
domain: Distribution
range: Membership institution

meronym
type: Semantic type
type: NamedIndividual

META-SHARE
has URL: http://www.meta-share.org
type: LR identifier scheme
type: NamedIndividual
comment: Value for LRTIdentifierScheme referring to the identifier assigned by META-SHARE (http://www.meta-share.org/)
note: in MS, we had MetaShareId and not the scheme; in general, discuss the use of "local resource identifier scheme" from DataCite as a value

metadata creation date
type: DatatypeProperty
comment: Specifies the date when the metadata record was first created
domain: Metadata record
range: date

metadata creator
type: ObjectProperty
comment: Introduces the person who has created the metadata record
domain: Metadata record
range: Person
sub property of: is related to actor

metadata curator
type: ObjectProperty
comment: A person responsible for the creation, update, enrichment, etc. of a metadata record describing an entity
domain: Metadata record
range: Person
sub property of: is related to actor

metadata last date updated
type: DatatypeProperty
comment: Specifies the date when the last update of the metadata record was made
domain: Metadata record
range: date

metalanguage
type: DatatypeProperty
comment: Specifies the language that is used as support for the resource (e.g., a grammar of French described in English or a French dictionary with English definitions)
domain: Class
  union of: Language description image part
  union of: Language description text part
  union of: Language description video part
  union of: Lexical/Conceptual resource audio part
  union of: Lexical/Conceptual resource image part
  union of: Lexical/Conceptual resource text part
  union of: Lexical/Conceptual resource video part
range: anyURI
note: in the xsd, this is expressed with a BCP47 combination while in the ontology as a URI (to link with an ontology)

method
type: ObjectProperty
comment: Specifies the method used for the development of a tool/service or the ML model
domain: Class
  union of: Machine Learning model
  union of: Language Technology tool/service
range: TdmMethod

metric
type: ObjectProperty
comment: Identifies the metric used for the evaluation of the tool/service
domain: Performance indicator
range: Metric

microphone
type: Required hardware
type: NamedIndividual

microphone
type: Capturing device type
type: NamedIndividual

microphone array
type: Capturing device type
type: NamedIndividual

minute
type: Size unit
type: NamedIndividual

minute
type: Duration unit
type: NamedIndividual

mispronunciation
type: Annotated element
type: NamedIndividual

mixed
type: Process mode
type: NamedIndividual
comment: Value for 'Process mode' and its subclasses used for mixed processes, usually involving an automatic processing followed by human edits

mixed
type: Hearing impairment of participants
type: NamedIndividual

mixed
type: Speaking impairment of participants
type: NamedIndividual

ML framework
type: DatatypeProperty
comment: Specifies the framework that has been used for developing a model (e.g. keras, tensorflow, etc.)
domain: Machine Learning model
range: string
alternative label: Machine Learning framework

ML model
type: ObjectProperty
comment: Specifies the ML model that must be used together with the tool/service to perform the desired task
domain: Language Technology tool/service
range: Machine Learning model
sub property of: depends on

modality type
type: ObjectProperty
comment: Specifies the type of the modality represented in the resource or processed by a tool/service
domain: Media part
range: Modality type

modality type details
type: DatatypeProperty
comment: Provides further information on the modalities represented in a language resource
domain: Media part
range: langString

model variant
type: DatatypeProperty
comment: Introduces a label that can be used to identify the variant of a ML model
domain: Machine Learning model
range: string

modify
type: Previous annotation types policy
type: NamedIndividual

money amount
type: Speech item
type: NamedIndividual

monolingual
type: Linguality type
type: NamedIndividual
comment: Value for 'Linguality type' for resource (parts) which include material in one language

monologue
type: Conversational type
type: NamedIndividual

mood
type: Morphological type
type: NamedIndividual

morphological lexicon
type: Compatible lexicon type
type: LCR subclass
type: NamedIndividual
comment: a lexicon with morphological information associated with its entries

morphology
type: Encoding level
type: NamedIndividual
comment: Value for 'EncodingLevel' for the particular linguistic level that relates to the study of word formation (such as inflection, derivation and compounding)

mouth
type: Body part
type: NamedIndividual

mov
type: Compression name
type: NamedIndividual

mp3
type: Compression name
type: NamedIndividual

mpeg
type: Compression name
type: NamedIndividual

mpg
type: Compression name
type: NamedIndividual

mu-law
type: Signal encoding
type: NamedIndividual

multi-value
type: DatatypeProperty
comment: Specifies whether the parameter takes a list of values
domain: Parameter
range: boolean

multi-word unit
type: Size unit
type: NamedIndividual
alternative label: multi-word expression

multi-word unit
type: Lemma type
type: NamedIndividual
alternative label: multi-word expression

multilingual
type: Linguality type
type: NamedIndividual
comment: Value for 'Linguality type' for resource (parts) which include material in three or more languages

multilingual single text
type: Multilinguality type
type: NamedIndividual
comment: Value for 'Multilinguality type' for resource parts or resources that consist of segments including text in two or more languages (e.g., the transcription of a European Parliament session with MPs speaking in their native language)

multilinguality type
type: ObjectProperty
comment: Indicates whether the resource (part) is parallel, comparable or mixed
domain: Media part
range: Multilinguality type

multilinguality type details
type: DatatypeProperty
comment: Provides further information on multilinguality of a resource in free text
domain: Media part
range: langString

multilogue
type: Conversational type
type: NamedIndividual

multiple sources
type: Scene illumination
type: NamedIndividual

music
type: Non-speech item
type: NamedIndividual

Music
has identifier: DDC780
type: Domain
type: NamedIndividual

narrative
has identifier: MS SG008
type: Speech genre
type: NamedIndividual

national funds
type: Funding type
type: NamedIndividual
comment: Value for 'Funding type' for projects funded by national authorities

national max contribution
type: ObjectProperty
comment: Introduces the maximum amount of money contributed from national funds
domain: Project
range: Cost

national security
has identifier: ELG Domain015
type: Domain
type: NamedIndividual

native
type: Origin
type: NamedIndividual

natural
type: Naturality
type: NamedIndividual

natural number
type: Speech item
type: NamedIndividual

naturality
type: ObjectProperty
comment: Specifies the level of naturality for multimodal/multimedia resources
domain: Class
  union of: Corpus audio part
  union of: Corpus video part
range: Naturality

neologism
type: Size unit
type: NamedIndividual

network
type: Organization legal status
type: NamedIndividual

News, Media, Journalism & Publishing
has identifier: DDC070
type: Domain
type: NamedIndividual

no
type: Speaking impairment of participants
type: NamedIndividual

no derivatives
type: Condition of use
type: NamedIndividual
type: Set
comment: Value for 'ConditionOfUse' which states that the users of the resource are not allowed to share derivatives of the resource
prohibition:
  action: DerivativeWorks

no
type: Hearing impairment of participants
type: NamedIndividual

no redistribution
type: Condition of use
type: NamedIndividual
comment: Value for 'ConditionOfUse' which states that users are not allowed to redistribute the resource
prohibition:
  action: Reproduction

noise
type: Non-speech item
type: NamedIndividual

noise
has identifier: MS AG002
type: Audio genre
type: NamedIndividual

noise level
type: ObjectProperty
comment: Specifies the level of background noise
domain: Class
  union of: Corpus audio part
  union of: Lexical/Conceptual resource audio part
range: Noise level

non-commercial use
type: Condition of use
type: NamedIndividual
type: Set
comment: Value for 'ConditionOfUse' which states that the language resource cannot be used for commercial purposes, i.e. where there is some direct profit from using it
prohibition:
  action: CommercialUse

non fiction
has identifier: PAROLE G008
type: Text genre
type: NamedIndividual

non interactive
type: Interactivity
type: NamedIndividual

nonNative
type: Origin
type: NamedIndividual

non-speech item
type: ObjectProperty
comment: Specifies the distinct non-speech elements that maybe included in the audio part of a corpus or lexical/conceptual resource
domain: Class
  union of: Corpus audio part
  union of: Lexical/Conceptual resource audio part
range: Non-speech item

none
type: Body part
type: NamedIndividual

none
type: Text included in video
type: NamedIndividual

none
type: Text included in image
type: NamedIndividual

none
type: Audience
type: NamedIndividual

none
type: Related lexicon type
type: NamedIndividual

none
type: Required hardware
type: NamedIndividual

note
type: Non-speech item
type: NamedIndividual

note
type: Usage type
type: NamedIndividual

recognition of noun phrases
type: Language description task
type: NamedIndividual

NP structure
type: Grammatical phenomena coverage
type: NamedIndividual
alternative label: Structure of noun phrases

number
type: Morphological type
type: NamedIndividual

number of participants
type: DatatypeProperty
comment: The number of the persons participating in the audio or video part of the resource
domain: Class
  union of: Corpus audio part
  union of: Corpus image part
  union of: Corpus text numerical part
  union of: Corpus video part
range: int

number of tracks
type: DatatypeProperty
comment: Specifies the number of audio channels
domain: Detailed audio format
range: int
note: In MS it's a controlled vocabulary (1, 2, 4, 8) but I think it's too much

number of trained speakers
type: DatatypeProperty
comment: The number of participants that have been trained for the specific task
domain: Class
  union of: Corpus audio part
  union of: Corpus image part
  union of: Corpus text numerical part
  union of: Corpus video part
range: int

OAI
has URL: http://www.openarchives.org/OAI/2.0/guidelines-oai-identifier.htm
type: LR identifier scheme
type: NamedIndividual
comment: Value for LRTIdentifierScheme referring to the OAI identifier (Open Archives Initiative, http://www.openarchives.org/OAI/2.0/guidelines-oai-identifier.htm)

OCR system
type: Required hardware
type: NamedIndividual

office
type: Recording environment
type: NamedIndividual

official
has identifier: PAROLE G009
type: Text genre
type: NamedIndividual

Ogg Vorbis
type: Compression name
type: NamedIndividual

OMTD
has URL: https://services.openminted.eu/home
type: LR identifier scheme
type: Metadata record identifier scheme
type: NamedIndividual
comment: Value for LRTIdentifierScheme referring to the identifier assigned by the OpenMinTeD platform (https://services.openminted.eu/home)

OMTD-Docker
has URL: https://guidelines.openminted.eu/components_resourceIdentifier.html
type: LR identifier scheme
type: NamedIndividual
comment: Value for LRTIdentifierScheme referring to the recommended by OpenMinTeD use of identifiers for Docker images uploaded to the registry (https://guidelines.openminted.eu/components_resourceIdentifier.html)

online help URL
type: Documentation type
type: NamedIndividual
comment: Value for 'Documentation type' for the online help site of a language resource

online educational game
type: Scenario type
type: NamedIndividual

only META-SHARE members
type: Condition of use
type: NamedIndividual
type: Set
comment: Value for 'ConditionsOfUse' which states that the language resource can only be used by members of the MetaShare network
note: should we also add something more generic for restricting a resource to specific group members (as for spatial constraint)? and I don't think the odrl is ok.
permission:
  constraint:
    operator: eq
    recipient: only META-SHARE members

ontology
type: Compatible lexicon type
type: LCR subclass
type: NamedIndividual
comment: a set of concepts and categories in a subject area or domain that shows their properties and the relations between them [https://en.oxforddictionaries.com/definition/ontology]

open access
has identifier: omtdAccess2
type: Access rights statement
type: NamedIndividual
comment: The free and online availability of literature, which allows to read, download, copy, distribute, print, search, or link to the ful text, crawl articles for indexing, pass them as data to software, or use them for any other useful purpose. An availability that is granted without financial, legal, or technical barriers other than those inseparable from gaining access to the internet itself, and those related to giving authors control over the integrity of their work and the right to be properly acknowledged and cited.

open public place
type: Recording environment
type: NamedIndividual

operating system
type: ObjectProperty
comment: Specifies the operating system on which a software object can run
domain: Language Technology tool/service
range: operating system

optional
type: DatatypeProperty
comment: Specifies whether the parameter is mandatory or optional
domain: Parameter
range: boolean

order
type: DatatypeProperty
comment: Specifies the maximum number of items in the sequence
domain: N-gram model
range: int

organization alternative name
type: DatatypeProperty
comment: Introduces an alternative name (other than the official title or the short name) used for an organization
domain: Organization
range: langString
sub property of: alternative

organization description
type: DatatypeProperty
comment: Introduces a short free-text account that provides information on an organization
domain: Class
  union of: Division
  union of: Group
  union of: Organization
range: langString
sub property of: description

organization description
type: DatatypeProperty
comment: Provides description of the organizations that may appear in the image corpus
domain: Static element
range: langString

organization legal status
type: ObjectProperty
comment: Classifies an organization according to its legal status
domain: Organization
range: Organization legal status

organization name
type: DatatypeProperty
comment: The official title of an organization
domain: Class
  union of: Group
  union of: Organization
range: langString
sub property of: title

organization role
type: ObjectProperty
comment: Classifies an organization according to its role/mission
domain: Class
  union of: Division
  union of: Group
  union of: Organization
range: Organization role

organization short name
type: DatatypeProperty
comment: Introduces the short name (abbreviation, acronym, etc.) used for an organization
domain: Class
  union of: Group
  union of: Organization
range: langString
sub property of: alternative

origin
type: ObjectProperty
comment: Specifies the relation of the language of a participant with respect to the acquisition stage
domain: Participant
range: Origin

origin of participants
type: ObjectProperty
comment: Specifies the relation of the language of the group of participants with respect to the acquisition stage
domain: Class
  union of: Corpus audio part
  union of: Corpus image part
  union of: Corpus text numerical part
  union of: Corpus video part
range: Origin

original source description
type: DatatypeProperty
comment: A description in free text of the source material that has been used for the creation of a language data resource
domain: Class
  union of: Lexical/Conceptual resource
  union of: Media part
  union of: Language Technology tool/service
range: langString

OS-independent
type: operating system
type: NamedIndividual

other
type: Funder identfier scheme
type: Organization identifier scheme
type: Person identfier scheme
type: Annotated element
type: Audio genre
type: Audio genre classification scheme
type: Audio quality measure included
type: Base item
type: Capturing device type
type: Compatible lexicon type
type: Compression name
type: Condition of use
type: Content type
type: Currency
type: Dataset distribution form
type: Division category
type: Document identifier scheme
type: Document type
type: Domain
type: Domain classification scheme
type: Encoding level
type: Extratextual information
type: Extratextual information unit
type: Framework
type: Funding type
type: Grammatical phenomena coverage
type: Image genre classification scheme
type: Interactivity
type: LCR subclass
type: Language description task
type: LR identifier scheme
type: Language variety type
type: Licence identifier scheme
type: Membership institution
type: Metadata record identifier scheme
type: Metric
type: Modality type
type: Multilinguality type
type: Naturality
type: Non-speech item
type: operating system
type: Organization legal status
type: Organization role
type: Parameter type
type: Processing resource type
type: Project identifier scheme
type: Recording device type
type: Recording environment
type: Repository identifier scheme
type: Required hardware
type: Scenario type
type: Scene illumination
type: Segmentation level
type: Signal encoding
type: Size unit
type: Social media account occupational type
type: Software distribution form
type: Source channel
type: Source channel type
type: Speech genre
type: Speech genre classification scheme
type: Speech influence
type: Speech item
type: Standard/Best practice
type: Subject classification scheme
type: Support type
type: Text genre
type: Text genre classification scheme
type: Text type
type: Text type classification scheme
type: Video genre classification scheme
type: Vocal tract condition
type: Web service type
type: NamedIndividual
comment: Value used when none of the recommended values of an element is appropriate for an item

other media
type: ObjectProperty
comment: Specifies the media types that are linked to the media type described within the same resource
domain: Link to other media
range: Media type

address (other offices)
type: ObjectProperty
comment: Links to the physical address of an office (other than the principal one) of an organization or group represented as a set of distinct elements (street, zip code, city, etc.)
domain: Class
  union of: Affiliation
  union of: Division
  union of: Group
  union of: Organization
range: Address
sub property of: address

output
type: DatatypeProperty
comment: Indicates whether the output of the operation of the grammar is a statement of grammaticality (grammatical/ungrammatical) or structures (interpretation of the input)
domain: Language description
range: langString

output resource
type: ObjectProperty
comment: Specifies the output results of a tool/service, i.e. the features of the processed (content) resource
domain: Language Technology tool/service
range: Input content resource

output text
type: Processing resource type
type: NamedIndividual

overlapping
type: Interactivity
type: NamedIndividual

own funds
type: Funding type
type: NamedIndividual
comment: Value for 'Funding type' for self-funded projects

pages
type: DatatypeProperty
comment: Introduces the range of pages (preferrably with a dash between) on which a document is printed
domain: Document
range: string

Painting
has identifier: DDC750
type: Domain
type: NamedIndividual

Paleontology
has identifier: DDC560
type: Domain
type: NamedIndividual

paper copy
type: Dataset distribution form
type: NamedIndividual
comment: Value for data distribution medium, used for language resources that are delivered in paper format

paragraph
type: Segmentation level
type: NamedIndividual

parallel
type: Multilinguality type
type: NamedIndividual
comment: Value for 'Multilinguality type' for resource parts or resources that consist of the equivalent text segments in two or more languages (e.g., an original and its translation equivalents)

parameter
type: ObjectProperty
comment: Introduces a parameter used for running a tool/service
domain: Language Technology tool/service
range: Parameter

parameter description
type: DatatypeProperty
comment: Provides a short account of he parameter (e.g., function it performs, input / output requirements, etc.) in free text
domain: Parameter
range: langString

parameter label
type: DatatypeProperty
comment: Introduces a short free text used to show to the user for the parameter
domain: Parameter
range: langString

parameter name
type: DatatypeProperty
comment: Introduces a free text used to identify the parameter
domain: Parameter
range: string

parameter type
type: ObjectProperty
comment: Classifies the parameter according to a specific (not yet standardised) typing system (e.g., whether it's boolean, string, integer, a document, mapping, etc.)
domain: Parameter
range: Parameter type

parsing
type: Language description task
type: NamedIndividual

part of speech
type: Morphological type
type: NamedIndividual

partial
type: Validation extent
type: NamedIndividual

participant
type: ObjectProperty
comment: Introduces descriptive characteristics of a person that has participated in the audio, video, sensorimotor (textNumerical) part of the resource
domain: Class
  union of: Corpus audio part
  union of: Corpus image part
  union of: Corpus text numerical part
  union of: Corpus video part
range: Participant

participating organization
type: ObjectProperty
comment: Indicates the organization(s) that participate (or have participated) in a project
domain: Project
range: Organization
sub property of: is related to actor

pear story
type: Scenario type
type: NamedIndividual

Penn treebank
has URL: https://link.springer.com/chapter/10.1007/978-94-010-0201-1_1
type: Standard/Best practice
type: NamedIndividual

performance indicator
type: ObjectProperty
comment: Describes the performance indicator used for the evaluation of a tool/service
domain: Evaluation
range: Performance indicator

perplexity
type: DatatypeProperty
comment: Provides information on the perplexity derived from running on test set taken from the same corpus
domain: N-gram model
range: float

person
type: Morphological type
type: NamedIndividual

person description
type: DatatypeProperty
comment: Provides descriptive features for the persons represented in the image corpus
domain: Static element
range: langString

personal data details
type: DatatypeProperty
comment: If the resource includes personal data, this field can be used for entering more information, e.g., whether special handling of the resource is required (e.g., anonymization, further request for use, etc.)
domain: Data language resource
range: langString

personal data included
type: DatatypeProperty
comment: Specifies whether the language resource contains personal data (mainly in the sense falling under the GDPR)
domain: Data language resource
range: boolean

pharmaceutics
has identifier: ELG Domain003
type: Domain
type: NamedIndividual

PhD thesis
type: Document type
type: NamedIndividual

Philosophy
has identifier: DDC100
type: Domain
type: NamedIndividual

phoneme
type: Base item
type: NamedIndividual

phoneme
type: Segmentation level
type: NamedIndividual

phoneme
type: Size unit
type: NamedIndividual

phonetic unit
type: Size unit
type: NamedIndividual

phonetically balanced sentence
type: Speech item
type: NamedIndividual

phonetically rich sentence
type: Speech item
type: NamedIndividual

phonetically rich word
type: Speech item
type: NamedIndividual

phonetics
type: Encoding level
type: NamedIndividual
comment: Value for 'EncodingLevel' for the particular linguistic level that relates to the study of speech sounds

phonology
type: Encoding level
type: NamedIndividual
comment: Value for 'EncodingLevel' for the particular linguistic level that relates to the study of speech sounds that constitute the fundamental components of a language

Photography, Computer Art, Film, Video
has identifier: DDC770
type: Domain
type: NamedIndividual

phrase
type: Segmentation level
type: NamedIndividual

Physics
has identifier: DDC530
type: Domain
type: NamedIndividual

place of birth
type: DatatypeProperty
comment: The place in which the participant has been born
domain: Participant
range: langString

place of childhood
type: DatatypeProperty
comment: The place in which the participant lived as a child
domain: Participant
range: langString

place of living
type: DatatypeProperty
comment: The place of living of a participant
domain: Participant
range: langString

place of second education
type: DatatypeProperty
comment: Specifies the place of the secondary education of the participant
domain: Participant
range: langString

plain
type: Capturing environment
type: NamedIndividual

planned
type: Naturality
type: NamedIndividual

Plants
has identifier: DDC580
type: Domain
type: NamedIndividual

plugin
type: Software distribution form
type: NamedIndividual
comment: Value for software distribution form, used for software objects in the form of plugins (e.g. Chrome browser extension)

PMCID
has URL: https://www.ncbi.nlm.nih.gov/pmc/pmctopmid/
type: Document identifier scheme
type: NamedIndividual
comment: Value for resourceIdentifierSchemeName, referring to the PMCID (PubMed Central Identifier, https://www.ncbi.nlm.nih.gov/pmc/pmctopmid/)
alternative label: PubMed Central Identifier

PMID
has URL: https://www.ncbi.nlm.nih.gov/pmc/pmctopmid/
type: Document identifier scheme
type: NamedIndividual
comment: Value for resourceIdentifierSchemeName, referring to the PMID (PubMed Identifier, https://www.ncbi.nlm.nih.gov/pmc/pmctopmid/)
alternative label: PubMed Identifier

Political Science
has identifier: DDC320
type: Domain
type: NamedIndividual

politics
has identifier: ELG Domain017
type: Domain
type: NamedIndividual

poses per subject
type: DatatypeProperty
comment: Indicates the number of poses per subject that participates in the video part of the resource
domain: Dynamic element
range: int

position
type: DatatypeProperty
comment: The position or the title of a person if affiliated to an organization
domain: Affiliation
range: langString

PP attachment
type: Grammatical phenomena coverage
type: NamedIndividual
alternative label: Attachment of Prepositional phrases

pragmatics
type: Encoding level
type: NamedIndividual
comment: Value for 'EncodingLevel' for the particular linguistic level of analysis that studies the relationship of sentences to the environment in which they occur

Prague treebank
has URL: http://ufal.mff.cuni.cz/pdt2.0/
type: Standard/Best practice
type: NamedIndividual
alternative label: PDT
alternative label: Prague Dependency Treebank

predicate
type: Size unit
type: NamedIndividual

presentation
has identifier: MS SG003
type: Speech genre
type: NamedIndividual

previous annotation types policy
type: ObjectProperty
comment: Specifies the policy that a tool/service has with respect to the annotation types included in the annotated resource that it takes as input (i.e. whether it keeps, modifies or drops them in the output resource)
domain: Language Technology tool/service
range: Previous annotation types policy

private
has identifier: PAROLE G007
type: Text genre
type: NamedIndividual

proceedings
type: Document type
type: NamedIndividual

process mode
type: ObjectProperty
comment: Specifies the type of processing performed on a language resource
domain: Thing
range: Process mode

processing resource type
type: ObjectProperty
comment: Specifies the resource type that a tool/service takes as input or produces as output
domain: Input content resource
range: Processing resource type

profession
type: DatatypeProperty
comment: Provides information on the participant's profession
domain: Participant
range: langString

project alternative name
type: DatatypeProperty
comment: Introduces an alternative name (other than the short name) used for a project
domain: Project
range: langString
sub property of: alternative

project end date
type: DatatypeProperty
comment: The end date of a project
domain: Project
range: date

project name
type: DatatypeProperty
comment: The official title of a project
domain: Project
range: langString
sub property of: title
alternative label: project title

project related to
type: ObjectProperty
comment: Links a project to the language resource(s) it has some relation with (e.g., funded the creation of)
domain: Project
range: Language Resource
sub property of: is related to

project report
type: DatatypeProperty
comment: Links to a report issued by a project
domain: Project
range: langString

project short name
type: DatatypeProperty
comment: Introduces a short name (e.g., acronym, abbreviated form) by which a project is known
domain: Project
range: langString
sub property of: alternative

project start date
type: DatatypeProperty
comment: The starting date of a project
domain: Project
range: date

project summary
type: DatatypeProperty
comment: Introduces a short description (in free text) of the main objectives, mission or contents of the project
domain: Project
range: langString

prompted
type: Naturality
type: NamedIndividual

proper noun
type: Speech item
type: NamedIndividual

prosodic boundary
type: Segmentation level
type: NamedIndividual

Psychology
has identifier: DDC150
type: Domain
type: NamedIndividual

public
conforms to: CLARIN licence category scheme
type: Licence category
type: NamedIndividual
alternative label: PUB

public administration
has identifier: ELG Domain007
type: Domain
type: NamedIndividual

Public Administration
has identifier: DDC351
type: Domain
type: NamedIndividual

public organization
type: Organization legal status
type: NamedIndividual

publication
type: Documentation type
type: NamedIndividual
comment: Value for 'Documentation type' used for published documents about a language resource (mainly meant for documents that describe the resource itself rather than its deployment)

publication date
type: DatatypeProperty
comment: Specifies the date when a language resource has been made available to the public
domain: Class
  union of: Distribution
  union of: Document
  union of: Language Resource
range: date
sub property of: issued
note: problem: when is the first publication date if a resource has been made available through zenodo, meta-share, clarin, etc.?? How can this be propagated? Important for citation purposes should we also differentiate between distributions? e.g., a csv published at a different time from a database?

publication for citation
type: Documentation type
type: NamedIndividual
comment: Value for 'Documentation type' for a published document describing the language resource and which is recommended by the resource creator(s) to be used for citation purposes when the resource is mentioned in another publication

published
type: Version type
type: NamedIndividual
comment: Value for 'Version type' used for versions as published in digital or print form

published record
type: Size unit
type: NamedIndividual

publisher
type: DatatypeProperty
comment: Introduces the name of an organization that has published the document being described
domain: Document
range: langString

publishing
has identifier: ELG Domain001
type: Domain
type: NamedIndividual

qualia structure
type: Semantic type
type: NamedIndividual

quality
type: ObjectProperty
comment: Specifies the quality level of image resource
domain: Detailed image format
range: Quality

quantization
type: DatatypeProperty
comment: The number of bits for each audio sample
domain: Detailed audio format
range: int
note: In MS it's a controlled vocabulary (8, 16, 24, 32, 64) but I found it too much

queries
type: ObjectProperty
comment: Links a tool/service B that is (or can be) used for querying LR A to LR A
domain: Language Technology tool/service
range: Data language resource
sub property of: LT tool/service related to

question
type: Size unit
type: NamedIndividual

question answer
has identifier: MS SG004
type: Speech genre
type: NamedIndividual

radio
type: Source channel
type: NamedIndividual

raster
type: Raster or vector graphics
type: NamedIndividual

raster or vector graphics
type: ObjectProperty
comment: Indicates if the image is stored as raster or vector graphics
domain: Detailed image format
range: Raster or vector graphics

raw corpus
type: Corpus subclass
type: NamedIndividual
comment: The form of the corpus that has not been enriched with annotations

re3data
type: Repository identifier scheme
type: NamedIndividual

read speech
type: Naturality
type: NamedIndividual

real audio
type: Compression name
type: NamedIndividual

recorder
type: ObjectProperty
comment: Links to the recorder(s) of the audio or video part of the resource
domain: Class
  union of: Corpus audio part
  union of: Corpus text numerical part
  union of: Corpus video part
range: Actor
sub property of: is related to actor

recording device type
type: ObjectProperty
comment: Specifies the nature of the recording platform hardware and the storage medium
domain: Class
  union of: Corpus audio part
  union of: Corpus text numerical part
  union of: Corpus video part
range: Recording device type

recording device type details
type: DatatypeProperty
comment: Free text description of the recording device
domain: Class
  union of: Corpus audio part
  union of: Corpus text numerical part
  union of: Corpus video part
range: langString

recording environment
type: ObjectProperty
comment: Specifies where the recording took place
domain: Class
  union of: Corpus audio part
  union of: Corpus text numerical part
  union of: Corpus video part
range: Recording environment

recording platform software
type: DatatypeProperty
comment: Specifies the software used for the recording platform
domain: Class
  union of: Corpus audio part
  union of: Corpus text numerical part
  union of: Corpus video part
range: string

recording quality
type: ObjectProperty
comment: Indicates the audio or video recording quality
domain: Detailed audio format
range: Recording quality

redeposit
type: Condition of use
type: NamedIndividual
type: Set
comment: Value for 'ConditionsOfUse' which states that users are encouraged to deposit any modified versions of the resource they make to the distribution channel through which they have acquired the resource
permission:
  duty:
    action: redeposit

reflexivity
type: Morphological type
type: NamedIndividual

region
type: DatatypeProperty
comment: The name of the region, county or department as mentioned in the postal address of a person or organization
domain: Address
range: langString

register
type: DatatypeProperty
comment: Specifies the type of register (any of the varieties of a language that a speaker uses in a particular social context [Merriam-Webster]) of the contents of a language resource
domain: Corpus text part
range: langString

register
type: Usage type
type: NamedIndividual

related call
type: DatatypeProperty
comment: Specifies the Call for proposals to which a project was submitted
domain: Project
range: string

related language resource
type: ObjectProperty
comment: Identifies the language resource with which a relation is holding with the one being described
domain: Relation
range: Language Resource

related lexicon type
type: ObjectProperty
comment: Indicates the type of the lexica that must or can be used with the grammar
domain: Language description
range: Related lexicon type

related programme
type: DatatypeProperty
comment: Specifies the funding programme to which a project was submitted
domain: Project
range: string
alternative label: program

related subprogramme
type: DatatypeProperty
comment: Specifies the funding subprogramme to which a project was submitted
domain: Project
range: string

relation
type: ObjectProperty
comment: Links a language resource to other related resources specifying also the type of relation
domain: Language Resource
range: Relation

relation type
type: DatatypeProperty
comment: Describes in a free text statement a relation holding between two Language Resources not yet covered by the schema
domain: Relation
range: langString

Religion
has identifier: DDC200
type: Domain
type: NamedIndividual

replaces
type: ObjectProperty
comment: Links to LR B that is an older version of LR A (the one being described) and has been replaced by it
domain: Language Resource
range: Language Resource
sub property of: is version of

request plan
type: Condition of use
type: NamedIndividual
comment: Value for 'ConditionOfUse' that states that the licensor requires the submission of a research plan in order to grant access to the language resource

required hardware
type: ObjectProperty
comment: Specifies the type of hardware required for running a tool and/or computational grammar
domain: Class
  union of: Language description
  union of: Language Technology tool/service
range: Required hardware

requires language resource
type: ObjectProperty
comment: Links to LR B that is required for the operation of a tool/service or computational grammar (the one that is described)
domain: Class
  union of: Language description
  union of: Input content resource
  union of: Language Technology tool/service
range: Class
  union of: Language description
  union of: Lexical/Conceptual resource
sub property of: depends on

requires software
type: DatatypeProperty
comment: Specifies software tools or libraries that are required for the operation of a tool/service or computational grammar
domain: Class
  union of: Language description
  union of: Language Technology tool/service
range: string
note: left as a data property - it's for more general software than language processing tools, so difficult to restrict

research organization
type: Organization role
type: NamedIndividual

research use
type: Condition of use
type: NamedIndividual
comment: Value for 'ConditionOfUse' stating that the resource can be used only for research purposes
note: add ODRL

resolution
type: ObjectProperty
comment: Groups together information on the image resolution
domain: Class
  union of: Detailed image format
  union of: Detailed video format
range: Resolution

resolution standard
type: ObjectProperty
comment: Specifies the standard to which the resolution conforms
domain: Resolution
range: Resolution standard

resource creator
type: ObjectProperty
comment: Links a resource to the person, group or organisation that has created the resource
domain: Language Resource
range: Actor
sub property of: is related to actor

resource name
type: DatatypeProperty
comment: Introduces a human-readable name or title by which the resource is known
domain: Language Resource
range: langString
sub property of: title
alternative label: resource title
example: British National Corpus

resource provider
type: ObjectProperty
comment: The person/organization responsible for providing, curating, maintaining and making available (publishing) the resource
domain: Language Resource
range: Actor
sub property of: is related to actor

resource short name
type: DatatypeProperty
comment: Introduces a short form (e.g., abbreviation, acronym, etc.) used to refer to a language resource
domain: Language Resource
range: langString
sub property of: alternative

restricted
conforms to: CLARIN licence category scheme
type: Licence category
type: NamedIndividual
alternative label: RES

restricted access
has identifier: omtdAccess1
type: Access rights statement
type: NamedIndividual
comment: Access is subject to restrictions or controls regarding users (e.g., limited to researchers or members of a specific group) or use (e.g., for research only, noncommercial use, etc.); subscription or registration may also be required and access may incur financial costs

review
has identifier: ClarinEl TT017
type: Text type
type: NamedIndividual

reviews
type: ObjectProperty
comment: Links a document to the language resource it reviews
domain: Document
range: Language Resource
sub property of: documents

revision
type: DatatypeProperty
comment: Provides an account of the revisions in free text or a link to a document with revisions
domain: Class
  union of: Language Resource
  union of: Metadata record
range: langString

robustness
type: DatatypeProperty
comment: Introduces a free text statement on the robustness of the grammar (how well the grammar can cope with misspelt/unknown, etc. input, i.e. whether it can produce even partial interpretations of the input)
domain: Language description
range: langString

role play
type: Scenario type
type: NamedIndividual

roundtable
has identifier: MS SG005
type: Speech genre
type: NamedIndividual

rule
type: Size unit
type: NamedIndividual

running environment details
type: DatatypeProperty
comment: Provides further information on the running environment of a tool/service or of a language description
domain: Class
  union of: Language description
  union of: Language Technology tool/service
range: langString

running time
type: DatatypeProperty
comment: Gives information on the running time of a tool or service
domain: Language Technology tool/service
range: string

samples
type: Documentation type
type: NamedIndividual
comment: Value for 'DocumentationType' used for samples of a language resource

samples location
type: DatatypeProperty
comment: Links a resource to a url (or url's) with samples of a data resource or of the input of output resource of a tool/service
domain: Class
  union of: Data language resource
  union of: Input content resource
range: anyURI
sub property of: has URL

sampling rate
type: DatatypeProperty
comment: Specifies the format of files contained in the resource in Hertz
domain: Detailed audio format
range: int

scenario type
type: ObjectProperty
comment: Indicates the task defined for the conversation or the interaction of participants
domain: Class
  union of: Corpus audio part
  union of: Corpus video part
range: Scenario type

scene
type: Segmentation level
type: NamedIndividual

scene illumination
type: ObjectProperty
comment: Provides information on the illumination of the scene
domain: Class
  union of: Corpus audio part
  union of: Corpus image part
  union of: Corpus text numerical part
  union of: Corpus video part
range: Scene illumination
note: needed for audio?

scholarly communication
has identifier: Clarin Domain006
type: Domain
type: NamedIndividual
comment: Scholarly communication can be defined as “the system through which research and other scholarly writings are created, evaluated for quality, disseminated to the scholarly community, and preserved for future use. The system includes both formal means of communication, such as publication in peer-reviewed journals, and informal channels, such as electronic listservs.” (Association of College & Research Libraries, “Principles and Strategies for the Reform of Scholarly Communication 1,” 2003)

school
type: Division category
type: NamedIndividual

Science
has identifier: DDC500
type: Domain
type: NamedIndividual

Scopus ID
type: Person identfier scheme
type: NamedIndividual
comment: Value for personIdentifierSchemeName, referring to the Scopus identifier for authors (https://www.scopus.com)

script
has identifier: ClarinEl TT010
type: Text type
type: NamedIndividual

Sculpture, Ceramics and Metalwork
has identifier: DDC730
type: Domain
type: NamedIndividual

second
type: Size unit
type: NamedIndividual

second
type: Duration unit
type: NamedIndividual

segmentation level
type: ObjectProperty
comment: Specifies the segmentation unit in terms of which the resource has been segmented or the level of segmentation a tool/service requires/outputs
domain: Annotation
range: Segmentation level

semantic class
type: Semantic type
type: NamedIndividual

semantic feature
type: Semantic type
type: NamedIndividual
alternative label: semantic trait

semantic relation
type: Semantic type
type: NamedIndividual

semantic role
type: Semantic type
type: NamedIndividual

semantic unit
type: Extratextual information unit
type: NamedIndividual

semantic unit
type: Size unit
type: NamedIndividual

semantics
type: Encoding level
type: NamedIndividual
comment: Value for 'EncodingLevel' for the particular linguistic level of analysis that relates to the meaning of a word, phrase, etc.

semi-interactive
type: Interactivity
type: NamedIndividual

semi-planned
type: Naturality
type: NamedIndividual

sensitive data details
type: DatatypeProperty
comment: If the resource includes sensitive data, this field can be used for entering more information, e.g., whether special handling of the resource is required (e.g., anonymization, further request for use, etc.)
domain: Data language resource
range: langString

sensitive data included
type: DatatypeProperty
comment: Specifies whether the language resource contains sensitive data (e.g., medical/health-related, etc.) and thus requires special handling
domain: Data language resource
range: boolean

sensor technology
type: DatatypeProperty
comment: Specifies the type of image sensor or the sensing method used in the camera or the image-capture device
domain: Class
  union of: Corpus audio part
  union of: Corpus image part
  union of: Corpus text numerical part
  union of: Corpus video part
range: string

sentence
type: Segmentation level
type: NamedIndividual

sentence
type: Size unit
type: NamedIndividual

series
type: DatatypeProperty
comment: Introduces the title of the series of a book/journal where the document being described has been published
domain: Document
range: langString

service adapter download location
type: DatatypeProperty
comment: Τhe URL where the docker image of the service adapter can be downloaded from
domain: Language Technology tool/service
range: string
sub property of: download location

service offered
type: DatatypeProperty
comment: Lists the service(s) offered by an organization or person
domain: Class
  union of: Division
  union of: Group
  union of: Organization
  union of: Person
range: langString

sex
type: ObjectProperty
comment: Specifies the sex of a participant (either of the two major forms of individuals that occur in many species and that are distinguished respectively as female or male especially on the basis of their reproductive organs and structures [https://www.merriam-webster.com/dictionary/sex])
domain: Participant
range: Sex
note: check with sociologists?

sex of participants
type: ObjectProperty
comment: Specifies the sex of the participants (either of the two major forms of individuals that occur in many species and that are distinguished respectively as female or male especially on the basis of their reproductive organs and structures [https://www.merriam-webster.com/dictionary/sex])
domain: Class
  union of: Corpus audio part
  union of: Corpus image part
  union of: Corpus text numerical part
  union of: Corpus video part
range: Sex
note: check with sociologists?

shallowness
type: DatatypeProperty
comment: Introduces a free text statement on the shallowness of the grammar (how deep the syntactic analysis performed by the grammar can be)
domain: Language description
range: langString

share alike
type: Condition of use
type: NamedIndividual
type: Set
comment: Value for 'ConditionOfUse' that states that the derivatives of the language resource must be distributed with the same or a compatible licence
permission:
  duty:
    action: ShareALike

short bio
type: DatatypeProperty
comment: Introduces a free text that can be used as a short bio for a person
domain: Person
range: langString
sub property of: description

shorten
type: Compression name
type: NamedIndividual

shot
type: Segmentation level
type: NamedIndividual

shot
type: Size unit
type: NamedIndividual

sign convention
type: ObjectProperty
comment: Indicates the binary representation of numbers
domain: Detailed audio format
range: Sign convention

sign language
type: Modality type
type: NamedIndividual
comment: Value for 'ModalityType' for sign languages represented in a language resource

signal
type: Segmentation level
type: NamedIndividual

signal encoding
type: ObjectProperty
comment: Specifies the encoding the audio type uses
domain: Corpus audio part
range: Signal encoding

signed integer
type: Sign convention
type: NamedIndividual

single source
type: Scene illumination
type: NamedIndividual

size
type: ObjectProperty
comment: Specifies the size of a countable entity with regard to the SizeUnit measurement in form of a number
domain: Dataset distribution
range: Size

size height
type: DatatypeProperty
comment: The frame height in pixels
domain: Resolution
range: int

size per annotation
type: ObjectProperty
comment: Provides information on size for the annotated parts of the resource
range: Size
sub property of: size per subset

size per audio classification
type: ObjectProperty
comment: The size of the audio subparts of the resource in terms of classification criteria
range: Size
sub property of: size per subset

size per audio format
type: ObjectProperty
comment: Used to give info on size of parts of a resource that differ as to the format
range: Size
sub property of: size per subset

size per character encoding
type: ObjectProperty
comment: Provides information on the size of the resource parts with different character encoding
range: Size
sub property of: size per subset

size per domain
type: ObjectProperty
comment: Specifies the size of resource parts per domain
range: Size
sub property of: size per subset

size per geographic coverage
type: ObjectProperty
comment: Provides information on size per geographically distinct section of the resource
range: Size
sub property of: size per subset

size per image classification
type: ObjectProperty
comment: Provides information on size of parts with different image classification
range: Size
sub property of: size per subset

size per image format
type: ObjectProperty
comment: Used to give info on size of parts of a resource that differ as to the format
range: Size
sub property of: size per subset

size per language
type: ObjectProperty
comment: Provides information on the size per language component
range: Size
sub property of: size per subset

size per language variety
type: ObjectProperty
comment: Provides information on the size per language variety component
range: Size
sub property of: size per subset

size per modality
type: ObjectProperty
comment: Provides information on the size per modality component
range: Size
sub property of: size per subset

size per subset
type: ObjectProperty
comment: Indicates the size of a subset of a language resource
domain: Subset
range: Size

size per text classification
type: ObjectProperty
comment: Provides information on size of resource parts with different text classification
range: Size
sub property of: size per subset

size per text format
type: ObjectProperty
comment: Provides information on the size of the resource parts with different format
range: Size
sub property of: size per subset

size per textNumerical format
type: ObjectProperty
comment: Gives information on the size of textNumerical resource parts with different format
range: Size
sub property of: size per subset

size per time coverage
type: ObjectProperty
comment: Provides information on size per time period represented in the resource
range: Size
sub property of: size per subset

size per validation
type: ObjectProperty
comment: Specifies the size of the validated part of a resource
range: Size
sub property of: size per subset

size per video classification
type: ObjectProperty
comment: Used to give info on size of parts with different video classification
range: Size
sub property of: size per subset

size per video format
type: ObjectProperty
comment: Used to give info on size of parts of a resource that differ as to the format
range: Size
sub property of: size per subset

size unit
type: ObjectProperty
comment: Specifies the unit that is used when providing information on the size of the resource or of resource parts
domain: Size
range: Size unit

size width
type: DatatypeProperty
comment: The frame width in pixels
domain: Resolution
range: int

sleep deprivation
type: Speech influence
type: NamedIndividual

SME
type: Organization legal status
type: NamedIndividual

smoking habit
type: DatatypeProperty
comment: Provides information on whether the participant smokes and on his/her smoking habits in general
domain: Participant
range: langString

smoothing
type: DatatypeProperty
comment: The technique used for giving unseen items some probability
domain: N-gram model
range: string

social media occupational account
type: ObjectProperty
comment: Introduces the social media or occupational account details of an entity
domain: Class
  union of: Division
  union of: Group
  union of: Organization
  union of: Person
  union of: Project
range: Social media occupational account

social media occupational account type
type: ObjectProperty
comment: Specifies the type of the social media or occupational account
domain: Social media occupational account
range: Social media account occupational type

Social Problems & Social Services
has identifier: DDC360
type: Domain
type: NamedIndividual

Social Sciences
has identifier: DDC300
type: Domain
type: NamedIndividual
comment: The social sciences are academic disciplines concerned with the study of the social life of human groups and individuals including anthropology, economics, geography, history, political science, psychology, social studies, and sociology. The social sciences consist of the scientific study of the human aspects of the world.[https://en.wikipedia.org/wiki/Category:Social_sciences

society
type: Organization legal status
type: NamedIndividual

Sociology & Anthropology
has identifier: DDC301
type: Domain
type: NamedIndividual

some
type: Audience
type: NamedIndividual

song
has identifier: MS AG004
type: Audio genre
type: NamedIndividual

sound
type: Non-speech item
type: NamedIndividual

Sound blaster card
type: Recording device type
type: NamedIndividual

sound recording
type: Extratextual information
type: NamedIndividual

source and executable code
type: Software distribution form
type: NamedIndividual
comment: Value for software distribution form, used for software that is available from the same location both as source code and executable program

source channel
type: ObjectProperty
comment: Specifies the source channel of the recording of a multimedia resource
domain: Class
  union of: Corpus audio part
  union of: Corpus text numerical part
  union of: Corpus video part
range: Source channel

source channel details
type: DatatypeProperty
comment: Provides information on the details of the channel equipment used (brand, type, etc.) in free text
domain: Class
  union of: Corpus audio part
  union of: Corpus text numerical part
  union of: Corpus video part
range: langString

source channel name
type: DatatypeProperty
comment: Introduces the name of the source channel through which the recording has been made
domain: Class
  union of: Corpus audio part
  union of: Corpus text numerical part
  union of: Corpus video part
range: langString

source channel type
type: ObjectProperty
comment: Specifies the type of the source channel
domain: Class
  union of: Corpus audio part
  union of: Corpus text numerical part
  union of: Corpus video part
range: Source channel type

source code
type: Software distribution form
type: NamedIndividual
comment: Value for software distribution form, used for software objects in the form of source code, i.e. as files with the commands ready to be compiled or assembled into an executable computer program

source metadata record
type: ObjectProperty
comment: Links, in some cases (e.g., harvesting, population from other catalogues, conversion from other metadata records, etc.), to the metadata record that has been used as the basis for the creation of the metadata record
domain: Metadata record
range: Metadata record
sub property of: is related to metadata record
inverse of: target metadata record

sourceOfMetadataRecord
type: ObjectProperty
comment: Refers to the entity (repository, catalogue, archive, etc.) from which the metadata record has been imported into the new catalogue
domain: Metadata record
range: Catalog
note: for now dcat:catalog

spatial constraint
type: Condition of use
type: NamedIndividual
comment: Value for 'ConditionsOfUse' which is used for resources with spatial restrictions, e.g., in cases where the content is available or can be used only at a single location, center, or site

speaker noise
type: Annotated element
type: NamedIndividual

speaking impairment
type: DatatypeProperty
comment: Provides information on any speaking impairment the participant may have
domain: Participant
range: langString

speaking impairment of participants
type: ObjectProperty
comment: Indicates whether the group of participants contains persons with speaking impairments
domain: Class
  union of: Corpus audio part
  union of: Corpus image part
  union of: Corpus text numerical part
  union of: Corpus video part
range: Speaking impairment of participants

special hardware equipment
type: Required hardware
type: NamedIndividual

speech
has identifier: MS AG003
type: Audio genre
type: NamedIndividual

speech influence
type: ObjectProperty
comment: Specifies the factors influencing speech
domain: Class
  union of: Corpus audio part
  union of: Corpus image part
  union of: Corpus text numerical part
  union of: Corpus video part
range: Speech influence

speech item
type: ObjectProperty
comment: Specifies the distinct elements that are pronounced and annotated as such
domain: Class
  union of: Corpus audio part
  union of: Lexical/Conceptual resource audio part
range: Speech item

spoken language
type: Modality type
type: NamedIndividual
comment: Value for 'ModalityType' for language resources including spoken language words and expressions

spontaneous
type: Naturality
type: NamedIndividual

Sports, Games & Entertainment
has identifier: DDC790
type: Domain
type: NamedIndividual

standardization body
type: Organization role
type: NamedIndividual

startup
type: DatatypeProperty
comment: Indicates whether a company is a startup
domain: Class
  union of: Division
  union of: Organization
range: boolean

static element
type: ObjectProperty
comment: Groups information on the static elements visible on images
domain: Class
  union of: Corpus image part
  union of: Language description image part
  union of: Lexical/Conceptual resource image part
range: Static element

statistical property
type: Content type
type: NamedIndividual

Statistics
has identifier: DDC310
type: Domain
type: NamedIndividual

status
type: DatatypeProperty
comment: Specifies the status in which a project is found in the course of a funding process (e.g. approved, signed, under negotiation, etc.)
domain: Project
range: string

string
type: Parameter type
type: NamedIndividual

studio
type: Recording environment
type: NamedIndividual

studio equipment
type: Capturing device type
type: NamedIndividual

subcategorization frame
type: Syntactic type
type: NamedIndividual

subject
type: ObjectProperty
comment: Specifies the subject/topic of a language resource
domain: Class
  union of: Corpus part
  union of: Document
  union of: Project
range: Subject
alternative label: topic

submitted
type: Version type
type: NamedIndividual
comment: Value for 'Version type' used for versions as submitted for publication

subsidiary
type: Division category
type: NamedIndividual

subtitle
type: DatatypeProperty
comment: Introduces a secondary title used for a document
domain: Document
range: langString
sub property of: alternative

subtitle
type: Text included in video
type: NamedIndividual

subtitle
type: Text included in image
type: NamedIndividual

subtitle
has identifier: ClarinEl TT015
type: Text type
type: NamedIndividual

support type
type: ObjectProperty
comment: Specifies whether some type of support (commercial, free, etc.) is provided for the resource installation or use
domain: Language Resource
range: Support type

surname
type: DatatypeProperty
comment: Introduces the surname (i.e. the name shared by members of a family, also known as "family name" or "last name") of a person
domain: Person
range: langString
alternative label: family name
alternative label: last name

syllable
type: Base item
type: NamedIndividual

syllable
type: Segmentation level
type: NamedIndividual

syllable
type: Size unit
type: NamedIndividual

synchronized with audio
type: DatatypeProperty
comment: Whether the media part described is synchronized with audio within the same resource
domain: Link to other media
range: boolean

synchronized with image
type: DatatypeProperty
comment: Whether the media part described is synchronized with image within the same resource
domain: Link to other media
range: boolean

synchronized with text
type: DatatypeProperty
comment: Whether video, text and textNumerical media type is synchronized with text within the same resource
domain: Link to other media
range: boolean

synchronized with textNumerical
type: DatatypeProperty
comment: Whether the media part described is synchronized with textNumerical within the same resource
domain: Link to other media
range: boolean

synchronized with video
type: DatatypeProperty
comment: Whether the media part described is synchronized with video within the same resource
domain: Link to other media
range: boolean

synonym
type: Semantic type
type: NamedIndividual

synset
type: Size unit
type: NamedIndividual

syntactic unit
type: Extratextual information unit
type: NamedIndividual

syntactic unit
type: Size unit
type: NamedIndividual

syntactico-semantic link
type: Syntactico-semantic type
type: NamedIndividual

syntax
type: Encoding level
type: NamedIndividual
comment: Value for 'EncodingLevel' for the particular linguistic level that relates to the study of the structure of linguistic units (phrases, sentences)

synthetic data
type: DatatypeProperty
comment: Specifies whether the contents of a corpus have been artificially generated (e.g., using a Machine Translation or NLG system) rather than having been created by humans (authentic/original data)
domain: Corpus part
range: boolean

system evaluator
type: Organization role
type: NamedIndividual

tagset
type: ObjectProperty
comment: The tagset used for annotating a resource or for the input resource (if annotated) of a tool/service or that should be used (dependency) for the annotation
domain: Class
  union of: Annotation
  union of: Machine Learning model
range: Lexical/Conceptual resource

tagset
type: Compatible lexicon type
type: LCR subclass
type: NamedIndividual
comment: a flat list of valid values (tags) designed to annotate data; it usually corresponds to a specific annotation type or set of annotation types

VHS tape
type: Recording device type
type: NamedIndividual

target metadata record
type: ObjectProperty
comment: Links, in some cases (e.g., harvesting, population from other catalogues, conversion from other metadata records, etc.), an external metadata record that has been used as the basis for the creation of the internal metadata record to this internal metadata record
domain: Metadata record
range: Metadata record
sub property of: metadata record related to

terabyte
type: Size unit
type: NamedIndividual
alternative label: tb

technical report
type: Document type
type: NamedIndividual

technical text
has identifier: ClarinEl TT011
type: Text type
type: NamedIndividual

technological
type: Evaluation level
type: NamedIndividual

Technology
has identifier: DDC600
type: Domain
type: NamedIndividual

teenager
type: Age group
type: NamedIndividual

telecommunications
has identifier: ELG Domain004
type: Domain
type: NamedIndividual

telephone
type: Source channel
type: NamedIndividual

telephone conversation
has identifier: ClarinEl TT005
type: Text type
type: NamedIndividual

fixed telephone
type: Capturing device type
type: NamedIndividual

IP telephone
type: Capturing device type
type: NamedIndividual

mobile telephone
type: Capturing device type
type: NamedIndividual

telephone number
type: Speech item
type: DatatypeProperty
type: NamedIndividual
comment: Introduces the telephone number of a person, group or organization; recommended format: +_international code_city code_number without spaces
domain: Class
  union of: Division
  union of: Group
  union of: Organization
  union of: Person
range: string
example: +123456789012

tempo
type: Non-speech item
type: NamedIndividual

tense
type: Morphological type
type: NamedIndividual

term
type: Size unit
type: NamedIndividual

terminological resource
type: LCR subclass
type: NamedIndividual
comment: A lexical resource that lists concepts pertaining to a specific domain
alternative label: term list

text
type: Media type
type: NamedIndividual
comment: Value for 'MediaType' for the written or printed form of a language resource (part)

text
type: Size unit
type: NamedIndividual

text included in image
type: ObjectProperty
comment: Provides information on the type of text that may be on the image
domain: Class
  union of: Corpus image part
  union of: Language description image part
  union of: Lexical/Conceptual resource image part
range: Text included in image

text included in video
type: ObjectProperty
comment: Indicates if any text and what type is present in or in conjunction with the video
domain: Class
  union of: Corpus video part
  union of: Language description video part
  union of: Lexical/Conceptual resource video part
range: Text included in video

numerical text
type: Media type
type: NamedIndividual

detailed numerical text format
type: ObjectProperty
comment: Groups information on the format(s) of the textNumerical part of the resource
domain: Corpus text numerical part
range: DataFormat

text type
type: ObjectProperty
comment: Specifies the text type (e.g., factual, literary, etc.) according to which a text corpus (part) is classified
domain: Corpus text part
range: Text type

theoretic model
type: DatatypeProperty
comment: Indicates the theoretic model applied for the creation/enrichment of the resource, by name and/or by reference (URL or bibliographic reference) to informative material about the theoretic model used
domain: Class
  union of: Annotation
  union of: Language description
  union of: Lexical/Conceptual resource
range: langString

thesaurus
type: LCR subclass
type: NamedIndividual
comment: A reference work that lists words grouped together according to similarity of meaning (containing synonyms and sometimes antonyms) [https://en.wikipedia.org/wiki/Thesaurus]

thing description
type: DatatypeProperty
comment: Provides description of the things represented in the image corpus
domain: Static element
range: langString

time coverage
type: DatatypeProperty
comment: Indicates the time period that the content of a resource is about
domain: Class
  union of: Corpus
  union of: Language description
  union of: Lexical/Conceptual resource
  union of: Subset
range: langString

title
type: DatatypeProperty
comment: Introduces a human-readable text (typically short) used as a name for referring to the document being described
domain: Document
range: langString
sub property of: title

parsing of titles
type: Language description task
type: NamedIndividual

token
type: Size unit
type: NamedIndividual

token
type: Segmentation level
type: NamedIndividual

trained speaker
type: DatatypeProperty
comment: Provides information on whether the participant is trained in a specific task
domain: Participant
range: boolean

training corpus details
type: DatatypeProperty
comment: Provides a detailed description of the training corpus (e.g., size, number of features, etc.)
domain: Machine Learning model
range: langString

training resource
type: Documentation type
type: NamedIndividual
comment: Value for 'DocumentationType' used for the training material of a resource (e.g., video tutorials, screencasts, guided tours, etc.)

training use
type: Condition of use
type: NamedIndividual
comment: Value for 'ConditionOfUse' which states that the resource can only be used for training purposes
note: add ODRL representation

phonetic transcription
type: Audio type
type: NamedIndividual

translation equivalent
type: Translation type
type: NamedIndividual

translation unit
type: Size unit
type: NamedIndividual
alternative label: tu

transport
type: Recording environment
type: NamedIndividual

Transportation
has identifier: DDC388
type: Domain
type: NamedIndividual

travel industry
has identifier: ELG Domain013
type: Domain
type: NamedIndividual

trigram
type: Size unit
type: NamedIndividual

TRL
type: ObjectProperty
comment: Specifies the TRL (Technology Readiness Level) of the technology according to the measurement system defined by the EC
domain: Language Technology tool/service
range: TRL
alternative label: Technology Readiness Level

TRL1
type: TRL
type: NamedIndividual
comment: Basic principles observed

TRL2
type: TRL
type: NamedIndividual
comment: Technology concept formulated

TRL3
type: TRL
type: NamedIndividual
comment: Experimental proof of concept

TRL4
type: TRL
type: NamedIndividual
comment: Technology validated in lab

TRL5
type: TRL
type: NamedIndividual
comment: Technology validated in relevant environment (industrially relevant environment in the case of key enabling technologies)

TRL6
type: TRL
type: NamedIndividual
comment: Technology demonstrated in relevant environment (industrially relevant environment in the case of key enabling technologies)

TRL7
type: TRL
type: NamedIndividual
comment: System prototype demonstration in operational environment

TRL8
type: TRL
type: NamedIndividual
comment: System complete and qualified

TRL9
type: TRL
type: NamedIndividual
comment: Actual system proven in operational environment (competitive manufacturing in the case of key enabling technologies; or in space)

troponym
type: Semantic type
type: NamedIndividual

truncation
type: Annotated element
type: NamedIndividual

turn
type: Size unit
type: NamedIndividual

tv
type: Source channel
type: NamedIndividual

tweet
has identifier: ClarinEl TT007
type: Text type
type: NamedIndividual

twitter
type: Social media account occupational type
type: NamedIndividual

type of element
type: DatatypeProperty
comment: Specifies the type of objects or people represented in the video or image part of the resource
domain: Class
  union of: Dynamic element
  union of: Static element
range: langString

type of image content
type: DatatypeProperty
comment: The main types of object or people represented in the image corpus
domain: Class
  union of: Corpus image part
  union of: Language description image part
  union of: Lexical/Conceptual resource image part
range: langString

type of textNumerical content
type: DatatypeProperty
comment: Specifies the content that is represented in the textNumerical part of the resource
domain: Corpus text numerical part
range: langString

type of video content
type: DatatypeProperty
comment: Main type of object or people represented in the video
domain: Class
  union of: Corpus video part
  union of: Language description video part
  union of: Lexical/Conceptual resource video part
range: langString

typesystem
type: ObjectProperty
comment: Specifies the typesystem (preferrably through an identifier or URL) that has been used for the annotation of a resource or that is required for the input resource of a tool/service or that should be used (dependency) for the annotation or used in the training of a ML model
domain: Class
  union of: Machine Learning model
  union of: Input content resource
  union of: Language Technology tool/service
range: Lexical/Conceptual resource
sub property of: depends on

typesystem
type: LCR subclass
type: NamedIndividual
comment: A set of elements designed to annotate data; it typically contains only a list of annotation types, i.e. specific labels that are used for the annotation (e.g., part-of-speech, person, organization, etc.), and is usually inbuilt in the annotation software

under negotiation
type: Availability
type: NamedIndividual
comment: For resources whose availability is still pending.

unigram
type: Size unit
type: NamedIndividual

unit
type: Size unit
type: NamedIndividual

unit
type: Division category
type: NamedIndividual

unit of measure
type: DatatypeProperty
comment: Identifies the unit of measure used in the calculation of the metric (for the evaluation of a tool/service)
domain: Performance indicator
range: string

UNIX
type: operating system
type: NamedIndividual

unknown
type: Origin
type: NamedIndividual

unknown
type: Sex
type: NamedIndividual

unpublished
type: Document type
type: NamedIndividual

unsigned integer
type: Sign convention
type: NamedIndividual

unspecified
type: Funder identfier scheme
type: Organization identifier scheme
type: Person identfier scheme
type: Annotated element
type: Audio genre
type: Audio genre classification scheme
type: Audio quality measure included
type: Base item
type: Capturing device type
type: Compatible lexicon type
type: Compression name
type: Condition of use
type: Content type
type: Corpus subclass
type: Currency
type: Dataset distribution form
type: Division category
type: Document identifier scheme
type: Document type
type: Documentation type
type: Domain
type: Domain classification scheme
type: Encoding level
type: Extratextual information
type: Extratextual information unit
type: Framework
type: Funding type
type: Grammatical phenomena coverage
type: Image genre classification scheme
type: Interactivity
type: LCR subclass
type: Language description task
type: LR identifier scheme
type: Language variety type
type: Licence identifier scheme
type: Membership institution
type: Metadata record identifier scheme
type: Metric
type: Modality type
type: Multilinguality type
type: Naturality
type: Non-speech item
type: operating system
type: Organization legal status
type: Organization role
type: Parameter type
type: Processing resource type
type: Project identifier scheme
type: Recording device type
type: Recording environment
type: Repository identifier scheme
type: Required hardware
type: Scenario type
type: Scene illumination
type: Segmentation level
type: Signal encoding
type: Size unit
type: Social media account occupational type
type: Software distribution form
type: Source channel
type: Source channel type
type: Speech genre
type: Speech genre classification scheme
type: Speech influence
type: Speech item
type: Standard/Best practice
type: Subject classification scheme
type: Support type
type: Text genre
type: Text genre classification scheme
type: Text type
type: Text type classification scheme
type: Video genre classification scheme
type: Vocal tract condition
type: Web service type
type: NamedIndividual
comment: Value used for mandatory elements whose value is unknown or cannot be specified

update frequency
type: DatatypeProperty
comment: Specifies the frequency with which the resource is updated
domain: Language Resource
range: langString

updated
type: Version type
type: NamedIndividual
comment: Value for 'Version type' used for versions that have been updated vis-a-vis the previous published version

has URL
type: DatatypeProperty
comment: Links to a URL
domain: Thing
range: anyURI

url
type: Parameter type
type: NamedIndividual

usage
type: Evaluation level
type: NamedIndividual

usage project
type: ObjectProperty
comment: Links to a project in which the language resource has been used
domain: Actual use
range: Project
sub property of: is related to project

usage report
type: ObjectProperty
comment: Links to a document (e.g., research article, report) describing a project, application, experiment or use case where the language resource has been used
domain: Actual use
range: Document
sub property of: is documented by

used in application
type: ObjectProperty
comment: Specifies an LT application where the language resource has been used in
domain: Actual use
range: Operation

user identified
type: Condition of use
type: NamedIndividual
comment: Value for 'ConditionOfUse' which states that the resource can only be accessed by identified/authenticated users

user input text
type: Processing resource type
type: NamedIndividual

user manual
type: Documentation type
type: NamedIndividual
comment: Value for 'Documentation type' for documents that include instructions and examples on the usage of a tool/service (or resource in general)

user query
type: DatatypeProperty
comment: Introduces a query performed by a user that has resulted in the creation of the resource being described (e.g. a dataset created with a query aggregating texts from a database, or subset of a lexical resource, or a virtual collection of sentences from online corpora)
domain: Corpus
range: string

user type
type: ObjectProperty
comment: Used to identify the type of user of the resource (affiliated with a commercial vs. academic institution); it is usually associated with licensing or pricing conditions on the use of a resource
domain: Distribution
range: User type

utterance
type: Segmentation level
type: NamedIndividual

utterance
type: Size unit
type: NamedIndividual

validated
type: DatatypeProperty
comment: Specifies whether the resource has undergone a formal validation process
domain: Language Resource
range: boolean

validation
type: ObjectProperty
comment: Provides information on each of the the validation procedure(s) a language resource may have undergone (e.g., formal validation of the whole resource, content validation of one part of the resource, etc.).
domain: Language Resource
range: Validation

validation details
type: DatatypeProperty
comment: Provides additional information in the form of free text about the validation process of a language resource
domain: Validation
range: langString

validation extent
type: ObjectProperty
comment: Specifies the coverage of the language resource that has been validated
domain: Validation
range: Validation extent

validation mode
type: ObjectProperty
comment: Specifies the type of processing applied for the validation of the language resource
domain: Validation
range: Process mode
sub property of: process mode

validation report
type: ObjectProperty
comment: Links to a document with detailed information on the validation process and results
domain: Validation
range: Document
sub property of: is documented by

validation type
type: ObjectProperty
comment: Specifies the type of validation that has been performed on a language resource
domain: Validation
range: Validation type

validator
type: ObjectProperty
comment: Links a validation to the person(s), group(s) or organization(s) that have performed a specific validation of a language resource
domain: Validation
range: Actor
sub property of: is related to actor

variable
type: Scene illumination
type: NamedIndividual

variant
type: Lemma type
type: NamedIndividual

VCV sequence
type: Speech item
type: NamedIndividual

vector
type: Raster or vector graphics
type: NamedIndividual

version
type: DatatypeProperty
comment: Associates a language resource with a pattern that indicates its version; the recommended way is to follow the semantic versioning guidelines (http://semver.org) and use a numeric pattern of the form major_version.minor_version.patch
domain: Language Resource
range: string
sub property of: hasVersion

version date
type: DatatypeProperty
comment: Identifies the date associated with the version of the language resource being described (as a recommendation, of the latest update of the particular version)
domain: Language Resource
range: date

version type
type: ObjectProperty
comment: Links scholarly works (mainly) to a type of versioning vocabulary related to the publication process
domain: Class
  union of: Document
  union of: Language Resource
range: Version type
note: If we think this shouldn' be used for LRTs, remove from XSD's

very high
type: Recording quality
type: NamedIndividual

very high
type: Quality
type: NamedIndividual

very low
type: Recording quality
type: NamedIndividual

very low
type: Quality
type: NamedIndividual

video
type: Media type
type: NamedIndividual
comment: Value for 'Media type' for the audiovisual form of a language resource (part)

video
type: Extratextual information
type: NamedIndividual

detailed video format
type: ObjectProperty
comment: Groups information on the format(s) of a resource; repeated if parts of the resource are in different formats
domain: Dataset distribution
range: Detailed video format
note: see how data formats, audio & video formats will be handled; must be on distribution

visual modelling
type: ObjectProperty
comment: Specifies the dimensional form applied on the video or image part(s) of a corpus
domain: Class
  union of: Detailed image format
  union of: Detailed video format
range: Visual modelling

vocal tract condition
type: ObjectProperty
comment: Provides information on the vocal tract conditions that may influence the speech of the participant
domain: Participant
range: Vocal tract condition

voice
type: Modality type
type: NamedIndividual
comment: Value for 'ModalityType' for voice

voice
type: Morphological type
type: NamedIndividual

volume
type: DatatypeProperty
comment: Introduces the number used for the volume of a journal or a series of publications
domain: Document
range: string

webcam
type: Source channel
type: NamedIndividual

web service
type: Software distribution form
type: NamedIndividual
comment: Value for software distribution form, used for software objects that can be accessed through remote invocation typically using some REST-style APIs or SOAP protocols

web service type
type: ObjectProperty
comment: Identifies the type of a web service in accordance to a classification vocabulary that refers to the web service communication protocols
domain: Software distribution
range: Web service type
note: try to restrict with instance "webService" on DistributionForm

webcam
type: Capturing device type
type: NamedIndividual

website
type: DatatypeProperty
comment: Links to a URL that acts as the primary page (like a table of contents) introducing information about an organization (e.g., products, contact information, etc.) or project
domain: Class
  union of: Division
  union of: Group
  union of: Organization
  union of: Project
range: anyURI
sub property of: has URL
alternative label: home page

weight
type: DatatypeProperty
comment: Provides information on the weight of the participant
domain: Participant
range: int

weighted grammar
type: DatatypeProperty
comment: Indicates whether the grammar contains numerical weights (incl. probabilities)
domain: Language description
range: boolean

whole body
type: Body part
type: NamedIndividual

Windows
type: operating system
type: NamedIndividual

windows-1250
type: Character encoding
type: NamedIndividual

windows-1251
type: Character encoding
type: NamedIndividual

windows-1252
type: Character encoding
type: NamedIndividual

windows-1253
type: Character encoding
type: NamedIndividual

windows-1254
type: Character encoding
type: NamedIndividual

windows-1255
type: Character encoding
type: NamedIndividual

windows-1256
type: Character encoding
type: NamedIndividual

windows-1257
type: Character encoding
type: NamedIndividual

windows-1258
type: Character encoding
type: NamedIndividual

windows-31j
type: Character encoding
type: NamedIndividual

wizard of Oz
type: Scenario type
type: NamedIndividual

word
type: Base item
type: NamedIndividual

word
type: Segmentation level
type: NamedIndividual

word
type: Extratextual information unit
type: NamedIndividual

word
type: Size unit
type: NamedIndividual

word game
type: Scenario type
type: NamedIndividual

word group
type: Segmentation level
type: NamedIndividual

WordNet
type: Compatible lexicon type
type: LCR subclass
type: Standard/Best practice
type: NamedIndividual
comment: A lexical database originally created for English and extended to other languages, which groups words into sets of synonyms called synsets, provides short definitions and usage examples, and records a number of relations among these synonym sets or their members

wordlist
type: Compatible lexicon type
type: LCR subclass
type: NamedIndividual
comment: A written collection of all words derived from a particular source, or sharing some other characteristic [https://www.yourdictionary.com/wordlist]

workflow file
type: Software distribution form
type: NamedIndividual
comment: Value for software distribution form, used for software workflows that are made available in the form of the workflow description file

written language
type: Modality type
type: NamedIndividual
comment: Value for 'ModalityType' for texts with written language

x-EUC-CN
type: Character encoding
type: NamedIndividual

x-EUC-JP-LINUX
type: Character encoding
type: NamedIndividual

x-EUC-TW
type: Character encoding
type: NamedIndividual

x-MS950-HKSCS
type: Character encoding
type: NamedIndividual

x-mswin-936
type: Character encoding
type: NamedIndividual

x-windows-949
type: Character encoding
type: NamedIndividual

x-windows-950
type: Character encoding
type: NamedIndividual

yes
type: Speaking impairment of participants
type: NamedIndividual

yes
type: Hearing impairment of participants
type: NamedIndividual

yes/no question
type: Speech item
type: NamedIndividual

youtube
type: Social media account occupational type
type: NamedIndividual

zip code
type: DatatypeProperty
comment: The zip code of the postal address of a person or organization
domain: Address
range: string