GND Ontology
license: http://creativecommons.org/publicdomain/zero/1.0/
description: GND stands for Gemeinsame Normdatei (Integrated Authority File) and offers a broad range of elements to describe authorities. The GND originates from the German library community and aims to solve the name ambiguity problem in the library world.
title: GND-Ontologie @de
available: 2022-09-27
contributor: Staff members of the Deutsche Nationalbibliothek
contributor: Members of the GND ontology mailing list
creator: Alexander Haffner
issued: 2012-06-30
modified: 2022-10-10T16:05:00+02:00
publisher: DE-101
rights: Copyright 2012-2022 Deutsche Nationalbibliothek
preferred namespace prefix: gndo
type: Vocabulary
type: Ontology
prior version: gnd_20191015
version IRI: gnd_20221010
version info: 1.16
version notes: Changes from 2022-06-27 to 2022-10-10 Add new object properties - #descriptionLevel *Changes from 2022-02-08 to 2022-06-27 Add new object properties - #equivalence - #exactEquivalence - #inexactEquivalence - #compoundEquivalence - #cumulativeCompoundEquivalence - #broaderMapping - #narrowerMapping - #relatedMapping Add new datatype properties - #mediumOfPerformanceAsLiteral - #numberOfEnsemblesOfTheSameType - #numberOfPerformersOfTheSameMedium - #alternativeMediumOfPerformance - #totalNumberOfPerformers - #totalNumberOfEnsembles Add new annotation property - #titleWithOtherTitleInformation *Changes from 2019-10-15 to 2022-02-08 Add new annotation property gndo:abbreviatedName Changes from 2019-06-18 to 2019-10-15 All d-nb.info-URIs changed from http to https Changes from 2019-02-12 to 2019-06-18 Updated comments to #dateOfBirth Added comments to #dateOfDeath Removed alignment from #dateOfBirth to foaf:birthday Corrected improper comments in #firstAuthor Changes from 2018-10-16 to 2019-02-12 Removed the axiom that all main classes are disjoint Removed all owl:PropertyChains that have a owl:DatatypeProperty as their last chain link - #affiliationAsLiteral - #functionOrRoleAsLiteral - #placeOfBirthAsLiteral - #placeOfDeathAsLiteral - #professionOrOccupationAsLiteral - #titleOfNobilityAsLiteral Changes from 2018-05-15 Minor corrections at some labels Added alignments to AgRelOn: gndo:relatedPerson rdfs:subPropertyOf agrelon:relatedAgent gndo:relatedFamily rdfs:subPropertyOf agrelon:relatedAgent gndo:relatedCorporateBody rdfs:subPropertyOf agrelon:relatedAgent gndo:memberOfTheFamily rdfs:subPropertyOf agrelon:isMemberOf gndo:dateOfBirth rdfs:subPropertyOf agrelon:hasBeginDate gndo:dateOfEstablishment rdfs:subPropertyOf agrelon:hasBeginDate gndo:dateOfDeath rdfs:subPropertyOf agrelon:hasEndDate gndo:dateOfTermination rdfs:subPropertyOf agrelon:hasEndDate Changes from 2018-01-16 Minor corrections to https://d-nb.info/standards/elementset/gnd#topic https://d-nb.info/standar…

Administrative unit
type: Class
label: Verwaltungseinheit @de
subclass of: Place or geographic name
MARC 21 equivalent: 079 $v=giv

Authority Resource
type: Class
label: Normdatenressource @de

Building or memorial
type: Class
label: Bauwerk oder Denkmal @de
subclass of: Place or geographic name
MARC 21 equivalent: 079 $v=gib

Characters or morphemes
type: Class
label: Buchstaben oder Morpheme @de
subclass of: Subject heading
MARC 21 equivalent: 079 $v=slz

Collection
type: Class
label: Sammlung @de
subclass of: Work
MARC 21 equivalent: 079 $v=win

Collective manuscript
type: Class
label: Sammelhandschrift @de
subclass of: Work
MARC 21 equivalent: 079 $v=wil

Collective pseudonym
type: Class
label: Sammelpseudonym @de
subclass of: Differentiated person
MARC 21 equivalent: 079 $v=pis

Company
type: Class
label: Firma @de
subclass of: Corporate Body
MARC 21 equivalent: 079 $v=kif

Conference or Event
type: Class
label: Konferenz oder Veranstaltung @de
subclass of: C10005
subclass of: Authority Resource
MARC 21 equivalent: 079 $b=f
MARC 21 equivalent: 079 $v=vie

Corporate Body
type: Class
label: Körperschaft @de
subclass of: C10005
subclass of: Authority Resource
equivalent class: Organization
MARC 21 equivalent: 079 $b=b
MARC 21 equivalent: 079 $v=kiz

Country
type: Class
label: Land oder Staat @de
subclass of: Place or geographic name
MARC 21 equivalent: 079 $v=gil

Differentiated person
type: Class
label: Individualisierte Person @de
subclass of: Person
disjoint with: Undifferentiated person
MARC 21 equivalent: 079 $b=p
MARC 21 equivalent: 079 $v=piz

Earlier name of the person
type: Class
comment: Der vorliegende abweichende Name ist der frühere Name einer Person, wie beispielsweise der Geburtsname, frühere Ehename usw. @de
label: Früherer Name der Person @de
subclass of: Variant name of the person
MARC 21 equivalent: 400 $4=nafr

Ethnographic name
type: Class
label: Ethnografikum @de
subclass of: Subject heading
MARC 21 equivalent: 079 $v=sie

Expression
type: Class
subclass of: Work
MARC 21 equivalent: 079 $v=wie

Extraterrestrial territory
type: Class
label: Extraterrestrikum @de
subclass of: Place or geographic name
MARC 21 equivalent: 079 $v=gix

Family
type: Class
label: Familie @de
subclass of: C10008
subclass of: Authority Resource
MARC 21 equivalent: 079 $v=pif

Fictive corporate body
type: Class
label: Fiktive Körperschaft @de
subclass of: Corporate Body
MARC 21 equivalent: 079 $v=kxz

Fictive place
type: Class
label: Fiktiver Ort @de
subclass of: Place or geographic name
MARC 21 equivalent: 079 $v=gxz

Fictive term
type: Class
label: Fiktiver Sachbegriff @de
subclass of: Subject heading
MARC 21 equivalent: 079 $v=sxz

Fictive term
type: Class
comment: Bitte verwenden Sie FictiveTerm @de
comment: Use FictiveTerm instead
label: Fiktiver Sachbegriff @de
subclass of: Subject heading
deprecated: true
MARC 21 equivalent: 079 $v=sxz

Fuller form of the name of the person
type: Class
comment: Die vorliegende abweichende Namensform ist die vollständig aufgelöste Form des bevorzugten Namens, der abgekürzte Formen enthält. @de
comment: The complete or a fuller form of name of a person, family or corporate body
label: Vollständiger Name der Person @de
subclass of: Variant name of the person
MARC 21 equivalent: 400 $4=navo

Gods
type: Class
label: Götter @de
subclass of: Differentiated person
MARC 21 equivalent: 079 $v=pxg

Group of persons
type: Class
label: Personengruppe @de
subclass of: Subject heading
MARC 21 equivalent: 079 $v=siu

Historic single event or era
type: Class
label: Historisches Einzelereignis oder Epoche @de
subclass of: Subject heading
MARC 21 equivalent: 079 $v=sih

Language
type: Class
label: Sprache @de
subclass of: Subject heading
MARC 21 equivalent: 079 $v=sis

Later name of the person
type: Class
comment: Die vorliegende abweichende Namensform ist der spätere Name einer Person, wie der Ehename etc., der nicht als bevorzugter Name gewählt wird. @de
label: Späterer Name der Person @de
subclass of: Variant name of the person
MARC 21 equivalent: 400 $4=nasp

Literary or legendary character
type: Class
label: Literarische oder Sagengestalt @de
subclass of: Differentiated person
MARC 21 equivalent: 079 $v=pxl

Manuscript
type: Class
label: Schriftdenkmal @de
subclass of: Work
MARC 21 equivalent: 079 $v=wis

Means of transport with individual name
type: Class
label: Verkehrsmittel mit Individualnamen @de
subclass of: Subject heading
MARC 21 equivalent: 079 $v=sif

Means of transport with individual name
type: Class
comment: Bitte verwenden Sie gndo:MeansOfTransportWithIndividualName @de
comment: Use gndo:MeansOfTransportWithIndividualName
label: Verkehrsmittel mit Individualnamen @de
subclass of: Subject heading
deprecated: true
MARC 21 equivalent: 079 $v=sif

Member state
type: Class
label: Gliedstaat @de
subclass of: Place or geographic name
MARC 21 equivalent: 079 $v=gif

Musical corporate body
type: Class
label: Musikalische Körperschaft @de
subclass of: Corporate Body
equivalent class: CorporateBody
MARC 21 equivalent: 079 $v=kim

Musical work
type: Class
label: Werk der Musik @de
subclass of: Work
MARC 21 equivalent: 079 $v=wim

Name of small geographic unit lying within another geographic unit
type: Class
label: Kleinräumiges Geografikum innerhalb eines Ortes @de
subclass of: Place or geographic name
MARC 21 equivalent: 079 $v=gio

Name of the person
type: Class
label: Personenname @de
subclass of: Thing

Natural geographic unit
type: Class
label: Natürlich geografische Einheit @de
subclass of: Place or geographic name
MARC 21 equivalent: 079 $v=gin

Nomenclature in biology or chemistry
type: Class
label: Nomenklatur Biologie - Chemie @de
subclass of: Subject heading
MARC 21 equivalent: 079 $v=snz

Organ of corporate body
type: Class
label: Organ einer Körperschaft @de
subclass of: Corporate Body
MARC 21 equivalent: 079 $v=kio

Person
type: Class
subclass of: Authority Resource
equivalent class: C10004
equivalent class: Person

Place or geographic name
type: Class
label: Geografikum @de
subclass of: Authority Resource
MARC 21 equivalent: 079 $b=g
MARC 21 equivalent: 079 $v=giz

Preferred name of the person
type: Class
label: Bevorzugter Name der Person @de
subclass of: Name of the person

Product name or brand name
type: Class
label: Produkt oder Markenname @de
subclass of: Subject heading
MARC 21 equivalent: 079 $v=sip

Project or program
type: Class
label: Projekt oder Programm @de
subclass of: Corporate Body
MARC 21 equivalent: 079 $v=kip

Provenance characteristic
type: Class
comment: Provenienzmerkmale bezeichnen spuren, die Vorbesitzer (Personen und Institutionen) in und auf Büchern, Handschriften oder anderen Artefakten hinterlassen haben. Diese Merkmale kennzeichnen Besitz, Lesespuren oder Zensurabsichten. @de
label: Provenienzmerkmal @de
subclass of: Work
MARC 21 equivalent: 079 $v=wip

Pseudonym
type: Class
comment: Die vorliegende abweichende Namensform ist der wirkliche Name einer Person, für die als bevorzugter Name ein Pseudonym gewählt wird. @de
subclass of: Differentiated person
MARC 21 equivalent: 079 $v=pip

Pseudonym name of the person
type: Class
label: Pseudonym der Person @de
subclass of: Variant name of the person
MARC 21 equivalent: 400 $4=pseu

Real name of the person
type: Class
comment: Der wirkliche Name einer Person @de
comment: The person’s real name
label: Wirklicher Name der Person @de
subclass of: Variant name of the person
MARC 21 equivalent: 400 $4=nawi

Religious administrative unit
type: Class
label: Religiöse Verwaltungseinheit @de
subclass of: Corporate Body
MARC 21 equivalent: 079 $v=kiv

Religious corporate body
type: Class
label: Religiöse Körperschaft @de
subclass of: Corporate Body
MARC 21 equivalent: 079 $v=kir

Religious territory
type: Class
label: Religiöses Territorium @de
subclass of: Place or geographic name
MARC 21 equivalent: 079 $v=gir

Royal or member of a royal house
type: Class
label: Regierender Fürst oder Mitglied eines regierenden Fürstenhauses @de
subclass of: Differentiated person
MARC 21 equivalent: 079 $v=pik

Series of conference or event
type: Class
label: Kongressfolge oder Veranstaltungsfolge @de
subclass of: Conference or Event
MARC 21 equivalent: 079 $v=vif

Software product
type: Class
label: Softwareprodukt @de
subclass of: Subject heading
MARC 21 equivalent: 079 $v=siw

Spirits
type: Class
label: Geister @de
subclass of: Differentiated person
MARC 21 equivalent: 079 $v=pxs

Starting or final point of a distance
type: Property
type: ObjectProperty
comment: Bitte verwenden sie startingOrFinalPointOfADistance (mit kleinem s) @de
comment: Use startingOrFinalPointOfADistance (with a minor s) instead
domain: Place or geographic name
label: Beginn und Ende einer Strecke @de
range: Place or geographic name
deprecated: true
MARC 21 equivalent: 551 $0 $4=punk

Subject heading
type: Class
label: Schlagwort @de
subclass of: Authority Resource
equivalent class: Concept
MARC 21 equivalent: 079 $b=s
MARC 21 equivalent: 079 $v=szz

Subject heading sensu stricto
type: Class
label: Schlagwort sensu stricto @de
subclass of: Subject heading
MARC 21 equivalent: 079 $v=saz

Territorial corporate body or administrative unit
type: Class
label: Gebietskörperschaft oder Verwaltungseinheit @de
subclass of: Place or geographic name
MARC 21 equivalent: 079 $v=gik

Undifferentiated person
type: Class
label: Nicht-individualisierte Person @de
subclass of: Person
MARC 21 equivalent: 079 $b=n

Variant name of the person
type: Class
label: Abweichender Name der Person @de
subclass of: Name of the person

Version of a musical work
type: Class
label: Fassung eines Werks der Musik @de
subclass of: Work
MARC 21 equivalent: 079 $v=wif

Way, border or line
type: Class
label: Weg, Grenze oder Linie @de
subclass of: Place or geographic name
MARC 21 equivalent: 079 $v=giw

Work
type: Class
label: Werk @de
subclass of: Authority Resource
MARC 21 equivalent: 079 $b=u
MARC 21 equivalent: 079 $v=wit

Abbreviated name
type: Property
type: AnnotationProperty
label: Abgekürzter Name @de
sub property of: Variant name

Abbreviated name for the conference or event
type: Property
type: AnnotationProperty
domain: Conference or Event
label: Abgekürzter Name der Konferenz oder Veranstaltung @de
range: Literal
sub property of: Variant name for the conference or event
MARC 21 equivalent: 411 $a $c $d $e $g $n $4=abku

Abbreviated name for the corporate body
type: Property
type: AnnotationProperty
domain: Corporate Body
label: Abgekürzter Name der Körperschaft @de
range: Literal
sub property of: Variant name for the corporate body
MARC 21 equivalent: 410 $a $b $g $n $4=abku

Abbreviated name for the place or geographic name
type: Property
type: AnnotationProperty
domain: Place or geographic name
label: Abgekürzter Name des Geografikum @de
range: Literal
sub property of: Variant name for the place or geographic name
MARC 21 equivalent: 451 $a $g $z $4=abku

Abbreviated name for the work
type: Property
type: AnnotationProperty
domain: Work
label: Abgekürzter Name des Werks @de
range: Literal
sub property of: Variant name for the work
MARC 21 equivalent: 430 $a $f $g $m $n $o $p $r $s $4=abku

Academic degree
type: Property
type: DatatypeProperty
comment: An academic degree.
comment: Ein Rang, der als Bestätigung für wissenschaftliche Leistungen verliehen wird. @de
domain: Differentiated person
label: Akademischer Grad @de
sub property of: title
MARC 21 equivalent: 550 $a $g $4=akad

According work
type: Property
type: ObjectProperty
domain: Work
label: Zugehöriges Werk @de
range: Work
MARC 21 equivalent: 530 $0 $4=werk

Accredited artist
type: Property
type: ObjectProperty
comment: An author, artist, etc., relating him/her to a resource for which there is or once was substantial authority for designating that person as author, creator, etc. of the work
domain: Class
  union of: Place or geographic name
  union of: Work
label: Zugeschriebener Künstler @de
range: Class
  union of: Corporate Body
  union of: Differentiated person
  union of: Family
sub property of: P60431
sub property of: Artist
MARC 21 equivalent: 500 $0 $4=kueg
MARC 21 equivalent: 510 $0 $4=kueg

Accredited author
type: Property
type: ObjectProperty
comment: An author, artist, etc., relating him/her to a resource for which there is or once was substantial authority for designating that person as author, creator, etc. of the work
domain: Work
label: Zugeschriebener Verfasser @de
range: Class
  union of: Corporate Body
  union of: Differentiated person
  union of: Family
sub property of: P60434
sub property of: Author
MARC 21 equivalent: 500 $0 $4=autg
MARC 21 equivalent: 510 $0 $4=autg

Accredited composer
type: Property
type: ObjectProperty
comment: An author, artist, etc., relating him/her to a resource for which there is or once was substantial authority for designating that person as author, creator, etc. of the work
domain: Work
label: Zugeschriebener Komponist @de
range: Class
  union of: Corporate Body
  union of: Differentiated person
  union of: Family
sub property of: P60426
sub property of: Composer
MARC 21 equivalent: 500 $0 $4=komg
MARC 21 equivalent: 510 $0 $4=komg

Acquaintanceship or friendship
type: Property
type: ObjectProperty
comment: Person, die mit der beschriebenen Person bekannt ist und nicht in familiärer oder beruflicher Beziehung steht. Für Beziehungen von oder zu Familien wird gndo:memberOfTheFamily verwendet. @de
comment: Relationship between a person, family, or corporate body and another person, family, or corporate body which cannot be specified more closely
domain: Class
  union of: Differentiated person
  union of: Family
label: Beziehung, Bekanntschaft, Freundschaft @de
range: Class
  union of: Differentiated person
  union of: Family
sub property of: knows
equivalent property: hasAcquaintance
MARC 21 equivalent: 500 $0 $4=beza

Addition
type: Property
type: DatatypeProperty
domain: Class
  union of: Name of the person
  union of: Corporate Body
  union of: Conference or Event
  union of: Work
  union of: Place or geographic name
  union of: Subject heading
label: Zusatz @de
range: Literal
deprecated: true
MARC 21 equivalent: 100 $g
MARC 21 equivalent: 400 $g

Addressee
type: Property
type: ObjectProperty
comment: A person, family, or organization to whom the correspondence in a work is addressed.
comment: Eine Person, Familie oder Körperschaft, an die eine Korrespondenz adressiert ist. @de
domain: Work
label: Adressat @de
range: Class
  union of: Corporate Body
  union of: Differentiated person
  union of: Family
sub property of: P60456
MARC 21 equivalent: 500 $0 $4=adre
MARC 21 equivalent: 510 $0 $4=adre

Affiliation
type: Property
type: ObjectProperty
comment: A corporate body associated with a person or group of persons.
comment: Eine Konferenz oder Veranstaltung, eine Körperschaft oder eine Gebietskörperschaft, zu der eine Person gehört oder der sie durch Anstellung, Mitgliedschaft, kulturelle Identität usw. zugeordnet wird. @de
domain: Class
  union of: Differentiated person
  union of: Family
range: Class
  union of: Conference or Event
  union of: Corporate Body
  union of: Place or geographic name
sub property of: P50101
equivalent property: hasAssociate
MARC 21 equivalent: 510 $0 $4=affi
MARC 21 equivalent: 511 $0 $4=affi
MARC 21 equivalent: 551 $0 $4=affi

Affiliation (Literal)
type: Property
type: DatatypeProperty
comment: A corporate body associated with a person or group of persons. This property is equivalent to gndo:affiliation but gives a literal instead of a URI.
comment: Eine Konferenz oder Veranstaltung, eine Körperschaft oder eine Gebietskörperschaft, zu der eine Person gehört oder der sie durch Anstellung, Mitgliedschaft, kulturelle Identität usw. zugeordnet wird. Diese Property ist äquivalent zu gndo:affiliation, zeigt aber ein Literal statt eines URIs. @de
domain: Class
  union of: Differentiated person
  union of: Family
sub property of: P50101
MARC 21 equivalent: 510 $a $b $g $n $4=affi
MARC 21 equivalent: 511 $a $c $d $e $g $n $4=affi
MARC 21 equivalent: 551 $a $g $z $4=affi

Alexander Haffner
type: Person

Alternative medium of performance
type: Property
type: DatatypeProperty
domain: Work
label: Alternative Besetzung oder Doubling instruments oder Ad-libitum-Besetzung @de
range: Literal

Annotator
type: Property
type: ObjectProperty
comment: A person who makes manuscript annotations on an item.
comment: Eine Person, Familie oder Körperschaft, die handschriftlich Anmerkungen in ein spezifisches Exemplar schreibt. @de
domain: Work
range: Class
  union of: Corporate Body
  union of: Differentiated person
sub property of: P60464
MARC 21 equivalent: 500 $0 $4=anno
MARC 21 equivalent: 510 $0 $4=anno

Architect
type: Property
type: ObjectProperty
comment: A person, family, or organization responsible for creating an architectural design, including a pictorial representation intended to show how a building, etc., will look when completed. It also oversees the construction of structures.
comment: Eine Person, Familie oder Körperschaft, die für eine architektonische Gestaltung verantwortlich ist, einschließlich einer bildlichen Darstellung, die zeigt, wie ein Gebäude o. ä. aussieht, wenn es fertig gebaut sein wird. @de
domain: Place or geographic name
label: Architekt @de
range: Class
  union of: Corporate Body
  union of: Differentiated person
sub property of: P60435
MARC 21 equivalent: 500 $0 $4=arch
MARC 21 equivalent: 510 $0 $4=arch

Arranger
type: Property
type: ObjectProperty
comment: A person, family, or organization contributing to a musical work by rewriting the composition for a medium of performance different from that for which the work was originally intended, or modifying the work for the same medium of performance, etc., such that the musical substance of the original composition remains essentially unchanged. For extensive modification that effectively results in the creation of a new musical work, see composer.
comment: Eine Person, eine Familie oder eine Körperschaft, die eine Realisierung eines Musikwerkes umschreibt oder modifiziert. @de
domain: Work
label: Arrangeur @de
range: Class
  union of: Corporate Body
  union of: Differentiated person
  union of: Family
sub property of: P60379
MARC 21 equivalent: 500 $0 $4=arra
MARC 21 equivalent: 510 $0 $4=arra

Artist
type: Property
type: ObjectProperty
domain: Class
  union of: Place or geographic name
  union of: Work
label: Künstler @de
range: Class
  union of: Corporate Body
  union of: Differentiated person
  union of: Family
sub property of: P60431
MARC 21 equivalent: 500 $0 $4=kuen
MARC 21 equivalent: 510 $0 $4=kuen

Associated date
type: Property
type: DatatypeProperty
label: Assoziierte Zeit @de

Associated place
type: Property
type: ObjectProperty
label: Assoziierter Ort @de

Author
type: Property
type: ObjectProperty
comment: A person, family, or organization responsible for creating a work that is primarily textual in content, regardless of media type (e.g., printed text, spoken word, electronic text, tactile text) or genre (e.g., poems, novels, screenplays, blogs). Use also for persons, etc., creating a new work by paraphrasing, rewriting, or adapting works by another creator such that the modification has substantially changed the nature and content of the original or changed the medium of expression
domain: Work
label: Verfasser @de
range: Class
  union of: Corporate Body
  union of: Differentiated person
  union of: Family
sub property of: P60434
MARC 21 equivalent: 500 $0 $4=auta
MARC 21 equivalent: 510 $0 $4=auta

Beginning of a period
type: Property
type: DatatypeProperty
label: Begin einer Periode @de

Benefactor
type: Property
type: ObjectProperty
comment: A person, family, or corporate body being the benefactor of a work, a thing, or a corporate body
comment: Eine Person, Familie oder Körperschaft, die ein Werk, eine Sache oder eine Körperschaft gestiftet hat @de
domain: Class
  union of: Conference or Event
  union of: Corporate Body
  union of: Place or geographic name
  union of: Work
label: Stifter @de
range: Class
  union of: Corporate Body
  union of: Differentiated person
  union of: Family
MARC 21 equivalent: 500 $0 $4=stif
MARC 21 equivalent: 510 $0 $4=stif

Biographical or historical information
type: Property
type: DatatypeProperty
comment: Summary of the essential biographical, historical, or other information about the described entity.
comment: Zusammenfassung von wesentlichen biografischen, geschichtlichen oder anderen Informationen über die zu beschreibende Entität. @de
domain: Class
  union of: Conference or Event
  union of: Corporate Body
  union of: Differentiated person
  union of: Family
  union of: Place or geographic name
  union of: Subject heading
  union of: Work
label: Biografische oder historische Angaben @de
range: Literal
MARC 21 equivalent: 678 $b
Super-property of: P50035
Super-property of: P50064
Super-property of: P50113

Bookbinder
type: Property
type: ObjectProperty
comment: A person who binds an item
domain: Work
label: Buchbinder @de
range: Differentiated person
sub property of: P60458
MARC 21 equivalent: 500 $0 $4=bubi

Bookdesigner
type: Property
type: ObjectProperty
comment: A person or organization involved in manufacturing a manifestation by being responsible for the entire graphic design of a book, including arrangement of type and illustration, choice of materials, and process used
domain: Work
label: Buchgestalter @de
range: Class
  union of: Corporate Body
  union of: Differentiated person
  union of: Family
sub property of: P60409
MARC 21 equivalent: 500 $0 $4=gest
MARC 21 equivalent: 510 $0 $4=gest

Broader mapping
type: Property
type: ObjectProperty
comment: The term represents a concept having a wider meaning than the GND concept.
label: Oberbegriff-Relation @de
MARC 21 equivalent: $4 = BM

Broader term
type: Property
type: ObjectProperty
comment: Bitte verwenden Sie Oberbegriff allgemein @de
comment: Use broader term general instead
label: Oberbegriff @de
deprecated: true

Broader term (general)
type: Property
type: ObjectProperty
comment: Broader term
domain: Class
  union of: Conference or Event
  union of: Corporate Body
  union of: Differentiated person
  union of: Place or geographic name
  union of: Subject heading
  union of: Work
label: Oberbegriff allgemein @de
range: Subject heading
equivalent property: broader
inverse of: Narrower term (general)
MARC 21 equivalent: 550 $0 $4=obal

Broader term (generic)
type: Property
type: ObjectProperty
comment: Eine generische Relation ist eine hierarchische Relation zwischen zwei Begriffen, von denen der untergeordnete Begriff alle Merkmale des übergeordneten Begriffs besitzt und zusätzlich noch mindestens ein weiteres Merkmal. @de
comment: The generic relation is a semantic relation between two concepts where the intension of one of the concepts includes that of the other concepts and at least one additional delimiting characteristic is added.
domain: Subject heading
label: Oberbegriff generisch @de
range: Subject heading
sub property of: Broader term (general)
inverse of: Narrower term (generic)
MARC 21 equivalent: 550 $0 $4=obge

Broader term (instantial)
type: Property
type: ObjectProperty
comment: Die Instanzbeziehung verbindet ein allgemeines Konzept, etwa eine Klasse von Dingen oder Ereignissen mit einem individuellen Exemplar dieser Klasse, das oft durch einen Eigennamen repräsentiert wird. @de
comment: The instance relationship links a general concept such as a class of things or events, and an individual instance oft hat class, which is often represented by a proper name.
domain: Class
  union of: Corporate Body
  union of: Differentiated person
  union of: Place or geographic name
  union of: Subject heading
  union of: Work
label: Oberbegriff instantiell @de
range: Subject heading
sub property of: Broader term (general)
inverse of: Narrower term (instantial)
MARC 21 equivalent: 550 $0 $4=obin

Broader term (partitive)
type: Property
type: ObjectProperty
comment: Eine partitive Relation ist eine hierarchische Relation zwischen zwei Begriffen, von denen der übergeordnete Begriff (Verbandsbegriff) einem Ganzen entspricht und der untergeordnete Begriff einen der Bestandteile dieses Ganzen repräsentiert. Bei Personen ist die Relation die Beziehung zwischen einer einzelnen Person (besonders Gottheiten) und übergeordneten Gruppen von Göttern und mythologische Gestalten. @de
comment: The hierarchical whole-part relationship covers a limited range of situations in which a part of an entity or system belongs uniquely to a particular possessing whole. When applied to persons, this is the relation between a single person (particularly gods) and hierarchically broader groups of gods and mythologic entities.
domain: Class
  union of: Conference or Event
  union of: Corporate Body
  union of: Place or geographic name
  union of: Subject heading
  union of: Work
label: Oberbegriff partitiv @de
range: Class
  union of: Place or geographic name
  union of: Subject heading
  union of: Work
sub property of: Broader term (general)
inverse of: Narrower term (partitive)
MARC 21 equivalent: 530 $0 $4=obpa
MARC 21 equivalent: 550 $0 $4=obpa
MARC 21 equivalent: 551 $0 $4=obpa

Broader term (with more than one element)
type: Property
type: ObjectProperty
domain: Class
  union of: Conference or Event
  union of: Corporate Body
  union of: Place or geographic name
  union of: Subject heading
  union of: Work
label: Oberbegriff mehrgliedrig @de
range: Subject heading
sub property of: Broader term (general)
MARC 21 equivalent: 550 $0 $4=obmo

Broader term (general)
type: Property
type: ObjectProperty
comment: Bitte verwenden Sie gndo:broaderTermGeneral @de
comment: Use gndo:broaderTermGeneral instead
label: Oberbegriff allgemein @de
deprecated: true

Building owner
type: Property
type: ObjectProperty
comment: A person, family, or corporate body in charge of financing and constructing a building
comment: Person, Familie oder Körperschaft, die einen Bau errichten lässt und finanziert. @de
domain: Place or geographic name
label: Bauherr @de
range: Class
  union of: Differentiated person
  union of: Family
MARC 21 equivalent: 500 $0 $4=bauh

Cartographer
type: Property
type: ObjectProperty
comment: A person, family, or organization responsible for creating a map, atlas, globe, or other cartographic work
domain: Work
label: Kartograf @de
range: Class
  union of: Corporate Body
  union of: Differentiated person
sub property of: P60425
MARC 21 equivalent: 500 $0 $4=kart
MARC 21 equivalent: 510 $0 $4=kart

Celebrated corporate body
type: Property
type: ObjectProperty
domain: Class
  union of: Conference or Event
  union of: Corporate Body
  union of: Subject heading
  union of: Work
label: Gefeierte Körperschaft @de
range: Corporate Body
MARC 21 equivalent: 510 $0 $4=feie

Celebrated family
type: Property
type: ObjectProperty
domain: Class
  union of: Conference or Event
  union of: Corporate Body
  union of: Place or geographic name
  union of: Subject heading
  union of: Work
label: Gefeierte Familie @de
range: Family

Celebrated person
type: Property
type: ObjectProperty
domain: Class
  union of: Conference or Event
  union of: Corporate Body
  union of: Place or geographic name
  union of: Subject heading
  union of: Work
label: Gefeierte Person @de
range: Differentiated person
MARC 21 equivalent: 500 $0 $4=feie

Celebrated topic
type: Property
type: ObjectProperty
domain: Class
  union of: Conference or Event
  union of: Corporate Body
  union of: Subject heading
  union of: Work
label: Gefeiertes Thema @de
range: Subject heading
MARC 21 equivalent: 550 $0 $4=feie

Characteristic place
type: Property
type: ObjectProperty
comment: A significant place for a person or family
comment: Ort, der mit einer Familie in Verbindung steht. @de
domain: Differentiated person
label: Charakteristischer Ort @de
range: Place or geographic name
sub property of: Associated place
MARC 21 equivalent: 551 $0 $4=ortc

Choreographer
type: Property
type: ObjectProperty
comment: A person responsible for creating or contributing to a work of movement
domain: Work
label: Choreograf @de
range: Class
  union of: Corporate Body
  union of: Differentiated person
sub property of: P60433
MARC 21 equivalent: 500 $0 $4=chre
MARC 21 equivalent: 510 $0 $4=chre

Cited artist
type: Property
type: ObjectProperty
comment: A person or organization whose work is largely quoted or extracted in works to which he or she did not contribute directly. Such quotations are found particularly in exhibition catalogs, collections of photographs, etc.
domain: Class
  union of: Place or geographic name
  union of: Work
label: Zitierter Künstler @de
range: Class
  union of: Corporate Body
  union of: Differentiated person
  union of: Family
sub property of: P60431
sub property of: Artist
MARC 21 equivalent: 500 $0 $4=kuez
MARC 21 equivalent: 510 $0 $4=kuez

Cited author
type: Property
type: ObjectProperty
comment: A person or organization whose work is largely quoted or extracted in works to which he or she did not contribute directly. Such quotations are found particularly in exhibition catalogs, collections of photographs, etc.
domain: Work
label: Zitierter Verfasser @de
range: Class
  union of: Corporate Body
  union of: Differentiated person
  union of: Family
sub property of: P60434
sub property of: Author
MARC 21 equivalent: 500 $0 $4=autz
MARC 21 equivalent: 510 $0 $4=autz

Cited composer
type: Property
type: ObjectProperty
comment: A person or organization whose work is largely quoted or extracted in works to which he or she did not contribute directly. Such quotations are found particularly in exhibition catalogs, collections of photographs, etc.
domain: Work
label: Zitierter Komponist @de
range: Class
  union of: Corporate Body
  union of: Differentiated person
  union of: Family
sub property of: P60426
sub property of: Composer
MARC 21 equivalent: 500 $0 $4=komz
MARC 21 equivalent: 510 $0 $4=komz

Collector
type: Property
type: ObjectProperty
comment: A curator who brings together items from various sources that are then arranged, described, and cataloged as a collection. A collector is neither the creator of the material nor a person to whom manuscripts in the collection may have been addressed
domain: Class
  union of: Corporate Body
  union of: Work
label: Sammler @de
range: Corporate Body
sub property of: P60066
MARC 21 equivalent: 500 $0 $4=saml
MARC 21 equivalent: 510 $0 $4=saml

Compiler
type: Property
type: ObjectProperty
comment: A person, family, or organization responsible for creating a new work (e.g., a bibliography, a directory) through the act of compilation, e.g., selecting, arranging, aggregating, and editing data, information, etc
domain: Work
label: Kompilator @de
range: Differentiated person
sub property of: P60428
MARC 21 equivalent: 500 $0 $4=comp

Complex see reference - subject
type: Property
type: ObjectProperty
domain: Class
  union of: Conference or Event
  union of: Corporate Body
  union of: Differentiated person
  union of: Family
  union of: Place or geographic name
  union of: Subject heading
  union of: Work
label: Relationierter Deskriptor @de
range: Subject heading
MARC 21 equivalent: 260 $0

Composer
type: Property
type: ObjectProperty
comment: A person, family, or organization responsible for creating or contributing to a musical resource by adding music to a work that originally lacked it or supplements it
domain: Work
label: Komponist @de
range: Class
  union of: Corporate Body
  union of: Differentiated person
  union of: Family
sub property of: P60426
MARC 21 equivalent: 500 $0 $4=koma
MARC 21 equivalent: 510 $0 $4=koma

intersecting compound equivalence
type: Property
type: ObjectProperty
comment: The intersection of two or more terms represents the GND concept.
label: UND-Aequivalenz @de
MARC 21 equivalent: $4 = EQ+

Conferrer
type: Property
type: ObjectProperty
comment: A person or organization permitting the temporary use of a book, manuscript, etc., such as for photocopying or microfilming
domain: Work
label: Leihgeber @de
range: Class
  union of: Corporate Body
  union of: Differentiated person
  union of: Family
MARC 21 equivalent: 500 $0 $4=leih
MARC 21 equivalent: 510 $0 $4=leih

Contributing family
type: Property
type: ObjectProperty
comment: Bitte verwenden sie contributingFamily. @de
comment: Use contributingFamily instead.
domain: Class
  union of: Conference or Event
  union of: Corporate Body
  union of: Subject heading
  union of: Work
label: Beteiligte Familie @de
range: Family
deprecated: true

Contributing corporate body
type: Property
type: ObjectProperty
domain: Class
  union of: Conference or Event
  union of: Corporate Body
  union of: Work
label: Beteiligte Körperschaft @de
range: Corporate Body
MARC 21 equivalent: 510 $0 $4=bete

Contributing family
type: Property
type: ObjectProperty
domain: Class
  union of: Conference or Event
  union of: Corporate Body
  union of: Subject heading
  union of: Work
label: Beteiligte Familie @de
range: Family

Contributing person
type: Property
type: ObjectProperty
domain: Class
  union of: Conference or Event
  union of: Corporate Body
  union of: Subject heading
  union of: Work
label: Beteiligte Person @de
range: Differentiated person
MARC 21 equivalent: 500 $0 $4=bete

Contributing place or geographic name
type: Property
type: ObjectProperty
domain: Class
  union of: Corporate Body
  union of: Subject heading
label: Beteiligtes Geografikum @de
range: Place or geographic name
MARC 21 equivalent: 551 $0 $4=bete

Coordinates
type: Property
type: DatatypeProperty
label: Koordinaten @de

Copist
type: Property
type: ObjectProperty
comment: A person or family who is known as scribe or copyist.
comment: Eine Person oder Familie, die als Kopist oder Schreiber gearbeitet haben @de
domain: Work
label: Kopist @de
range: Class
  union of: Corporate Body
  union of: Differentiated person
  union of: Family
MARC 21 equivalent: 500 $0 $4=kopi
MARC 21 equivalent: 510 $0 $4=kopi

Corporate body is member
type: Property
type: ObjectProperty
domain: Corporate Body
label: Körperschaft ist Mitglied @de
range: Class
  union of: Corporate Body
  union of: Place or geographic name
sub property of: Member
MARC 21 equivalent: 510 $0 $4=mitg
MARC 21 equivalent: 551 $0 $4=mitg

Correspondent
type: Property
type: ObjectProperty
type: SymmetricProperty
comment: A person or organization who was either the writer or recipient of a letter or other communication
comment: Person, die zu der im Datensatz beschriebenen Person oder Körperschaft als Korrespondenzpartner in Beziehung steht. @de
domain: Class
  union of: Corporate Body
  union of: Differentiated person
  union of: Family
label: Korrespondenzpartner @de
range: Class
  union of: Corporate Body
  union of: Differentiated person
  union of: Family
equivalent property: hasCorrespondent
MARC 21 equivalent: 500 $0 $4=korr
MARC 21 equivalent: 510 $0 $4=korr

Counting
type: Property
type: DatatypeProperty
domain: Name of the person
label: Zählung @de
range: Literal
MARC 21 equivalent: 100 $b
MARC 21 equivalent: 400 $b

Creator
type: Property
type: ObjectProperty
comment: A person or organization performing the work, i.e., the name of a person or organization associated with the intellectual content of the work. This category does not include the publisher or personal affiliation, or sponsor except where it is also the corporate author
domain: Class
  union of: Subject heading
  union of: Work
label: Urheber @de
range: Class
  union of: Corporate Body
  union of: Differentiated person
MARC 21 equivalent: 500 $0 $4=urhe
MARC 21 equivalent: 510 $0 $4=urhe

cumulative compound equivalence
type: Property
type: ObjectProperty
comment: The cumulation of two or more terms represents the GND concept.
label: ODER-Aequivalenz @de
MARC 21 equivalent: $4 = EQ|

Curator
type: Property
type: ObjectProperty
comment: A person, family, or organization conceiving, aggregating, and/or organizing an exhibition, collection, or other item
domain: Class
  union of: Conference or Event
  union of: Work
label: Kurator @de
range: Class
  union of: Corporate Body
  union of: Differentiated person
  union of: Family
sub property of: P60376
MARC 21 equivalent: 500 $0 $4=kura
MARC 21 equivalent: 510 $0 $4=kura

Date of birth
type: Property
type: DatatypeProperty
comment: Das Geburtsdatum einer Person. Dies kann ein Jahr, eine Kombination von Jahr und Monat oder ein vollständiges Datum sein. @de
comment: The birth date of a person. This can be a year, a year-month combination or a full date.
domain: Differentiated person
label: Geburtsdatum @de
range: Class
  union of: Literal
  union of: date
  union of: gYearMonth
  union of: gYear
sub property of: hasBeginDate
sub property of: Associated date
equivalent property: P50121
MARC 21 equivalent: 548 $a $4=datl
MARC 21 equivalent: 548 $a $4=datx

Date of birth and death
type: Property
type: DatatypeProperty
domain: Differentiated person
label: Geburts- und Sterbedatum @de
range: Class
  union of: Literal
  union of: date
  union of: gYearMonth
  union of: gYear
sub property of: Associated date
MARC 21 equivalent: 548 $a $4=datl
MARC 21 equivalent: 548 $a $4=datx

Date of conference or event
type: Property
type: DatatypeProperty
comment: Date of a conference
comment: Datum einer Konferenz @de
domain: Conference or Event
label: Veranstaltungsdaten @de
range: Class
  union of: Literal
  union of: dateTime
sub property of: Associated date
equivalent property: P50039
MARC 21 equivalent: 548 $a $4=datv

Date of death
type: Property
type: DatatypeProperty
comment: Das Sterbedatum einer Person. Dies kann ein Jahr, eine Kombination von Jahr und Monat oder ein vollständiges Datum sein. @de
comment: The death date of a person. This can be a year, a year-month combination or a full date.
domain: Differentiated person
label: Sterbedatum @de
range: Class
  union of: Literal
  union of: date
  union of: gYearMonth
  union of: gYear
sub property of: hasEndDate
sub property of: Associated date
equivalent property: P50120
MARC 21 equivalent: 548 $a $4=datl
MARC 21 equivalent: 548 $a $4=datx

Date of discovery
type: Property
type: DatatypeProperty
comment: Date or year in which an object was found (not to be used in connection with persons, families and corporate bodies)
comment: Datum oder Jahr, in dem ein Objekt gefunden wurde (darf nicht bei Personen, Familien und Körperschaften verwendet werden) @de
domain: Work
label: Fundjahr @de
range: Class
  union of: Literal
  union of: dateTime
sub property of: Associated date
MARC 21 equivalent: 548 $a $4=datf

Date of establishment
type: Property
type: DatatypeProperty
domain: Class
  union of: Conference or Event
  union of: Corporate Body
  union of: Place or geographic name
  union of: Subject heading
  union of: Work
label: Gründungsdatum @de
range: Class
  union of: Literal
  union of: dateTime
sub property of: hasBeginDate
sub property of: Associated date
MARC 21 equivalent: 548 $a $4=datb

Date of establishment and termination
type: Property
type: DatatypeProperty
domain: Class
  union of: Conference or Event
  union of: Corporate Body
  union of: Place or geographic name
  union of: Subject heading
  union of: Work
label: Gründungs- und Auflösungsdatum @de
range: Class
  union of: Literal
  union of: dateTime
sub property of: Associated date
MARC 21 equivalent: 548 $a $4=datb

Date of production
type: Property
type: DatatypeProperty
comment: Date (year) in which a written historical document was created or a building constructed
comment: Zeitpunkt (Jahr), in dem ein Schriftdenkmal erstellt oder ein Bauwerk errichtet wurde / Entstehungszeit @de
domain: Class
  union of: Place or geographic name
  union of: Subject heading
  union of: Work
label: Erstellungszeit @de
range: Class
  union of: Literal
  union of: dateTime
sub property of: Associated date
MARC 21 equivalent: 548 $a $4=dats

Date of publication
type: Property
type: DatatypeProperty
comment: Date of publication of the first expression of a work
comment: Zeitpunkt, zu der die erste Expression eines Werkes veröffentlicht wurde @de
domain: Work
label: Erscheinungszeit @de
range: Class
  union of: Literal
  union of: dateTime
sub property of: Associated date
MARC 21 equivalent: 548 $a $4=datj

Date of termination
type: Property
type: DatatypeProperty
domain: Class
  union of: Conference or Event
  union of: Corporate Body
  union of: Place or geographic name
  union of: Subject heading
  union of: Work
label: Auflösungsdatum @de
range: Class
  union of: Literal
  union of: dateTime
sub property of: P50038
sub property of: hasEndDate
sub property of: Associated date
MARC 21 equivalent: 548 $a $4=datb

Dedicatee
type: Property
type: ObjectProperty
comment: A person, family, or organization to whom a resource is dedicated
domain: Class
  union of: Place or geographic name
  union of: Work
label: Widmungsempfänger @de
range: Class
  union of: Corporate Body
  union of: Differentiated person
  union of: Family
sub property of: P60455
MARC 21 equivalent: 500 $0 $4=widm
MARC 21 equivalent: 510 $0 $4=widm

Definition
type: Property
type: DatatypeProperty
domain: Class
  union of: Conference or Event
  union of: Corporate Body
  union of: Differentiated person
  union of: Family
  union of: Place or geographic name
  union of: Subject heading
  union of: Work
range: Literal
MARC 21 equivalent: 679 $a
Super-property of: definition

GND Description Level
type: Property
type: ObjectProperty
comment: Drückt den Grad der Vollständigkeit der Beschreibung mittels Werten des GND-Katalogisierungslevel aus. Mehr Informationen dazu unter https://wiki.dnb.de/download/attachments/50759357/005.pdf @de
comment: Expressing the level of completness of the description on the scale of GND Description Level values. More information on this scale at https://wiki.dnb.de/download/attachments/50759357/005.pdf (in german)
label: GND-Katalogisierungslevel @de
range: DescriptionLevelValue
MARC 21 equivalent: 042 $a

Designer
type: Property
type: ObjectProperty
comment: A person, family, or organization responsible for creating a design for an object
domain: Work
range: Class
  union of: Corporate Body
  union of: Differentiated person
  union of: Family
sub property of: P60424
MARC 21 equivalent: 500 $0 $4=desi
MARC 21 equivalent: 510 $0 $4=desi

Director
type: Property
type: ObjectProperty
comment: A person responsible for the general management and supervision of a filmed performance, a radio or television program, etc.
domain: Work
label: Regisseur @de
range: Class
  union of: Corporate Body
  union of: Differentiated person
sub property of: P60449
MARC 21 equivalent: 500 $0 $4=regi
MARC 21 equivalent: 510 $0 $4=regi

Director of photography
type: Property
type: ObjectProperty
comment: A person in charge of photographing a motion picture, who plans the technical aspets of lighting and photographing of scenes, and often assists the director in the choice of angles, camera setups, and lighting moods. He or she may also supervise the further processing of filmed material up to the completion of the work print. Cinematographer is also referred to as director of photography. Do not confuse with videographer
domain: Work
label: Verantwortlicher Kameramann @de
range: Class
  union of: Corporate Body
  union of: Differentiated person
sub property of: P60452
MARC 21 equivalent: 500 $0 $4=kame
MARC 21 equivalent: 510 $0 $4=kame

Staff members of the Deutsche Nationalbibliothek
type: Organization

Doubtful artist
type: Property
type: ObjectProperty
comment: A person or organization to which authorship has been dubiously or incorrectly ascribed
domain: Class
  union of: Place or geographic name
  union of: Work
label: Angezweifelter Künstler @de
range: Class
  union of: Corporate Body
  union of: Differentiated person
  union of: Family
sub property of: P60431
sub property of: Artist
MARC 21 equivalent: 500 $0 $4=kuew
MARC 21 equivalent: 510 $0 $4=kuew

Doubtful author
type: Property
type: ObjectProperty
comment: A person or organization to which authorship has been dubiously or incorrectly ascribed
domain: Work
label: Angezweifelter Verfasser @de
range: Class
  union of: Corporate Body
  union of: Differentiated person
  union of: Family
sub property of: P60434
sub property of: Author
MARC 21 equivalent: 500 $0 $4=autw
MARC 21 equivalent: 510 $0 $4=autw

Doubtful composer
type: Property
type: ObjectProperty
comment: A person or organization to which authorship has been dubiously or incorrectly ascribed
domain: Work
label: Angezweifelter Komponist @de
range: Class
  union of: Corporate Body
  union of: Differentiated person
  union of: Family
sub property of: P60426
sub property of: Composer
MARC 21 equivalent: 500 $0 $4=komw
MARC 21 equivalent: 510 $0 $4=komw

Easternmost longitude
type: Property
type: DatatypeProperty
domain: Place or geographic name
label: Östlichster Längengrad @de
range: Literal
sub property of: Coordinates
MARC 21 equivalent: 034 $e

Editor
type: Property
type: ObjectProperty
comment: A person, family, or organization contributing to a resource by revising or elucidating the content, e.g., adding an introduction, notes, or other critical matter. An editor may also prepare a resource for production, publication, or distribution. For major revisions, adaptations, etc., that substantially change the nature and content of the original work, resulting in a new work, see author
domain: Work
label: Herausgeber @de
range: Class
  union of: Corporate Body
  union of: Differentiated person
  union of: Family
MARC 21 equivalent: 500 $0 $4=hrsg
MARC 21 equivalent: 510 $0 $4=hrsg

End of a period
type: Property
type: DatatypeProperty
label: Ende einer Periode @de

Engraver
type: Property
type: ObjectProperty
comment: A person or organization who cuts letters, figures, etc. on a surface, such as a wooden or metal plate used for printing
domain: Work
label: Graveur @de
range: Class
  union of: Corporate Body
  union of: Differentiated person
sub property of: P60410
MARC 21 equivalent: 500 $0 $4=grav
MARC 21 equivalent: 510 $0 $4=grav

Epithet, generic name, title or territory
type: Property
type: DatatypeProperty
domain: Name of the person
label: Beiname, Gattungsname, Titulatur, Territorium @de
range: Literal
deprecated: true
MARC 21 equivalent: 100 $c
MARC 21 equivalent: 400 $c

Equivalence
type: Property
type: ObjectProperty
comment: Concepts of mapped vocabularies are most closely matching.
label: Aequivalenz @de
MARC 21 equivalent: $4 = EQ

Etcher
type: Property
type: ObjectProperty
comment: A person or organization who produces text or images for printing by subjecting metal, glass, or some other surface to acid or the corrosive action of some other substance
domain: Work
label: Radierer @de
range: Class
  union of: Corporate Body
  union of: Differentiated person
sub property of: P60416
MARC 21 equivalent: 500 $0 $4=radi
MARC 21 equivalent: 510 $0 $4=radi

exact equivalence
type: Property
type: ObjectProperty
comment: Concepts of mapped vocabularies are exactly the same.
label: exakte Aequivalenz @de
MARC 21 equivalent: $4 = =EQ

Exhibitor
type: Property
type: ObjectProperty
comment: A person, family, or corporate body in charge of an exhibition.
comment: Eine Person, Familie oder Körperschaft, die für eine Ausstellung verantwortlich ist. @de
domain: Conference or Event
label: Aussteller @de
range: Class
  union of: Corporate Body
  union of: Differentiated person
  union of: Family
MARC 21 equivalent: 500 $0 $4=aust
MARC 21 equivalent: 510 $0 $4=aust

Familial relationship
type: Property
type: ObjectProperty
comment: A family relationship between a person or family and another person or family
comment: Person, die zu der beschriebenen Person in familiärer bzw. verwandtschaftlicher Beziehung steht. Für Beziehungen von oder zu Familien wird gndo:memberOfTheFamily verwendet. @de
domain: Class
  union of: Differentiated person
  union of: Family
label: Familiäre Beziehung @de
range: Class
  union of: Differentiated person
  union of: Family
equivalent property: hasRelative
MARC 21 equivalent: 500 $0 $4=bezf

Fictitious author
type: Property
type: ObjectProperty
comment: A fictitious person, family, or corporate body ascertained to be the author
comment: Eine fiktive Person, Familie oder Körperschaft, die als Autor gilt. @de
domain: Work
label: Fiktiver Verfasser @de
range: Class
  union of: Corporate Body
  union of: Differentiated person
  union of: Family
sub property of: P60434
sub property of: Author
MARC 21 equivalent: 500 $0 $4=autf
MARC 21 equivalent: 510 $0 $4=autf

Field of activity
type: Property
type: ObjectProperty
comment: Beschäftigungsfeld/Wissensgebiet mit dem sich eine Person, Körperschaft, Konferenz oder Veranstaltung beschäftigt oder beschäftigt hat. @de
comment: Field of activity of a person, corporate body, conference or event.
domain: Class
  union of: Conference or Event
  union of: Corporate Body
  union of: Differentiated person
  union of: Family
label: Tätigkeitsbereich @de
range: Subject heading
MARC 21 equivalent: 550 $0 $4=akti

Field of study
type: Property
type: ObjectProperty
comment: A person’s field of study
comment: Studienfach einer Person. @de
domain: Differentiated person
label: Studienfach @de
range: Subject heading
MARC 21 equivalent: 550 $0 $4=stud

First artist
type: Property
type: ObjectProperty
comment: A person or organization that takes primary responsibility for a particular activity or endeavor. May be combined with another relator term or code to show the greater importance this person or organization has regarding that particular role. If more than one relator is assigned to a heading, use the Lead relator only if it applies to all the relators
comment: Eine Person, Familie oder Körperschaft, die als einziger oder erster Künstler bekannt ist @de
domain: Class
  union of: Place or geographic name
  union of: Work
label: Erster Künstler @de
range: Class
  union of: Corporate Body
  union of: Differentiated person
  union of: Family
sub property of: P60431
sub property of: Artist
MARC 21 equivalent: 500 $0 $4=kue1
MARC 21 equivalent: 510 $0 $4=kue1

First author
type: Property
type: ObjectProperty
comment: A person or organization that takes primary responsibility for a particular activity or endeavor. May be combined with another relator term or code to show the greater importance this person or organization has regarding that particular role. If more than one relator is assigned to a heading, use the Lead relator only if it applies to all the relators.
comment: Eine Person, Familie oder Körperschaft, die als der einzige oder der erste Autor einer Publikation bekannt ist. @de
domain: Work
label: Erste Verfasserschaft @de
range: Class
  union of: Corporate Body
  union of: Differentiated person
  union of: Family
sub property of: P60434
sub property of: Author
MARC 21 equivalent: 500 $0 $4=aut1
MARC 21 equivalent: 510 $0 $4=aut1

First composer
type: Property
type: ObjectProperty
comment: A person or organization that takes primary responsibility for a particular activity or endeavor. May be combined with another relator term or code to show the greater importance this person or organization has regarding that particular role. If more than one relator is assigned to a heading, use the Lead relator only if it applies to all the relators
comment: Eine Person, Familie oder Körperschaft, die als einziger oder erster Komponist bekannt ist @de
domain: Work
label: Erster Komponist @de
range: Class
  union of: Corporate Body
  union of: Differentiated person
  union of: Family
sub property of: P60426
sub property of: Composer
MARC 21 equivalent: 500 $0 $4=kom1
MARC 21 equivalent: 510 $0 $4=kom1

Forename
type: Property
type: DatatypeProperty
domain: Name of the person
label: Vorname @de
range: Literal
equivalent property: givenName
MARC 21 equivalent: 100 $a
MARC 21 equivalent: 400 $a

Form of work and expression
type: Property
type: ObjectProperty
domain: Work
label: Form des Werks und der Expression @de
range: Class
  union of: Subject heading
  union of: Work
MARC 21 equivalent: 380 $0 $2=gnd

Former owner
type: Property
type: ObjectProperty
comment: A person, family, or organization formerly having legal possession of an item
comment: Eine Person, eine Familie oder eine Körperschaft, die früher rechtmäßiger Besitzer einer Ressource war. @de
domain: Class
  union of: Place or geographic name
  union of: Work
label: Früherer Besitzer @de
range: Class
  union of: Corporate Body
  union of: Differentiated person
  union of: Family
sub property of: P60401
sub property of: Owner
MARC 21 equivalent: 500 $0 $4=befr
MARC 21 equivalent: 510 $0 $4=befr

Founder
type: Property
type: ObjectProperty
comment: A person, family, or corporate body being a founder of an enterprise, an event, or an ensemble of buildings
comment: Eine Person, Familie oder Körperschaft, die ein Unternehmen oder Veranstaltung oder Bauensemble gründet @de
domain: Class
  union of: Corporate Body
  union of: Place or geographic name
label: Gründer @de
range: Class
  union of: Corporate Body
  union of: Differentiated person
  union of: Family
sub property of: P50029
MARC 21 equivalent: 500 $0 $4=grue
MARC 21 equivalent: 510 $0 $4=grue

Function or role
type: Property
type: ObjectProperty
comment: Diese Property ist äquivalent zu gndo:functionOrRoleAsLiteral, zeigt aber auf ein Schlagwort statt ein Literal auszugeben. @de
comment: This property is equivalent to gndo:functionOrRoleAsLiteral but points to a subject heading instead of giving a literal value.
domain: Class
  union of: Corporate Body
  union of: Differentiated person
  union of: Subject heading
label: Funktion oder Rolle @de
range: Subject heading
MARC 21 equivalent: 550 $0 $4=funk

Function or role (Literal)
type: Property
type: DatatypeProperty
comment: Diese Property ist äquivalent zu gndo:functionOrRole, zeigt aber ein Literal statt eines URIs @de
comment: This property is equivalent to gndo:functionOrRole but gives a literal instead of a URI
domain: Class
  union of: Corporate Body
  union of: Differentiated person
  union of: Subject heading
label: Funktion oder Rolle (Literal) @de
MARC 21 equivalent: 550 $a $g $4=funk

Gender
type: Property
type: ObjectProperty
domain: Differentiated person
label: Geschlecht @de
range: GenderValue
sub property of: P50116
MARC 21 equivalent: 375 $a

Geographic Area Code
type: Property
type: ObjectProperty
domain: Class
  union of: Conference or Event
  union of: Corporate Body
  union of: Differentiated person
  union of: Family
  union of: Place or geographic name
  union of: Subject heading
  union of: Work
label: Ländercode @de
range: GeographicAreaCodeValue
MARC 21 equivalent: 043 $c

GND-Identifier
type: Property
type: DatatypeProperty
domain: Class
  union of: Conference or Event
  union of: Corporate Body
  union of: Differentiated person
  union of: Family
  union of: Place or geographic name
  union of: Subject heading
  union of: Undifferentiated person
  union of: Work
label: GND-Nummer @de
range: Literal
MARC 21 equivalent: 035 $a=(DE-588)...
Super-property of: P50006
Super-property of: P50052
Super-property of: P50094

GND subject category
type: Property
type: ObjectProperty
domain: Class
  union of: Conference or Event
  union of: Corporate Body
  union of: Differentiated person
  union of: Family
  union of: Place or geographic name
  union of: Subject heading
  union of: Work
label: GND-Sachgruppe @de
range: GndSubjectCategoryValue
MARC 21 equivalent: 065 $a $2=sswd

Hierarchical superior
type: Property
type: ObjectProperty
label: Administrative Überordnung @de

Hierarchical superior of place or geographic name
type: Property
type: ObjectProperty
comment: A hierarchically superordinate unit (corporate body, conference, jurisdiction) of the described unit (corporate body, conference, jurisdiction).
comment: Eine hierarchisch übergeordnete Einheit (Gebietskörperschaft, Körperschaft, Konferenz) der beschriebenen Einheit (Gebietskörperschaft, Körperschaft, Konferenz). @de
domain: Place or geographic name
label: Administrative Überordnung des Geografikums @de
range: Place or geographic name
sub property of: P50008
sub property of: Hierarchical superior
MARC 21 equivalent: 551 $0 $4=adue

Hierarchical superior of the conference or event
type: Property
type: ObjectProperty
domain: Conference or Event
label: Administrative Überordnung der Konferenz oder der Veranstaltung @de
range: Class
  union of: Conference or Event
  union of: Corporate Body
sub property of: P50008
sub property of: Hierarchical superior
MARC 21 equivalent: 510 $0 $4=adue
MARC 21 equivalent: 511 $0 $4=adue

Hierarchical superior of the corporate body
type: Property
type: ObjectProperty
domain: Corporate Body
label: Administrative Überordnung der Körperschaft @de
range: Class
  union of: Conference or Event
  union of: Corporate Body
  union of: Place or geographic name
sub property of: P50008
sub property of: Hierarchical superior
MARC 21 equivalent: 510 $0 $4=adue
MARC 21 equivalent: 511 $0 $4=adue
MARC 21 equivalent: 551 $0 $4=adue

Homepage
type: Property
type: ObjectProperty
domain: Class
  union of: Conference or Event
  union of: Corporate Body
  union of: Differentiated person
  union of: Family
  union of: Place or geographic name
  union of: Subject heading
  union of: Work
MARC 21 equivalent: 670 $u $a=Homepage
Super-property of: homepage

Illustrator or illuminator
type: Property
type: ObjectProperty
comment: A person, family, or organization contributing to a resource by supplementing the primary content with drawings, diagrams, photographs, etc. If the work is primarily the artistic content created by this entity, use artist or photographer
domain: Work
label: Illustrator oder Illuminator @de
range: Class
  union of: Corporate Body
  union of: Differentiated person
  union of: Family
MARC 21 equivalent: 500 $0 $4=illu
MARC 21 equivalent: 510 $0 $4=illu

inexact equivalence
type: Property
type: ObjectProperty
comment: Concepts of mapped vocabularies are most closely matching but not exactly the same.
label: inexakte Aequivalenz @de
MARC 21 equivalent: $4 = ~EQ

Initiator
type: Property
type: ObjectProperty
comment: A person, family, or corporate body who initiated a work
comment: Eine Person, Familie oder Körperschaft, die ein Werk veranlasst hat @de
domain: Class
  union of: Place or geographic name
  union of: Work
label: Veranlasser @de
range: Class
  union of: Corporate Body
  union of: Differentiated person
  union of: Family
MARC 21 equivalent: 500 $0 $4=verr
MARC 21 equivalent: 510 $0 $4=verr

Instrument
type: Property
type: ObjectProperty
comment: A musical instrument, a device to perform music with
comment: Ein Musikinstrument @de

Instrumentalist
type: Property
type: ObjectProperty
comment: A performer contributing to a resource by playing a musical instrument
domain: Work
label: Instrumentalmusiker @de
range: Differentiated person
MARC 21 equivalent: 500 $0 $4=istm

Inventor
type: Property
type: ObjectProperty
comment: A person, family, or organization responsible for creating a new device or process
domain: Subject heading
label: Erfinder @de
range: Class
  union of: Corporate Body
  union of: Differentiated person
  union of: Family
sub property of: P60427
MARC 21 equivalent: 500 $0 $4=erfi
MARC 21 equivalent: 510 $0 $4=erfi

Key of the version
type: Property
type: DatatypeProperty
domain: Work
label: Tonart der Fassung @de
range: Literal
MARC 21 equivalent: 384 1# $a
Super-property of: P60580

Key of the work
type: Property
type: DatatypeProperty
domain: Work
label: Tonart des Werks @de
range: Literal
MARC 21 equivalent: 384 0# $a
Super-property of: P60580

Language
type: Property
type: ObjectProperty
comment: A language used by a person or family or in which a work was written
comment: Sprache, in der ein Werk verfasst wurde oder die eine Person, Familie oder Körperschaft benutzt. @de
domain: Work
label: Sprache @de
range: Subject heading

Language code
type: Property
type: ObjectProperty
domain: Class
  union of: Conference or Event
  union of: Corporate Body
  union of: Differentiated person
  union of: Family
  union of: Place or geographic name
  union of: Subject heading
  union of: Work
label: Sprachencode @de
MARC 21 equivalent: 377 $a $2=iso639-2b

Librettist
type: Property
type: ObjectProperty
comment: An author of a libretto of an opera or other stage work, or an oratorio
domain: Work
range: Class
  union of: Corporate Body
  union of: Differentiated person
  union of: Family
sub property of: P60478
MARC 21 equivalent: 500 $0 $4=libr
MARC 21 equivalent: 510 $0 $4=libr

Members of the GND ontology mailing list
type: Organization

Literary source
type: Property
type: ObjectProperty
comment: Die beschriebene Entität ist eine Realisierung des in Beziehung stehenden Werkes @de
comment: The described entity is a realization of the related work
domain: Work
label: Vorlage @de
range: Work
MARC 21 equivalent: 530 $0 $4=vorl

Lithographer
type: Property
type: ObjectProperty
comment: A person or organization who prepares the stone or plate for lithographic printing, including a graphic artist creating a design directly on the surface from which printing will be done.
domain: Work
label: Litograf @de
range: Class
  union of: Corporate Body
  union of: Differentiated person
  union of: Family
sub property of: P60414
MARC 21 equivalent: 500 $0 $4=lith
MARC 21 equivalent: 510 $0 $4=lith

Manufacturer
type: Property
type: ObjectProperty
comment: A person or organization responsible for printing, duplicating, casting, etc. a resource
domain: Class
  union of: Subject heading
  union of: Work
label: Hersteller @de
range: Class
  union of: Corporate Body
  union of: Differentiated person
  union of: Family
sub property of: P60443
inverse of: made
MARC 21 equivalent: 500 $0 $4=hers
MARC 21 equivalent: 510 $0 $4=hers

MARC 21 equivalent
type: Property
type: AnnotationProperty
comment: Expresses the MARC 21 equivalent for this element in the GND MARC format.
comment: Gibt die MARC 21 Entsprechung des Elements im GND-MARC-Format wieder. @de
label: MARC 21 Entsprechung @de

Medium of performance
type: Property
type: ObjectProperty
domain: Work
label: Besetzung im Musikbereich @de
range: Subject heading
sub property of: P60536
sub property of: Instrument
MARC 21 equivalent: 382 $0
MARC 21 equivalent: 550 $0 $4=istr

Medium of performance (Literal)
type: Property
type: DatatypeProperty
domain: Work
label: Besetzung im Musikbereich (Literal) @de
range: Literal

Member
type: Property
type: ObjectProperty
comment: A person or family being a member of (another) family
comment: Eine Person oder Familie, die Mitglied einer (anderen) Familie ist @de
label: Mitglied @de

Member of the family
type: Property
type: ObjectProperty
comment: Die beschriebene Person (Subjekt) ist ein bedeutendes Mitglied der verknüpften Familie (Objekt). Für Göttergruppen und Gruppen mythologischer Gestalten wird gndo:broaderTermPartitive verwendet. @de
domain: Differentiated person
label: Familienmitglied @de
range: Family
sub property of: P50056
sub property of: isMemberOf
sub property of: Member
MARC 21 equivalent: 500 $0 $4=mitg

Musician
type: Property
type: ObjectProperty
comment: A person or organization who performs music or contributes to the musical content of a work when it is not possible or desirable to identify the function more precisely
domain: Class
  union of: Conference or Event
  union of: Corporate Body
label: Musiker @de
range: Differentiated person
MARC 21 equivalent: 500 $0 $4=musi

Name addition
type: Property
type: DatatypeProperty
domain: Name of the person
label: Namensusatz @de
range: Literal
MARC 21 equivalent: 100 $g
MARC 21 equivalent: 400 $g

Narrator
type: Property
type: ObjectProperty
comment: A performer contributing to a resource by reading or speaking in order to give an account of an act, occurrence, course of events, etc
domain: Work
label: Sprecher @de
range: Differentiated person
sub property of: P60153
MARC 21 equivalent: 500 $0 $4=spre

Narrower mapping
type: Property
type: ObjectProperty
comment: The term represents a concept having a narrower meaning than the GND concept.
label: Unterbegriff-Relation @de
MARC 21 equivalent: $4 = NM

Narrower term (general)
type: Property
type: ObjectProperty
domain: Subject heading
label: Unterbegriff allgemein @de
range: Class
  union of: Conference or Event
  union of: Corporate Body
  union of: Differentiated person
  union of: Place or geographic name
  union of: Subject heading
  union of: Work
equivalent property: narrower
inverse of: Broader term (general)

Narrower term (generic)
type: Property
type: ObjectProperty
comment: Eine generische Relation ist eine hierarchische Relation zwischen zwei Begriffen, von denen der untergeordnete Begriff alle Merkmale des übergeordneten Begriffs besitzt und zusätzlich noch mindestens ein weiteres Merkmal. @de
comment: The generic relation is a semantic relation between two concepts where the intension of one of the concepts includes that of the other concepts and at least one additional delimiting characteristic is added.
domain: Subject heading
label: Unterbegriff generisch @de
range: Subject heading
sub property of: Narrower term (general)
inverse of: Broader term (generic)

Narrower term (instantial)
type: Property
type: ObjectProperty
comment: Die Instanzbeziehung verbindet ein allgemeines Konzept, etwa eine Klasse von Dingen oder Ereignissen mit einem individuellen Exemplar dieser Klasse, das oft durch einen Eigennamen repräsentiert wird. @de
comment: The instance relationship links a general concept such as a class of things or events, and an individual instance oft hat class, which is often represented by a proper name.
domain: Subject heading
label: Unterbegriff instantiell @de
range: Class
  union of: Corporate Body
  union of: Differentiated person
  union of: Place or geographic name
  union of: Subject heading
  union of: Work
sub property of: Narrower term (general)
inverse of: Broader term (instantial)

Narrower term (partitive)
type: Property
type: ObjectProperty
comment: Eine partitive Relation ist eine hierarchische Relation zwischen zwei Begriffen, von denen der übergeordnete Begriff (Verbandsbegriff) einem Ganzen entspricht und der untergeordnete Begriff einen der Bestandteile dieses Ganzen repräsentiert. Bei Personen ist die Relation die Beziehung zwischen einer einzelnen Person (besonders Gottheiten) und übergeordneten Gruppen von Göttern und mythologische Gestalten. @de
comment: The hierarchical whole-part relationship covers a limited range of situations in which a part of an entity or system belongs uniquely to a particular possessing whole. When applied to persons, this is the relation between a single person (particularly gods) and hierarchically superior groups of gods and mythologic entities.
domain: Class
  union of: Place or geographic name
  union of: Subject heading
  union of: Work
label: Unterbegriff partitiv @de
range: Class
  union of: Conference or Event
  union of: Corporate Body
  union of: Place or geographic name
  union of: Subject heading
  union of: Work
sub property of: Narrower term (general)
inverse of: Broader term (partitive)

No mapping
type: Property
type: ObjectProperty
comment: There is no relationship to the other vocabulary.
label: Null-Relation @de

Northernmost latitude
type: Property
type: DatatypeProperty
domain: Place or geographic name
label: Nördlichster Breitengrad @de
range: Literal
sub property of: Coordinates
MARC 21 equivalent: 034 $f

Number of ensembles of the same type
type: Property
type: DatatypeProperty
domain: Work
label: Anzahl der Ensembles vom gleichen Typ @de
range: Literal

Number of perfomers of the same medium
type: Property
type: DatatypeProperty
domain: Work
label: Besetzungsstärke @de
range: Literal

Occasion
type: Property
type: ObjectProperty
comment: Bewegrund für die vorliegende Entität als Datensatz (z.B. ein Werk oder historisches Einzelereignis als Anlass für eine Konferenz oder ein historisches Einzelereignis oder eine Konferenz als Anlass für ein Werk). @de
comment: Reason of the entity, e.g. a work or a historic event is the reason of a conference, or a conference is the reason of a work.
label: Anlass @de

Occasion of the subject heading
type: Property
type: ObjectProperty
domain: Class
  union of: Conference or Event
  union of: Subject heading
  union of: Work
label: Anlass des Schlagworts @de
range: Subject heading
sub property of: Occasion
MARC 21 equivalent: 550 $0 $4=anla

Occasion of the work
type: Property
type: ObjectProperty
domain: Class
  union of: Conference or Event
  union of: Work
label: Anlass des Werkes @de
range: Work
sub property of: Occasion
MARC 21 equivalent: 530 $0 $4=anla

Old authority number
type: Property
type: DatatypeProperty
domain: Class
  union of: Conference or Event
  union of: Corporate Body
  union of: Differentiated person
  union of: Family
  union of: Place or geographic name
  union of: Subject heading
  union of: Undifferentiated person
  union of: Work
label: Alte Normnummer @de
range: Literal
MARC 21 equivalent: 035 $z
Super-property of: P50006
Super-property of: P50052
Super-property of: P50094

Opus numeric designation of musical work
type: Property
type: DatatypeProperty
domain: Work
label: Opus-Zählung des Musikwerks @de
range: Literal
MARC 21 equivalent: 383 $b

Organizer or host
type: Property
type: ObjectProperty
comment: A person, family, or organization organizing the exhibit, event, conference, etc., which gave rise to a resource
domain: Conference or Event
label: Veranstalter oder Gastgeber @de
range: Class
  union of: Corporate Body
  union of: Differentiated person
sub property of: P60061
MARC 21 equivalent: 500 $0 $4=vera
MARC 21 equivalent: 510 $0 $4=vera

Other place
type: Property
type: ObjectProperty
domain: Class
  union of: Conference or Event
  union of: Corporate Body
label: Weiterer Ort @de
range: Place or geographic name
sub property of: Associated place
MARC 21 equivalent: 551 $0 $4=ortm

Owner
type: Property
type: ObjectProperty
comment: A person, family, or organization that currently owns an item or collection, i.e. has legal possession of a resource
comment: Eine Person, eine Familie oder eine Körperschaft, die im rechtmäßigen Besitz einer Ressource ist. @de
domain: Class
  union of: Place or geographic name
  union of: Work
label: Besitzer @de
range: Class
  union of: Corporate Body
  union of: Differentiated person
  union of: Family
sub property of: P60404
MARC 21 equivalent: 500 $0 $4=besi
MARC 21 equivalent: 510 $0 $4=besi

Painter
type: Property
type: ObjectProperty
comment: A person or family who paints
comment: Eine Person oder Familie, die malt @de
domain: Work
label: Maler @de
range: Class
  union of: Corporate Body
  union of: Differentiated person
  union of: Family
MARC 21 equivalent: 500 $0 $4=malr
MARC 21 equivalent: 510 $0 $4=malr

Period of activity
type: Property
type: DatatypeProperty
comment: A person’s known period of activity
comment: Exaktes Wirkungsdatum einer Person @de
domain: Class
  union of: Differentiated person
  union of: Family
label: Wirkungsdaten @de
sub property of: Associated date
MARC 21 equivalent: 548 $a $4=datw
MARC 21 equivalent: 548 $a $4=datz
Super-property of: P50058
Super-property of: P50098

Personal name
type: Property
type: DatatypeProperty
domain: Name of the person
label: Persönlicher Name @de
range: Literal
MARC 21 equivalent: 100 $a
MARC 21 equivalent: 400 $a

Photographer
type: Property
type: ObjectProperty
comment: A person, family, or organization responsible for creating a photographic work
domain: Work
label: Fotograf @de
range: Class
  union of: Corporate Body
  union of: Differentiated person
sub property of: P60429
MARC 21 equivalent: 500 $0 $4=foto
MARC 21 equivalent: 510 $0 $4=foto

Place
type: Property
type: ObjectProperty
comment: A country, state, province, etc., or place where an organization has its headquarters
comment: Ein Land, ein Staat, eine Provinz usw. oder ein Ort, an dem/der eine Organisation ihren Hauptsitz hat. @de
domain: Class
  union of: Place or geographic name
  union of: Subject heading
label: Ort @de
range: Place or geographic name
sub property of: Associated place
MARC 21 equivalent: 551 $0 $4=orta

Place of activity
type: Property
type: ObjectProperty
comment: A person’s or family’s place of activity
comment: Wirkungsort bzw. Wohnort einer Person. @de
domain: Class
  union of: Differentiated person
  union of: Family
  union of: Subject heading
label: Wirkungsort @de
range: Place or geographic name
sub property of: Associated place
MARC 21 equivalent: 551 $0 $4=ortw

Place of Birth
type: Property
type: ObjectProperty
comment: A person’s place of birth
comment: Geburtsort einer Person. @de
domain: Differentiated person
label: Geburtsort @de
range: Place or geographic name
sub property of: P50119
sub property of: Associated place
MARC 21 equivalent: 551 $0 $4=ortg

Place of Birth (Literal)
type: Property
type: DatatypeProperty
comment: Diese Property ist äquivalent zu gndo:placeOfBirth, zeigt aber ein Literal statt einer Referenz zu einer geografischen Entität @de
comment: This property is equivalent to gndo:placeOfBirth but gives a literal instead of a reference to a geographic entity
domain: Differentiated person
label: Geburtsort (Literal) @de
sub property of: P50119
sub property of: Associated place
MARC 21 equivalent: 551 $a $g $z $4=ortg

Place of business
type: Property
type: ObjectProperty
domain: Corporate Body
label: Sitz @de
range: Place or geographic name
sub property of: P50018
sub property of: Associated place
MARC 21 equivalent: 551 $0 $4=orta

Place of conference or event
type: Property
type: ObjectProperty
comment: A place where an event such as a conference or a concert took place
comment: Ort, an dem eine Veranstaltung oder eine Konferenz stattfindet @de
domain: Conference or Event
label: Veranstaltungsort @de
range: Place or geographic name
sub property of: P50024
sub property of: Associated place
MARC 21 equivalent: 551 $0 $4=ortv

Place of custody
type: Property
type: ObjectProperty
comment: A place where something is kept
comment: Der Aufbewahrungsort eines Werkes @de
domain: Work
label: Aufbewahrungsort @de
range: Place or geographic name
sub property of: Associated place
MARC 21 equivalent: 551 $0 $4=ortb

Place of death
type: Property
type: ObjectProperty
comment: A person’s place of death
comment: Sterbeort einer Person. @de
domain: Differentiated person
label: Sterbeort @de
range: Place or geographic name
sub property of: P50118
sub property of: Associated place
MARC 21 equivalent: 551 $0 $4=orts

Place of death (Literal)
type: Property
type: DatatypeProperty
comment: Diese Property ist äquivalent zu gndo:placeOfDeath, zeigt aber ein Literal statt einer Referenz zu einer geografischen Entität @de
comment: This property is equivalent to gndo:placeOfDeath but gives a literal instead of a reference to a geographic entity
domain: Differentiated person
label: Sterbeort (Literal) @de
sub property of: P50118
sub property of: Associated place
MARC 21 equivalent: 551 $a $g $z $4=orts

Place of discovery
type: Property
type: ObjectProperty
comment: A place where a work or thing was found
comment: Der Fundort eines Werks @de
domain: Work
label: Fundort @de
range: Place or geographic name
sub property of: Associated place
MARC 21 equivalent: 551 $0 $4=ortf

Place of Exile
type: Property
type: ObjectProperty
comment: A place where a person or family dwelt in exile (lived in exile)
comment: Ortschaft, Stadt, Provinz, Staat und/oder Land, in der/dem eine Person oder Familie im Exil lebt(e). @de
domain: Class
  union of: Differentiated person
  union of: Family
label: Exilort @de
range: Place or geographic name
sub property of: Associated place
MARC 21 equivalent: 551 $0 $4=ortx

Place of manufacture
type: Property
type: ObjectProperty
comment: A place where a work or thing was manufactured
comment: Herstellungsort einer Sache oder eines Werks @de
domain: Class
  union of: Subject heading
  union of: Work
label: Herstellungsort @de
range: Place or geographic name
sub property of: Associated place
MARC 21 equivalent: 551 $0 $4=orth

Place or geographic name is member
type: Property
type: ObjectProperty
domain: Place or geographic name
label: Geografikum ist Mitglied @de
range: Corporate Body
sub property of: Member
MARC 21 equivalent: 510 $0 $4=mitg

Played instrument
type: Property
type: ObjectProperty
domain: Differentiated person
label: Gespieltes Instrument @de
range: Subject heading
sub property of: Instrument
MARC 21 equivalent: 550 $0 $4=istr

Poet
type: Property
type: ObjectProperty
comment: An author of the words of a non-dramatic musical work (e.g. the text of a song), except for oratorios
domain: Work
label: Dichter @de
range: Class
  union of: Corporate Body
  union of: Differentiated person
sub property of: P60477
MARC 21 equivalent: 500 $0 $4=dich
MARC 21 equivalent: 510 $0 $4=dich

Preceding conference or event
type: Property
type: ObjectProperty
domain: Conference or Event
label: Vorherige Konferenz oder Veranstaltung @de
range: Conference or Event
sub property of: P50012
sub property of: Predecessor
MARC 21 equivalent: 511 $0 $4=vorg

Preceding corporate body
type: Property
type: ObjectProperty
domain: Class
  union of: Corporate Body
  union of: Place or geographic name
label: Vorherige Körperschaft @de
range: Corporate Body
sub property of: P50012
sub property of: Predecessor
MARC 21 equivalent: 510 $0 $4=vorg

Preceding place or geographic name
type: Property
type: ObjectProperty
domain: Class
  union of: Conference or Event
  union of: Place or geographic name
label: Vorheriges Geografikum @de
range: Place or geographic name
sub property of: Predecessor
MARC 21 equivalent: 551 $0 $4=vorg

Preceding subject heading
type: Property
type: ObjectProperty
domain: Subject heading
label: Vorheriges Schlagwort @de
range: Subject heading
sub property of: Predecessor
MARC 21 equivalent: 550 $0 $4=vorg

Preceding work
type: Property
type: ObjectProperty
domain: Work
label: Vorheriges Werk @de
range: Work
sub property of: P60261
sub property of: Predecessor
MARC 21 equivalent: 530 $0 $4=vorg

Predecessor
type: Property
type: ObjectProperty
comment: A corporate body or a work being the predecessor of another corporate body or work
comment: Eine Körperschaft oder ein Werk, das der Vorgänger einer anderen Körperschaft oder eines anderen Werks ist @de
label: Vorgänger @de

Preferred name
type: Property
type: AnnotationProperty
label: Bevorzugter Name @de
sub property of: label

Preferred name entity for the person
type: Property
type: ObjectProperty
domain: Class
  union of: Differentiated person
  union of: Undifferentiated person
label: Bevorzugte Namensentität der Person @de
range: Name of the person

Preferred name for the conference or event
type: Property
type: AnnotationProperty
domain: Conference or Event
label: Bevorzugter Name der Konferenz oder Veranstaltung @de
range: Literal
sub property of: P50041
sub property of: Preferred name
MARC 21 equivalent: 111 $a $c $d $e $n $g

Preferred name for the corporate body
type: Property
type: AnnotationProperty
domain: Corporate Body
label: Bevorzugter Name der Körperschaft @de
range: Literal
sub property of: P50041
sub property of: name
sub property of: Preferred name
MARC 21 equivalent: 110 $a $b $g $n

Preferred name for the family
type: Property
type: AnnotationProperty
domain: Family
label: Bevorzugter Name der Familie @de
range: Literal
sub property of: P50065
sub property of: Preferred name
MARC 21 equivalent: 100 $a $b $c $g

Preferred name for the person
type: Property
type: AnnotationProperty
label: Bevorzugter Name der Person @de
range: Literal
sub property of: P50117
sub property of: name
sub property of: Preferred name
MARC 21 equivalent: 100 $a $b $c $g

Preferred name for the place or geographic name
type: Property
type: AnnotationProperty
domain: Place or geographic name
label: Bevorzugter Name des Geografikum @de
range: Literal
sub property of: Preferred name
MARC 21 equivalent: 151 $a $g $z

Preferred name for the subject heading
type: Property
type: AnnotationProperty
domain: Subject heading
label: Bevorzugter Name des Schlagworts @de
range: Literal
sub property of: Preferred name
equivalent property: prefLabel
MARC 21 equivalent: 150 $a $g

Preferred name for the work
type: Property
type: AnnotationProperty
domain: Work
label: Bevorzugter Name des Werks @de
range: Literal
sub property of: Preferred name
MARC 21 equivalent: 130 $a $f $g $m $n $o $p $r $s

Prefix
type: Property
type: DatatypeProperty
domain: Name of the person
label: Präfix @de
range: Literal
MARC 21 equivalent: 100 $a
MARC 21 equivalent: 400 $a

Printer
type: Property
type: ObjectProperty
comment: A person, family, or organization involved in manufacturing a manifestation of printed text, notated music, etc., from type or plates, such as a book, newspaper, magazine, broadside, score, etc
domain: Work
label: Drucker @de
range: Class
  union of: Corporate Body
  union of: Differentiated person
sub property of: P60418
MARC 21 equivalent: 500 $0 $4=druc
MARC 21 equivalent: 510 $0 $4=druc

Profession or occupation
type: Property
type: ObjectProperty
comment: A profession or occupation practiced by a person or family
comment: Ein Beruf oder eine Tätigkeit, die von einer Person oder Familie ausgeübt wird. @de
domain: Class
  union of: Differentiated person
  union of: Family
label: Beruf oder Beschäftigung @de
range: Subject heading
sub property of: P50104
MARC 21 equivalent: 550 $0 $4=berc
MARC 21 equivalent: 550 $0 $4=beru

Profession or occupation (Literal)
type: Property
type: DatatypeProperty
comment: Berufs- oder Tätigkeitsbezeichnung bzw. Bezeichnung für die Religionszugehörigkeit oder die Weltanschauung einer Person. Diese Property ist äquivalent zu gndo:professionOrOccupation, zeigt aber ein Literal statt einer Referenz zu einem Schlagwort @de
comment: This property is equivalent to gndo:professionOrOccupation but gives a literal instead of a reference to a subject heading
domain: Class
  union of: Differentiated person
  union of: Family
label: Beruf oder Beschäftigung (Literal) @de
sub property of: P50104
MARC 21 equivalent: 550 $a $g $4=berc
MARC 21 equivalent: 550 $a $g $4=beru

Professional relationship
type: Property
type: ObjectProperty
comment: An occupational relationship between a person or family and another person or family
comment: Eine berufliche Beziehung zwischen einer Person oder Familie und einer anderen Person oder Familie. @de
domain: Class
  union of: Differentiated person
  union of: Family
label: Berufliche Beziehung @de
range: Class
  union of: Differentiated person
  union of: Family
equivalent property: hasProfessionalContact
MARC 21 equivalent: 500 $0 $4=bezb

Pseudonym
type: Property
type: ObjectProperty
comment: Links a person's real identity to an identity under which one or more persons act, e. g. write, compose or create art, but that is not the person's real name (i. e. a pseudonym).
comment: Verknüpft eine echte Identität einer Person mit einer Identität, unter der eine oder mehrere Personen agieren, z. B. schreiben, komponieren oder Kunstwerke schaffen, aber die nicht der wirkliche Name der Person ist (Pseudonym). @de
domain: Differentiated person
range: Differentiated person
sub property of: P50105
sub property of: Related person
inverse of: Real identity
MARC 21 equivalent: 500 $0 $4=pseu

Publication
type: Property
type: DatatypeProperty
domain: Class
  union of: Differentiated person
  union of: Family
  union of: Undifferentiated person
label: Titelangabe @de
range: Literal
MARC 21 equivalent: 692 $a
Super-property of: publications

Real identity
type: Property
type: ObjectProperty
comment: Links an identity under which one or more persons act, e. g. write, compose or create art, but that is not their real name (i. e. a pseudonym) to their real identity.
comment: Verknüpft eine Identität, unter der eine oder mehrere Personen agieren, z. B. schreiben, komponieren oder Kunstwerke schaffen, aber die nicht der wirkliche Name der Person ist (Pseudonym), mit der echten Identität der Person. @de
domain: Differentiated person
label: Echte Identität @de
range: Differentiated person
sub property of: P50106
sub property of: Related person
inverse of: Pseudonym
MARC 21 equivalent: 500 $0 $4=nawi

Related conference or event
type: Property
type: ObjectProperty
domain: Class
  union of: Conference or Event
  union of: Corporate Body
  union of: Differentiated person
  union of: Family
  union of: Place or geographic name
  union of: Subject heading
  union of: Work
label: In Beziehung stehende Konferenz oder Veranstaltung @de
range: Conference or Event
sub property of: P50218
MARC 21 equivalent: 511 $0 $4=rela

Related Corporate Body
type: Property
type: ObjectProperty
domain: Class
  union of: Conference or Event
  union of: Corporate Body
  union of: Differentiated person
  union of: Family
  union of: Place or geographic name
  union of: Subject heading
  union of: Work
label: In Beziehung stehende Körperschaft @de
range: Corporate Body
sub property of: P50218
sub property of: relatedAgent
MARC 21 equivalent: 510 $0 $4=rela

Related Dewey Decimal Classification with degree of determinacy 1
type: Property
type: ObjectProperty
comment: Der Bedeutungsumfang der GND-Entität und der Bedeutungsumfang der DDC-Klasse haben eine geringe Schnittmenge. @de
comment: The connotation scope of the GND entity corresponds to a small part to the connotation scope of the assigned DDC class.
domain: Class
  union of: Place or geographic name
  union of: Subject heading
  union of: Work
label: In Beziehung stehende Dewey-Dezimalklassifikation mit Determiniertheitsgrad 1 @de

Related Dewey Decimal Classification with degree of determinacy 2
type: Property
type: ObjectProperty
comment: Die GND-Entität stimmt in seinem Bedeutungsumfang vollständig oder weitgehend mit dem Bedeutungsumfang eines Themas überein, das sinngemäß Teil einer DDC-Klasse ist, aber einen geringeren inhaltlichen Umfang aufweist als der durch die Notation repräsentierte Begriff. @de
comment: The connotation scope of the GND entity is identical or nearly identical to the connotation scope of a topic that is logically part of the class but is less extensive in scope than the concept represented by the class number.
domain: Class
  union of: Place or geographic name
  union of: Subject heading
  union of: Work
label: In Beziehung stehende Dewey-Dezimalklassifikation mit Determiniertheitsgrad 2 @de

Related Dewey Decimal Classification with degree of determinacy 3
type: Property
type: ObjectProperty
comment: Die GND-Entität stimmt in seinem Bedeutungsumfang vollständig oder weitgehend mit dem Bedeutungsumfang eines Themas überein, das wesentliche Übereinstimmung mit der DDC-Klasse aufweist. In der DDC-Terminologie liegt eine wesentliche Übereinstimmung vor, wenn ein Thema nahezu koextensiv mit einer DDC-Klasse ist oder mehr als die Hälfte des Inhalts einer Klassenbenennung abdeckt. @de
comment: The connotation scope of the GND entity is identical or nearly identical to the connotation scope of a topic that approximates the whole of the assigned DDC class. According to DDC terms, topics that are nearly coextensive with the full meaning of a class or cover more than half of the content of the class approximate the whole of the DDC class.
domain: Class
  union of: Place or geographic name
  union of: Subject heading
  union of: Work
label: In Beziehung stehende Dewey-Dezimalklassifikation mit Determiniertheitsgrad 3 @de

Related Dewey Decimal Classification with degree of determinacy 4
type: Property
type: ObjectProperty
comment: Die GND-Entität stimmt in seinem Bedeutungsumfang vollständig mit dem Bedeutungsumfang des in der DDC-Klassenbenennung hervorgehobenen Themas überein, d.h. es weist auch denselben fachlichen Kontext wie die DDC-Klasse auf. @de
comment: The connotation scope of the GND entity is identical to the connotation scope of the topic emphasized in the DDC class heading.
domain: Class
  union of: Place or geographic name
  union of: Subject heading
  union of: Work
label: In Beziehung stehende Dewey-Dezimalklassifikation mit Determiniertheitsgrad 4 @de

Related family
type: Property
type: ObjectProperty
domain: Class
  union of: Conference or Event
  union of: Corporate Body
  union of: Differentiated person
  union of: Family
  union of: Place or geographic name
  union of: Subject heading
  union of: Work
label: In Beziehung stehende Familie @de
range: Family
sub property of: P50219
sub property of: relatedAgent

Related mapping
type: Property
type: ObjectProperty
comment: The term labels an associated concept that is not synonym and not broader or narrower than the GND concept.
label: Verwandter-Begriff-Relation @de
MARC 21 equivalent: $4 = RM

Related person
type: Property
type: ObjectProperty
domain: Class
  union of: Conference or Event
  union of: Corporate Body
  union of: Differentiated person
  union of: Family
  union of: Place or geographic name
  union of: Subject heading
  union of: Work
label: In Beziehung stehende Person @de
range: Differentiated person
sub property of: P50220
sub property of: relatedAgent
MARC 21 equivalent: 500 $0 $4=rela

Related place or geographic name
type: Property
type: ObjectProperty
domain: Class
  union of: Conference or Event
  union of: Corporate Body
  union of: Differentiated person
  union of: Family
  union of: Place or geographic name
  union of: Subject heading
  union of: Work
label: In Beziehung stehendes Geografikum @de
range: Place or geographic name
MARC 21 equivalent: 551 $0 $4=geoa
MARC 21 equivalent: 551 $0 $4=rela

Related subject heading
type: Property
type: ObjectProperty
comment: Bitte verwenden sie relatedSubjectHeading (mit 'subject' statt 'subjec') @de
comment: Use relatedSubjectHeading ('subject', not 'subjec') instead
domain: Class
  union of: Conference or Event
  union of: Corporate Body
  union of: Differentiated person
  union of: Family
  union of: Place or geographic name
  union of: Subject heading
  union of: Work
label: In Beziehung stehendes Schlagwort @de
range: Subject heading
deprecated: true
MARC 21 equivalent: 550 $0 $4=rela

Related subject heading
type: Property
type: ObjectProperty
domain: Class
  union of: Conference or Event
  union of: Corporate Body
  union of: Differentiated person
  union of: Family
  union of: Place or geographic name
  union of: Subject heading
  union of: Work
label: In Beziehung stehendes Schlagwort @de
range: Subject heading
MARC 21 equivalent: 550 $0 $4=rela

Related Term
type: Property
type: ObjectProperty
type: SymmetricProperty
comment: Eine Assoziationsrelation ist eine zwischen Begriffen als wichtig erscheinende Relation, die weder eindeutig hierarchischer Natur ist, noch als äquivalent angesehen werden kann. Bei Personen ist dies z. B. die Beziehung zwischen fiktiven Gestalten und ihrem realem Vorbild. Hierzu gehören auch Beziehungen zwischen Personen und z. B. Körperschaften, die im Namen einer Person agieren, Gesellschaften, die zu Ehren einer Person gegründet wurden und Körperschaften, die sich mit einer Person und ihrem Werk beschäftigen. @de
comment: The associative relationship covers associations between pairs of concepts that are not related hierarchically, but are semantically or concetually associated to such an extent that the link between them needs to be made explicit in the thesaurus.
domain: Class
  union of: Conference or Event
  union of: Corporate Body
  union of: Differentiated person
  union of: Family
  union of: Place or geographic name
  union of: Subject heading
  union of: Work
label: Verwandter Begriff @de
range: Class
  union of: Conference or Event
  union of: Corporate Body
  union of: Differentiated person
  union of: Family
  union of: Place or geographic name
  union of: Subject heading
  union of: Work
MARC 21 equivalent: 500 $0 $4=vbal
MARC 21 equivalent: 510 $0 $4=vbal
MARC 21 equivalent: 511 $0 $4=vbal
MARC 21 equivalent: 530 $0 $4=vbal
MARC 21 equivalent: 550 $0 $4=vbal
MARC 21 equivalent: 551 $0 $4=vbal

Related work
type: Property
type: ObjectProperty
domain: Class
  union of: Conference or Event
  union of: Corporate Body
  union of: Differentiated person
  union of: Family
  union of: Place or geographic name
  union of: Subject heading
  union of: Work
label: In Beziehung stehendes Werk @de
range: Work
MARC 21 equivalent: 530 $0 $4=rela

Restorer
type: Property
type: ObjectProperty
comment: A person, family, or organization responsible for the set of technical, editorial, and intellectual procedures aimed at compensating for the degradation of an item by bringing it back to a state as close as possible to its original condition
domain: Class
  union of: Place or geographic name
  union of: Work
label: Restaurator @de
range: Class
  union of: Corporate Body
  union of: Differentiated person
  union of: Family
sub property of: P60450
MARC 21 equivalent: 500 $0 $4=rest
MARC 21 equivalent: 510 $0 $4=rest

Revisor
type: Property
type: ObjectProperty
comment: A person or organization who 1) reworks a musical composition, usually for a different medium, or 2) rewrites novels or stories for motion pictures or other audiovisual medium.
domain: Work
label: Bearbeiter @de
range: Differentiated person
MARC 21 equivalent: 500 $0 $4=bear

Screenwriter
type: Property
type: ObjectProperty
comment: An author of a screenplay, script, or scene
domain: Work
label: Drehbuchautor @de
range: Class
  union of: Corporate Body
  union of: Differentiated person
sub property of: P60476
MARC 21 equivalent: 500 $0 $4=vfrd
MARC 21 equivalent: 510 $0 $4=vfrd

Scriptorium
type: Property
type: ObjectProperty
comment: A scriptorium in a monastery
domain: Work
label: Skriptorium @de
range: Corporate Body

Sculptor
type: Property
type: ObjectProperty
comment: An artist responsible for creating a three-dimensional work by modeling, carving, or similar technique
domain: Class
  union of: Place or geographic name
  union of: Work
label: Bildhauer @de
range: Class
  union of: Corporate Body
  union of: Differentiated person
  union of: Family
sub property of: P60475
MARC 21 equivalent: 500 $0 $4=bilh
MARC 21 equivalent: 510 $0 $4=bilh

Serial numeric designation of musical work
type: Property
type: DatatypeProperty
domain: Work
label: Fortlaufende Zählung des Musikwerks @de
range: Literal
MARC 21 equivalent: 383 $a

Singer
type: Property
type: ObjectProperty
comment: A performer contributing to a resource by using his/her/their voice, with or without instrumental accompaniment, to produce music. A singer's performance may or may not include actual words
domain: Work
label: Sänger @de
range: Class
  union of: Corporate Body
  union of: Differentiated person
  union of: Family
sub property of: P60156
MARC 21 equivalent: 500 $0 $4=saen
MARC 21 equivalent: 510 $0 $4=saen

Southernmost latitude
type: Property
type: DatatypeProperty
domain: Place or geographic name
label: Südlichster Breitengrad @de
range: Literal
sub property of: Coordinates
MARC 21 equivalent: 034 $g

Spatial area of activity
type: Property
type: ObjectProperty
comment: Geografischer Wirkungsbereich @de
comment: Geographic field of activity
domain: Class
  union of: Conference or Event
  union of: Corporate Body
label: Geographischer Wirkungsbereich @de
range: Place or geographic name
MARC 21 equivalent: 551 $0 $4=geow

Sponsor or patron
type: Property
type: ObjectProperty
comment: A person, family, or organization sponsoring some aspect of a resource, e.g., funding research, sponsoring an event
domain: Class
  union of: Conference or Event
  union of: Corporate Body
  union of: Place or geographic name
  union of: Work
label: Sponsor oder Mäzen @de
range: Class
  union of: Corporate Body
  union of: Differentiated person
  union of: Family
sub property of: P50028
MARC 21 equivalent: 500 $0 $4=spon
MARC 21 equivalent: 510 $0 $4=spon
MARC 21 equivalent: 550 $0 $4=spon

Starting or final point of a distance
type: Property
type: ObjectProperty
domain: Place or geographic name
label: Beginn und Ende einer Strecke @de
range: Place or geographic name
MARC 21 equivalent: 551 $0 $4=punk

Subeditor
type: Property
type: ObjectProperty
comment: A person or organization who writes or develops the framework for an item without being intellectually responsible for its content
domain: Work
label: Redakteur @de
range: Class
  union of: Corporate Body
  union of: Differentiated person
MARC 21 equivalent: 500 $0 $4=reda
MARC 21 equivalent: 510 $0 $4=reda

Succeeding conference or event
type: Property
type: ObjectProperty
domain: Conference or Event
label: Nachfolgende Konferenz oder Veranstaltung @de
range: Conference or Event
sub property of: P50016
sub property of: Successor
MARC 21 equivalent: 511 $0 $4=nach

Succeeding corporate body
type: Property
type: ObjectProperty
domain: Class
  union of: Corporate Body
  union of: Place or geographic name
label: Nachfolgende Körperschaft @de
range: Corporate Body
sub property of: P50016
sub property of: Successor
MARC 21 equivalent: 510 $0 $4=nach

Succeeding place or geographic name
type: Property
type: ObjectProperty
domain: Class
  union of: Corporate Body
  union of: Place or geographic name
label: Nachfolgendes Geografikum @de
range: Place or geographic name
sub property of: Successor
MARC 21 equivalent: 551 $0 $4=nach

Succeeding subject heading
type: Property
type: ObjectProperty
domain: Subject heading
label: Nachfolgendes Schlagwort @de
range: Subject heading
sub property of: Successor
MARC 21 equivalent: 550 $0 $4=nach

Succeeding work
type: Property
type: ObjectProperty
domain: Work
label: Nachfolgendes Werk @de
range: Work
sub property of: P60278
sub property of: Successor
MARC 21 equivalent: 530 $0 $4=nach

Successor
type: Property
type: ObjectProperty
label: Nachfolger @de

Super-property of
type: Property
type: TransitiveProperty
comment: P1 gnd:superPropertyOf P2 sagt aus, dass P2 eine Subproperty von P1 ist. Die gndo:superPropertyOf-Property ist transitiv. @de
comment: P1 gnd:superPropertyOf P2 states that P2 is a subproperty of P1. The gndo:superPropertyOf property is transitive.
label: Super-Property von @de
inverse of: subPropertyOf

Surname
type: Property
type: DatatypeProperty
domain: Name of the person
label: Nachname @de
range: Literal
equivalent property: familyName
MARC 21 equivalent: 100 $a
MARC 21 equivalent: 400 $a

Temporary name
type: Property
type: ObjectProperty
label: Zeitweiser Name @de

Temporary name of the conference or event
type: Property
type: ObjectProperty
domain: Conference or Event
label: Zeitweiser Name der Konferenz oder Veranstaltung @de
range: Conference or Event
sub property of: Temporary name
MARC 21 equivalent: 511 $0 $4=nazw

Temporary name of the corporate body
type: Property
type: ObjectProperty
domain: Corporate Body
label: Zeitweiser Name der Körperschaft @de
range: Class
  union of: Corporate Body
  union of: Place or geographic name
sub property of: Temporary name
MARC 21 equivalent: 510 $0 $4=nazw
MARC 21 equivalent: 551 $0 $4=nazw

Temporary name of the place or geographic name
type: Property
type: ObjectProperty
domain: Place or geographic name
label: Zeitweiser Name des Geografikums @de
range: Class
  union of: Corporate Body
  union of: Place or geographic name
sub property of: Temporary name
MARC 21 equivalent: 510 $0 $4=nazw
MARC 21 equivalent: 551 $0 $4=nazw

Thematic index numeric designation of musical work
type: Property
type: DatatypeProperty
domain: Work
label: Zählung eines Werksverzeichnisses des Musikwerks @de
range: Literal
MARC 21 equivalent: 383 $c

Title of nobility
type: Property
type: ObjectProperty
comment: A title of nobility held by a person or family.
comment: Adelstitel einer Person oder einer Familie. @de
domain: Differentiated person
label: Adelstitel @de
range: Subject heading
sub property of: P50059
sub property of: P50110
sub property of: title
MARC 21 equivalent: 550 $0 $4=adel

Title of nobility (Literal)
type: Property
type: DatatypeProperty
comment: A title of nobility held by a person or family. This property is equivalent to gndo:titleOfNobility but gives a literal instead of a reference to a subject heading.
comment: Adelstitel einer Person oder Adelstitel im Erbtitel einer Familie. Diese Property ist äquivalent zu gndo:titleOfNobility, zeigt aber ein Literal statt einer Referenz zu einem Schlagwort. @de
domain: Differentiated person
label: Adelstitel (Literal) @de
sub property of: P50059
sub property of: P50110
sub property of: title
MARC 21 equivalent: 550 $a $g $4=adel

Title with other title information
type: Property
type: AnnotationProperty
domain: Work
label: Titel mit Titelzusatz @de
range: Literal
sub property of: Variant name for the work
MARC 21 equivalent: 430 $4=tmzu

Topic
type: Property
type: ObjectProperty
comment: Thema, das mit einer Körperschaft, Konferenz, Person, Familie, Schlagwort oder Werk in Beziehung steht. @de
comment: Topic that is related to a corporate body, conference, person, family, subject heading or work.
domain: Class
  union of: Conference or Event
  union of: Corporate Body
  union of: Differentiated person
  union of: Subject heading
  union of: Work
label: Thema @de
range: Class
  union of: Conference or Event
  union of: Corporate Body
  union of: Differentiated person
  union of: Family
  union of: Place or geographic name
  union of: Subject heading
  union of: Work
MARC 21 equivalent: 500 $0 $4=them
MARC 21 equivalent: 510 $0 $4=them
MARC 21 equivalent: 511 $0 $4=them
MARC 21 equivalent: 530 $0 $4=them
MARC 21 equivalent: 550 $0 $4=them
MARC 21 equivalent: 551 $0 $4=them

Total number of ensembles
type: Property
type: DatatypeProperty
domain: Work
label: Gesamtanzahl der Ensembles @de
range: Literal

Total number of performers
type: Property
type: DatatypeProperty
domain: Work
label: Gesamtanzahl der Ausführenden @de
range: Literal

Translator
type: Property
type: ObjectProperty
comment: A person or organization who renders a text from one language into another, or from an older form of a language into the modern form
domain: Class
  union of: Subject heading
  union of: Work
label: Übersetzer @de
range: Class
  union of: Corporate Body
  union of: Differentiated person
sub property of: P60385
MARC 21 equivalent: 500 $0 $4=uebe
MARC 21 equivalent: 510 $0 $4=uebe

Type of coordinates
type: Property
type: ObjectProperty
domain: Place or geographic name
label: Koordinatentyp @de
range: TypeOfCoordinatesValue
MARC 21 equivalent: 034 $9

UDK-Code
type: Property
type: DatatypeProperty
comment: Date, expressed as UDK code
comment: Zeitangabe als UDK-Code @de
domain: Class
  union of: Differentiated person
  union of: Work
range: Class
  union of: Literal
  union of: dateTime
sub property of: Associated date
MARC 21 equivalent: 548 $a $4=datu

Variant name
type: Property
type: AnnotationProperty
label: Varianter Name @de

Variant name entity for the person
type: Property
type: ObjectProperty
domain: Class
  union of: Differentiated person
  union of: Undifferentiated person
label: Variante Namensentität der Person @de
range: Name of the person

Variant name for the conference or event
type: Property
type: AnnotationProperty
domain: Conference or Event
label: Varianter Name der Konferenz oder Veranstaltung @de
range: Literal
sub property of: P50025
sub property of: Variant name
MARC 21 equivalent: 411 $a $c $d $e $g $n

Variant name for the corporate body
type: Property
type: AnnotationProperty
domain: Corporate Body
label: Varianter Name der Körperschaft @de
range: Literal
sub property of: P50025
sub property of: name
sub property of: Variant name
MARC 21 equivalent: 410 $a $b $g $n

Variant name for the family
type: Property
type: AnnotationProperty
domain: Family
label: Varianter Name der Familie @de
range: Literal
sub property of: P50054
sub property of: Variant name
MARC 21 equivalent: 400 $a $b $c $g

Variant name for the person
type: Property
type: AnnotationProperty
label: Varianter Name der Person @de
range: Literal
sub property of: P50103
sub property of: name
sub property of: Variant name
MARC 21 equivalent: 400 $a $b $c $g

Variant name for the place or geographic name
type: Property
type: AnnotationProperty
domain: Place or geographic name
label: Varianter Name des Geografikum @de
range: Literal
sub property of: Variant name
MARC 21 equivalent: 451 $a $g $z

Variant name for the subject heading
type: Property
type: AnnotationProperty
domain: Subject heading
label: Varianter Name des Schlagworts @de
range: Literal
sub property of: Variant name
equivalent property: altLabel
MARC 21 equivalent: 450 $a $g

Variant name for the work
type: Property
type: AnnotationProperty
domain: Work
label: Varianter Name des Werks @de
range: Literal
sub property of: Variant name
MARC 21 equivalent: 430 $a $f $g $m $n $o $p $r $s

Westernmost longitude
type: Property
type: DatatypeProperty
domain: Place or geographic name
label: Westlichster Längengrad @de
range: Literal
sub property of: Coordinates
MARC 21 equivalent: 034 $d

Writer of added commentary
type: Property
type: ObjectProperty
comment: A person or organization responsible for the commentary or explanatory notes about a text. For the writer of manuscript annotations in a printed book, use Annotator
domain: Work
label: Kommentator (schriftlich) @de
range: Class
  union of: Corporate Body
  union of: Differentiated person
  union of: Family
MARC 21 equivalent: 500 $0 $4=komm
MARC 21 equivalent: 510 $0 $4=komm