Ontology of coordinates reference systems
type: Ontology
license: http://creativecommons.org/licenses/by/2.0/
license: by
license: Licence-Ouverte-Open-Licence
contributor: ~troncy
creator: ~atemezin
description: Codes for describing coordinates reference systems consistently with ISO TC/211. French translations of terms and definitions are mainly taken from the multilingual glossary of ISO/TC 211 available online: http://www.isotc211.org/Terminology.htm
description: Codes pour la description de systèmes de coordonnées de référence conforme ISO TC/211. Les traductions françaises des termes et leurs définitions sont pour la plupart issues du glossaire multilingue ISO/TC 211 disponible ici: http://www.isotc211.org/Terminology.htm @fr
issued: 2013-06-11
modified: 2014-04-09
modified: 2015-05-05
modified: 2016-06-28
modified: 2019-02-13
publisher: Institut national de l'information géographique et forestière
rights: Copyright 2019, IGN
title: Ontologie des systèmes de coordonnées de référence @fr
preferred namespace prefix: ignf
preferred namespace uri: http://data.ign.fr/def/ignf#
prior version: 20160628.ttl
version info: Version 3.1 - 2019-02-13
type: NamedIndividual
type: Vocabulary

uses axis
type: ObjectProperty
domain: Coordinate system
range: List of axes
comment: An axis used by some ellipsoidal or cartesian coordinate system. Cf. ISO 19111:2007:2007-07, table 17, association role axis.
comment: Désigne un axe utilisé par un système de coordonnées ellipsoïdal ou cartésien. Cf. ISO 19111:2007:2007-07, tableau 17, rôle d'association axis. @fr
label: utilise l'axe @fr

base coordinate reference system
type: ObjectProperty
domain: Projected coordinate reference system
range: Geodetic coordinate reference system
comment: Désigne le système de coordonnées de référence géodésique sur lequel repose un système de coordonnées de référence projeté. Cf. ISO 19111:2007:2007-07, tableau 11, rôle d'association baseCRS. @fr
comment: The geodetic coordinate reference system on which a projected coordinate reference system is based. Cf. ISO 19111:2007:2007-07, table 11, association role baseCRS.
label: système de coordonnées de référence de base @fr

uses cartesian coordinate system
type: ObjectProperty
sub property of: uses coordinate system
domain: Class
  union of: Geodetic coordinate reference system
  union of: Projected coordinate reference system
range: Cartesian coordinate system
comment: Désigne le système de coordonnées cartésien utilisé par un système de coordonnées de référence géodésique ou projeté. Cf. ISO 19111:2007:2007-07, tableaux 10 et 11, association nommée CoordinateSystem. @fr
comment: The cartesian coordinate system used by some geodetic or projected coordinate reference system. Cf. ISO 19111:2007:2007-07, tables 10 et 11, association roles coordinateSystem.
label: utilise le système de coordonnées cartesien @fr

defined by conversion
type: ObjectProperty
domain: Projected coordinate reference system
range: Conversion
comment: Désigne la conversion utilisée pour définir un système de coordonnées de référence projeté. Cf. ISO 19111:2007:2007-07, tableau 7, association nommée Definition. @fr
comment: The conversion used to define a projected coordinate reference system. Cf. ISO 19111:2007:2007-07, table 7, named association Definition.
label: défini par conversion @fr

uses coordinate system
type: ObjectProperty
domain: Single coordinate reference system
range: Coordinate system
comment: Désigne le système de coordonnées utilisé par un système de coordonnées de référence. Cf. ISO 19111:2007:2007-07, tableau 5, association nommée CoordinateSystem. @fr
comment: The coordinate system used by a coordinate reference system. Cf. ISO 19111:2007:2007-07, table 5, named association CoordinateSystem.
label: utilise le système de coordonnées @fr

uses datum
type: ObjectProperty
domain: Single coordinate reference system
range: Datum
comment: Désigne le référentiel utilisé par un système de coordonnées de référence simple. Cf. ISO 19111:2007:2007-07, tableau 5, association nommée DefiningDatum. @fr
comment: The datum used by a single coordinate reference system. Cf. ISO 19111:2007:2007-07, table 5, named association DefiningDatum.
label: utilise le référentiel @fr

domain of validity
type: ObjectProperty
range: Extent
comment: Geographic area or time interval in which the referring object is valid. Cf. ISO 19111:2007:2007-07, tables 4, 33 and 42, attribute domainOfValidity.
comment: Zone ou intervalle de temps dans lequel l'objet de référence est valide. Cf. ISO 19111:2007:2007-07, tableaux 4, 33 et 42, attribut domainOfValidity. @fr
label: domaine de validité @fr

uses ellipsoid
type: ObjectProperty
domain: Geodetic datum
range: Ellipsoid
comment: Désigne l'ellipsoïde utilisé par un référentiel géodésique. Cf. ISO 19111:2007:2007-07, tableau 34, rôle d'association ellipsoid. @fr
comment: The ellipsoid used by a geodetic datum. Cf. ISO 19111:2007:2007-07, table 34, association role ellipsoid.
label: utilise l'ellipsoïde @fr

uses ellipsoidal coordinate system
type: ObjectProperty
sub property of: uses coordinate system
domain: Geodetic coordinate reference system
range: Ellipsoidal coordinate system
comment: Désigne le système de coordonnées ellipsoïdal utilisé par un système de coordonnées de référence géodésique. Cf. ISO 19111:2007:2007-07, tableau 10, association nommée CoordinateSystem. @fr
comment: The ellipsoidal coordinate system used by a geodetic coordinate reference system. Cf. ISO 19111:2007:2007-07, table 10, named association CoordinateSystem.
label: utilise le système de coordonnées ellipsoïdal @fr

uses geodetic datum
type: ObjectProperty
sub property of: uses datum
domain: Geodetic coordinate reference system
range: Geodetic datum
comment: Désigne le référentiel géodésique utilisé par un système de coordonnées de référence géodésique. Cf. ISO 19111:2007:2007-07, tableau 10, association nommée DefiningDatum. @fr
comment: The geodetic datum used by a geodetic coordinate reference system. Cf. ISO 19111:2007:2007-07, table 10, named association DefiningDatum.
label: utilise le référentiel géodésique @fr

geographic element
type: ObjectProperty
domain: Extent
range: Geographic bounding box
comment: Désigne le cadre englobant géographique d'une région de validité. Cf. ISO 19115-1:2014:2014-04, partie 6.6.1 et tableau B.15 ligne 337. @fr
comment: The geographic bounding box used for defining a domain of validity. Cf. ISO 19115-1:2014:2014-04, part 6.6.1 and table B.15 line 337.
label: élément géographique @fr

greenwich longitude
type: ObjectProperty
domain: Prime meridian
range: Class
  intersection of: QuantityValue
  intersection of: Restriction
    on property: unit
    all values from: AngleUnit
comment: Désigne la longitude par rapport au méridien de Greenwich. Cf. ISO 19111:2007:2007-07, tableau 35, attribut longitude du méridien d'origine. @fr
comment: Indicates the longitude from Greenwich meridian. Cf. ISO 19111:2007:2007-07, table 35, attribute prime meridian Greenwich longitude.
label: longitude par rapport à Greenwich @fr

includes some single coordinate reference systems
type: ObjectProperty
domain: Compound coordinate reference system
range: List of single coordinate reference systems
comment: Désigne les systèmes de coordonnées de référence simples qui composent un système de coordonnées de référence composé. Cf. ISO 19111:2007:2007-07, tableau 6, rôle d'association componentReferenceSystem. @fr
comment: Indicates the single coordinate reference systems used by a compound coordinate reference system. Cf. ISO 19111:2007:2007-07, table 6, association role componentReferenceSystem.
label: inclut des systèmes de coordonnées de référence simples @fr

inverse flattening
type: ObjectProperty
domain: Ellipsoid
range: Class
  intersection of: QuantityValue
  intersection of: Restriction
    on property: unit
    all values from: CountingUnit
comment: Désigne la valeur d'aplatissement inverse d'un ellipsoïde, exprimée sous la forme d'un nombre ou d'un ratio (pourcentage, parties par million, etc.). Cf. ISO 19111:2007:2007-07, tableau 37, attribut aplatissement inverse. @fr
comment: Indicates the inverse flattening value of an ellipsoid, expressed as a number or a ratio (percentage rate, parts per million, etc.). Cf. ISO 19111:2007:2007-07, table 37, attribute inverse flattening
label: aplatissement inverse @fr

parameter
type: ObjectProperty
domain: Operation parameter value
range: Operation parameter
comment: Désigne le paramètre auquel est associée une valeur. Cf. ISO 19111:2007:2007-07, tableau 55, rôle d'association parameter. @fr
comment: The parameter associated to a given value. Cf. ISO 19111:2007:2007-07, table 55, association role parameter.
label: paramètre @fr

uses prime meridian
type: ObjectProperty
domain: Geodetic datum
range: Prime meridian
comment: Désigne le méridien origine d'un référentiel géodésique. Cf. ISO 19111:2007:2007-07, tableau 34, rôle d'association primeMeridian. @fr
comment: The prime meridian used by a geodetic datum. Cf. ISO 19111:2007:2007-07, table 34, association role primeMeridian.
label: utilise le méridien origine @fr

semi major axis
type: ObjectProperty
domain: Ellipsoid
range: Class
  intersection of: QuantityValue
  intersection of: Restriction
    on property: unit
    all values from: LengthUnit
comment: Désigne la longueur du demi grand axe d'un ellipsoïde. Cf. ISO 19111:2007:2007-07, tableau 36, attribut longueur du demi-grand axe. @fr
comment: Indicates the length of the semi major axis of an ellipsoid. Cf. ISO 19111:2007:2007-07, table 36, attribute length of semi-major axis.
label: demi grand axe @fr

semi minor axis
type: ObjectProperty
domain: Ellipsoid
range: Class
  intersection of: QuantityValue
  intersection of: Restriction
    on property: unit
    all values from: LengthUnit
comment: Désigne la longueur du demi petit axe d'un ellipsoïde. Cf. ISO 19111:2007:2007-07, tableau 37, attribut longueur du demi-petit axe. @fr
comment: Indicates the length of the semi minor axis of an ellipsoid. Cf. ISO 19111:2007:2007-07, table 37, attribute length of semi-minor axis.
label: demi petit axe @fr

source coordinate reference system
type: ObjectProperty
domain: Coordinate operation
range: Coordinate reference system (CRS)
comment: Désigne le système de coordonnées de référence des données en entrée d'une opération. Cf. ISO 19111:2007:2007-07, tableau 42, association nommée Source. @fr
comment: The coordinate reference system associated to the data used as input of a given operation. Cf. ISO 19111:2007:2007-07, table 42, named association Source.
label: système de coordonnées de référence source @fr

target coordinate reference system
type: ObjectProperty
domain: Coordinate operation
range: Coordinate reference system (CRS)
comment: Désigne le système de coordonnées de référence des données en sortie d'une opération. Cf. ISO 19111:2007:2007-07, tableau 42, association nommée Target. @fr
comment: The coordinate reference system associated to the data obtained as output of a given operation. Cf. ISO 19111:2007:2007-07, table 42, named association Target.
label: système de coordonnées de référence cible @fr

uses method
type: ObjectProperty
domain: Coordinate operation
range: Operation method
comment: Désigne la méthode utilisée par une opération sur des coordonnées. Cf. ISO 19111:2007:2007-07, tableau 43, rôle d'association method. @fr
comment: The method used by an operation on coordinates. Cf. ISO 19111:2007:2007-07, table 43, association role method.
label: utilise la méthode @fr

uses parameter
type: ObjectProperty
domain: Operation method
range: Operation parameter
comment: A parameter used by a method to perform an operation on coordinates. Cf. ISO 19111:2007:2007-07, table 48, association role parameter.
comment: Désigne un paramètre utilisé par une méthode pour faire une opération sur des coordonnées. Cf. ISO 19111:2007:2007-07, tableau 48, rôle d'association parameter. @fr
label: utilise le paramètre @fr

uses value
type: ObjectProperty
domain: Coordinate operation
range: Operation parameter value
comment: A value used by an operation on coordinates. Cf. ISO 19111:2007:2007-07, table 43, association role parameterValue.
comment: Désigne une valeur utilisée par une opération sur des coordonnées. Cf. ISO 19111:2007:2007-07, tableau 43, rôle d'association parameterValue. @fr
label: utilise la valeur @fr

uses vertical coordinate system
type: ObjectProperty
sub property of: uses coordinate system
domain: Vertical coordinate reference system
range: Vertical coordinate system
comment: Désigne le système de coordonnées vertical utilisé par un système de coordonnées de référence vertical. Cf. ISO 19111:2007:2007-07, tableau 14, association nommée CoordinateSystem. @fr
comment: The vertical coordinate system used by a vertical coordinate reference system. Cf. ISO 19111:2007:2007-07, table 14, named association CoordinateSystem.
label: utilise le système vertical de coordonnées @fr

uses vertical datum
type: ObjectProperty
sub property of: uses datum
domain: Vertical coordinate reference system
range: Vertical datum
comment: Désigne le référentiel vertical utilisé par un système de coordonnées de référence vertical. Cf. ISO 19111:2007:2007-07, tableau 14, association nommée DefiningDatum. @fr
comment: The vertical datum used by a vertical coordinate reference system. Cf. ISO 19111:2007:2007-07, table 14, named association DefiningDatum.
label: utilise le référentiel vertical @fr

axis abbreviation
type: DatatypeProperty
domain: Axis
range: string
comment: Désigne l'abréviation utilisée pour désigner l'axe. Cf. ISO 19111:2007:2007-07, tableau 27, attribut abréviation de l'axe du système de coordonnées. @fr
comment: The abbreviation used to identify an axis. Cf. ISO 19111:2007:2007-07, table 27, attribute coordinate system axis abbreviation.
label: abréviation utilisée pour désigner l'axe @fr

axis direction
type: DatatypeProperty
domain: Axis
range: string
comment: Désigne la direction de l'axe. Cf. ISO 19111:2007:2007-07, tableau 27, attribut direction de l'axe du système de coordonnées. @fr
comment: The direction of an axis. Cf. ISO 19111:2007:2007-07, table 27, attribute coordinate system axis direction.
label: direction de l'axe @fr

code space
type: DatatypeProperty
range: string
comment: Désigne la règle ou l'autorité dont résulte la valeur de la référence. @fr
comment: Rule or authority for a code, name, term or category.
label: espace de codage @fr

east bound longitude
type: DatatypeProperty
domain: Geographic bounding box
range: double
comment: Désigne la longitude est maximale du cadre englobant. Cf. ISO 19115-1:2014:2014-04, partie 6.6.1 et tableau B.15.1 ligne 346. @fr
comment: Indicates the east bound longitude of a bounding box. Cf. ISO 19115-1:2014:2014-04, part 6.6.1 and table B.15.1 line 346.
label: longitude est maximale @fr

espg identifier
type: DatatypeProperty
range: string
comment: Indique l'identifiant EPSG de la ressource. @fr
comment: The EPSG identifier of the resource.
label: identifiant epsg @fr

is sphere
type: DatatypeProperty
domain: Ellipsoid
range: boolean
comment: Indicates whether the ellipsoid is a sphere. Cf. ISO 19111:2007:2007-07, table 37, attribute ellipsoid=sphere indicator.
comment: Indique si l'ellipsoïde est une sphère. Cf. ISO 19111:2007:2007-07, tableau 37, attribut indicateur ellipsoïde=sphère. @fr
label: est une sphère @fr

method formula
type: DatatypeProperty
domain: Operation method
range: string
comment: Indique la formule utilisée par une méthode pour faire opération sur des coordonnées. Cf. ISO 19111:2007:2007-07, tableau 48, attribut référence de formule de la méthode d'opération sur les coordonnées. @fr
comment: The formula used by a method to perform an operation on coordinates. Cf. ISO 19111:2007:2007-07, table 48, attribute coordinate operation method formula reference.
label: formule de la méthode @fr

north bound longitude
type: DatatypeProperty
domain: Geographic bounding box
range: double
comment: Désigne la latitude nord maximale du cadre englobant. Cf. ISO 19115-1:2014:2014-04, partie 6.6.1 et tableau B.15.1 ligne 348. @fr
comment: Indicates the north bound longitude of a bounding box. Cf. ISO 19115-1:2014:2014-04, part 6.6.1 and table B.15.1 line 348.
label: latitude nord maximale @fr

operation version
type: DatatypeProperty
domain: Coordinate operation
range: string
comment: Indique la version d'une opération appliquée sur des coordonnées. Cf. ISO 19111:2007:2007-07, tableau 42, attribut version de l'opération sur les coordonnées. @fr
comment: The version of an operation performed on coordinates. Cf. ISO 19111:2007:2007-07, table 42, attribute coordinate operation version.
label: version de l'opération @fr

scope
type: DatatypeProperty
range: string
comment: Désigne la portée de la référence. Cf. ISO 19111:2007:2007-07, tableaux 4, 33 et 42, attribut scope. @fr
comment: The scope of the referring object. Cf. ISO 19111:2007:2007-07, tables 4, 33 et 42, attribute scope.
label: portée @fr

source coordinate reference system dimension
type: DatatypeProperty
domain: Operation method
range: integer
comment: Indique la dimension du système de coordonnées de référence des données en entrée d'une opération. Cf. ISO 19111:2007:2007-07, tableau 48, attribut dimension du système de coordonnées de référence source. @fr
comment: The dimension of the coordinate reference system associated with the data used as input of an operation. Cf. ISO 19111:2007:2007-07, table 48, attribute dimension of source CRS.
label: dimension du système de coordonnées de référence source @fr

south bound latitude
type: DatatypeProperty
domain: Geographic bounding box
range: double
comment: Désigne la latitude sud minimale du cadre englobant. Cf. ISO 19115-1:2014:2014-04, partie 6.6.1 et tableau B.15.1 ligne 347. @fr
comment: Indicates the south bound latitude of a bounding box. Cf. ISO 19115-1:2014:2014-04, part 6.6.1 and table B.15.1 line 347.
label: latitude sud minimale @fr

target coordinate reference system dimension
type: DatatypeProperty
domain: Operation method
range: integer
comment: Indique la dimension du système de coordonnées de référence des données en sortie d'une opération. Cf. ISO 19111:2007:2007-07, tableau 48, attribut dimension du système de coordonnées de référence cible. @fr
comment: The dimension of the coordinate reference system associated with the data obtained as output of an operation. Cf. ISO 19111:2007:2007-07, table 48, attribute dimension of target CRS.
label: dimension du système de coordonnées de référence cible @fr

west bound longitude
type: DatatypeProperty
domain: Geographic bounding box
range: double
comment: Désigne la longitude ouest minimale du cadre englobant. Cf. ISO 19115-1:2014:2014-04, partie 6.6.1 et tableau B.15.1 ligne 345. @fr
comment: Indicates the west bound longitude of a bounding box. Cf. ISO 19115-1:2014:2014-04, part 6.6.1 and table B.15.1 line 345.
label: longitude ouest minimale @fr

List of axes
type: Class
subclass of: Class
  intersection of: List
  intersection of: Restriction
    on property: first
    all values from: Axis
  intersection of: Restriction
    on property: rest
    all values from: List of axes
comment: Liste ordonnée d'axes de systèmes de coordonnées. @fr
comment: Ordered list of coordinates system axes.
label: Liste d'axes @fr

Coordinate reference system (CRS)
type: Class
subclass of: Restriction
  on property: domain of validity
  some values from: Extent
disjoint with: Coordinate system
comment: Depending on the spatial dimension of coordinates (1D, 2D, 3D), this piece of metadata is used for specifying the elements of definition associated to a given set of coordinates: its datum, its ellipsoid, its prime meridian, the type of coordinates (geocentric, geographic, projected,...), the coordinates units of measure, when appropriate the cartographic projection used, the vertical coordinate reference system. Definition translated from: http://geodesie.ign.fr/index.php?page=glossaire. Cf. ISO 19111:2007:2007-07, part 8.2, table 4 and annex B.1.
comment: Métadonnées permettant de préciser, selon la dimension spatiale des coordonnées 1D, 2D ou 3D, les éléments de définition associés au jeu de coordonnées: le système de référence terrestre, l'ellipsoïde géodésique, le méridien origine, le type de coordonnées (cartésiennes géocentriques, planes, géographiques,...), les unités dans lesquelles sont exprimées les coordonnées, la projection cartographique, le référentiel altimétrique(http://geodesie.ign.fr/index.php?page=glossaire). Cf. ISO 19111:2007:2007-07, partie 8.2, tableau 4 et annexe B.1. @fr
label: Système de coordonnées de référence @fr

Cartesian coordinate system
type: Class
subclass of: Coordinate system
disjoint with: Geodetic coordinate reference system
comment: Coordinate system which gives the position of points relative to n mutually perpendicular axes. Cf. ISO 19111:2007:2007-07, tables 15 and 18.
comment: Système de coordonnées donnant la position des points relativement à n axes perpendiculaires deux à deux. Cf. ISO 19111:2007:2007-07, tableaux 15 et 18. @fr
label: Système cartésien de coordonnées @fr

Compound coordinate reference system
type: Class
subclass of: Coordinate reference system (CRS)
subclass of: Restriction
  on property: includes some single coordinate reference systems
  some values from: Class
    intersection of: List of single coordinate reference systems
    intersection of: Restriction
      on property: rest
      qualified cardinality: 1
      on class: List of single coordinate reference systems
disjoint with: Geodetic coordinate reference system
comment: Coordinate reference system using at least two independent single coordinate reference systems. Cf. ISO 19111:2007:2007-07, parts 8.2.3.c, 8.2.4, table 6 and annex B.1.2.4.
comment: Système de coordonnées de référence utilisant au moins deux systèmes de coordonnées de référence simples indépendants. Cf. ISO 19111:2007:2007-07, parties 8.2.3.c, 8.2.4, tableau 6 et annexe B.1.2.4. @fr
label: Système de coordonnées de référence combiné @fr

Conversion
type: Class
subclass of: Single coordinate operation
comment: Coordinate operation in which both coordinate reference systems are based on the same datum. Cf. ISO 19111:2007:2007-07, table 45 and annex B.4.2.
comment: Opération sur les coordonnées dans laquelle les deux systèmes de coordonnées de référence sont basés sur le même référentiel (ex: projection cartographique). Cf. ISO 19111:2007:2007-07, tableau 45 et annexe B.4.2. @fr

Coordinate operation
type: Class
comment: Mathematical operation on coordinates, based on one-to-one relationship, that changes coordinates from one coordinate reference system to another. Cf. ISO 19111:2007:2007-07, part 11.1, table 42 and annex B.4.
comment: Opération mathématique sur des coordonnées, basée sur une relation 1:1, qui change ces coordonnées d'une système de coordonnées de référence à un autre. Cf. ISO 19111:2007:2007-07, partie 11.1, tableau 42 et annexe B.4. @fr
label: Opération sur les coordonnées @fr

Coordinate system
type: Class
subclass of: Restriction
  on property: uses axis
  min qualified cardinality: 1
  on class: List of axes
comment: Ensemble d'axes couvrant un espace de coordonnées, et de règles mathématiques permettant l'affectation de coordonnées à un point. Cf. ISO 19111:2007:2007-07, partie 9.2, tableau 17 et annexe B.2. @fr
comment: Set of axes that spans a given coordinate space and of mathematical rules for specifying how coordinates are to be assigned to points. Cf. ISO 19111:2007:2007-07, part 9.2, table 17 and annex B.2.
label: Système de coordonnées @fr

Axis
type: Class
comment: Axe par rapport auquel une coordonnée d'un point est spécifiée dans un système de coordonnées. Cf. ISO 19111:2007:2007-07, partie 9.3, tableau 27 et annexe B.2.2. @fr
comment: Axis composing a coordinate system and used to specify one given coordinate in a coordinate tuple describing the position of a point. Cf. ISO 19111:2007:2007-07, part 9.3, table 27 and annex B.2.2.
label: Axe @fr

Datum
type: Class
comment: Parameter or set of parameters that define the position of the origin, the scale and the orientation of a coordinate system. Cf. ISO 19111:2007:2007-07, part 10.1, table 33 and annex B.3.
comment: Paramètre ou ensemble de paramètres définissant la position de l'origine, l'échelle et l'orientation d'un système de coordonnées. Cf. ISO 19111:2007:2007-07, partie 10.1, tableau 33 et annexe B.3. @fr
label: Référentiel @fr

Ellipsoid
type: Class
subclass of: Class
  intersection of: Class
    union of: Restriction
      on property: inverse flattening
      qualified cardinality: 1
      on class: QuantityValue
    union of: Restriction
      on property: semi minor axis
      qualified cardinality: 1
      on class: QuantityValue
    union of: Restriction
      on property: is sphere
      qualified cardinality: 1
      on data range: boolean
  intersection of: Restriction
    on property: semi major axis
    qualified cardinality: 1
    on class: QuantityValue
disjoint with: Prime meridian
comment: Surface de révolution engendrée par une ellipse tournant autour de son petit axe, définie par le rayon équatorial et un paramètre d'aplatissement, et sensiblement géocentrique. Note : Il s'agit d'un modèle mathématique du géoïde, c'est-à-dire de la Terre débarrassée de son relief. Il existe de nombreux ellipsoïdes géodésiques. Cf. ISO 19111:2007:2007-07, partie 10.2.2, tableau 36 et annexe B.3.2.3. @fr
comment: Surface formed by the rotation of an ellipse about its minor axis, defined by a semi-major axis and a flattening parameter and fairly geocentric. NB : It is a mathematical model of the geoid, i.e. the Earth without its relief. Many geodetic ellipsoids exist. Cf. ISO 19111:2007:2007-07, part 10.2.2, table 36 and annex B.3.2.3.
label: Ellipsoïde @fr

Ellipsoidal coordinate system
type: Class
subclass of: Coordinate system
disjoint with: Geodetic coordinate reference system
comment: Coordinate system which gives the position is specified by geodetic latitude, geodetic longitude and (in the three-dimensional case) ellipsoidal height. Cf. ISO 19111:2007:2007-07, tables 15 and 20.
comment: Système de coordonnées dans lequel la position est spécifiée par la latitude géodésique, la longitude géodésique et (dans le cas tridimensionnel) la hauteur ellipsoïdale. Cf. ISO 19111:2007:2007-07, tableaux 15 et 20. @fr
label: Système de coordonnées ellipsoïdal @fr

Extent
type: Class
comment: Geographic area or time interval in which the referring object is valid. Cf. ISO 19115-1:2014:2014-04, part 6.6.1 and table B.15 line 335.
comment: Zone géographique ou intervalle de temps dans lequel la référence est valide. Cf. ISO 19115-1:2014:2014-04, partie 6.6.1 et tableau B.15 ligne 335. @fr
label: Étendue @fr

Geodetic coordinate reference system
type: Class
subclass of: Single coordinate reference system
subclass of: Restriction
  on property: uses datum
  all values from: Geodetic datum
comment: Coordinate reference system associated with a geodetic datum. Cf. ISO 19111:2007:2007-07, part 8.2.2.a, table 10 and annex B.1.2.1.a.
comment: Système de coordonnées de référence associé à un référentiel géodésique. Cf. ISO 19111:2007:2007-07, partie 8.2.2.a, tableau 10 et annexe B.1.2.1.a. @fr
label: Système de coordonnées de référence geodésique @fr

Geodetic datum
type: Class
subclass of: Datum
subclass of: Class
  intersection of: Restriction
    on property: uses ellipsoid
    qualified cardinality: 1
    on class: Ellipsoid
  intersection of: Restriction
    on property: uses prime meridian
    qualified cardinality: 1
    on class: Prime meridian
comment: Datum describing the relation of a two- or three-dimensional coordinate system to the Earth. Cf. ISO 19111:2007:2007-07, part 10.2, table 34 and annex B.3.2.
comment: Référentiel décrivant la relation entre un système de coordonnées à deux ou trois dimensions et la Terre. Cf. ISO 19111:2007:2007-07, partie 10.2, tableau 34 et annexe B.3.2. @fr
label: Référentiel géodésique @fr

Geographic bounding box
type: Class
subclass of: Class
  intersection of: Restriction
    on property: east bound longitude
    qualified cardinality: 1
    on data range: double
  intersection of: Restriction
    on property: north bound longitude
    qualified cardinality: 1
    on data range: double
  intersection of: Restriction
    on property: south bound latitude
    qualified cardinality: 1
    on data range: double
  intersection of: Restriction
    on property: west bound longitude
    qualified cardinality: 1
    on data range: double
comment: Box bounding an area of interest. Cf. ISO 19115-1:2014:2014-04, part 6.6.1 and table B.15.1 line 344.
comment: Cadre délimitant une zone d'intérêt. Cf. ISO 19115-1:2014:2014-04, partie 6.6.1 et tableau B.15.1 ligne 344. @fr
label: Cadre englobant géographique @fr

Operation method
type: Class
comment: Méthode utilisée pour faire une opération sur des coordonnées. Cf. ISO 19111:2007:2007-07, tableau 48 et annexe B.4.5. @fr
comment: The method (algorithm or procedure) used to perform the coordinate operation. Cf. ISO 19111:2007:2007-07, table 48 and annex B.4.5.
label: Méthode @fr

Operation parameter
type: Class
comment: Parameter used by a method to perform some coordinate operation. Cf. ISO 19111:2007:2007-07, table 52 and annex B.4.5.
comment: Paramètre utilisé par une méthode pour faire une opération sur des coordonnées. Cf. ISO 19111:2007:2007-07, tableau 52 et annexe B.4.5. @fr
label: Paramètre @fr

Operation parameter value
type: Class
comment: Valeur d'un paramètre utilisé par une méthode pour faire une opération sur des coordonnées. Cf. ISO 19111:2007:2007-07, tableau 55. @fr
comment: Value of a parameter used by a method to perform some coordinate operation. Cf. ISO 19111:2007:2007-07, table 55.
label: Valeur de paramètre @fr

Prime meridian
type: Class
comment: Meridian from which the longitudes of other meridians are quantified. Cf. ISO 19111:2007:2007-07, part 10.2.1, table 35 and annex B.3.2.2.
comment: Méridien à partir duquel les longitudes d'autres méridiens sont mesurées. Cf. ISO 19111:2007:2007-07, partie 10.2.1, tableau 35 et annexe B.3.2.2. @fr
label: Méridien origine @fr

Projected coordinate reference system
type: Class
subclass of: Single coordinate reference system
subclass of: Restriction
  on property: base coordinate reference system
  all values from: Geodetic coordinate reference system
comment: Coordinate reference system derived from a two-dimensional geodetic coordinate reference system by applying a map projection. Cf. ISO 19111:2007:2007-07, part 8.2.3.b, table 11 and annex B.1.2.3.
comment: Système de coordonnées de référence dérivé par projection cartographique d'un système de coordonnées de référence bidimentionnel. Cf. ISO 19111:2007:2007-07, partie 8.2.3.b, tableau 11 et annexe B.1.2.3. @fr
label: Système de coordonnées de référence projeté @fr

Single coordinate reference system
type: Class
subclass of: Coordinate reference system (CRS)
subclass of: Class
  intersection of: Restriction
    on property: uses coordinate system
    qualified cardinality: 1
    on class: Coordinate system
  intersection of: Restriction
    on property: uses datum
    qualified cardinality: 1
    on class: Datum
comment: Coordinate reference system consisting of one coordinate system and one datum. Cf. ISO 19111:2007:2007-07, table 5.
comment: Système de coordonnées de référence composé d'un système de coordonnées et d'un référentiel. Cf. ISO 19111:2007:2007-07 tableau 5. @fr
label: Système de coordonnées de référence simple @fr

List of single coordinate reference systems
type: Class
subclass of: Class
  intersection of: List
  intersection of: Restriction
    on property: first
    all values from: Single coordinate reference system
  intersection of: Restriction
    on property: rest
    all values from: List of single coordinate reference systems
comment: Liste ordonnée de systèmes de coordonnées de référence simples. @fr
comment: Ordered list of single coordinate reference systems.
label: Liste de systèmes de coordonnées de référence simples @fr

Single coordinate operation
type: Class
subclass of: Coordinate operation
comment: A non concatenated coordinate operation. Cf. ISO 19111:2007:2007-07, table 43.
comment: Opération non concaténée sur des coordonnées. Cf. ISO 19111:2007:2007-07, tableau 43. @fr
label: Opération simple sur les coordonnées @fr

Transformation
type: Class
subclass of: Single coordinate operation
comment: Coordinate operation in which the two coordinate reference systems are based on different datums. Cf. ISO 19111:2007:2007-07, table 44.
comment: Opération sur les coordonnées dans laquelle les deux systèmes de coordonnées de référence sont basés sur des référentiels distincts. Cf. ISO 19111:2007:2007-07, tableau 44. @fr

Vertical coordinate reference system
type: Class
subclass of: Single coordinate reference system
subclass of: Class
  intersection of: Restriction
    on property: uses coordinate system
    all values from: Vertical coordinate system
  intersection of: Restriction
    on property: uses datum
    all values from: Vertical datum
disjoint with: Vertical coordinate system
comment: One-dimensional coordinate reference system associated with a vertical datum and used for recording heights or depths.Ellipsoidal heights are not captured in a vertical coordinate reference system but as part of a 3D coordinates tuple defined in a geodetic 3D coordinate reference system. Cf. ISO 19111:2007:2007-07, parts 8.2.2.b, table 14 and annex B.1.2.1.b.
comment: Système de coordonnées de référence à une dimension, associé à un référentiel vertical, et utilisé pour enregistrer des hauteurs ou des profondeurs. Les hauteurs ellipsoïdales ne sont pas enregistrées à l'aide d'un système de coordonnées de référence vertical, mais au sein d'un tuple de coordonnées 3D défini dans un système de coordonnées de référence géodésique 3D. Cf. ISO 19111:2007:2007-07, parties 8.2.2.b, tableau 14 et annexe B.1.2.1.b. @fr
label: Système de coordonnées de référence vertical @fr

Vertical coordinate system
type: Class
subclass of: Coordinate system
comment: One-dimensional coordinate system used for gravity related height or depth measurements. Cf. ISO 19111:2007:2007-07, tables 15 and 25.
comment: Système de coordonnées à une dimension utilisé pour les mesures de hauteur ou de profondeur relatives à la gravité. Cf. ISO 19111:2007:2007-07, tableaux 15 et 25. @fr
label: Système de coordonnées vertical @fr

Vertical datum
type: Class
subclass of: Datum
comment: Datum describing the relation of gravity-related heights or depths to the Earth. Cf. ISO 19111:2007:2007-07, table 41 and annex B.3.3.
comment: Référentiel décrivant la relation entre les hauteurs ou les profondeurs relatives à la gravité et la Terre. Cf. ISO 19111:2007:2007-07, tableau 41 et annexe B.3.3. @fr
label: Référentiel vertical @fr

Nathalie Abadie
type: Person
has membership: Membership
  member during: Interval
    has beginning: Instant
      in XSD date time stamp: 2005-09-09
  organization: recherche.ign.fr
  organization: www.ign.fr
  role: Survey engineer and Scientist
    type: Role
    label: Chargée de recherche @fr
family name: Abadie
first name: Nathalie
work info homepage: http://recherche.ign.fr/labos/cogit/cv.php