Cultural-ON (Cultural ONtology): Ontologia dei Luoghi della Cultura e degli Eventi Culturali
type: Ontology
version IRI: http://dati.beniculturali.it/cis/3.2
imports: AccessCondition
imports: CLV
imports: CPEV
imports: POI
imports: POT
imports: RO
imports: SM
imports: TI
imports: l0
accrual periodicity: IRREG
creator: Ministero per i Beni e le Attività Culturali
creator: stlab
description: L'ontologia ha lo scopo di modellare i dati che caratterizzano gli istituti e i luoghi della cultura, come ad esempio i dati sugli enti o sulle persone che hanno un determinato ruolo sugli istituti e luoghi della cultura, le sedi fisiche dei luoghi, i contatti, eventuali materiali multimediali che descrivono un istituto e luogo della cultura e ogni altra informazione utile al pubblico per poter accedere all'istituto e luogo della cultura. Inoltre, l'ontologia rappresenta gli eventi che possono aver luogo in un istituto e luogo della cultura. La figura seguente illustra alcuni elementi principali dell'ontologia. La figura non è esaustiva ma è inserita per aiutare a comprendere alcune relazioni tra concetti dell'ontologia. Per ogni classe dell'ontologia saranno forniti esempi di utilizzo in turtle; solo per alcune classi saranno altresì riportate figure specifiche che illustrano le relazioni e i concetti che ruotano attorno a tali classi. il file alignment_xml.owl inoltre rapprensenta tutti gli allineamenti dell'ontologia con altre esistenti nel Web dei dati come per esempio FOAF, Dubin Core, PRO, schema.org, etc. Per il MIBAC hanno contribuito attivamente allo sviluppo dell'ontologia Chiara Veninata e Annarita Orsini. Per l'Istituto di Scienze e Tecnologie della Cognizione (CNR) hanno contribuito i seguenti ricercatori: Giorgia Lodi, Luigi Asprino, Silvio Peroni, Andrea Nuzzolese, Valentina Presutti e Aldo Gangemi.
description: The ontology aims at modelling the data on cultural institutes or sites such as data regarding the agents that play a specific role on cultural institutes or sites, the sites themselves, the contact points, all multimedia files which describe the cultural institute or site and any other information useful to the public in order to access the institute or site. Moreover, the ontology represents events that can take place in specific cultural institutes or sites. The following figure illustrates some of the core elements of the ontology. The figure is not exaustive; however, it is included in order to help readers to understand some relationships among important concepts represented in the ontology. For each class, examples of their usage in turtle are provided; moreover, for only some of the classes, specific figures are reported that show the relationships and concepts connected to them. The alignment_xml.owl complements the ontology with the alignments with external ontologies such as FOAF, PRO, schma.org, dublin core, etc. The people involved in the creation or the ontology are: from the Ministry Annarita Orsini and Chiara Veninata; from the National Council of Research Giorgia Lodi, Luigi Asprino, Silvio Peroni, Andrea Nuzzolese, Valentina Presutti and Aldo Gangemi. @en
issued: 2015-01-12
language: ENG
language: ITA
modified: 2019-05-27
publisher: Ministero per i Beni e le Attività Culturali
rights holder: Ministero per i Beni e le Attività Culturali
title: Cultural-ON (Cultural ONtology): Cultural Institute/Site and Cultural Event Ontology @en
comment: During the definition of Cultural-ON, an in depth discussion between the working group responsible for cultural linked open data, formed by the Ministry of Cultural Heritage and Activities (Service I) and the Institute of Cognitive Sciences and Technologies of the Council of Research (CNR) and the working group of the "Istituto beni artistici culturali e naturali" of Emilia Romagna Region, in order to contribute to the integration of the two ontologies, thus guaranteeing semantic interoperability. @en
comment: Nel corso dell'elaborazione di Cultural-ON è stato avviato un approfondito confronto tra il gruppo di lavoro responsabile del progetto di valorizzazione del patrimonio informativo pubblico attraverso i linked open data, costituito dal Ministero dei beni e delle attività culturali (Servizio I della Direzione generale Organizzazione) e dall’Istituto di Scienze e Tecnologie della Cognizione del Consiglio Nazionale delle Ricerche (CNR) con il gruppo costituito nell'ambito del progetto di pubblicazione di linked open data del dominio cultura, intrapreso dall'Istituto beni artistici culturali e naturali della Regione Emilia-Romagna che si inserisce nel più ampio progetto Open Data Emilia-Romagna, al fine di contribuire ad un’ampia integrazione tra le due ontologie, nella prospettiva di una sempre maggiore interoperabilità.
version info: Version 3.2 - 27 May 2019 - Introduction of the inverse property "is involved in cultural event" used to directly connect a cultural entity with the cultural events where it is involved in. Versione 3.2 includes all those changes necessary to refactor the original ontology in order to be fully integrated in the OntoPiA network. @en
version info: Versione 3.2 - 27 Maggio 2019 - Introduzione della proprietà inversa "is involved in cultural event" per collegare un'entità culturale all'evento in cui essa è coinvolta. Risponde al requisito emerso dall'issue https://github.com/italia/daf-ontologie-vocabolari-controllati/issues/62. La versione 3.2 include tutta la rifattorizzazione dell'ontologia per la piena integrazione nella rete OntoPiA
contact point: onto-mibac
keyword: Cultural events @en
keyword: Cultural sites @en
keyword: Eventi Culturali
keyword: Luoghi della Cultura
theme: EDUC
acronym: CIS
has contributor: Agenzia per l'Italia Digitale
has formality level: Formal
has key class: Evento Culturale
has key class: Istituto e Luogo Della Cultura
has ontology language: OWL
has semantic asset distribution: Distribuzione JSON-LD ontologia Cultural-ON
has semantic asset distribution: Distribuzione RDF/Turtle ontologia Cultural-ON
has semantic asset distribution: Distribuzione RDF/XML ontologia Cultural-ON
has task: AnnotationTask
has task: QueryFormulationTask
has task: SearchTask
prefix: cis
semantic asset in use: DAF
semantic asset in use: LODMIBAC
semantic asset in use: OntoPiA
status: catalogued
target: Imprese
target: Pubbliche Amministrazioni
type: DomainOntology
type: NamedIndividual
type: SemanticAsset

catalogo
type: ObjectProperty
inverse of: è catalogo di
domain: Istituto e Luogo Della Cultura
range: Catalogo
comment: Property used to associate the Cultural Institute or SIte with a catalogue of cultural collections included in the institute or site. The relatioships can be used to indicate that a Cultural Institute or Site has an its own catalogue or situations where a Cultural Institute or Site contributes to a union catalogue (this latter case is represented by libraries that can contribute to or participate in a union catalogue). @en
comment: Proprietà utilizzata per associare l'istituto e luogo della cultura a un catalogo che descrive le opere in esso contenute. Tale relazione può essere utilizzata per indicare che un istituto e luogo della cultura ha un catalogo ma anche una situazione per cui un istituto e luogo della cultura partecipa a un catalogo (in quest'ultimo caso un esempio è rappresentato dalle biblioteche che possono partecipare a un catalogo collettivo).
label: catalogue @en
version info: stabile
version info: stable

descrive entità culturale
type: ObjectProperty
inverse of: è descritto da
domain: Catalogo
range: Collezione Entità Culturali
comment: Property used to associate the catalogue with the cultural heritage objects of a cultural institute or site that the catalogue describes. @en
comment: Proprietà che consente di associare il catalogo alle opere di un istituto e luogo della cultura che esso descrive.
label: describes cultural entity @en
version info: stabile
version info: stable

ha attribute
type: ObjectProperty
domain: Descrizione della sede
range: Attributo
comment: Property used to associate the description of the site of the cultural institute or site an attribute (e.g., total space, shelving, etc.) @en
comment: Proprietà che permette di associare una descrizione del sito dell'istituto e luogo della cultura a un attributo, inteso come caratteristica del sito (metratura, scaffalatura, etc)
label: has attribute @en
version info: stabile
version info: stable @en

ha nome luogo cultura nel tempo
type: ObjectProperty
domain: Class
  union of: Istituto e Luogo Della Cultura
  union of: Sede
range: Nome Luogo Cultura Nel Tempo
comment: Property which associate a cultural institute or site or a site with the situation name in time @en
comment: Proprietà che associa un istituto o luogo della cultura o un sito alla situazione "denominazione nel tempo", ovvero una determinata denominazione valida in un determinato arco temporale
label: has name in time @en
version info: stabile
version info: stable

ha tipologia luogo cultura
type: ObjectProperty
domain: Istituto e Luogo Della Cultura
range: Tipo di Istituto e Luogo della Cultura
comment: La proprietà è utilizzata per collegare un istituto e luogo della cultura alla sua tipologia.
comment: The property is used to link a cultural institure or site to its type. @en
label: has cultural institute or site type @en
version info: unstable @en
version info: versione non definitiva

ha collezione
type: ObjectProperty
domain: Istituto e Luogo Della Cultura
range: Collezione Entità Culturali
comment: Property used to associate the Cultural Institute or Site with the set of cultural objects it contains. @en
comment: Proprietà che permette di associare l'istituto e luogo della cultura all'insieme delle opere in esso contenute.
label: has collection @en
version info: stabile
version info: stable

ha ambito disciplinare
type: ObjectProperty
domain: Istituto e Luogo Della Cultura
range: Categoria prevalente
comment: Property used to associate the Cultural Institute or Site with its own field of knowledge @en
comment: Proprietà che permette di specificare la categoria a cui l'istituto e luogo della cultura è tipicamente associato (es. archeologia, etnografia e antropologia, arte, ...).
label: has discipline @en
version info: stabile
version info: stable

ha membro
type: ObjectProperty
sub property of: hasMember
inverse of: è membro di
domain: Collezione Entità Culturali
range: Class
  union of: Collezione Entità Culturali
  union of: Oggetto Culturale
comment: Property that permits to specify the cultural heritage objects that form a specific collection or the entire cultural heritage included in a cultural institute or site @en
comment: Proprietà che consente di specificare le opere che formano una determinata collezione o l'intero patrimonio di un istituto e luogo della cultura
label: has member @en
version info: stabile
version info: stable

ha contenitore fisico
type: ObjectProperty
inverse of: è contenitore fisico di
type: TransitiveProperty
domain: Istituto e Luogo Della Cultura
range: Sede
comment: Property which links a cultural institute or site to its own physical site(s). @en
comment: Proprietà che collega un istituto e luogo della cultura al proprio o ai propri siti fisici.
label: ha sede
label: has site @en
version info: stabile
version info: stable

ha descrizione della sede
type: ObjectProperty
domain: Sede
range: Descrizione della sede
comment: Propery that permits to associate a site of a cultural institute or site with its description. @en
comment: Proprietà che permette di associare una descrizione alla sede dell'istituto e luogo della cultura.
label: has site description @en
version info: stabile
version info: stable

ospita evento culturale
type: ObjectProperty
sub property of: hosts
inverse of: è ospitato da sede luogo
domain: Sede
range: Evento Culturale
comment: Property used to associate a site to an event @en
comment: Proprietà usata per associare una sede del luogo della cultura a un evento.
label: hosts cultural event @en
version info: stabile
version info: stable

coinvolge entità culturale
type: ObjectProperty
inverse of: è coinvolta in evento culturale
domain: Evento Culturale
range: Entità culturale
comment: Involvement property that associates a cultural event with a general cultural entity @en
comment: Proprietà di coinvolgimento che associa un evento culturale a una generica entità culturale.
label: involves cultural entity @en
version info: stabile
version info: stable

tratta di
type: ObjectProperty
inverse of: è soggetto di
domain: Lavoro Creativo
range: Class
  union of: Entità culturale
  union of: Evento Culturale
  union of: Sede
comment: Property used to associate a creative work with a cultural entity. The same property is used in a similar way to associate the creative work with an event or site @en
comment: Proprietà che consente di associare un lavoro creativo a un'entità culturale. La stessa proprietà può essere utilizzata in maniera analoga per associare un lavoro creativo a un evento o a un sito.
label: is about @en
version info: stabile
version info: stable

è catalogo di
type: ObjectProperty
domain: Catalogo
range: Istituto e Luogo Della Cultura
comment: Inverse property of "has catalogue". @en
comment: Proprietà inversa di "ha catalogo".
label: is catalogue of @en
version info: unstable @en
version info: versione non definitiva

è descritto da
type: ObjectProperty
domain: Collezione Entità Culturali
range: Catalogo
comment: Inverse property of "describes" @en
comment: Proprietà inversa di "descrive"
label: is described by @en

è ospitato da sede luogo
type: ObjectProperty
sub property of: takesPlaceIn
domain: Evento Culturale
range: Sede
comment: Questa proprietà è l'inversa di "ospita" e collega un evento a una sede di un istituto e luogo della cultura
comment: This property is the inverse of "hosts" and links the Event to the Site of the Cultural Institute or Site @en
label: is hosted by site @en
version info: stabile
version info: stable @en

è nella sede
type: ObjectProperty
domain: Oggetto Culturale
range: Sede
property chain axiom: ha membro
comment: Property that permits to associate cultural heritage objects with the site(s) which conserve(s) them @en
comment: Proprietà che consente di associare opere culturali al luogo fisico in cui sono conservate.
label: is in site @en
version info: stabile
version info: stable

è coinvolta in evento culturale
type: ObjectProperty
domain: Entità culturale
range: Evento Culturale
comment: Inverse property of "involves cultural entity". It is used to directly connect a cultural entity to the cultural events that involve it. @en
comment: Proprietà inversa di "coinvolge entità culturale" che collega direttamente l'entità culturale con gli eventi culturali che la coinvolgono
label: is involved in cultural event @en
version info: stabile
version info: stable @en

è coinvolto in progetto
type: ObjectProperty
domain: Istituto e Luogo Della Cultura
range: Progetto Culturale
comment: Property used to represent an involvement relationship between a cultural institute or site and a project @en
comment: Proprietà utilizzata per rappresentare una relazione di coinvolgimento tra l'istituto e luogo della cultura e un progetto.
label: is involved in a project @en
version info: stabile
version info: stable

è membro di
type: ObjectProperty
sub property of: isMemberOf
domain: Class
  union of: Collezione Entità Culturali
  union of: Oggetto Culturale
range: Collezione Entità Culturali
comment: Inverse property of hasMember. @en
comment: Proprietà inversa di hasMember.
label: is member of @en
version info: stabile
version info: stable @en

è parte di
type: ObjectProperty
domain: Istituto e Luogo Della Cultura
range: Istituto e Luogo Della Cultura
comment: Questa proprietà è utilizzata per connettere, con una relazione "essere parte di", un istituto e luogo della cultura a se stesso. In particolare, tale proprietà può essere efficacemente usata per rappresentare sezioni dell'Archivio di Stato (sezione dell'Archivio di Spoleto che è parte dell'Archivio di Stato)
comment: This object property is meant to link a cultural institute or site with itself. This can be used to represent all those cases in which a institute or site can be part of another general institute or site. This property can be effectively used in the cases of Sections of the Central Archive. @en
label: is part of @en
version info: non stabile
version info: unstable @en

è fornito da
type: ObjectProperty
inverse of: fornisce servizi
domain: Servizio Luogo Cultura
range: Istituto e Luogo Della Cultura
comment: Inverse property of "provides service" @en
comment: Proprietà inversa di "fornisce servizio"
label: is provided by @en

è contenitore fisico di
type: ObjectProperty
domain: Sede
range: Istituto e Luogo Della Cultura
comment: Inverse property of "has Site" @en
comment: Proprietà inversa di "ha sede".
label: is site of @en
label: è sede di
version info: stabile
version info: stable @en

è soggetto di
type: ObjectProperty
domain: Class
  union of: Entità culturale
  union of: Evento Culturale
  union of: Sede
range: Lavoro Creativo
comment: Inverse propery of "is about". @en
comment: Proprietà inversa di "tratta di".
label: is subject of @en
version info: stabile
version info: stable @en

è valido durante
type: ObjectProperty
domain: Nome Luogo Cultura Nel Tempo
range: TimeInterval
comment: Property used to associate the situation name in time with a temporal validity interval @en
comment: Proprietà usata per associare la situzione "nome nel tempo", ovvero una denominazione valida in un certo arco temporale, a un intervallo temporale di validità
label: is valid during @en
version info: stabile
version info: stable

rende disponibile attrezzatura
type: ObjectProperty
domain: Istituto e Luogo Della Cultura
range: Attrezzatura
comment: Property that permits to associate the Cultural Institute or Site with its own equipment @en
comment: Proprietà che consente di associare l'istituto e luogo della cultura alle attrezzature da esso possedute.
label: makes available equipment @en
version info: stabile
version info: stable

fornisce servizi
type: ObjectProperty
domain: Istituto e Luogo Della Cultura
range: Servizio Luogo Cultura
comment: Property used to represent a supply service relationship between a cultural institute or site and a service. @en
comment: Proprietà utilizzata per rappresentare una relazione di fornitura di servizi da parte di un istituto e luogo della cultura.
label: provides Service @en
version info: stabile
version info: stable

Identificativo ISIL
type: DatatypeProperty
sub property of: identifier
type: FunctionalProperty
domain: Istituto e Luogo Della Cultura
range: Literal
comment: Questa proprietà è utilizzata per rappresentare l'identificativo univoco dell'Istituto e luogo della cultura, i.e., il codice ISIL (International Standard identifier for Libraries and Related Organization). Sotto proprietà di identificativo.
comment: This property is used to define the unique identifier of the cultural institute or site (i.e., the ISIL - International Standard Identifier for Libriaries and Related Organization - code). Subproperty of identifier. @en
label: ISIL identifier @en
version info: Stabile
version info: Stable @en

nome alternativo luogo cultura
type: DatatypeProperty
sub property of: name
domain: Class
  union of: Nome Luogo Cultura Nel Tempo
  union of: Istituto e Luogo Della Cultura
range: Literal
comment: Property used to associate the situation name in time with the alternative name of the cultural institute or site @en
comment: Proprietà utilizzata per associare la situazione name in time a una denominazione alternativa dell'istituto e luogo della cultura.
label: alternative cultural site name @en
version info: stabile
version info: stable

Institutional Name of Cultural Site
type: DatatypeProperty
sub property of: name
domain: Class
  union of: Nome Luogo Cultura Nel Tempo
  union of: Istituto e Luogo Della Cultura
range: Literal
comment: Questa proprietà identifica direttamente il nome istituzionale dell'Istituto e luogo della cultura
comment: This data property identifies the institutional name of the Cultural Institute or Site. @en
label: Nome Istituzionale Luogo Cultura
version info: Stabile
version info: Stable @en

Area Archeologica
type: Class
equivalent class: Restriction
  on property: ha tipologia luogo cultura
  has value: Area Archeologica
subclass of: Istituto e Luogo Della Cultura
type: NamedIndividual
type: Tipo di Istituto e Luogo della Cultura
description: An example of usage of the class cis:ArchaeologicalArea is the following: cissite:Museo_delle_navi_romane_di_Nemi a cis:CulturalInstituteOrSite, cis:ArchaeologicalArea ; rdfs:label "Museo delle navi romane di Nemi" ; cis:institutionalName "Museo delle navi romane di Nemi" ; cis:ISILIdentifier "IT-EX0001" . @en
description: Un esempio di uso della classe cis:ArchaeologicalArea è il seguente: cissite:Museo_delle_navi_romane_di_Nemi a cis:CulturalInstituteOrSite, cis:ArchaeologicalArea ; rdfs:label "Museo delle navi romane di Nemi" ; cis:institutionalName "Museo delle navi romane di Nemi" ; cis:ISILIdentifier "IT-EX0001" .
version info: stable @en
comment: Rappresenta uno specifico tipo di Istituto e Luogo della Cultura ovvero Area archeologica.
comment: It represents a specific type of Cultural Institute or SIte; that is, ArchaeologicalArea @en
version info: stabile
label: Archaeological Area @en

Parco Archeologico
type: Class
equivalent class: Restriction
  on property: ha tipologia luogo cultura
  has value: Parco Archeologico
subclass of: Istituto e Luogo Della Cultura
type: NamedIndividual
type: Tipo di Istituto e Luogo della Cultura
comment: It represents a specific type of Cultural Institute or SIte; that is, Archaeological Park @en
description: An example of usage of the class cis:ArchaeologicalPark is the following: cissite:Parco_archeologico_di_Liternum a cis:CulturalInstituteOrSite, cis:ArchaeologicalPark ; rdfs:label "Parco archeologico di Liternum" ; cis:institutionalName "Parco archeologico di Liternum" ; cis:ISILIdentifier "IT-EX0002" . @en
description: Un esempio di utilizzo della classe cis:ArchaeologicalPark è il seguente: cissite:Parco_archeologico_di_Liternum a cis:CulturalInstituteOrSite, cis:ArchaeologicalPark ; rdfs:label "Parco archeologico di Liternum" ; cis:institutionalName "Parco archeologico di Liternum" ; cis:ISILIdentifier "IT-EX0002" .
version info: stabile
label: Archaeological Park @en
comment: Rappresenta uno specifico tipo di Istituto e Luogo della Cultura ovvero Parco Archeologico.
version info: stable @en

Attributo
type: Class
subclass of: Characteristic
subclass of: Restriction
  on property: description
  all values from: Literal
subclass of: Restriction
  on property: name
  all values from: Literal
description: An example of usage of the class cis:Attribute is the following: attribute:Shelving a cis:Attribute ; rdfs:label "Shelving"@en , "Scaffalature"@it ; l0:name "Shelving"@en , "Scaffalature"@it ; l0:description "The linear dimension of a shelf unit (e.g. 3 meters)"@en , "La dimensione di uno scaffale in metri lineari (es. 3 metri)"@it . @en
description: Un esempio di utilizzo della classe cis:Attribute è il seguente: attribute:Shelving a cis:Attribute ; rdfs:label "Shelving"@en , "Scaffalature"@it ; l0:name "Shelving"@en , "Scaffalature"@it ; l0:description "The linear dimension of a shelf unit (e.g. 3 meters)"@en , "La dimensione di uno scaffale in metri lineari (es. 3 metri)"@it .
comment: It represents the attribute that a site description of a site of a cultural institute or site may have. For instance, length, the shelving in a library, etc. @en
comment: Rappresenta gli attributi di una certa descrizione della sede fisica di un istituto e luogo della cultura. Per esempio, metratura, scaffalatura, ecc.
label: Attribute @en
version info: stabile
version info: stable @en

Oggetto audio
type: Class
subclass of: Lavoro Creativo
subclass of: Restriction
  on property: URL
  all values from: anyURI
description: An example of usage of the class cis:AudioObject is the following: audio:Audio_Tour_Parco_archeologico_di_Liternum a cis:AudioObject , cis:CreativeWork ; rdfs:label "Audio Tour of the Parco archeologico di Liternum"@en ; rdfs:label "Audio guida del Parco archeologico di Liternum"@it ; smapit:URL http://www.example.com/Audio/Audio_Tour_Parco_archeologico_di_Liternum.mp3^^xsd:anyURI ; cis:isAbout cissite:Parco_archeologico_di_Liternum . @en
description: Un esempio di utilizzo della classe cis:AudioObject è il seguente: audio:Audio_Tour_Parco_archeologico_di_Liternum a cis:AudioObject , cis:CreativeWork ; rdfs:label "Audio Tour of the Parco archeologico di Liternum"@en ; rdfs:label "Audio guida del Parco archeologico di Liternum"@it ; smapit:URL http://www.example.com/Audio/Audio_Tour_Parco_archeologico_di_Liternum.mp3^^xsd:anyURI ; cis:isAbout cissite:Parco_archeologico_di_Liternum .
comment: Concept used to represent multimedia objects of type audio. @en
comment: Concetto utilizzato per rappresentare materiali multimediali di tipo audio.
label: Audio Object @en
version info: stabile
version info: stable @en

Nome Luogo Cultura Nel Tempo
type: Class
subclass of: NameInTime
subclass of: EventOrSituation
subclass of: Restriction
  on property: è valido durante
  some values from: TimeInterval
subclass of: Restriction
  on property: Institutional Name of Cultural Site
  some values from: Literal
subclass of: Restriction
  on property: nome alternativo luogo cultura
  all values from: Literal
description: An example of usage of the class cis:CISNameInTime is the following: cissite:Museo_di_Capodimonte a cis:CulturalInstituteOrSite, cis:Museum ; l0:name "Museo di Capodimonte" ; cis:institutionalCISName "Museo di Capodimonte" ; cis:ISILIdentifier "IT-EX0008" ; cis:hasCISNameInTime nit:Museo_di_Capodimonte ; cis:hasSite site:Museo_di_Capodimonte . nit:Museo_di_Capodimonte a cis:CISNameInTime ; rdfs:label "Denominazione nel tempo 'Museo di Capodimonte'"@it ; cis:institutionalCISName "Museo di Capodimonte"@it ; cis:altCISName "Museo Nazionale di Capodimonte"@it ; cis:isValidDuring ti:Intervallo_di_tempo_per_denominazione_nel_tempo_Museo_di_Capodimonte . ti:Intervallo_di_tempo_per_denominazione_nel_tempo_Museo_di_Capodimonte a ti:TimeInterval ; ti:startTime "1957-01-01"^^xsd:date . @en
description: Un esempio di utilizzo della classe cis:CISNameInTime è il seguente: cissite:Museo_di_Capodimonte a cis:CulturalInstituteOrSite, cis:Museum ; l0:name "Museo di Capodimonte" ; cis:institutionalCISName "Museo di Capodimonte" ; cis:ISILIdentifier "IT-EX0008" ; cis:hasCISNameInTime nit:Museo_di_Capodimonte ; cis:hasSite site:Museo_di_Capodimonte . nit:Museo_di_Capodimonte a cis:CISNameInTime ; rdfs:label "Denominazione nel tempo 'Museo di Capodimonte'"@it ; cis:institutionalCISName "Museo di Capodimonte"@it ; cis:altCISName "Museo Nazionale di Capodimonte"@it ; cis:isValidDuring ti:Intervallo_di_tempo_per_denominazione_nel_tempo_Museo_di_Capodimonte . ti:Intervallo_di_tempo_per_denominazione_nel_tempo_Museo_di_Capodimonte a ti:TimeInterval ; ti:startTime "1957-01-01"^^xsd:date .
comment: Permette di rappresentare una situazione relativa alla denominazione di un istituto e luogo della cultura che cambia nel tempo.
comment: Permits to represent a situation in which a name of the Cultural Institute or Site change in time. @en
label: Cultural Site Name in Time @en
version info: stabile
version info: stable @en

Servizio Luogo Cultura
type: Class
subclass of: Characteristic
subclass of: Restriction
  on property: è fornito da
  all values from: Istituto e Luogo Della Cultura
subclass of: Restriction
  on property: hasOnlineContactPoint
  all values from: OnlineContactPoint
subclass of: Restriction
  on property: name
  some values from: Literal
subclass of: Restriction
  on property: description
  all values from: Literal
description: A Cultural Institute or Site (CIS) might offer a variety of services (e.g., Wi-Fi Handicapped access, cafeteria, etc.). These services are represented as individuals of the class 'Service' and they are in relationship with a CIS by means of the object property providesService. The following is an example expressed by using the turtle syntax: service:Caffetteria a cis:CISService ; cis:name "Caffetteria" . service:Connessione_WI-FI a cis:CISService ; cis:name "Connessione WI-FI" . cissite:Biblioteca_nazionale_centrale a cis:Library , cis:CulturalInstituteOrSite ; cis:providesService service:Caffetteria, service:Connessione_WI-FI. @en
description: Un istituto della cultura può offrire una serie di servizi (e.g., Wi-Fi, accesso ai disabili, caffetteria, ecc.). Questi servizi sono rappresentati da individui della classe "Servizio" e sono in relazione con l'istituto della cultural attraverso la proprietà "fornisce servizio". Il seguente esempio mostra in turtle l'uso della classe servizio: service:Caffetteria a cis:CISService ; cis:name "Caffetteria" . service:Connessione_WI-FI a cis:CISService ; cis:name "Connessione WI-FI" . cissite:Biblioteca_nazionale_centrale a cis:Library , cis:CulturalInstituteOrSite ; cis:providesService service:Caffetteria, service:Connessione_WI-FI.
comment: It represents a service that is provided by the Cultural Institute or Site. For instance, a service can be: the presence of a restaurant internal to the Cultural Institute or Site, the uso of an educational room, the use of a free wifi connection @en
comment: Rappresenta un servizio offerto da un istituto e luogo della cultura. Per esempio, un servizio può essere: la presenza di un ristorante interno al luogo, l'uso una sala didattica, l'uso di una connessione wifi libera, ecc.
label: Cultural Site Service @en
version info: stabile
version info: stable @en

Tipo di Istituto e Luogo della Cultura
type: Class
subclass of: Characteristic
subclass of: Restriction
  on property: name
  some values from: Literal
subclass of: Restriction
  on property: description
  all values from: Literal
comment: Questa classe rappresenta il tipo di istituto e luogo della cultura.
comment: This class represents the type of cultural institute or site. @en
label: Cultural Institute or Site Type @en
version info: stabile
version info: stable @en

Catalogo
type: Class
subclass of: Object
subclass of: Restriction
  on property: descrive entità culturale
  all values from: Collezione Entità Culturali
subclass of: Restriction
  on property: è catalogo di
  all values from: Istituto e Luogo Della Cultura
subclass of: Restriction
  on property: hasWebSite
  all values from: WebSite
subclass of: Restriction
  on property: name
  some values from: Literal
subclass of: Restriction
  on property: description
  all values from: Literal
description: A catalogue is always associated with an individual of the class 'CulturalInstituteOrSite' (CIS) by means of the object property hasCatalogue (with domain CulturalInstituteOrSite and range Catalogue). The inverse property of hasCatalogue is isCatalogueOf and relates a catalogue to a CIS. An example in turtle is the following: catalogue:Catalogo_Generale_(autore) a cis:Catalogue ; rdfs:label "Catalogo Generale (autore)"@it ; l0:name "Catalogo Generale (autore)"@it ; cis:isCatalogueOf cissite:Biblioteca_nazionale_centrale ; l0:description "Catalogo Generale per autore - online"@it . cissite:Biblioteca_nazionale_centrale a cis:Library , cis:CulturalInstituteOrSite ; cis:catalogue catalogue:Catalogo_Generale_(autore) . @en
description: Un catalogo è sempre associato a un individuo della classe "Istitute e luogo della cultura" attraverso la proprietà ha catalogo (che ha dominio CulturaInstituteOrSite e codominio Catalogue). La proprietà inversa di ha catalogo è "è catalogo di" e collega il catalogo all'istituto e luogo della cultura. Un esempio in turtle è il seguente: catalogue:Catalogo_Generale_(autore) a cis:Catalogue ; rdfs:label "Catalogo Generale (autore)"@it ; l0:name "Catalogo Generale (autore)"@it ; cis:isCatalogueOf cissite:Biblioteca_nazionale_centrale ; l0:description "Catalogo Generale per autore - online"@it . cissite:Biblioteca_nazionale_centrale a cis:Library , cis:CulturalInstituteOrSite ; cis:catalogue catalogue:Catalogo_Generale_(autore) .
comment: Concept used to represent the catalogue which describes the set of cultural heritage objects included in a Cultural Institute or Site @en
comment: Concetto utilizzato per rappresentare il catalogo che descrive l'insieme delle opere contenute in un istituto e luogo della cultura.
label: Catalogue @en
version info: stabile
version info: stable @en

Cinema
type: Class
equivalent class: Restriction
  on property: ha tipologia luogo cultura
  has value: Cinema
subclass of: Istituto e Luogo Della Cultura
type: NamedIndividual
type: Tipo di Istituto e Luogo della Cultura
version info: unstable @en
description: An example of usage of the class cis:Cinema is the following: cissite:Cinema_Storico_Alberto_Sordi a cis:CulturalInstituteOrSite, cis:Cinema ; rdfs:label "Cinema storico Alberto Sordi" ; cis:institutionalName "Cinema storico Alberto Sordi" ; cis:ISILIdentifier "IT-EX0003" . @en
version info: non stabile
comment: This class represents a cultural institute or site of type Cinema @en
comment: Questa classe rappresenta un istituto e luogo della cultura di tipo Cinema
description: Un esempio di utilizzo della classe cis:Cinema è il seguente: cissite:Cinema_Storico_Alberto_Sordi a cis:CulturalInstituteOrSite, cis:Cinema ; rdfs:label "Cinema storico Alberto Sordi" ; cis:institutionalName "Cinema storico Alberto Sordi" ; cis:ISILIdentifier "IT-EX0003" .

Area amministrativa ecclesiastica
type: Class
subclass of: Feature
disjoint with: Sede
description: An example of usage of the class cis:ClericalAdministrativeArea èil the following: caa:Diocesi_di_San_Marco_Argentano_Scalea a cis:ClericalAdministrativeArea ; rdfs:label "Diocese of San Marco Argentano-Scalea"@en ; rdfs:label "Diocesi di San Marco Argentano-Scalea"@it ;; l0:name "Diocese of San Marco Argentano-Scalea"@en , Diocesi di San Marco Argentano-Scalea"@it ;; clvapit:hasIdentifier Diocesi_di_San_Marco_Argentano_Scalea_ID . id:Diocesi_di_San_Marco_Argentano_Scalea_ID a clvapit:Identifier ; l0:identifier "SMA-CS" . @en
description: Un esempio di utilizzo della classe cis:ClericalAdministrativeArea è il seguente caa:Diocesi_di_San_Marco_Argentano_Scalea a cis:ClericalAdministrativeArea ; rdfs:label "Diocese of San Marco Argentano-Scalea"@en ; rdfs:label "Diocesi di San Marco Argentano-Scalea"@it ;; l0:name "Diocese of San Marco Argentano-Scalea"@en , Diocesi di San Marco Argentano-Scalea"@it ;; clvapit:hasIdentifier Diocesi_di_San_Marco_Argentano_Scalea_ID . id:Diocesi_di_San_Marco_Argentano_Scalea_ID a clvapit:Identifier ; l0:identifier "SMA-CS" .
comment: Questa classe rappresenta un'area amministrativa territoriale ecclesiastica. Essa include le diocesi, parrocchie, ecc.
comment: This class represents the clerical administrative area. It can be used to represents Diocese, Parish, etc. @en
label: Clerical Administrative Area @en
version info: stabile
version info: stable @en

Collezione Entità Culturali
type: Class
subclass of: Entità culturale
subclass of: Collection
subclass of: Restriction
  on property: ha membro
  all values from: Class
    union of: Collezione Entità Culturali
    union of: Oggetto Culturale
subclass of: Restriction
  on property: è descritto da
  all values from: Catalogo
subclass of: Restriction
  on property: atTime
  all values from: TimeInterval
subclass of: Restriction
  on property: name
  some values from: Literal
subclass of: Restriction
  on property: description
  all values from: Literal
description: Individuals of this class represent cultural heritage included in a Cultural Institute or Site. A Cultural Institute or Site can be related to a collection by means of the object property hasCollection. Additionally, a collection can be composed of items that, in turn, can be individuals of the class 'Collection' or the class 'Cultural Heritage Object'. For example, this allows to assert that the Biblioteca Centrale di Roma has its own cultural heritage (e.g,, Patrimonio di Biblioteca Centrale di Roma). This cultural heritage is composed of different items, e.g., Archivio Capizucchi, Fondo Ceccarius, etc. This can be modelled by using turtle in the following way: cissite:Biblioteca_nazionale_centrale a cis:Library , cis:CulturalInstituteOrSite ; cis:hasCollection collezioni:Patrimonio_di_Biblioteca_nazionale_centrale_di_Roma . collezioni:Patrimonio_di_Biblioteca_nazionale_centrale_di_Roma a cis:CollectionCulEnt ; l0:name "Patrimonio di: Biblioteca nazionale centrale di Roma" ; cis:hasMemberColCultEnt collezioni:Archivio_Capizucchi, collezioni:Fondo_Ceccarius . collezioni:Archivio_Capizucchi a cis:CollectionCultEnt ; l0:name "Archivio Capizucchi" ; cis:isMemberOfColCultEnt collezioni:Patrimonio_di_Biblioteca_nazionale_centrale_di_Roma ; l0:description "materiale documentario relativo alla famiglia Capizucchi"@it . collezioni:Fondo_Ceccarius a cis:CollectionCultEnt ; l0:name "Fondo Ceccarius" ; cis:isMemberOfColCultEnt collezioni:Patrimonio_di_Biblioteca_nazionale_centrale_di_Roma ; l0:description "volumi, opuscoli, articoli e fotografie della biblioteca di G. Ceccarelli"@it . @en
description: Individui di questa classe rappresentano il patrimonio culturale incluso in un Istituto e luogo della cultural. Un Istituto e luogo della cultural è relazionato a una collezione attraverso la proprietà "ha collezione". Inoltre, una collezione può essere composta da elementi che a loro volta possono essere individui della classe "Collezione" o della classe "Oggetto culturale". L'esempio sotto riportato permette di asserire che la Biblioteca Centrale di Roma ha il proprio patrimonio (e..g, Patrimonio della Biblioteca Centrale di Roma). Questo patrimonio culturale è formato da diversi elementi, e.g., Archivio Cpizucchi, Fondo Ceccarius, ecc. Nello specifico, questo può essere modellato in turtle come segue: cissite:Biblioteca_nazionale_centrale a cis:Library , cis:CulturalInstituteOrSite ; cis:hasCollection collezioni:Patrimonio_di_Biblioteca_nazionale_centrale_di_Roma . collezioni:Patrimonio_di_Biblioteca_nazionale_centrale_di_Roma a cis:CollectionCulEnt ; l0:name "Patrimonio di: Biblioteca nazionale centrale di Roma" ; cis:hasMemberColCultEnt collezioni:Archivio_Capizucchi, collezioni:Fondo_Ceccarius . collezioni:Archivio_Capizucchi a cis:CollectionCultEnt ; l0:name "Archivio Capizucchi" ; cis:isMemberOfColCultEnt collezioni:Patrimonio_di_Biblioteca_nazionale_centrale_di_Roma ; l0:description "materiale documentario relativo alla famiglia Capizucchi"@it . collezioni:Fondo_Ceccarius a cis:CollectionCultEnt ; l0:name "Fondo Ceccarius" ; cis:isMemberOfColCultEnt collezioni:Patrimonio_di_Biblioteca_nazionale_centrale_di_Roma ; l0:description "volumi, opuscoli, articoli e fotografie della biblioteca di G. Ceccarelli"@it .
comment: It represents the cultural heritage included in a Cultural Institute or Site or single collections that compone the cultural heritage @en
comment: Rappresenta il patrimonio complessivo dell'Istituto e Luogo della Cultura o le singole collezioni di cui esso si compone.
label: Collection of Cultural Entities @en
version info: stabile
version info: stable @en

Lavoro Creativo
type: Class
subclass of: Object
subclass of: Restriction
  on property: tratta di
  all values from: Class
    union of: Entità culturale
    union of: Evento Culturale
    union of: Sede
comment: Concept used to represent all types of creative works such multimedia objects (audio, video, image files), bibliographic references, and different types of articles, that refer to and cite the Cultural Institute or Site @en
comment: Concetto utilizzato per rappresentare tutti quei materiali, multimediali (file audio, video), immagini), bibliografici, articoli di varia natura che si riferiscono e citano l'Istituto e Luogo della Cultura.
label: Creative Work @en
version info: stabile
version info: stable @en

Centri di ricerca e promozione culturale
type: Class
equivalent class: Restriction
  on property: ha tipologia luogo cultura
  has value: Centri di ricerca e promozione culturale
subclass of: Istituto e Luogo Della Cultura
type: NamedIndividual
type: Tipo di Istituto e Luogo della Cultura
comment: Questa classe rappresenta istituti culturali che costituiscono centri di ricerca e di promozione culturale.
description: An example of usage of the class cis:CultReseachCenter is the following: crc:Fondazione_Arnaldo_Pomodoro a cis:CultResearchCenter ; rdfs:label "Fondazione Arnaldo Pomodoro"@it ; rdfs:label "Arnaldo Pomodoro Foundation"@en ; cis:institutionalName "Fondazione Arnaldo Pomodoro"@it ; cis:institutionalName "Arnaldo Pomodoro Foundation"@en ; cis:ISILIdentifier "IT-EX0005" . @en
version info: versione non definitiva
label: Cultural Reseach and Promotion Center @en
description: Un esempio di utilizzo della classe cis:CultReseachCenter è il seguente: crc:Fondazione_Arnaldo_Pomodoro a cis:CultReseachCenter ; rdfs:label "Fondazione Arnaldo Pomodoro"@it ; rdfs:label "Arnaldo Pomodoro Foundation"@en ; cis:institutionalName "Fondazione Arnaldo Pomodoro"@it ; cis:institutionalName "Arnaldo Pomodoro Foundation"@en ; cis:ISILIdentifier "IT-EX0005" .
version info: unstable @en
comment: This class represents cultural institutions that form so-called cultural research and promotion centers. @en

Entità culturale
type: Class
subclass of: Entity
subclass of: Restriction
  on property: è coinvolta in evento culturale
  all values from: Evento Culturale
comment: Class that provides a generalization of three classes; that is , cultural institute or site, collection and cultural heritage object. It does not correspond to a concept used typically in the cultural domain but it is used in order to model properties and property restrictions that are common to all the these three classes. The class will never be directly instanziated. @en
comment: Classe che fornisce una generalizzazione per le tre classi di istituto e luogo della cultura, collezione e oggetto culturale. Non corrisponde ad un concetto usato normalmente nel linguaggio del dominio, ma risponde all'esigenza di modellare proprietà e assiomi di property-restriction comuni ad ognuna di queste tre classi. La classe CulturalEntity non sarà mai istanziata direttamente
label: Cultural Entity @en
version info: stabile
version info: stable @en

Evento Culturale
type: Class
subclass of: PublicEvent
subclass of: Restriction
  on property: è ospitato da sede luogo
  some values from: Sede
subclass of: Restriction
  on property: coinvolge entità culturale
  all values from: Entità culturale
description: An example of usage of the class cis:CulturalEvent is the following: culturalEvent:Vincenzo_Gemito_al_Museo_di_Capodimonte a cis:CulturalEvent, cpevapit:PublicEvent ; cis:isHostedBySite site:Museo_di_Capodimonte; cpevapit:eventTitle "Vincenzo Gemito, dal salotto Minozzi al Museo di Capodimonte" ; rdfs:comment "Apre al pubblico al Museo di Capodimonte la mostra ‘Vincenzo Gemito, dal salotto Minozzi al Museo di Capodimonte’, organizzata dalla Soprintendenza speciale per il patrimonio storico"@it ; cis:involvesCulturalEntity culturalheritageobject:Il_giocatore_di_carte ; cpevapit:hasPublicEventTypology <https://w3id.org/italia/controlled-vocabulary/public-event-types/11_Exposure> ; cpevapit:hasRiT rit:Role_Org_Vincenzo_Gemito_al_Museo_di_Capodimonte ; l0:identifier "Gemito-1" ; cpevapit:hasSubEvent culturaleEvent:Vincenzo_Gemito_Il_Pescatorello ; l0:description "Apre al pubblico al Museo di Capodimonte la mostra ‘Vincenzo Gemito, dal salotto Minozzi al Museo di Capodimonte’, organizzata dalla Soprintendenza speciale per il patrimonio storico"@it ; rdfs:label "Vincenzo Gemito, dal salotto Minozzi al Museo di Capodimonte"@it ; tiapit::atTime ti:Durata_di_Vincenzo_Gemito_dal_salotto_Minozzi_al_Museo_di_Capodimonte . culturalEvent:Vincenzo_Gemito_Il_Pescatorello a cis:CulturalEvent , cpevapit:PublicEvent ; cis:isHostedBySite site:Museo_di_Capodimonte; rdfs:label "Vincenzo Gemito, esposizione de Il Pescatorello"@it ; cpevapit:eventTitle "Vincenzo Gemito, esposizione de Il Pescatorello&apos@it" ; l0:description "Evento racchiuso nell'esposizione generale Vincenzo Gemito"@it ; l0:identifier "Gemito-Pescatorello-2"; cpevapit:hasRiT rit:Role_Org_Vincenzo_Gemito_al_Museo_di_Capodimonte ; cpevapit:hasPublicEventTypology <https://w3id.org/italia/controlled-vocabulary/public-event-types/11_Exposure> ; cis:involvesCulturalEntity culturalheritageobject:Il_Pescatorello ; tiapit:atTime ti:urata_di_Vincenzo_Gemito_dal_salotto_Minozzi_al_Museo_di_Capodimonte . rit:Role_Org_Vincenzo_Gemit… @en
description: Un esempio di utilizzo della classe cis:Event è il seguente: culturalEvent:Vincenzo_Gemito_al_Museo_di_Capodimonte a cis:CulturalEvent, cpevapit:PublicEvent ; cis:isHostedBySite site:Museo_di_Capodimonte; cpevapit:eventTitle "Vincenzo Gemito, dal salotto Minozzi al Museo di Capodimonte" ; rdfs:comment "Apre al pubblico al Museo di Capodimonte la mostra ‘Vincenzo Gemito, dal salotto Minozzi al Museo di Capodimonte’, organizzata dalla Soprintendenza speciale per il patrimonio storico"@it ; cis:involvesCulturalEntity culturalheritageobject:Il_giocatore_di_carte ; cpevapit:hasPublicEventTypology <https://w3id.org/italia/controlled-vocabulary/public-event-types/11_Exposure> ; cpevapit:hasRiT rit:Role_Org_Vincenzo_Gemito_al_Museo_di_Capodimonte ; l0:identifier "Gemito-1" ; cpevapit:hasSubEvent culturaleEvent:Vincenzo_Gemito_Il_Pescatorello ; l0:description "Apre al pubblico al Museo di Capodimonte la mostra ‘Vincenzo Gemito, dal salotto Minozzi al Museo di Capodimonte’, organizzata dalla Soprintendenza speciale per il patrimonio storico"@it ; rdfs:label "Vincenzo Gemito, dal salotto Minozzi al Museo di Capodimonte"@it ; tiapit::atTime ti:Durata_di_Vincenzo_Gemito_dal_salotto_Minozzi_al_Museo_di_Capodimonte . culturalEvent:Vincenzo_Gemito_Il_Pescatorello a cis:CulturalEvent , cpevapit:PublicEvent ; cis:isHostedBySite site:Museo_di_Capodimonte; rdfs:label "Vincenzo Gemito, esposizione de Il Pescatorello"@it ; cpevapit:eventTitle "Vincenzo Gemito, esposizione de Il Pescatorello&apos@it" ; l0:description "Evento racchiuso nell'esposizione generale Vincenzo Gemito"@it ; l0:identifier "Gemito-Pescatorello-2"; cpevapit:hasRiT rit:Role_Org_Vincenzo_Gemito_al_Museo_di_Capodimonte ; cpevapit:hasPublicEventTypology <https://w3id.org/italia/controlled-vocabulary/public-event-types/11_Exposure> ; cis:involvesCulturalEntity culturalheritageobject:Il_Pescatorello ; tiapit:atTime ti:urata_di_Vincenzo_Gemito_dal_salotto_Minozzi_al_Museo_di_Capodimonte . rit:Role_Org_Vincenzo_Gemito_al_Mus…
comment: Rappresenta un evento culturale.
comment: it represents an event that typically is related to the cultural domain @en
label: Cultural Event @en
version info: stabile
version info: stable @en

Oggetto Culturale
type: Class
subclass of: Entità culturale
subclass of: Object
subclass of: Restriction
  on property: è nella sede
  all values from: Sede
subclass of: Restriction
  on property: name
  some values from: Literal
description: An example of usage of the class cis:CulturalHeritageObject is the following: culturalheritageobject:Nascita_di_Venere a cis:CulturalHeritageObject , cis:CulturalEntity ; rdfs:label "Nascita di Venere"@it ;; l0:name "Nascita di Venere"@it ; cis:isInSite site:Palazzo_degli_uffizi . @en
description: Un esempio di utilizzo della classe cis:CulturalHeritageObject iè il seguente: culturalheritageobject:Nascita_di_Venere a cis:CulturalHeritageObject , cis:CulturalEntity ; rdfs:label "Nascita di Venere"@it ;; l0:name "Nascita di Venere"@it ; cis:isInSite site:Palazzo_degli_uffizi .
comment: It represents a cultural asset (even intagible) of the cultural heritage. @en
comment: Rappresenta un bene, materiale o immateriale, del patrimonio culturale.
label: Cultural Heritage Object @en
version info: stabile
version info: stable @en

Istituto e Luogo Della Cultura
type: Class
subclass of: Entità culturale
subclass of: PointOfInterest
subclass of: Restriction
  on property: ha tipologia luogo cultura
  some values from: Tipo di Istituto e Luogo della Cultura
subclass of: Restriction
  on property: ha contenitore fisico
  some values from: Sede
subclass of: Restriction
  on property: hasRiT
  some values from: TimeIndexedRole
subclass of: Restriction
  on property: catalogo
  all values from: Catalogo
subclass of: Restriction
  on property: ha nome luogo cultura nel tempo
  all values from: Nome Luogo Cultura Nel Tempo
subclass of: Restriction
  on property: ha collezione
  all values from: Collezione Entità Culturali
subclass of: Restriction
  on property: ha ambito disciplinare
  all values from: Categoria prevalente
subclass of: Restriction
  on property: è coinvolto in progetto
  all values from: Progetto Culturale
subclass of: Restriction
  on property: è parte di
  all values from: Istituto e Luogo Della Cultura
subclass of: Restriction
  on property: è soggetto di
  all values from: Lavoro Creativo
subclass of: Restriction
  on property: rende disponibile attrezzatura
  all values from: Attrezzatura
subclass of: Restriction
  on property: fornisce servizi
  all values from: Servizio Luogo Cultura
subclass of: Restriction
  on property: hasAccessCondition
  all values from: AccessCondition
subclass of: Restriction
  on property: hasSpatialCoverage
  all values from: Feature
subclass of: Restriction
  on property: hasTicket
  all values from: Ticket
subclass of: Restriction
  on property: hasOnlineContactPoint
  all values from: OnlineContactPoint
subclass of: Restriction
  on property: Institutional Name of Cultural Site
  some values from: Literal
subclass of: Restriction
  on property: description
  all values from: Literal
subclass of: Restriction
  on property: Identificativo ISIL
  cardinality: 1
description: An example of usage of the class 'Cultural Institute or Site' is the following: cissite:Biblioteca_nazionale_centrale a cis:Library , cis:CulturalInstituteOrSite , poiapit:PointOfInterest ; l0:description """La Biblioteca Nazionale Centrale di Roma fu inaugurata il 14 marzo 1876 in un'ala del monumentale Palazzo cinquecentesco del Collegio Romano, sede dell'antica Bibliotheca Secreta o Major dei Gesuiti, che costituì il nucleo originario della nuova istituzione, cui si aggiunsero i fondi manoscritti e a stampa di 69 biblioteche conventuali devolute al Regno d'Italia dopo la soppressione delle corporazioni religiose di Roma nel 1873. Cento anni dopo la Biblioteca venne trasferita nella nuova sede, all'interno della zona archeologica del Castro Pretorio, fra la Città universitaria e la Stazione Termini, realizzata su progetto degli architetti Massimo Castellazzi, Tullio Dell'Anese e Annibale Vitellozzi."""@it rdfs:comment """La Biblioteca Nazionale Centrale di Roma fu inaugurata il 14 marzo 1876 in un'ala del monumentale Palazzo cinquecentesco del Collegio Romano, sede dell'antica Bibliotheca Secreta o Major dei Gesuiti, che costituì il nucleo originario della nuova istituzione, cui si aggiunsero i fondi manoscritti e a stampa di 69 biblioteche conventuali devolute al Regno d'Italia dopo la soppressione delle corporazioni religiose di Roma nel 1873. Cento anni dopo la Biblioteca venne trasferita nella nuova sede, all'interno della zona archeologica del Castro Pretorio, fra la Città universitaria e la Stazione Termini, realizzata su progetto degli architetti Massimo Castellazzi, Tullio Dell'Anese e Annibale Vitellozzi."""@it ; rdfs:label "Biblioteca nazionale centrale"@it ; cis:istitutionalCISName "Biblioteca nazionale centrale"@it ; poiapit:POIofficialName Biblioteca nazionale centrale"@it ; poiapit:POIID "29387" ; poiapit:POICategory <https://w3id.org/italia/controlled-vocabulary/poi-category-classification/cat_6_travel> ; clvapit:hasGeometry geometry_Biblioteca_nazi… @en
description: Un esempio di utilizzo della classe "Istituto e Luogo della Cultura" è il seguente: cissite:Biblioteca_nazionale_centrale a cis:Library , cis:CulturalInstituteOrSite , poiapit:PointOfInterest ; l0:description """La Biblioteca Nazionale Centrale di Roma fu inaugurata il 14 marzo 1876 in un'ala del monumentale Palazzo cinquecentesco del Collegio Romano, sede dell'antica Bibliotheca Secreta o Major dei Gesuiti, che costituì il nucleo originario della nuova istituzione, cui si aggiunsero i fondi manoscritti e a stampa di 69 biblioteche conventuali devolute al Regno d'Italia dopo la soppressione delle corporazioni religiose di Roma nel 1873. Cento anni dopo la Biblioteca venne trasferita nella nuova sede, all'interno della zona archeologica del Castro Pretorio, fra la Città universitaria e la Stazione Termini, realizzata su progetto degli architetti Massimo Castellazzi, Tullio Dell'Anese e Annibale Vitellozzi."""@it rdfs:comment """La Biblioteca Nazionale Centrale di Roma fu inaugurata il 14 marzo 1876 in un'ala del monumentale Palazzo cinquecentesco del Collegio Romano, sede dell'antica Bibliotheca Secreta o Major dei Gesuiti, che costituì il nucleo originario della nuova istituzione, cui si aggiunsero i fondi manoscritti e a stampa di 69 biblioteche conventuali devolute al Regno d'Italia dopo la soppressione delle corporazioni religiose di Roma nel 1873. Cento anni dopo la Biblioteca venne trasferita nella nuova sede, all'interno della zona archeologica del Castro Pretorio, fra la Città universitaria e la Stazione Termini, realizzata su progetto degli architetti Massimo Castellazzi, Tullio Dell'Anese e Annibale Vitellozzi."""@it ; rdfs:label "Biblioteca nazionale centrale"@it ; cis:istitutionalCISName "Biblioteca nazionale centrale"@it ; poiapit:POIofficialName Biblioteca nazionale centrale"@it ; poiapit:POIID "29387" ; poiapit:POICategory <https://w3id.org/italia/controlled-vocabulary/poi-category-classification/cat_6_travel> ; clvapit:hasGeometry geometry_Biblioteca_…
comment: Sono istituti e luoghi della cultura i musei, le biblioteche e gli archivi, le aree e i parchi archeologici, i complessi monumentali. Gli istituti e luoghi e della cultura che appartengono a soggetti pubblici sono destinati alla pubblica fruizione ed espletano un servizio pubblico. Le strutture espositive e di consultazione nonché i luoghi della cultura che appartengono a soggetti privati e sono aperti al pubblico espletano un servizio privato di utilità sociale.
comment: The class Cultural Institute or Site represents museums, libraries, archive holders, archaeologic areas and parks, monumental areas. The cultural institutes of sites that are owned by public bodies are meant to offer public services. The cultural institutes or sites that are owned by private subjects, and are open to the public, offer a public and societal service. @en
label: Cultural Institute or Site @en
version info: stabile
version info: stable @en

Bene Paesaggistico
type: Class
equivalent class: Restriction
  on property: ha tipologia luogo cultura
  has value: Bene Paesaggistico
subclass of: Istituto e Luogo Della Cultura
type: NamedIndividual
type: Tipo di Istituto e Luogo della Cultura
version info: unstable @en
version info: versione non definitiva
label: Cultural Landscape Asset @en
description: An example of usage of the class cis:CulturalLandscapeAsset is the following: cissite:Costiera_Amalfitana a cis:CulturalInstituteOrSite, cis:CulturalLandscapeAsset ; rdfs:label "Costiera Amalfitana"@it ; cis:institutionalName "Costiera Amalfitana"@en ; cis:ISILIdentifier "IT-EX0004" . @en
comment: Questa classe rappresenta uno specifico tipo di istituto e luogo della cultura, i.e., il bene paessaggistico così come definito dall'art. 136 del Codice dei Beni Culturali.
comment: This class represents a specific types of cultural institute or site, i.e., the cultural landscape asset. @en
description: Un esempio di utilizzo della classe cis:CulturalLandscapeAsset è il seguente: cissite:Costiera_Amalfitana a cis:CulturalInstituteOrSite, cis:CulturalLandscapeAsset ; rdfs:label "Costiera Amalfitana"@it ; cis:institutionalName "Costiera Amalfitana"@en ; cis:ISILIdentifier "IT-EX0004" .

Progetto Culturale
type: Class
subclass of: Activity
subclass of: Restriction
  on property: name
  some values from: Literal
subclass of: Restriction
  on property: URL
  all values from: anyURI
description: An example of usage of the class cis:Project is the following: cissite:Museo_di_Capodimonte a cis:CulturalInstituteOrSite, cis:Museum ; rdfs:label "Museo di Capodimonte" ; cis:InstitutionalName "Museo di Capodimonte" ; cis:ISILIdentifier "IT-EX0008" ; cis:isInvolvedInProject project:ProgettoEsempio ; cis:hasSite site:Museo_di_Capodimonte . project:ProgettoEsempio a cis:CulturalProject; rdfs:label "Example Project"@en , "Progetto di Esempio";@it; l0:name "Example Project";@en , "Progetto di Esempio"@it; smapit:URL "http://progettoesempio.com"^^xsd:aniURI . @en
description: Un esempio di uso della classe cis:Project è il seguente: cissite:Museo_di_Capodimonte a cis:CulturalInstituteOrSite, cis:Museum ; rdfs:label "Museo di Capodimonte" ; cis:InstitutionalName "Museo di Capodimonte" ; cis:ISILIdentifier "IT-EX0008" ; cis:isInvolvedInProject project:ProgettoEsempio ; cis:hasSite site:Museo_di_Capodimonte . project:ProgettoEsempio a cis:CulturalProject; rdfs:label "Example Project"@en , "Progetto di Esempio";@it; l0:name "Example Project";@en , "Progetto di Esempio"@it; smapit:URL "http://progettoesempio.com"^^xsd:aniURI .
comment: It represents a Project, usually cultural, the Cultural Institute and Site can be involved in. @en
comment: Rappresenta un progetto, tipicamente culturale, nel quale l'istitutto della Cultura può essere coinvolto.
label: Cultural Project @en
version info: stabile
version info: stable @en

Attrezzatura
type: Class
subclass of: Object
subclass of: Restriction
  on property: name
  some values from: Literal
description: An example of usage of the class cis:Equipment is the following: equ:Photocopier a cis:Equipment ; rdfs:label "Photocopier"@en , "Fotocopiatrice"@it ; l0:name "Photocopier"@en , "Fotocopiatrice"@it . cissite:Biblioteca_nazionale_centrale cis:makesAvailableEquipment equ:Photocopier . @en
description: Un esempio di utilizzo della classe cis:Equipment è il seguente: equ:Photocopier a cis:Equipment ; rdfs:label "Photocopier"@en , "Fotocopiatrice"@it ; l0:name "Photocopier"@en , "Fotocopiatrice"@it . cissite:Biblioteca_nazionale_centrale cis:makesAvailableEquipment equ:Photocopier .
comment: It represents the equipment made available by the Cultural Institute or Site. For instance, the equipment can be a totem, etc. @en
comment: Rappresenta l'attrezzatura resa disponibile dall'Istituto e luogo della cultura. Per esempio è un'attrezzatura un totem, ecc.
label: Equipment @en
version info: stabile
version info: stable @en

Conservatore di archivi
type: Class
equivalent class: Restriction
  on property: ha tipologia luogo cultura
  has value: Conservatore di archivi
subclass of: Istituto e Luogo Della Cultura
type: NamedIndividual
type: Tipo di Istituto e Luogo della Cultura
comment: Questa classe rappresenta una specifica tipologia di istituto e luogo della cultura, i.e., Archivio
version info: stable @en
label: Holder of Archives @en
description: Un esempio di utilizzo della classe cis:HolderOfArchive è il seguente: cissite:Archivio_di_Stato_di_Oristano a cis:CulturalInstituteOrSite, cis:HolderOfArchive ; rdfs:label "Archivio di Stato di Oristano" ; cis:institutionalName "Archivio di Stato di Oristano" ; cis:ISILIdentifier "IT-EX0006" .
comment: This class represents a specific tyep of cultural institute or site, i.e., Holder of Archive @en
description: An example of usage of the class cis:HolderOfArchive is the following: cissite:Archivio_di_Stato_di_Oristano a cis:CulturalInstituteOrSite, cis:HolderOfArchive ; rdfs:label "Archivio di Stato di Oristano" ; cis:institutionalName "Archivio di Stato di Oristano" ; cis:ISILIdentifier "IT-EX0006" . @en
version info: stabile

Oggetto immagine
type: Class
subclass of: Lavoro Creativo
subclass of: Restriction
  on property: URL
  all values from: anyURI
description: An example of the usage of the class cis:ImageObject is the following: image:Poster_Evento_Vincenzo_Gemito_al_Museo_di_Capodimonte a cis:ImageObject , cis:CreativeWork ; rdfs:label "Poster of the event 'Vincenzo Gemito al Museo di Capodimonte'"@en; rdfs:label "Poster dell'evento 'Vincenzo Gemito al Museo di Capodimonte'"@it; smapit:URL http://www.example.com/Image/Poster_Evento_Vincenzo_Gemito_al_Museo_di_Capodimonte.png^^xsd:anyURI ; cis:isAbout event:Vincenzo_Gemito_al_Museo_di_Capodimonte . @en
description: Un esempio dell'utilizzo della classe cis:ImageObject è il seguente: image:Poster_Evento_Vincenzo_Gemito_al_Museo_di_Capodimonte a cis:ImageObject , cis:CreativeWork ; rdfs:label "Poster of the event 'Vincenzo Gemito al Museo di Capodimonte'"@en; rdfs:label "Poster dell'evento 'Vincenzo Gemito al Museo di Capodimonte'"@it; smapit:URL http://www.example.com/Image/Poster_Evento_Vincenzo_Gemito_al_Museo_di_Capodimonte.png^^xsd:anyURI ; cis:isAbout event:Vincenzo_Gemito_al_Museo_di_Capodimonte .
comment: Concept used to represent an image file. @en
comment: Concetto utilizzato per rappresentare un file immagine.
label: Image Object @en
version info: stabile
version info: stable @en

Biblioteca
type: Class
equivalent class: Restriction
  on property: ha tipologia luogo cultura
  has value: Biblioteca
subclass of: Istituto e Luogo Della Cultura
type: NamedIndividual
type: Tipo di Istituto e Luogo della Cultura
comment: Rappresenta uno specifico tipo di Istituto e Luogo della Cultura, ovvero Biblioteca.
label: Library @en
comment: It represents a specific type of Cultural Institute or Site; that is, Library @en
version info: stable @en
version info: stabile

Complesso Monumentale
type: Class
equivalent class: Restriction
  on property: ha tipologia luogo cultura
  has value: Complesso Monumentale
subclass of: Istituto e Luogo Della Cultura
type: NamedIndividual
type: Tipo di Istituto e Luogo della Cultura
version info: stable @en
comment: Rappresenta uno specifico tipo di Istituto e Luogo della Cultura ovvero Complesso Monumentale.
description: An example of usage of the class cis:MonumentalArea is the following: cissite:COMPLESSO_MONUMENTALE_DI_VICOPISANO_ROCCA_DEL_BRUNELLESCHI_E_PALAZZO_PRETORIO a cis:CulturalInstituteOrSite, cis:MonumentalArea ; rdfs:label "COMPLESSO MONUMENTALE DI VICOPISANO: ROCCA DEL BRUNELLESCHI E PALAZZO PRETORIO" ; cis:institutionalName "COMPLESSO MONUMENTALE DI VICOPISANO: ROCCA DEL BRUNELLESCHI E PALAZZO PRETORIOi" ; cis:ISILIdentifier "IT-EX0007" . @en
label: Monumental Area or Complex @en
description: Un esempio di utilizzo della classe cis:MonumentalArea è il seguente: cissite:COMPLESSO_MONUMENTALE_DI_VICOPISANO_ROCCA_DEL_BRUNELLESCHI_E_PALAZZO_PRETORIO a cis:CulturalInstituteOrSite, cis:MonumentalArea ; rdfs:label "COMPLESSO MONUMENTALE DI VICOPISANO: ROCCA DEL BRUNELLESCHI E PALAZZO PRETORIO" ; cis:institutionalName "COMPLESSO MONUMENTALE DI VICOPISANO: ROCCA DEL BRUNELLESCHI E PALAZZO PRETORIOi" ; cis:ISILIdentifier "IT-EX0007" .
version info: stabile
comment: It represents a specific type of Cultural Institute or Site; that is, Monumental Area @en

Museo
type: Class
equivalent class: Restriction
  on property: ha tipologia luogo cultura
  has value: Museo
subclass of: Istituto e Luogo Della Cultura
type: NamedIndividual
type: Tipo di Istituto e Luogo della Cultura
description: An example of usage of the class cis:Museum is the following: cissite:Museo_di_Capodimonte a cis:CulturalInstituteOrSite, cis:Museum ; rdfs:label "Museo di Capodimonte"; ; cis:institutionalName "Museo di Capodimonte" ; cis:ISILIdentifier "IT-EX0008" . @en
comment: Rappresenta uno specifico tipo di istituto e luogo della cultura ovvero museo.
label: Museum @en
version info: stabile
comment: It represents a specific type of Cultural Institute or Site; that is, Museum @en
description: Un esempio di utilizzo della classe cis:Museum è il seguente: cissite:Museo_di_Capodimonte a cis:CulturalInstituteOrSite, cis:Museum ; rdfs:label "Museo di Capodimonte"; ; cis:institutionalName "Museo di Capodimonte" ; cis:ISILIdentifier "IT-EX0008" .
version info: stable @en

Articolo
type: Class
subclass of: Lavoro Creativo
subclass of: Restriction
  on property: URL
  all values from: anyURI
comment: Concept used to represent a news article. @en
comment: Concetto utilizzato per rappresentare un articolo
label: News Article @en
version info: stabile
version info: stable @en

Sede
type: Class
subclass of: Feature
subclass of: PointOfInterest
subclass of: Restriction
  on property: è contenitore fisico di
  some values from: Istituto e Luogo Della Cultura
subclass of: Restriction
  on property: ha descrizione della sede
  all values from: Descrizione della sede
subclass of: Restriction
  on property: ospita evento culturale
  all values from: Evento Culturale
subclass of: Restriction
  on property: siteAddress
  all values from: Address
subclass of: Restriction
  on property: hasSpatialCoverage
  all values from: Feature
subclass of: Restriction
  on property: hasOnlineContactPoint
  all values from: OnlineContactPoint
subclass of: Restriction
  on property: description
  all values from: Literal
disjoint with: Address
description: A site is always associated with an individual of the class 'Cultural Institute or Site' (CIS) by means of the object property hasSite. A site, which is a subclass of the PointOfInterest class of the POI ontology is additionally characterised by the following properties: * siteAddress (subproperty of hasAddress of the Location ontology) that allows associating the site with an address; * hasOnlineContactPoint that associates the site with an individual identifying an online contact point; * hasSpatialCoverage for relating the site to the description of its AdminUnitComponent (City, Country, District, Province, Region)'; * isSiteOf that is the inverse property of hasSite. * hasSiteDescription for relating the site to its general description ; * hostsCulturalEvent for associating the site with a possible cultural event that hosts. The following is an example of a Site and its association with a CIS site:Sede_di_Biblioteca_nazionale_centrale_di_Roma a cis:Site , poiapit:PointOfInterest ; rdfs:label "Sede Biblioteca nazionale centrale di Roma"@it ; poiapit:POIofficialName "Sede Biblioteca nazionale centrale di Roma"@it ; poiapit:POIID "1" ; cis:siteAddress address:Indirizzo_della_sede_di_Biblioteca_nazionale_centrale_di_Roma ; smapit:hasOnlineContactPoint contactPoint:Contatti_di_Biblioteca_nazionale_centrale_di_Roma ; clvapit:hasSpatialCoverage <https://w3id.org/italia/controlled-vocabulary/territorial-classifications/cities/058091-(1992-04-04)> ; cis:isSiteOf cissite:Biblioteca_nazionale_centrale ; clvapit:hasGeometry geo_sede_biblioteca_nazionale ; poiapit:hasPOICategory <https://w3id.org/italia/controlled-vocabulary/poi-category-classification/cat_2_recreation> , <https://w3id.org/italia/controlled-vocabulary/poi-category-classification/cat_6_travel> . cissite:Biblioteca_nazionale_centrale a cis:Library , cis:CulturalInstituteOrSite , ;poiapit:PointOfInterest ; cis:hasSite site:Sede_di_Biblioteca_nazionale_centrale_di_Roma . address:Indirizzo_della_sede_di_Bibliotec… @en
description: Una sede è sempre associata agli individui della classe "Istituto e Luogo della Cultura" attraverso la proprietà ha sede. Una sede è caratterizzata dalle seguenti proprietà: * ha indirizzo nel tempo: consente di associare una sede con un individuo della classe indirizzo nel tempo che fornisce la descrizione dell'indirizzo che varia nel tempo.; * ha punto di contatto: consente di associare una sede con un individuo che identifica un punto di contatto online; * ha copertura geografica: consente di associare la sede con la descrizione dell'area geografica * è sede di: la proprietà inversa di ha sede * ospita evento culturale: consente di associare una sede a un evento culturale ospitato in quel luogo fisico. Il seguente esempio in turle mostra una sede associata a un istituto e luogo della cultura: site:Sede_di_Biblioteca_nazionale_centrale_di_Roma a cis:Site , poiapit:PointOfInterest ; rdfs:label "Sede Biblioteca nazionale centrale di Roma"@it ; poiapit:POIofficialName "Sede Biblioteca nazionale centrale di Roma"@it ; poiapit:POIID "1" ; cis:siteAddress address:Indirizzo_della_sede_di_Biblioteca_nazionale_centrale_di_Roma ; smapit:hasOnlineContactPoint contactPoint:Contatti_di_Biblioteca_nazionale_centrale_di_Roma ; clvapit:hasSpatialCoverage <https://w3id.org/italia/controlled-vocabulary/territorial-classifications/cities/058091-(1992-04-04)> ; cis:isSiteOf cissite:Biblioteca_nazionale_centrale ; clvapit:hasGeometry geo_sede_biblioteca_nazionale ; poiapit:hasPOICategory <https://w3id.org/italia/controlled-vocabulary/poi-category-classification/cat_2_recreation> , <https://w3id.org/italia/controlled-vocabulary/poi-category-classification/cat_6_travel> . cissite:Biblioteca_nazionale_centrale a cis:Library , cis:CulturalInstituteOrSite , ;poiapit:PointOfInterest ; cis:hasSite site:Sede_di_Biblioteca_nazionale_centrale_di_Roma . address:Indirizzo_della_sede_di_Biblioteca_nazionale_centrale_di_Roma a clvapit:Address ; clvapit:hasIdentifier <https://w3id.org/italia/data/id…
comment: It represents a georeferenced physical site related to the Cultural Institute or Site. A Cultural Institute or Site can be located in more than one physical site. For instance, a Site can be "Palazzo Venezia" which is the site of the "Museum of Palazzo Venezia" and of "Library of Archaelogy and Art History". @en
comment: Rappresenta un luogo fisico georeferenziato relativo all'Istituto e luogo della Cultura. Un Istituto e Luogo della Cultura può avere più di un luogo fisico associato. Nell'ambito dell'Istituto Centrale per il Catalogo e la Documentazione (ICC)D) tale concetto rappresenta il contenitore fisico. Per esempio, un luogo fisico può essere "Palazzo Venezia" dove ha sede il "Museo Nazionale di Palazzo Venezia" o la "Biblioteca di Archeologia e Storia dell'Arte".
label: Site @en
version info: stabile
version info: stable @en

Descrizione della sede
type: Class
subclass of: Description
subclass of: Restriction
  on property: ha attribute
  all values from: Attributo
subclass of: Restriction
  on property: description
  all values from: Literal
description: An example of usage of the class cis:SiteDescription is the following: site:Sede_di_Biblioteca_nazionale_centrale_di_Roma a cis:Site ; rdfs:label "Sede Biblioteca nazionale centrale di Roma"@it ; cis:siteAddress address:Indirizzo_della_sede_di_Biblioteca_nazionale_centrale_di_Roma ; cis:isSiteOf cissite:Biblioteca_nazionale_centrale ; cis:hasSiteDescription sd:Sede_di_Biblioteca_nazionale_centrale_di_Roma ; l0:name "Sede di: Biblioteca nazionale centrale di Roma"@it . sd:Sede_di_Biblioteca_nazionale_centrale_di_Roma a cis:SiteDescription ; rdfs:label"Description of the 'Sede di Biblioteca Nazionale Centrale di Roma'"@en , "Descrizione della 'Sede di Biblioteca Nazionale Centrale di Roma'"@it ; l0:description "La libreria 1000 metri di scaffalature"@it , "The Library has 1000 meters of shelves"@en ; cis:hasAttribute attribute:Shelving . attribute:Shelving a cis:Attribute ; rdfs:label "Shelving"@en , "Scaffalature";@it ; l0:name "Shelving"@en , "Scaffalature"@it ; l0:description "The linear dimension of a shelf unit (e.g. 3 meters)"@en , ";La dimensione di uno scaffale in metri lineari (es. 3 metri)"@it . @en
description: Un esempio di utilizzo della classe cis:SiteDescription è il seguente: site:Sede_di_Biblioteca_nazionale_centrale_di_Roma a cis:Site ; rdfs:label "Sede Biblioteca nazionale centrale di Roma"@it ; cis:siteAddress address:Indirizzo_della_sede_di_Biblioteca_nazionale_centrale_di_Roma ; cis:isSiteOf cissite:Biblioteca_nazionale_centrale ; cis:hasSiteDescription sd:Sede_di_Biblioteca_nazionale_centrale_di_Roma ; l0:name "Sede di: Biblioteca nazionale centrale di Roma"@it . sd:Sede_di_Biblioteca_nazionale_centrale_di_Roma a cis:SiteDescription ; rdfs:label"Description of the 'Sede di Biblioteca Nazionale Centrale di Roma'"@en , "Descrizione della 'Sede di Biblioteca Nazionale Centrale di Roma'"@it ; l0:description "La libreria 1000 metri di scaffalature"@it , "The Library has 1000 meters of shelves"@en ; cis:hasAttribute attribute:Shelving . attribute:Shelving a cis:Attribute ; rdfs:label "Shelving"@en , "Scaffalature";@it ; l0:name "Shelving"@en , "Scaffalature"@it ; l0:description "The linear dimension of a shelf unit (e.g. 3 meters)"@en , ";La dimensione di uno scaffale in metri lineari (es. 3 metri)"@it .
comment: Permette di rappresentare una descrizione della sede fisica dell'istituto e luogo della cultura (per esempio, la sede ha una metratura complessiva di XX mq suddivisa in metratura al pubblico e una scaffalatura complessiva di n. YYY).
comment: Permits to represents a description of a site of the cultural institute or site (for instance, the site has a total space available XXX, and a shelving that consists of a set of XX X shelves, etc.) @en
label: Site Description @en
version info: stabile
version info: stable @en

Categoria prevalente
type: Class
subclass of: Topic
description: An example of usage of the class cis:SubjectDiscipline is the following: cissite:Museo_archeologico_statale a cis:CulturalInstituteOrSite, cis:Museum ; rdfs:label "Museo archeologico statale" ; cis:institutionalName"Museo archeologico statale" ; cis:ISILIdentifier "T-EX0010" ; cis:hasDiscipline <https://w3id.org/italia/controlled-vocabulary/classifications-for-culture/subject-disciplines/013-013> ; cis:hasSite site:Museo_archeologico_statale . @en
description: Un esempio di utilizzo della classe cis:SubjectDiscipline è il seguente: cissite:Museo_archeologico_statale a cis:CulturalInstituteOrSite, cis:Museum ; rdfs:label "Museo archeologico statale" ; cis:institutionalName"Museo archeologico statale" ; cis:ISILIdentifier "T-EX0010" ; cis:hasDiscipline <https://w3id.org/italia/controlled-vocabulary/classifications-for-culture/subject-disciplines/013-013> ; cis:hasSite site:Museo_archeologico_statale .
comment: It represents a a field of knowledge or human activity. This can be defined in a controlled vocabulary. Examples can be: Modern Art, Ancient History, Ethnografy, etc. @en
comment: Rappresenta un certo ambito della conoscenza o dell'attività umana. Tale ambito è preferibilmente modellato mediante un vocabolario controllato. Esempi: arte contemporanea, storia antica, etnografia, ecc.
label: Subject Discipline @en
version info: stabile
version info: stable @en
controlled vocabulary: subject-disciplines

Teatro
type: Class
equivalent class: Restriction
  on property: ha tipologia luogo cultura
  has value: Teatro
subclass of: Istituto e Luogo Della Cultura
type: NamedIndividual
type: Tipo di Istituto e Luogo della Cultura
description: Un esempio di utilizzo della classe cis:Theatre è il seguente: cissite:Teatro_Olimpico a cis:CulturalInstituteOrSite, cis:Theatre ; rdfs:label "Teatro Olimpico" ; cis:name "Teatro Olimpico" ; cis:ISILIdentifier "IT-EX0011" .
version info: unstable @en
description: An example of usage of the class cis:Theatre is the following: cissite:Teatro_Olimpico a cis:CulturalInstituteOrSite, cis:Theatre ; rdfs:label "Teatro Olimpico" ; cis:name "Teatro Olimpico" ; cis:ISILIdentifier "IT-EX0011" . @en
label: Theatre @en
version info: versione non definitiva
comment: This class represents a cultural institute or site of type Theatre @en
comment: Questa classe rappresenta un istituto e luogo della cultura di tipo Teatro

Oggetto video
type: Class
subclass of: Lavoro Creativo
subclass of: Restriction
  on property: URL
  all values from: anyURI
comment: Concept used to represent multimedia objects of type video. @en
comment: Concetto utilizzato per rappresentare materiali multimediali di tipo video.
label: Video Object @en
version info: stabile
version info: stable @en

Agenzia per l'Italia Digitale
type: NamedIndividual
type: Agent
name: Italian Digital Agency @en

Ministero per i Beni e le Attività Culturali
type: NamedIndividual
type: Agent
name: Ministry of Cultural Heritage and Activities @en

onto-mibac
type: NamedIndividual
type: Organization
type: Kind
fn: Ministero per i beni e le attività culturali

Distribuzione JSON-LD ontologia Cultural-ON
type: NamedIndividual
type: SemanticAssetDistribution
description: Questa è la distribuzione JSON-LD dell'ontologia Cultural-ON sui luoghi ed eventi culturali
description: This is the distribution in JSON-LD of Cultural-ON ontology on Cultural Events and Sites @en
format: JSON LD
license: A21 CCBY40
title: JSON-LD distribution of Cultural-ON Ontology @en
access URL: https://raw.githubusercontent.com/italia/daf-ontologie-vocabolari-controllati/master/Ontologie/Cultural-ON/latest
download URL: https://raw.githubusercontent.com/italia/daf-ontologie-vocabolari-controllati/master/Ontologie/Cultural-ON/latest/Cultural-ON-AP_IT.jsonld

Distribuzione RDF/Turtle ontologia Cultural-ON
type: NamedIndividual
type: SemanticAssetDistribution
description: Questa è la distribuzione RDF/Turtle dell'ontologia Cultural-ON sui luoghi ed eventi culturali
description: This is the distribution in RDF/turtle of Cultural-ON ontology on Cultural Events and Sites @en
format: RDF TURTLE
license: A21 CCBY40
title: RDF/Turtle distribution of Cultural-ON Ontology @en
access URL: https://raw.githubusercontent.com/italia/daf-ontologie-vocabolari-controllati/master/Ontologie/Cultural-ON/latest
download URL: https://raw.githubusercontent.com/italia/daf-ontologie-vocabolari-controllati/master/Ontologie/Cultural-ON/latest/Cultural-ON-AP_IT.ttl

Distribuzione RDF/XML ontologia Cultural-ON
type: NamedIndividual
type: SemanticAssetDistribution
description: Questa è la distribuzione RDF/XML dell'ontologia Cultural-ON sui luoghi ed eventi culturali
description: This is the distribution in RDF/XML of Cultural-ON ontology on Cultural Events and Sites @en
format: RDF XML
license: A21 CCBY40
title: RDF/XML distribution of Cultural-ON Ontology @en
access URL: https://raw.githubusercontent.com/italia/daf-ontologie-vocabolari-controllati/master/Ontologie/Cultural-ON/latest
download URL: https://raw.githubusercontent.com/italia/daf-ontologie-vocabolari-controllati/master/Ontologie/Cultural-ON/latest/Cultural-ON-AP_IT.rdf

stlab
type: NamedIndividual
type: Agent
name: Institute of Cognitive Sciences and Technologies of the Italian Research Council (CNR) - Semantic Technology Laboratory (STLab) @en
name: Istituto di Scienze e Tecnologie della Cognizione del CNR - Semantic Technology Lab (STLab)
identifier: cnr - Z6HZEH - STLab

DAF
type: NamedIndividual
type: Project
name: Data & Analytics Framework

LODMIBAC
type: NamedIndividual
type: Project
name: dati.beniculturali.it - Gli Open Data del Ministero dei Beni Culturali (MIBAC) - http://dati.beniculturali.it

OntoPiA
type: NamedIndividual
type: Project
name: OntoPiA - la rete di ontologie della pubblica amministrazione italiana