DCO Schema
type: Ontology
creator: JohnErickson
contributor: PatrickWest
contributor: StephanZednik
contributor: XiaogangMa
contributor: PeterFox
contributor: HaoZhong
contributor: AhmedEleish
publisher: TetherlessWorldConstellation
date: 2015-11-08
rights: This ontology is distributed under a Creative Commons Attribution License http://creativecommons.org/licenses/by/3.0/
comment: The Deep Carbon Observatory (DCO) Ontology represents concepts and relationships used within the DCO Knowledge Store, enhancing and extending the concepts and relationships defined in the many ontologies of the VIVO Application.

Object
type: Class
subclass of: Thing
comment: Top level object for classes in the DCO Ontology. Any dco:Object will have a DCO Id.

DCO ID
type: Class
comment: Resolvable handle from handle.net for all DCO objects.

DCO ID
type: FunctionalProperty
type: InverseFunctionalProperty
type: ObjectProperty
domain: Object
range: DCO ID
inverse of: DCO ID for
comment: Every dco:Object has a DCOID. From the object this property points to that DCO Id.

DCO ID for
type: ObjectProperty
domain: DCO ID
range: Object
inverse of: DCO ID
comment: Every dco:Object has a DCOID. From the DCOID this property points back to the dco:Object.

DCO ID
type: FunctionalProperty
type: DatatypeProperty
domain: Object
range: anyURI
sub property of: topDataProperty
comment: Original representation of a DCO Id was a simple URI.

Ph.D. Student
type: Class
subclass of: GraduateStudent
comment: A student who is pursuing their doctorate degree in a specific field of study for a specific topic.

Engineer
type: Class
subclass of: Person
subclass of: Agent
subclass of: Thing
subclass of: Object
comment: A role that a person has in any of the many engineering disciplines who's goal is to design and build.

Technician
type: Class
subclass of: Person
subclass of: Agent
subclass of: Thing
subclass of: Object
comment: A role that a person has in maintaining technical equipment or doing practical work in a lab

Scientist
type: Class
subclass of: Person
subclass of: Thing
subclass of: Agent
subclass of: Object
comment: A role that a person has who is researching or has expert knowledge of one or more of the natural or physical sciences.

Professor
type: Class
subclass of: Person
subclass of: FacultyMember
subclass of: Thing
subclass of: Agent
subclass of: Object
comment: A role that a person has as a teacher at the highest rank in a college or university.

Staff
type: Class
subclass of: Person
subclass of: Agent
subclass of: Thing
subclass of: Object
comment: A role that a person has who is assisting members of a group in carrying out assigned tasks.

skype
type: DatatypeProperty
domain: Person
sub property of: topDataProperty
comment: A person's identifier used for the Skype application.

short name
type: DatatypeProperty
domain: Person
sub property of: topDataProperty
comment: The name that people commonly refer to another person has. For example, a short name of Bill for their full name William.

Language(s) Spoken Fluently
type: DatatypeProperty
domain: Person
comment: A language that a person speaks fluently.

received grant
type: ObjectProperty
domain: Person
range: Grant
inverse of: recipient
comment: Relating a person with a grant that they have received for funded work.

recipient
type: ObjectProperty
domain: Grant
range: Person
inverse of: received grant
comment: Relates a grant with the person who received the grant to conduct funded work.

Nationality
type: ObjectProperty
domain: Person
range: Country
sub property of: topObjectProperty
comment: The country that a person currently resides in.

network ID
type: FunctionalProperty
type: DatatypeProperty
domain: Person
comment: The property that relates a person to their DCO login.

Artwork
type: Class
subclass of: Document
subclass of: Thing
subclass of: Object
subclass of: Image
subclass of: InformationResource
comment: Illustrations, photographs, or other nontextual material prepared for inclusion in a publication.

Poster
type: Class
subclass of: Document
subclass of: Thing
subclass of: Object
subclass of: InformationResource
subclass of: Restriction
  all values from: boolean
  on property: is DCO publication
comment: A large printed depiction representing research or work that is being conducted.

Government Report
type: Class
subclass of: Document
subclass of: Thing
subclass of: Object
subclass of: InformationResource
subclass of: Report
subclass of: Restriction
  all values from: boolean
  on property: is DCO publication
comment: An official document that is prepared to provide an account of a particular matter for a government entity.

Web Article
type: Class
subclass of: Document
subclass of: Thing
subclass of: Object
subclass of: InformationResource
subclass of: Article
subclass of: Restriction
  all values from: boolean
  on property: is DCO publication
comment: A piece of writing included with others on a website.

Broadcast
type: Class
subclass of: Document
subclass of: Thing
subclass of: Object
subclass of: AudioDocument
subclass of: InformationResource
subclass of: Restriction
  all values from: boolean
  on property: is DCO publication
comment: A transmission of content over a medium such as radio, television or streamed over the Internet.

Chart
type: Class
subclass of: Document
subclass of: Thing
subclass of: Object
subclass of: Image
subclass of: InformationResource
comment: A graphical representation of data.

Magazine Article
type: Class
subclass of: Document
subclass of: Thing
subclass of: Object
subclass of: InformationResource
subclass of: Article
subclass of: Restriction
  all values from: boolean
  on property: is DCO publication
comment: A piece of writing included with others in a magazine.

Proceedings
type: Class
subclass of: Collection
comment: A collection of academic papers published in the context of an academic conference

Journal Article
type: Class
subclass of: Document
subclass of: AcademicArticle
subclass of: Thing
subclass of: Object
subclass of: InformationResource
subclass of: Article
subclass of: Restriction
  all values from: boolean
  on property: is DCO publication
comment: A publication written by someone with academic qualifications or expert knowledge which is evidence-based and published in a journal.

Newspaper Article
type: Class
subclass of: Document
subclass of: Thing
subclass of: Object
subclass of: InformationResource
subclass of: Article
comment: A piece of writing included with others in a newspaper.

Book Series
type: Class
subclass of: Collection
subclass of: Thing
subclass of: Object
subclass of: Series
subclass of: InformationResource
comment: A sequence of books having certain characteristics in common that are formally identified together as a group.

is DCO publication
type: FunctionalProperty
type: DatatypeProperty
range: string
comment: A property which classifies a publication as being a contribution to the Deep Carbon Observatory Community.

year of publication
type: DatatypeProperty
domain: Document
range: gYear
sub property of: topDataProperty
comment: The year in which a publication has been published.

books
type: ObjectProperty
domain: Book Series
range: Book
sub property of: topObjectProperty
comment: One of many books that are included in a book series.

chapters
type: ObjectProperty
domain: Book
range: Chapter
sub property of: topObjectProperty
comment: One of one or more divisions of a book.

series title
type: ObjectProperty
range: Book Series
sub property of: topObjectProperty
comment: A book or chapter of a book that is published in a series of books.

date published
type: ObjectProperty
domain: InformationResource
range: DateTimeValue
sub property of: topObjectProperty
sub property of: dateTimeValue
comment: The date that a publication was published. Can be represented as a full date or one or more components of a date.

book title
type: ObjectProperty
range: Book
sub property of: topObjectProperty
comment: A chapter, chart, figure, table of data, etc... that is included in a book.

Project Update
type: Class
subclass of: Object
comment: Information provided to show what progress has been made in a project during a reporting year.

Project Update
type: ObjectProperty
domain: Project
range: Project Update
inverse of: For Project
comment: Property relating a project to information showing progress on the project during a reporting year. There can be multiple project updates during a reporting year.

For Project
type: ObjectProperty
domain: Project Update
range: Project
inverse of: Project Update
comment: Property relating a information showing progress on a project during a reporting year to the project being updated.

Date Submitted
type: FunctionalProperty
type: DatatypeProperty
domain: Project Update
range: date
comment: The date on which a project update is submitted during the reporting year. Project updates are sorted on this property in reporting year reports.

Update Text
type: DatatypeProperty
domain: Project Update
range: string
comment: The text of a project update describing the progress made on a project during a reporting year.

For Reporting Year
type: FunctionalProperty
type: ObjectProperty
domain: Project Update
range: Reporting Year
sub property of: topObjectProperty
comment: Associating a reporting year to the project update.

Reporting Year
type: Class
subclass of: Object
comment: A fixed span of time defined by a funding agency after which reports are due showing progress made on projects during the reporting year.

Starts On
type: DatatypeProperty
domain: Reporting Year
range: date
comment: The reporting year starts on this specific date.

Ends On
type: DatatypeProperty
domain: Reporting Year
range: date
comment: The reporting year ends on this specific date.

Reporting Year
type: ObjectProperty
domain: Organization
range: Reporting Year
inverse of: For Organization
comment: A reporting year that is defined by an organization, usually a funding agency.

For Organization
type: ObjectProperty
domain: Reporting Year
range: Organization
sub property of: topObjectProperty
inverse of: Reporting Year
comment: The organization, usually a funding agency, that a reporting year is related to.

Project Update Modification Note
type: Class
subclass of: Object
comment: Information showing who has provided information and when the information was provided for a project update.

Modified On
type: DatatypeProperty
domain: Project Update Modification Note
range: date
comment: The date on which an update was made to a project update.

Modified By
type: ObjectProperty
domain: Project Update Modification Note
range: Person
sub property of: topObjectProperty
comment: The person who has made an update to a project update.

List of Modifications
type: ObjectProperty
domain: Project Update
range: Project Update Modification Note
sub property of: topObjectProperty
inverse of: For Project Update
comment: A description of what modifications were made to a project update, such as the attachment of a publication or clarifying information in the update.

For Project Update
type: ObjectProperty
domain: Project Update Modification Note
range: Project Update
inverse of: List of Modifications
comment: The project update to which a modification information is added.

Referenced By Update
type: ObjectProperty
range: Project Update
inverse of: refers to
comment: Something that is referenced from within project update information during a specific reporting year.

refers to
type: ObjectProperty
domain: Project Update
inverse of: Referenced By Update
comment: An entity, such as an instrument, that is used by a project and referenced in a project update.

Associated Publications
type: ObjectProperty
domain: Project Update
range: Document
sub property of: topObjectProperty
comment: A publication referenced by a project update during a specific reporting year.

Field Study
type: Class
subclass of: Thing
subclass of: Activity
subclass of: Project
subclass of: Object
comment: A type of project where researchers visit a particular site in order to collect measurements, samples and other data.

Field sites
type: ObjectProperty
domain: Field Study
range: Physical Location
inverse of: is field site of
comment: Relating a field study with a specific location where measurements, samples and other data are collected.

is field site of
type: ObjectProperty
domain: Physical Location
range: Field Study
inverse of: Field sites
comment: Relating a representation of a physical location where measurements are taken to a field study.

Physical Location
type: Class
subclass of: Restriction
  all values from: string
  on property: description
subclass of: Restriction
  all values from: string
  on property: longitude (decimal)
subclass of: Restriction
  all values from: string
  on property: latitude (decimal)
comment: The location where measurements, samples and other data are collected. Must include a description, longitude and latitude.

longitude (decimal)
type: FunctionalProperty
type: DatatypeProperty
comment: Relates a thing to the angular distance of a place east or west of the meridian at Greenwich, England, or west of the standard meridian of a celestial object, where the thing is or was, usually expressed in degrees and minutes.

latitude (decimal)
type: FunctionalProperty
type: DatatypeProperty
comment: Relates a thing to the angular distance of a place north or south of the earth's equator, or of a celestial object north or south of the celestial equator, where the thing is or was, usually expressed in degrees and minutes.

pressure
type: DatatypeProperty
domain: Physical Location
range: string
comment: Measurement of force per unit area that a fluid exerts on its surroundings.

depth (meters)
type: FunctionalProperty
type: DatatypeProperty
domain: Physical Location
range: string
comment: The distance from the top or surface of something to the bottom at which measurements are taken as part of a field study.

temperature
type: FunctionalProperty
type: DatatypeProperty
domain: Physical Location
range: string
comment: The degree or intensity of heat present at a location where measurements are taken as part of a field study.

altitude (meters)
type: FunctionalProperty
type: DatatypeProperty
domain: Physical Location
range: string
comment: The height or point in relation to sea level or ground level where measurements are taken for a given field study.

leader for fieldwork
type: ObjectProperty
domain: Person
range: Field Study
inverse of: leader
comment: Relating a field study to a person who is responsible for working being conducted at the site.

leader
type: ObjectProperty
domain: Field Study
range: Person
inverse of: leader for fieldwork
comment: Relating a person who is responsible for work being conducted to a field study.

open to journalists
type: FunctionalProperty
type: DatatypeProperty
domain: Field Study
range: string
comment: Specifies whether a location where field study is being conducted is accessible to members of the media.

Research Vessel
type: Class
subclass of: Restriction
  all values from: string
  on property: Vessel Name
subclass of: Restriction
  all values from: string
  on property: Vessel Call Sign
subclass of: Restriction
  all values from: string
  on property: Vessel IMO
subclass of: Restriction
  all values from: Research Community
  on property: associated DCO Community
subclass of: Restriction
  all values from: anyURI
  on property: Vessel Information Link
subclass of: Restriction
  all values from: string
  on property: Vessel MMSI
comment: A ship or boat designed and/or equipped to carry out scientific studies at sea.

Vessel Name
type: FunctionalProperty
type: DatatypeProperty
range: string
comment: A name given to a research vessel. May not be unique.

Vessel Call Sign
type: DatatypeProperty
range: string
comment: A research vessel transmission statuon unique designation

Vessel IMO
type: FunctionalProperty
type: DatatypeProperty
range: string
comment: A research vessel ship number consisting of the three letters IMO followed by a unique seven-digit number

Vessel Information Link
type: DatatypeProperty
range: anyURI
comment: A resource URL that describes the deployment of a ResearchVessel

Vessel MMSI
type: FunctionalProperty
type: DatatypeProperty
range: string
comment: A research vessels Maritime Mobile Service Identity.

Research Vessel
type: ObjectProperty
domain: Field Study
range: Research Vessel
inverse of: Is Vessel For
comment: Linking a ResearchVessel to a specific field study.

Is Vessel For
type: ObjectProperty
domain: Research Vessel
range: Field Study
inverse of: Research Vessel
comment: Linking a field study to a specific research vessel.

Repository
type: Class
subclass of: Object
subclass of: Restriction
  all values from: Research Community
  on property: associated DCO Community
subclass of: Restriction
  all values from: GeographicLocation
  on property: RO_0001025
subclass of: Restriction
  all values from: Grant
  on property: hasFundingVehicle
subclass of: Restriction
  all values from: Project
  on property: related project
subclass of: Restriction
  all values from: Point of Contact
  on property: point of contact
subclass of: Restriction
  all values from: string
  on property: description
subclass of: Restriction
  all values from: Organization
  on property: hosted by organization
comment: a central location in which data is stored and managed

related project
type: ObjectProperty
range: Project
comment: An entity that is related to a DCO funded project

hosted by organization
type: ObjectProperty
range: Organization
comment: something that is located at an organization or that the organization is responsible for

repository website
type: DatatypeProperty
domain: Repository
range: anyURI
comment: A web site that includes information about a repository. Does not represent the online catalog where data can be searched for

repository online catalog
type: DatatypeProperty
domain: Repository
range: anyURI
comment: a link to the online data store for a repository where data can be searched for

Data Type
type: Class
comment: A data type is often treated as a purely syntactic label associated with a variable when it is declared, such as integer, float, boolean, character, and string, etc. Such definitions of 'data type' do not give any semantic meaning to the data types. In the context of this ontology, a data type can include more meaning beyond the syntax, such as who created the data type, the source standard that the data type derives from, the operations that can be done on datasets of that data type, and typical scientific domains, software programs and/or instruments that use the data type, etc. The intent is that any humans or machines that when they encounter that data type can quickly 'understand' or be in a situation to at least 'process' details within the dataset without even downloading that dataset.
subclass of: Object
subclass of: Entity
definition: A data type is the representation of particular qualities or features that a group of datasets share.

DataType Parameter
type: Class
comment: The data type includes a set of variables that define its usage. A user can find a datatype and know to expect these parameters to be a part of the dataset that the data type is associated with. Another use is that someone can find a datatype that a variable is a part of and then find additional datasets that this datatype is associated with.
subclass of: Object
subclass of: Entity
definition: An input variable of a data type.

has parameter
type: ObjectProperty
comment: Link a DataType with variables that make up the DataType
domain: Data Type
range: DataType Parameter

has unit
type: DatatypeProperty
comment: Annotate the unit, e.g. meter, degree, dollar, etc. of a parameter.
domain: DataType Parameter
range: string

expected uses
type: DatatypeProperty
comment: describes any additional constraints, comments or notes about a data type.
domain: Data Type
range: string

has data type subject area
type: ObjectProperty
comment: Associates a data type with the different defined domains of knowledge and skill within the Deep Carbon Observatory community.
domain: Data Type
range: Concept
sub property of: hasSubjectArea

created at time
type: DatatypeProperty
comment: Part of the provenance of a data type, at what time was the data type created.
domain: Data Type
range: dateTime

has source standard
type: ObjectProperty
comment: A data type may be derived from one or more universally or widely accepted, agreed upon, or established means of determining what something should be.
domain: Data Type
range: Standard
sub property of: wasDerivedFrom

has source data type
type: ObjectProperty
comment: Part of the provenance of a data type, a data type may be derived from one or more existing data types. For example, a data type can add one or more variables to an existing data type making it a new data type.
domain: Data Type
range: Data Type
sub property of: wasDerivedFrom

last modified at time
type: DatatypeProperty
comment: Part of the provenance of a data type this property represents the most recent time that a data type was modified
domain: Data Type
range: dateTime

Collaboration
type: Class
subclass of: Thing
subclass of: Object
subclass of: Restriction
  all values from: Research Community
  on property: associated DCO Community
comment: Working with someone or a group of people to produce or create something

Research Community
type: Class
subclass of: Group
subclass of: Thing
subclass of: Agent
subclass of: Object
comment: A group of people who are working together in a specific science domain.

DCO Team
type: Class
subclass of: Object
subclass of: Team
comment: A group of people who are working together on a specific project or task.

Activity
type: Class
subclass of: Thing
subclass of: Object
subclass of: Restriction
  all values from: Research Community
  on property: associated DCO Community
subclass of: Restriction
  all values from: DCO Team
  on property: associated DCO Team
comment: Something that a person or group does or has done. For example, FieldStudy or Project.

Research Administration
type: Class
subclass of: ResearchOrganization
subclass of: Organization
subclass of: Thing
subclass of: Agent
subclass of: Object
comment: An group of people who administer the resources of a research community.

Research Advisory Committee
type: Class
subclass of: ResearchOrganization
subclass of: Organization
subclass of: Agent
subclass of: Thing
subclass of: Object
comment: a collection of individuals who bring unique knowledge and skills which augment the knowledge and skills of the research community

associated DCO Community
type: ObjectProperty
range: Research Community
comment: Relates a research community to an entity such as a publication or dataset.

associated DCO Team
type: ObjectProperty
range: DCO Team
sub property of: topObjectProperty
comment: Relates a group of people working together on a common task

related organization
type: ObjectProperty
type: SymmetricProperty
domain: Organization
range: Organization
sub property of: topObjectProperty
comment: Relates one organization to another organization.

File
type: Class
subclass of: Thing
subclass of: Object
subclass of: Restriction
  all values from: Research Community
  on property: associated DCO Community
subclass of: Restriction
  all values from: Literal
  on property: download URL
comment: A self contained collection of data or information available in a particular format and available to computer programs.

distribution (attachments or links)
type: ObjectProperty
domain: InformationResource
range: Distribution
sub property of: topObjectProperty
inverse of: Distribution (attachment or links) for
comment: Links a collection of data or information to a particular available form of that information. Each dataset might be available in different forms, these forms might represent different formats of the dataset or different endpoints. Examples of distributions include a downloadable CSV file, an API or an RSS feed.

files or links to files
type: ObjectProperty
domain: Distribution
range: File
sub property of: topObjectProperty
inverse of: file or link for
comment: Links a distribution of a datasets to a specific file that is a part of that distribution.

Is Dataset Of
type: ObjectProperty
domain: Dataset
range: Project
inverse of: Related datasets
comment: Links a dataset back to the project from which the data was collected.

Related datasets
type: FunctionalProperty
type: ObjectProperty
domain: Project
range: Dataset
inverse of: Is Dataset Of
comment: Relates a dataset to a project that created or used it.

Distribution (attachment or links) for
type: ObjectProperty
domain: Distribution
range: InformationResource
sub property of: topObjectProperty
inverse of: distribution (attachments or links)
comment: Links a distribution back to the information resource, such as publication or dataset.

file or link for
type: ObjectProperty
domain: File
range: Distribution
sub property of: topObjectProperty
inverse of: files or links to files
comment: Links a container of data or information back to the distribution that it is a part of.

Add Dataset
type: ObjectProperty
domain: Person
sub property of: topObjectProperty
comment: Links a person to a dataset that they participated in the creation of.

has data type
type: ObjectProperty
domain: Dataset
range: Data Type
inverse of: data type for dataset
comment: Links a collection of data to a particular kind of data item that is contained within it.

data type for dataset
type: ObjectProperty
domain: Data Type
range: Dataset
inverse of: has data type
comment: Links a particular kind of data item that is a part of a collection of data.

Instrument Initiative
type: Class
subclass of: Object
subclass of: Restriction
  all values from: Thing
  on property: hasSubjectArea
subclass of: Restriction
  all values from: Research Community
  on property: associated DCO Community
subclass of: Restriction
  all values from: int
  on property: importance
subclass of: Restriction
  cardinality: 1
  on property: importance
subclass of: Restriction
  on property: ARG_2000028
  some values from: Individual
subclass of: Restriction
  all values from: Document
  on property: Associated Publications
subclass of: Restriction
  all values from: DCO Team
  on property: associated DCO Team
subclass of: Restriction
  on property: ARG_2000028
  some values from: Individual
subclass of: Restriction
  on property: Related News Article
  some values from: Individual
subclass of: Restriction
  all values from: string
  on property: description
subclass of: Restriction
  on property: Related News Article
  some values from: Individual
comment: Activities related to the design and construction of instruments for the Deep Carbon Observatory

Instrument Design
type: Class
subclass of: Object
subclass of: Restriction
  all values from: Research Community
  on property: associated DCO Community
subclass of: Restriction
  all values from: DCO Team
  on property: associated DCO Team
subclass of: Restriction
  all values from: Project Update
  on property: Referenced By Update
comment: The activity of designing a physical piece of equipment

DCO Instrument
type: Class
subclass of: ERO_0000004
subclass of: Restriction
  all values from: Grant
  on property: hasFundingVehicle
subclass of: Restriction
  all values from: Project Update
  on property: Referenced By Update
subclass of: Restriction
  all values from: Document
  on property: ERO_0000460
subclass of: Restriction
  all values from: Point of Contact
  on property: point of contact
subclass of: Restriction
  all values from: string
  on property: description
subclass of: Restriction
  all values from: DCO Team
  on property: associated DCO Team
subclass of: Restriction
  all values from: Research Community
  on property: associated DCO Community
comment: a tool or device designed to do careful and exact work

Instrument used in (e.g. project)
type: ObjectProperty
domain: DCO Instrument
range: Project
inverse of: Has instrument
comment: Links an instrument to a project that uses the instrument to collect information related to the goal of the project.

Has instrument
type: ObjectProperty
domain: Project
range: DCO Instrument
inverse of: Instrument used in (e.g. project)
comment: Relates an instrument to a project that uses the instrument to collect data or information.

Created Instrument
type: ObjectProperty
domain: Project
range: DCO Instrument
inverse of: Instrument Created By
comment: Associates an instrument with the project that funded the design and or creation of the instrument.

Instrument Created By
type: ObjectProperty
domain: DCO Instrument
range: Project
inverse of: Created Instrument
comment: Links a project to an instrument that was designed or created as part of the project.

built during initiative
type: ObjectProperty
domain: DCO Instrument
range: Instrument Initiative
comment: The physical device (Instrument) was constructed during a particular activity
inverse of: built Instrument

built Instrument
type: ObjectProperty
domain: Instrument Initiative
range: DCO Instrument
comment: The physical device (Instrument) was built during a particular activity
inverse of: built during initiative

Related News Article
type: ObjectProperty
comment: links to news articles that report on the activities of designing and/or building an instrument
sub property of: topObjectProperty

designed during Initiative
type: ObjectProperty
domain: Instrument Design
range: Instrument Initiative
comment: The physical device (Instrument) was designed during a specific activity
inverse of: designed Instrument

designed Instrument
type: ObjectProperty
domain: Instrument Initiative
range: Instrument Design
comment: The physical device (Instrument) was designed during a specific activity
inverse of: designed during Initiative

of Instrument Design
type: ObjectProperty
domain: DCO Instrument
range: Instrument Design
comment: The physical device (Instrument) was designed by the design activity
inverse of: instrument Built

instrument Built
type: ObjectProperty
domain: Instrument Design
range: DCO Instrument
comment: The manifestation of a physical device (Instrument) given a design
inverse of: of Instrument Design

Point of Contact
type: Class
comment: The agent that is to be contacted for information related to a particular entity
subclass of: Restriction
  all values from: string
  on property: description
subclass of: Restriction
  all values from: DateTimeInterval
  on property: dateTimeInterval

point of contact
type: ObjectProperty
comment: Any information related to a particular entity can be gathered by contacting a particular agent
inverse of: point of contact for
range: Point of Contact

point of contact for
type: ObjectProperty
comment: The agent is a contact for a particular entity
inverse of: point of contact
domain: Point of Contact

contact
type: ObjectProperty
domain: Point of Contact
comment: The Agent to be contacted
range: Agent

contact information
type: DatatypeProperty
domain: Point of Contact
comment: The inforamtion to be used to contact the Agent, such as email address
range: string

elevation
type: DatatypeProperty
comment: Relates the height of a given element to a given level, especially sea level.

in language
type: DatatypeProperty
sub property of: topDataProperty
comment: A language, spoken or written, that an entity is represented by, such as a publication.

date modified
type: ObjectProperty
domain: InformationResource
range: DateTimeValue
sub property of: topObjectProperty
sub property of: dateTimeValue
comment: Specifies when an information resource, such as a publication or dataset, was last updated, either added or edited.

running title
type: FunctionalProperty
type: DatatypeProperty
domain: Project
comment: The label that is associated with a project that has not yet been made the official label.

download URL
type: DatatypeProperty
sub property of: topDataProperty
comment: The URL used to access an entity, such as a publication or dataset.

submitted by
type: ObjectProperty
range: Person
sub property of: topObjectProperty
comment: Relates an entity to a person who submitted that entity for usage in an activity.

access URL
type: DatatypeProperty
sub property of: topDataProperty
comment: The URL used to download an entity, such as a publication or dataset.

Information Links
type: DatatypeProperty
domain: Project
range: string
comment: A link pointing to a page or site that describes and contains information about a project.

importance
type: DatatypeProperty
comment: A helper property to help determine the importance of something to display on a page
range: int

is cited by
type: ObjectProperty
inverse of: cites
comment: A specific reference, such as a quotation or piece of data, is made by another entity

cites
type: ObjectProperty
inverse of: is cited by
comment: The entity has a specific reference, such as a quotation or dataset, from another entity