CreativeWork
type: Class
subclass of: Thing
comment: The most generic kind of creative work, including books, movies, photographs, software programs, etc.
source: source rNews

isPartOf
type: Property
comment: Indicates an item or CreativeWork that this item, or CreativeWork (in some sense), is part of.
domain includes: CreativeWork
inverse of: hasPart
range includes: CreativeWork
range includes: URL

Secondary Term
type: Collection
position: 5
preferred label: Terme secondaire @fr
definition: Fifth level of the Nomenclature Hierarchy.
definition: Cinquième niveau de la hiérarchie de Nomenclature. @fr

Collection
type: Class
subclass of: CreativeWork
isPartOf: bib.schema.org
comment: A collection of items e.g. creative works or products.

position
type: Property
comment: The position of an item in a series or sequence of items.
domain includes: CreativeWork
domain includes: ListItem
range includes: Text
range includes: Integer

StructuredValue
type: Class
subclass of: Intangible
comment: Structured values are used when the value of a property has a more complex structure than simply being a textual value or a reference to another thing.

value
type: Property
comment: The value of the quantitative value or property value node.\n\n* For QuantitativeValue and MonetaryAmount, the recommended type for values is 'Number'.\n* For PropertyValue, it can be 'Text;', 'Number', 'Boolean', or 'StructuredValue'.\n* Use values from 0123456789 (Unicode 'DIGIT ZERO' (U+0030) to 'DIGIT NINE' (U+0039)) rather than superficially similiar Unicode symbols.\n* Use '.' (Unicode 'FULL STOP' (U+002E)) rather than ',' to indicate a decimal point. Avoid using these symbols as a readability separator.
source: source GoodRelationsTerms
domain includes: MonetaryAmount
domain includes: PropertyValue
domain includes: QuantitativeValue
range includes: StructuredValue
range includes: Text
range includes: Boolean
range includes: Number

English
type: Concept
type: Language
language tag: en
in scheme: Nomenclature - Languages
notation: en
preferred label: anglais @fr

Language
type: Class
subclass of: LinguisticSystem
subclass of: Language
equivalent class: Language
label: Sprache @de
label: Lingvo @eo
label: Lenguaje @es
label: Kieli @fi
label: Langue @fr
label: Linguaggio @it
label: 言語 @ja
label: Taal @nl
label: Språk @no
label: Jezyk @pl
label: Idioma @pt
label: Язык @ru
label: Dil @tr
label: 语言 @zh
comment: A language used in spoken or written human communication, or in which a resource is written or recorded. It is recommended to use instances defined on the basis of ISO 639 codes, such as those in examples
comment: Una lengua utilizada en la comunicación oral o escrita entre personas, o en la que se escribe o graba un recurso. Se recomienda el uso de las instancias definidas según los códigos ISO 639, como los que aparecen en los ejemplos @es
comment: Une langue utilisée dans la communication orale ou écrite entre humains, ou dans laquelle une ressource est écrite ou enregistrée. Il est recommandé d'utiliser des instances définies sur la base d'un code ISO 639, comme dans les exemples @fr
comment: Een taal gebruikt in geschreven of gesproken communicatie tussen mensen of in welke een bron is geschreven of opgenomen. Het is aan te raden instanties te gebruiken gedefinieerd op basis van de ISO 630 codes, zoals in deze voorbeelden @nl
comment: 会話または記述による人間のコミュニケーションで使用される言語、または資源が記述または記録される言語。例にあるような、ISO 639コードに基づいて定義されたインスタンスを使用することが推奨される @ja
comment: Um idioma utilizado na comunicação oral ou escrita entre pessoas, ou na que se escreve ou grava um recurso. Recomenda-se a utilização das instâncias definidas segundo os códigos ISO 639, como os que aparecem nos excemplos @pt
somewhat same as: Language
example: fra
example: ja

natural order terms
type: Concept
preferred label: Termes en ordre naturel @fr
definition: Multiple-word terms or names that are arranged in the form used in speech or written text. Examples are "Rocking Chair" and "Wedding Dress". Distinguished from inverted terms.
definition: Termes à mots multiples qui sont organisés selon la forme utilisée à l'expression orale ou à l'écrit en anglais. Des exemples sont « Rocking Chair » et « Wedding Dress ». Se distingue des termes inversés. @fr
scope note: Used only for English terms (both single-word and multi-word)
scope note: Utilisé seulement pour les termes en anglais (pour les unitermes et ceux à mots multiples). @fr
example: Barber's Chair

inverted terms
type: Concept
preferred label: Termes inversés @fr
definition: Multiple-word terms that are arranged in the form used in back-of-book indexing or other similar situations. Examples are "Chair, Rocking" and "Dress, Wedding". Distinguished from natural order terms.
definition: Termes à mots multiples qui sont organisés selon la forme utilisée lors de l'indexation à la fin des livres en anglais ou lors de situations similaires. Des exemples sont « Chair, Rocking » et « Dress, Wedding ». Se distingue des termes en ordre naturel. @fr
scope note: Used only for English multi-word terms.
scope note: Utilisé seulement pour les termes à mots multiples en anglais. @fr
example: Chair, Barber's

French
type: Concept
type: Language
language tag: fr
in scheme: Nomenclature - Languages
notation: fr
preferred label: français @fr

name
type: Property
sub property of: label
equivalent property: title
comment: The name of the item.
domain includes: Thing
range includes: Text

citation
type: Property
comment: A citation or reference to another creative work, such as another publication, web page, scholarly article, etc.
domain includes: CreativeWork
range includes: CreativeWork
range includes: Text

feminine
type: gender
label: féminin @fr
comment: Of, relating to, or constituting the gender that ordinarily includes most words or grammatical forms referring to females.
comment: De, relatif à, ou constituant le genre qui inclut habituellement la plupart des mots ou formes grammaticales se référant aux femmes. @fr

gender
type: Class
prior version: Gender

alternateName
type: Property
comment: An alias for the item.
domain includes: Thing
range includes: Text

image
type: Property
comment: An image of the item. This can be a URL or a fully described ImageObject.
domain includes: Thing
range includes: ImageObject
range includes: URL

ImageObject
type: Class
subclass of: MediaObject
equivalent class: Image
comment: An image file.

contentUrl
type: Property
comment: Actual bytes of the media object, for example the image file or video file.
domain includes: MediaObject
range includes: URL

thumbnailUrl
type: Property
comment: A thumbnail image relevant to the Thing.
domain includes: CreativeWork
range includes: URL

creditText
type: Property
isPartOf: pending.schema.org
comment: Text that can be used to credit person(s) and/or organization(s) associated with a published Creative Work.
source: https://github.com/schemaorg/schemaorg/issues/2659
domain includes: CreativeWork
range includes: Text

Tertiary Term
type: Collection
position: 6
preferred label: Terme tertiaire @fr
definition: Sixth level of the Nomenclature Hierarchy.
definition: Sixième niveau de la hiérarchie de Nomenclature. @fr

masculine
type: gender
label: masculin @fr
comment: Of, relating to, or constituting the gender that ordinarily includes most words or grammatical forms referring to males.
comment: De, relatif à, ou constituant le genre qui inclut habituellement la plupart des mots ou formes grammaticales se référant aux hommes. @fr

Primary Term
type: Collection
position: 4
preferred label: Terme primaire @fr
definition: Fourth level of the Nomenclature Hierarchy, containing the most general object names.
definition: Quatrième niveau de la hiérarchie de Nomenclature, contenant le nom d’objet le plus générique. @fr

Subclass
type: Collection
position: 3
preferred label: Sous-classe @fr
definition: Third level of the Nomenclature Hierarchy.
definition: Troisième niveau de la hiérarchie de Nomenclature. @fr

Class
type: Collection
position: 2
preferred label: Classe @fr
definition: Second level of the Nomenclature hierarchy.
definition: Deuxième niveau de la hiérarchie de Nomenclature. @fr

Category
type: Collection
position: 1
preferred label: Catégorie @fr
definition: Top level of the Nomenclature hierarchy, containing the broadest level of object grouping by functional context.
definition: Premier niveau de la hiérarchie, contenant le niveau le plus générique du regroupement d’objets par contexte fonctionnel. @fr

Canadian French
type: Concept
type: Language
language tag: fr-ca
in scheme: Nomenclature - Languages
notation: fr-ca
preferred label: français canadien @fr

Cree
type: Concept
type: Language
language tag: cr
in scheme: Nomenclature - Languages
notation: cr
preferred label: cri @fr

Spanish
type: Concept
type: Language
language tag: es
in scheme: Nomenclature - Languages
notation: es
preferred label: espagnol @fr

Canadian English
type: Concept
type: Language
language tag: en-ca
in scheme: Nomenclature - Languages
notation: en-ca
preferred label: anglais canadien @fr

Inuktitut
type: Concept
type: Language
language tag: iu
in scheme: Nomenclature - Languages
notation: iu
preferred label: inuktitut @fr

ChangeSet
type: Class
subclass of: Class
  intersection of: Restriction
    min cardinality: 1
    on property: statement
  intersection of: Restriction
    on property: previousChangeSet
    max cardinality: 1
  intersection of: Restriction
    on property: subjectOfChange
    max cardinality: 1
  intersection of: Restriction
    on property: createdDate
    max cardinality: 1
  intersection of: Restriction
    on property: creatorName
    max cardinality: 1
  intersection of: Restriction
    on property: changeReason
    max cardinality: 1
definition: The encapsulation of a delta between two versions of a resource description
change note: Improved documentation
  creator: Ian Davis
  date: 2006-03-21
issued: 2005-12-14
history note: Added property cardinality restrictions
  creator: Ian Davis
  date: 2006-03-21

Update event
type: Class
subclass of: ResourceChangeEvent
comment: An event class describing that a particular resource was 'updated' in a dataset. This means that some triples having the associated resource as subject or object were modified/created/removed in the corresponding RDF model.

createdDate
type: DatatypeProperty
sub property of: date
domain: ChangeSet
definition: the date that the changeset was created
comment: The date should be in W3CDTF format
issued: 2005-12-14
history note: Made owl:DatatypeProperty
  creator: Ian Davis
  date: 2006-03-21

subjectOfChange
type: ObjectProperty
domain: ChangeSet
range: Resource
definition: the resource to which this set of changes applies
change note: Added definitition and documentation
  creator: Ian Davis
  date: 2006-03-21
issued: 2005-12-14
history note: Made owl:ObjectProperty
  creator: Ian Davis
  date: 2006-03-21

removal
type: ObjectProperty
sub property of: statement
domain: ChangeSet
range: Statement
definition: a triple to be removed from the resource description
change note: Added definitition and documentation
  creator: Ian Davis
  date: 2006-03-21
comment: By convention the subject of the triple being removed should be the same as the subjectOfChange
issued: 2005-12-14
history note: Made owl:ObjectProperty
  creator: Ian Davis
  date: 2006-03-21
history note: Made a sub-property of statement
  creator: Ian Davis
  date: 2006-03-21

addition
type: ObjectProperty
sub property of: statement
domain: ChangeSet
range: Statement
definition: a triple to be added to the resource description
change note: Added definitition and documentation
  creator: Ian Davis
  date: 2006-03-21
comment: By convention the subject of the triple being added should be the same as the subjectOfChange
issued: 2005-12-14
history note: Made a sub-property of statement
  creator: Ian Davis
  date: 2006-03-21
history note: Made owl:ObjectProperty
  creator: Ian Davis
  date: 2006-03-21

Remove event
type: Class
subclass of: ResourceChangeEvent
comment: An event class describing that a particular resource was 'removed' from a dataset. This means that all triples having the associated resource as subject or object were removed from the corresponding RDF model.

target resource
type: DatatypeProperty
domain: ResourceChangeEvent
range: anyURI
comment: The identifier (URI) of a resource that was affected by the corresponding event.

source resource
type: DatatypeProperty
domain: Move event
range: anyURI
comment: The identifier (URI) of a resource that was published under a new URI (i.e., when a MoveEvent occurred).

create event
type: Class
subclass of: ResourceChangeEvent
comment: An event class describing that a particular resource was 'created' in a dataset. This means that one or more triples having the associated resource as subject or object were created in the corresponding RDF model.

Move event
type: Class
subclass of: ResourceChangeEvent
comment: An event class describing that a particular resource was 'moved' in a dataset or between datasets. This means that all triples having the associated older resource as subject/object were replaced by triples having the target resource as subject/object in the corresponding RDF models.

inverted form of
type: ObjectProperty
sub property of: labelRelation
domain: Label
range: Label
label: forme inversée de @fr
comment: Used only for multi-word English labels
comment: Utilisée seulement pour les termes anglais à mots multiples @fr
example: "Box, Drink" is the inverted form of "Drink Box"
example: "Box, Drink" est la forme inversée de "Drink Box" @fr

Dataset
type: Class
subclass of: CreativeWork
equivalent class: Dataset
comment: A body of structured information describing some topic(s) of interest.
source: source DatasetClass

url
type: Property
comment: URL of the item.
domain includes: Thing
range includes: URL

contributor
type: Property
comment: A secondary contributor to the CreativeWork or Event.
domain includes: CreativeWork
domain includes: Event
range includes: Organization
range includes: Person

creator
type: Property
comment: The creator/author of this CreativeWork. This is the same as the Author property for CreativeWork.
domain includes: CreativeWork
domain includes: UserComments
range includes: Organization
range includes: Person

description
type: Property
equivalent property: description
comment: A description of the item.
domain includes: Thing
range includes: Text

inLanguage
type: Property
comment: The language of the content or performance or used in an action. Please use one of the language codes from the [IETF BCP 47 standard](http://tools.ietf.org/html/bcp47). See also availableLanguage.
source: https://github.com/schemaorg/schemaorg/issues/2382
domain includes: CreativeWork
domain includes: Event
domain includes: CommunicateAction
domain includes: BroadcastService
domain includes: LinkRole
domain includes: PronounceableText
domain includes: WriteAction
range includes: Language
range includes: Text

license
type: Property
comment: A license document that applies to this content, typically indicated by URL.
domain includes: CreativeWork
range includes: CreativeWork
range includes: URL

publisher
type: Property
comment: The publisher of the creative work.
domain includes: CreativeWork
range includes: Organization
range includes: Person

about
type: Property
comment: The subject matter of the content.
source: https://github.com/schemaorg/schemaorg/issues/1670
domain includes: CreativeWork
domain includes: Event
domain includes: CommunicateAction
inverse of: subjectOf
range includes: Thing

keywords
type: Property
comment: Keywords or tags used to describe some item. Multiple textual entries in a keywords list are typically delimited by commas, or by repeating the property.
domain includes: CreativeWork
domain includes: Organization
domain includes: Event
domain includes: Place
domain includes: Product
range includes: URL
range includes: Text
range includes: DefinedTerm

distribution
type: Property
comment: A downloadable form of this dataset, at a specific location, in a specific format.
domain includes: Dataset
range includes: DataDownload

dateCreated
type: Property
comment: The date on which the CreativeWork was created or the item was added to a DataFeed.
domain includes: CreativeWork
domain includes: DataFeedItem
range includes: Date
range includes: DateTime

DataDownload
type: Class
subclass of: MediaObject
equivalent class: Distribution
comment: A dataset in downloadable form.
source: source DatasetClass

encodingFormat
type: Property
comment: Media type typically expressed using a MIME format (see [IANA site](http://www.iana.org/assignments/media-types/media-types.xhtml) and [MDN reference](https://developer.mozilla.org/en-US/docs/Web/HTTP/Basics_of_HTTP/MIME_types)) e.g. application/zip for a SoftwareApplication binary, audio/mpeg for .mp3 etc.). In cases where a CreativeWork has several media type representations, encoding can be used to indicate each MediaObject alongside particular encodingFormat information. Unregistered or niche encoding and file formats can be indicated instead via the most appropriate URL, e.g. defining Web page or a Wikipedia/Wikidata entry.
domain includes: CreativeWork
domain includes: MediaObject
range includes: URL
range includes: Text

contentSize
type: Property
comment: File size in (mega/kilo) bytes.
domain includes: MediaObject
range includes: Text

primary topic
type: Property
type: ObjectProperty
type: FunctionalProperty
domain: Document
range: Thing
inverse of: isPrimaryTopicOf
comment: The primary topic of some page or document.
term status: stable

Organization
type: Class
subclass of: Thing
comment: An organization such as a school, NGO, corporation, club, etc.

Nomenclature for Museum Cataloging Ontology
type: Ontology
label: Ontologie de Nomenclature pour le catalogage des objets de musée @fr
created: 2022-02-28
modified: 2022-04-22
description: NOM Ontology defines the values used in Nomenclature for Museum Cataloging. It uses the SKOS, SKOS-XL, DC, DCT, FOAF, Schema, Lexinfo, Changeset ontologies.
description: L'ontologie de NOM définit les valeurs utilisées dans Nomenclature pour le catalogage des objets de musée. Elle utilise les ontologies SKOS, SKOS-XL, DC, DCT, FOAF, Schema, Lexinfo, Changeset. @fr
creator: Canadian Heritage Information Network (CHIN)
license: http://creativecommons.org/licenses/by/4.0/
format: meta/rdf-schema
preferred namespace prefix: nomo
version info: 1.0

Canadian Heritage Information Network (CHIN)
type: Agent
name: Réseau canadien d’information sur le patrimoine (RCIP) @fr
nickname: CHIN
nickname: RCIP

Agent
type: Class
equivalent class: Agent
comment: An agent (eg. person, group, software or physical artifact).
term status: stable

DefinedTermSet
type: Class
subclass of: CreativeWork
isPartOf: pending.schema.org
comment: A set of defined terms for example a set of categories or a classification scheme, a glossary, dictionary or enumeration.
source: https://github.com/schemaorg/schemaorg/issues/894

sameAs
type: Property
comment: URL of a reference Web page that unambiguously indicates the item's identity. E.g. the URL of the item's Wikipedia page, Wikidata entry, or official website.
domain includes: Thing
range includes: URL

thumbnail
type: Property
comment: Thumbnail image for an image or video.
domain includes: ImageObject
domain includes: VideoObject
range includes: ImageObject

language tag
type: DatatypeProperty
sub property of: identifier
domain: Language
label: tag de langue @fr
label: etiqueta @es
label: 言語タグ @ja
label: taal tag @nl
label: tag de idioma @pt
comment: The tag to use for the language, for example as value of xml:lang. See https://tools.ietf.org/html/bcp47
comment: Le tag à utiliser pour la langue, par exemple comme valeur de xml:lang. Voir https://tools.ietf.org/html/bcp47 @fr
comment: La etiqueta a utilizar para el lenguaje, por ejemplo como valor de xml:lang. Ver https://tools.ietf.org/html/bcp47 @es
comment: 例えばxml:langの値として、言語に用いるタグ。https://tools.ietf.org/html/bcp47を参照 @ja
comment: A tag para ser usada, por exemplo como valor de xml:lang. Ver https://tools.ietf.org/html/bcp47 @pt

name
type: Property
type: DatatypeProperty
sub property of: label
domain: Thing
range: Literal
comment: A name for some thing.
term status: testing

nickname
type: Property
type: DatatypeProperty
comment: A short informal nickname characterising an agent (includes login identifiers, IRC and other chat nicknames).
term status: testing

Nomenclature - Languages
type: ConceptScheme
title: Nomenclature - Langues @fr

Cree in Latin script
type: Concept
type: Language
language tag: cr-latn
in scheme: Nomenclature - Languages
notation: cr-latn
preferred label: cri en écriture latine @fr

Haida
type: Concept
type: Language
language tag: hai
in scheme: Nomenclature - Languages
notation: hai
preferred label: haïda @fr

Haida in Latin script
type: Concept
type: Language
language tag: hai-latn
in scheme: Nomenclature - Languages
notation: hai-latn
preferred label: haïda en écriture latine @fr

Iroquoian
type: Concept
type: Language
language tag: iro
in scheme: Nomenclature - Languages
notation: iro
preferred label: iroquoien @fr

Iroquoian in Latin script
type: Concept
type: Language
language tag: iro-latn
in scheme: Nomenclature - Languages
notation: iro-latn
preferred label: iroquoien en écriture latine @fr

Inuktitut in Latin script
type: Concept
type: Language
language tag: iu-latn
in scheme: Nomenclature - Languages
notation: iu-latn
preferred label: inuktitut en écriture latine @fr

Mohawk
type: Concept
type: Language
language tag: moh
in scheme: Nomenclature - Languages
notation: moh
preferred label: mohawk @fr

Mohawk in Latin script
type: Concept
type: Language
language tag: moh-latn
in scheme: Nomenclature - Languages
notation: moh-latn
preferred label: mohawk en écriture latine @fr

Ojibwa
type: Concept
type: Language
language tag: oj
in scheme: Nomenclature - Languages
notation: oj
preferred label: ojibwé @fr
alternative label: Ojibway
alternative label: Ojibwe
alternative label: odjibwé @fr
alternative label: ojibwa @fr

Ojibwa in Latin script
type: Concept
type: Language
language tag: oj-latn
in scheme: Nomenclature - Languages
notation: oj-latn
preferred label: ojibwé en écriture latine @fr
alternative label: Ojibway in Latin script
alternative label: Ojibwe in Latin script
alternative label: odjibwé en écriture latine @fr
alternative label: ojibwa en écriture latine @fr

Hebrew
type: Concept
type: Language
language tag: he
in scheme: Nomenclature - Languages
notation: he
preferred label: hébreu @fr

Hebrew in Latin script
type: Concept
type: Language
language tag: he-latn
in scheme: Nomenclature - Languages
notation: he-latn
preferred label: hébreu en écriture latine @fr

American Association for State and Local History (AASLH)
type: Agent
nickname: AASLH

Government of Nunavut
type: Agent
name: Gouvernement du Nunavut @fr
nickname: GN

Getty Research Institute
type: Agent
nickname: GRI

Art and Architecture Thesaurus
type: Dataset
uri space: http://vocab.getty.edu/aat

Wikidata
type: Dataset
uri space: http://www.wikidata.org/entity

Library of Congress Subject Headings
type: Dataset
uri space: http://id.loc.gov/authorities/subjects

German National Library Integrated Authority File
type: Dataset
name: Gemeinsame Normdatei @de
name: Fichier d’autorité intégré de la Bibliothèque nationale allemande @fr
uri space: http://d-nb.info/gnd

DBpedia
type: Dataset
uri space: http://dbpedia.org/resource
uri space: http://fr.dbpedia.org/resource

Encyclopedic and Unified Alphabetical Directory of Authority-Matter (RAMEAU)
type: Dataset
name: Répertoire d'autorité-matière encyclopédique et alphabétique unifié (RAMEAU) @fr
uri space: http://data.bnf.fr/ark:/12148

Liste d’autorité Typologie documentaire pour l'indexation des archives locales
type: Dataset
uri space: http://data.culture.fr/thesaurus/resource/ark:/67717/T3

Thésaurus de la désignation des objets mobiliers
type: Dataset
uri space: http://data.culture.fr/thesaurus/resource/ark:/67717/T69

Thésaurus de la désignation des œuvres architecturales et des espaces aménagés
type: Dataset
uri space: http://data.culture.fr/thesaurus/resource/ark:/67717/T96

Liste d’autorités Dénomination - Joconde
type: Dataset
uri space: http://data.culture.fr/thesaurus/resource/ark:/67717/T505

Type
type: Class
subclass of: E28 Conceptual Object
label: Typus @de
label: Τύπος @el
label: Tipo @pt
label: Тип @ru
label: 类型 @zh
comment: This class comprises concepts denoted by terms from thesauri and controlled vocabularies used to characterize and classify instances of CIDOC CRM classes. Instances of E55 Type represent concepts in contrast to instances of E41 Appellation which are used to name instances of CIDOC CRM classes. E55 Type is the CIDOC CRM’s interface to domain specific ontologies and thesauri. These can be represented in the CIDOC CRM as subclasses of E55 Type, forming hierarchies of terms, i.e., instances of E55 Type linked via P127 has broader term (has narrower term): E55 Type. Such hierarchies may be extended with additional properties.