Spatial Uncertainty and Real Estate (SURE) Ontology
type: Ontology
title: Ontologie Incertitude Spatiale et Immobilier (SURE) @fr
description: An ontology to describe Real Estate and uncertain spatial data extracted from real estate advertisements.
description: Une ontologie pour la description de des données immobilières et spatiales floues issues d'annonces immobilières. @fr
issued: 2023-03-06
contributor: Fabien Gandon
contributor: Lucie Cadorel
contributor: me
creator: Lucie Cadorel
license: https://creativecommons.org/licenses/by/4.0/
preferred namespace prefix: sure
preferred namespace uri: http://ns.inria.fr/sure

Fabien Gandon
type: Person
affiliation: inria.fr

Lucie Cadorel
type: Person
affiliation: inria.fr

Andrea Tettamanzi
type: Person
affiliation: univ-cotedazur.fr

Alpha-cut
type: Class
subclass of: Geometry
comment: Given a fuzzy set A, an Alpha Cut is a crisp set of A which the degree of membership of each element is greater or equal to a certain alpha
label: Alpha-coupe @fr

RealEstate
type: Class
subclass of: Feature
label: Real estate
label: Bien immobilier @fr

AbsolutePlace
type: Class
subclass of: Feature
comment: A Place is compound of a place-name (Nice, France, etc.) and/or a common noun (city, downtown, street, etc.) expressing the location of the real estate.
example: Nice, Promenade des Anglais, Avenue Jean Médecin, Vieux Nice, Centre-ville @fr
label: Lieu Absolu @fr

Relative Place
type: Class
subclass of: Feature
comment: A relative place is compound of a place-name and/or a common noun, and a spatial relatio (nearby, 5 minutes away, etc.)
example: proche de la Promenade des Anglais, à 5 minutes de la gare, à proximité des commerces, non loin du Vieux Nice @fr
label: Lieu Relatif @fr

Amenity
type: Class
subclass of: Feature
comment: An amenity is a type of place that describe a service or natural area nearby the real estate. An amenity might enhance the value of the real estate.
example: école, gare, commerce, aéroport, plage, mer, montagne @fr
label: Amenité @fr

Locative Area
type: Class
subclass of: Feature
comment: A locative area is a type of place that locate the real estate
example: centre-ville, quartier, avenue, rue @fr
label: Zone de localisation @fr

Bright
type: Class
comment: The Real Estate is defined as bright
label: Lumineux @fr
subclass of: Class

Quiet
type: Class
comment: The Real Estate is defined as quiet
label: Calme @fr

Luxury
type: Class
comment: The Real Estate is defined as a luxury property
label: Standing @fr
subclass of: Class

Toponym
type: Class
label: Toponyme @fr

Geographic Feature
type: Class
label: Type de lieu @fr

SpatialRelation
type: Class
label: Relation Spatiale @fr

Mode of transportation
type: Class
label: Mode de transport @fr

has confidence score
type: Property
domain: Annotation
range: double
type: DataProperty

has alpha
type: Property
domain: Alpha-cut
range: double
type: DataProperty

has price
type: Property
domain: RealEstate
range: double
type: DataProperty

has anchor
type: ObjectProperty
domain: Relative Place
range: Feature

has description
type: DataProperty
domain: RealEstate
range: Text

has spatial relation
type: DataProperty
domain: Relative Place
range: string