Dublin Core Metadata Element Set, Version 1.1
Date Modified: 2012-06-14
publisher: DCMI

Contributor
description: Examples of a Contributor include a person, an organization, or a service. Typically, the name of a Contributor should be used to indicate the entity. @en
Has Version: contributor-006
issued: 1999-07-02
Date Modified: 2008-01-14
type: AnnotationProperty
comment: An entity responsible for making contributions to the resource. @en
note: A second property with the same name as this property has been declared in the dcterms: namespace (http://purl.org/dc/terms/). See the Introduction to the document "DCMI Metadata Terms" (http://dublincore.org/documents/dcmi-terms/) for an explanation. @en

Creator
description: Examples of a Creator include a person, an organization, or a service. Typically, the name of a Creator should be used to indicate the entity. @en
Has Version: creator-006
issued: 1999-07-02
Date Modified: 2008-01-14
type: AnnotationProperty
comment: An entity primarily responsible for making the resource. @en
note: A second property with the same name as this property has been declared in the dcterms: namespace (http://purl.org/dc/terms/). See the Introduction to the document "DCMI Metadata Terms" (http://dublincore.org/documents/dcmi-terms/) for an explanation. @en

Date
description: Date may be used to express temporal information at any level of granularity. Recommended best practice is to use an encoding scheme, such as the W3CDTF profile of ISO 8601 [W3CDTF]. @en
Has Version: date-006
issued: 1999-07-02
Date Modified: 2008-01-14
type: AnnotationProperty
comment: A point or period of time associated with an event in the lifecycle of the resource. @en
note: A second property with the same name as this property has been declared in the dcterms: namespace (http://purl.org/dc/terms/). See the Introduction to the document "DCMI Metadata Terms" (http://dublincore.org/documents/dcmi-terms/) for an explanation. @en

Description
description: Description may include but is not limited to: an abstract, a table of contents, a graphical representation, or a free-text account of the resource. @en
Has Version: description-006
issued: 1999-07-02
Date Modified: 2008-01-14
type: AnnotationProperty
comment: An account of the resource. @en
note: A second property with the same name as this property has been declared in the dcterms: namespace (http://purl.org/dc/terms/). See the Introduction to the document "DCMI Metadata Terms" (http://dublincore.org/documents/dcmi-terms/) for an explanation. @en

Identifier
description: Recommended best practice is to identify the resource by means of a string conforming to a formal identification system. @en
Has Version: identifier-006
issued: 1999-07-02
Date Modified: 2008-01-14
type: AnnotationProperty
comment: An unambiguous reference to the resource within a given context. @en
note: A second property with the same name as this property has been declared in the dcterms: namespace (http://purl.org/dc/terms/). See the Introduction to the document "DCMI Metadata Terms" (http://dublincore.org/documents/dcmi-terms/) for an explanation. @en

Publisher
description: Examples of a Publisher include a person, an organization, or a service. Typically, the name of a Publisher should be used to indicate the entity. @en
Has Version: publisher-006
issued: 1999-07-02
Date Modified: 2008-01-14
type: AnnotationProperty
comment: An entity responsible for making the resource available. @en
note: A second property with the same name as this property has been declared in the dcterms: namespace (http://purl.org/dc/terms/). See the Introduction to the document "DCMI Metadata Terms" (http://dublincore.org/documents/dcmi-terms/) for an explanation. @en

Relation
description: Recommended best practice is to identify the related resource by means of a string conforming to a formal identification system. @en
Has Version: relation-006
issued: 1999-07-02
Date Modified: 2008-01-14
type: AnnotationProperty
comment: A related resource. @en
note: A second property with the same name as this property has been declared in the dcterms: namespace (http://purl.org/dc/terms/). See the Introduction to the document "DCMI Metadata Terms" (http://dublincore.org/documents/dcmi-terms/) for an explanation. @en

Source
description: The described resource may be derived from the related resource in whole or in part. Recommended best practice is to identify the related resource by means of a string conforming to a formal identification system. @en
Has Version: source-006
issued: 1999-07-02
Date Modified: 2008-01-14
type: AnnotationProperty
comment: A related resource from which the described resource is derived. @en
note: A second property with the same name as this property has been declared in the dcterms: namespace (http://purl.org/dc/terms/). See the Introduction to the document "DCMI Metadata Terms" (http://dublincore.org/documents/dcmi-terms/) for an explanation. @en

Title
Has Version: title-006
issued: 1999-07-02
Date Modified: 2008-01-14
type: AnnotationProperty
comment: A name given to the resource. @en
note: A second property with the same name as this property has been declared in the dcterms: namespace (http://purl.org/dc/terms/). See the Introduction to the document "DCMI Metadata Terms" (http://dublincore.org/documents/dcmi-terms/) for an explanation. @en

DCMI Metadata Terms - other
Date Modified: 2012-06-14
publisher: DCMI
type: NamedIndividual

DCMI Box
Has Version: Box-003
issued: 2000-07-11
Date Modified: 2008-01-14
type: Datatype
type: NamedIndividual
comment: The set of regions in space defined by their geographic coordinates according to the DCMI Box Encoding Scheme. @en
zobacz też IRI: dcmi-box

DCMI Type Vocabulary
Has Version: DCMIType-005
issued: 2000-07-11
Date Modified: 2012-06-14
type: VocabularyEncodingScheme
type: NamedIndividual
comment: The set of classes specified by the DCMI Type Vocabulary, used to categorize the nature or genre of the resource. @en
zobacz też IRI: dcmitype

DDC
Has Version: DDC-003
issued: 2000-07-11
Date Modified: 2008-01-14
type: VocabularyEncodingScheme
type: NamedIndividual
comment: The set of conceptual resources specified by the Dewey Decimal Classification. @en
zobacz też IRI: dewey

IMT
Has Version: IMT-004
issued: 2000-07-11
Date Modified: 2008-01-14
type: VocabularyEncodingScheme
type: NamedIndividual
comment: The set of media types specified by the Internet Assigned Numbers Authority. @en
zobacz też IRI: media-types

ISO 3166
Has Version: ISO3166-004
issued: 2000-07-11
Date Modified: 2008-01-14
type: Datatype
type: NamedIndividual
comment: The set of codes listed in ISO 3166-1 for the representation of names of countries. @en
zobacz też IRI: list-en1.html

ISO 639-2
Has Version: ISO639-2-003
issued: 2000-07-11
Date Modified: 2008-01-14
type: Datatype
type: NamedIndividual
comment: The three-letter alphabetic codes listed in ISO639-2 for the representation of names of languages. @en
zobacz też IRI: langhome.html

ISO 639-3
Has Version: ISO639-3-001
issued: 2008-01-14
type: Datatype
type: NamedIndividual
comment: The set of three-letter codes listed in ISO 639-3 for the representation of names of languages. @en
zobacz też IRI: iso639-3

LCC
Has Version: LCC-003
issued: 2000-07-11
Date Modified: 2008-01-14
type: VocabularyEncodingScheme
type: NamedIndividual
comment: The set of conceptual resources specified by the Library of Congress Classification. @en
zobacz też IRI: lcco.html

LCSH
Has Version: LCSH-003
issued: 2000-07-11
Date Modified: 2008-01-14
type: VocabularyEncodingScheme
type: NamedIndividual
comment: The set of labeled concepts specified by the Library of Congress Subject Headings. @en

MeSH
Has Version: MESH-003
issued: 2000-07-11
Date Modified: 2008-01-14
type: VocabularyEncodingScheme
type: NamedIndividual
comment: The set of labeled concepts specified by the Medical Subject Headings. @en
zobacz też IRI: meshhome.html

NLM
Has Version: NLM-002
issued: 2005-06-13
Date Modified: 2008-01-14
type: VocabularyEncodingScheme
type: NamedIndividual
comment: The set of conceptual resources specified by the National Library of Medicine Classification. @en
zobacz też IRI: class

DCMI Period
Has Version: Period-003
issued: 2000-07-11
Date Modified: 2008-01-14
type: Datatype
type: NamedIndividual
comment: The set of time intervals defined by their limits according to the DCMI Period Encoding Scheme. @en
zobacz też IRI: dcmi-period

DCMI Point
Has Version: Point-003
issued: 2000-07-11
Date Modified: 2008-01-14
type: Datatype
type: NamedIndividual
comment: The set of points in space defined by their geographic coordinates according to the DCMI Point Encoding Scheme. @en
zobacz też IRI: dcmi-point

RFC 1766
Has Version: RFC1766-003
issued: 2000-07-11
Date Modified: 2008-01-14
type: Datatype
type: NamedIndividual
comment: The set of tags, constructed according to RFC 1766, for the identification of languages. @en
zobacz też IRI: rfc1766.txt

RFC 3066
description: RFC 3066 has been obsoleted by RFC 4646. @en
Has Version: RFC3066-002
issued: 2002-07-13
Date Modified: 2008-01-14
type: Datatype
type: NamedIndividual
comment: The set of tags constructed according to RFC 3066 for the identification of languages. @en
zobacz też IRI: rfc3066.txt

RFC 4646
description: RFC 4646 obsoletes RFC 3066. @en
Has Version: RFC4646-001
issued: 2008-01-14
type: Datatype
type: NamedIndividual
comment: The set of tags constructed according to RFC 4646 for the identification of languages. @en
zobacz też IRI: rfc4646.txt

RFC 5646
description: RFC 5646 obsoletes RFC 4646. @en
Has Version: RFC5646-001
issued: 2010-10-11
type: Datatype
type: NamedIndividual
comment: The set of tags constructed according to RFC 5646 for the identification of languages. @en
zobacz też IRI: rfc5646.txt

TGN
Has Version: TGN-003
issued: 2000-07-11
Date Modified: 2008-01-14
type: VocabularyEncodingScheme
type: NamedIndividual
comment: The set of places specified by the Getty Thesaurus of Geographic Names. @en
zobacz też IRI: index.html

UDC
Has Version: UDC-003
issued: 2000-07-11
Date Modified: 2008-01-14
type: VocabularyEncodingScheme
type: NamedIndividual
comment: The set of conceptual resources specified by the Universal Decimal Classification. @en
zobacz też IRI: www.udcc.org

URI
Has Version: URI-003
issued: 2000-07-11
Date Modified: 2008-01-14
type: Datatype
type: NamedIndividual
comment: The set of identifiers constructed according to the generic syntax for Uniform Resource Identifiers as specified by the Internet Engineering Task Force. @en
zobacz też IRI: rfc3986.txt

W3C-DTF
Has Version: W3CDTF-003
issued: 2000-07-11
Date Modified: 2008-01-14
type: Datatype
type: NamedIndividual
comment: The set of dates and times constructed according to the W3C Date and Time Formats Specification. @en
zobacz też IRI: NOTE-datetime

Abstract
Has Version: abstract-003
issued: 2000-07-11
Date Modified: 2008-01-14
type: AnnotationProperty
type: NamedIndividual
comment: A summary of the resource. @en
sub property of: Description

Alternative Title
description: The distinction between titles and alternative titles is application-specific. @en
Has Version: alternative-003
issued: 2000-07-11
Date Modified: 2010-10-11
type: AnnotationProperty
type: DatatypeProperty
type: NamedIndividual
comment: An alternative name for the resource. @en
range: Literal
sub property of: Title

Date Available
Has Version: available-003
issued: 2000-07-11
Date Modified: 2008-01-14
type: AnnotationProperty
type: DatatypeProperty
type: NamedIndividual
comment: Date (often a range) that the resource became or will become available. @en
range: Literal
sub property of: Date

Bibliographic Citation
description: Recommended practice is to include sufficient bibliographic detail to identify the resource as unambiguously as possible. @en
Has Version: bibliographicCitation-002
issued: 2003-02-15
Date Modified: 2008-01-14
type: AnnotationProperty
type: DatatypeProperty
type: NamedIndividual
comment: A bibliographic reference for the resource. @en
domain: BibliographicResource
range: Literal
sub property of: Identifier

Contributor
description: Examples of a Contributor include a person, an organization, or a service. @en
Has Version: contributorT-001
issued: 2008-01-14
Date Modified: 2010-10-11
type: AnnotationProperty
type: NamedIndividual
type: ObjectProperty
comment: An entity responsible for making contributions to the resource. @en
range: Agent
sub property of: Contributor

Date Created
Has Version: created-003
issued: 2000-07-11
Date Modified: 2008-01-14
type: AnnotationProperty
type: DatatypeProperty
type: NamedIndividual
comment: Date of creation of the resource. @en
range: Literal
sub property of: Date

Creator
description: Examples of a Creator include a person, an organization, or a service. @en
Has Version: creatorT-002
issued: 2008-01-14
Date Modified: 2010-10-11
type: AnnotationProperty
type: NamedIndividual
type: ObjectProperty
comment: An entity primarily responsible for making the resource. @en
range: Agent
sub property of: Creator
sub property of: Contributor
inverse of: jest utworzony przez

Date
description: Date may be used to express temporal information at any level of granularity. Recommended best practice is to use an encoding scheme, such as the W3CDTF profile of ISO 8601 [W3CDTF]. @en
Has Version: dateT-001
issued: 2008-01-14
Date Modified: 2008-01-14
type: AnnotationProperty
type: DatatypeProperty
type: NamedIndividual
comment: A point or period of time associated with an event in the lifecycle of the resource. @en
range: Literal
sub property of: Date

Date Accepted
description: Examples of resources to which a Date Accepted may be relevant are a thesis (accepted by a university department) or an article (accepted by a journal). @en
Has Version: dateAccepted-002
issued: 2002-07-13
Date Modified: 2008-01-14
type: AnnotationProperty
type: DatatypeProperty
type: NamedIndividual
comment: Date of acceptance of the resource. @en
range: Literal
sub property of: Date

Date Copyrighted
Has Version: dateCopyrighted-002
issued: 2002-07-13
Date Modified: 2008-01-14
type: AnnotationProperty
type: DatatypeProperty
type: NamedIndividual
comment: Date of copyright. @en
range: Literal
sub property of: Date

Date Submitted
description: Examples of resources to which a Date Submitted may be relevant are a thesis (submitted to a university department) or an article (submitted to a journal). @en
Has Version: dateSubmitted-002
issued: 2002-07-13
Date Modified: 2008-01-14
type: AnnotationProperty
type: DatatypeProperty
type: NamedIndividual
comment: Date of submission of the resource. @en
range: Literal
sub property of: Date

Description
description: Description may include but is not limited to: an abstract, a table of contents, a graphical representation, or a free-text account of the resource. @en
Has Version: descriptionT-001
issued: 2008-01-14
Date Modified: 2008-01-14
type: AnnotationProperty
type: NamedIndividual
comment: An account of the resource. @en
sub property of: Description

Has Format
Has Version: hasFormat-003
issued: 2000-07-11
Date Modified: 2008-01-14
type: AnnotationProperty
type: NamedIndividual
comment: A related resource that is substantially the same as the pre-existing described resource, but in another format. @en
sub property of: Relation
note: This term is intended to be used with non-literal values as defined in the DCMI Abstract Model (http://dublincore.org/documents/abstract-model/). As of December 2007, the DCMI Usage Board is seeking a way to express this intention with a formal range declaration. @en

Has Part
Has Version: hasPart-003
issued: 2000-07-11
Date Modified: 2008-01-14
type: AnnotationProperty
type: NamedIndividual
comment: A related resource that is included either physically or logically in the described resource. @en
sub property of: Relation
note: This term is intended to be used with non-literal values as defined in the DCMI Abstract Model (http://dublincore.org/documents/abstract-model/). As of December 2007, the DCMI Usage Board is seeking a way to express this intention with a formal range declaration. @en

Has Version
Has Version: hasVersion-003
issued: 2000-07-11
Date Modified: 2008-01-14
type: AnnotationProperty
type: NamedIndividual
comment: A related resource that is a version, edition, or adaptation of the described resource. @en
sub property of: Relation
note: This term is intended to be used with non-literal values as defined in the DCMI Abstract Model (http://dublincore.org/documents/abstract-model/). As of December 2007, the DCMI Usage Board is seeking a way to express this intention with a formal range declaration. @en

Identifier
description: Recommended best practice is to identify the resource by means of a string conforming to a formal identification system. @en
Has Version: identifierT-001
issued: 2008-01-14
Date Modified: 2008-01-14
type: AnnotationProperty
type: DatatypeProperty
type: NamedIndividual
comment: An unambiguous reference to the resource within a given context. @en
range: Literal
sub property of: Identifier

Is Format Of
Has Version: isFormatOf-003
issued: 2000-07-11
Date Modified: 2008-01-14
type: AnnotationProperty
type: NamedIndividual
comment: A related resource that is substantially the same as the described resource, but in another format. @en
sub property of: Relation
note: This term is intended to be used with non-literal values as defined in the DCMI Abstract Model (http://dublincore.org/documents/abstract-model/). As of December 2007, the DCMI Usage Board is seeking a way to express this intention with a formal range declaration. @en

Is Part Of
Has Version: isPartOf-003
issued: 2000-07-11
Date Modified: 2008-01-14
type: AnnotationProperty
type: NamedIndividual
comment: A related resource in which the described resource is physically or logically included. @en
sub property of: Relation
note: This term is intended to be used with non-literal values as defined in the DCMI Abstract Model (http://dublincore.org/documents/abstract-model/). As of December 2007, the DCMI Usage Board is seeking a way to express this intention with a formal range declaration. @en

Is Referenced By
Has Version: isReferencedBy-003
issued: 2000-07-11
Date Modified: 2008-01-14
type: AnnotationProperty
type: NamedIndividual
comment: A related resource that references, cites, or otherwise points to the described resource. @en
sub property of: Relation
note: This term is intended to be used with non-literal values as defined in the DCMI Abstract Model (http://dublincore.org/documents/abstract-model/). As of December 2007, the DCMI Usage Board is seeking a way to express this intention with a formal range declaration. @en

Is Replaced By
Has Version: isReplacedBy-003
issued: 2000-07-11
Date Modified: 2008-01-14
type: AnnotationProperty
type: NamedIndividual
comment: A related resource that supplants, displaces, or supersedes the described resource. @en
sub property of: Relation
note: This term is intended to be used with non-literal values as defined in the DCMI Abstract Model (http://dublincore.org/documents/abstract-model/). As of December 2007, the DCMI Usage Board is seeking a way to express this intention with a formal range declaration. @en

Is Required By
Has Version: isRequiredBy-003
issued: 2000-07-11
Date Modified: 2008-01-14
type: AnnotationProperty
type: NamedIndividual
comment: A related resource that requires the described resource to support its function, delivery, or coherence. @en
sub property of: Relation
note: This term is intended to be used with non-literal values as defined in the DCMI Abstract Model (http://dublincore.org/documents/abstract-model/). As of December 2007, the DCMI Usage Board is seeking a way to express this intention with a formal range declaration. @en

Is Version Of
description: Changes in version imply substantive changes in content rather than differences in format. @en
Has Version: isVersionOf-003
issued: 2000-07-11
Date Modified: 2008-01-14
type: AnnotationProperty
type: NamedIndividual
comment: A related resource of which the described resource is a version, edition, or adaptation. @en
sub property of: Relation
note: This term is intended to be used with non-literal values as defined in the DCMI Abstract Model (http://dublincore.org/documents/abstract-model/). As of December 2007, the DCMI Usage Board is seeking a way to express this intention with a formal range declaration. @en

Date Issued
Has Version: issued-003
issued: 2000-07-11
Date Modified: 2008-01-14
type: AnnotationProperty
type: DatatypeProperty
type: NamedIndividual
comment: Date of formal issuance (e.g., publication) of the resource. @en
range: Literal
sub property of: Date

Date Modified
Has Version: modified-003
issued: 2000-07-11
Date Modified: 2008-01-14
type: AnnotationProperty
type: DatatypeProperty
type: NamedIndividual
comment: Date on which the resource was changed. @en
range: Literal
sub property of: Date

References
Has Version: references-003
issued: 2000-07-11
Date Modified: 2008-01-14
type: AnnotationProperty
type: NamedIndividual
comment: A related resource that is referenced, cited, or otherwise pointed to by the described resource. @en
sub property of: Relation
note: This term is intended to be used with non-literal values as defined in the DCMI Abstract Model (http://dublincore.org/documents/abstract-model/). As of December 2007, the DCMI Usage Board is seeking a way to express this intention with a formal range declaration. @en

Relation
description: Recommended best practice is to identify the related resource by means of a string conforming to a formal identification system. @en
Has Version: relationT-001
issued: 2008-01-14
Date Modified: 2008-01-14
type: AnnotationProperty
type: NamedIndividual
comment: A related resource. @en
sub property of: Relation
note: This term is intended to be used with non-literal values as defined in the DCMI Abstract Model (http://dublincore.org/documents/abstract-model/). As of December 2007, the DCMI Usage Board is seeking a way to express this intention with a formal range declaration. @en

Replaces
Has Version: replaces-003
issued: 2000-07-11
Date Modified: 2008-01-14
type: AnnotationProperty
type: NamedIndividual
comment: A related resource that is supplanted, displaced, or superseded by the described resource. @en
sub property of: Relation
note: This term is intended to be used with non-literal values as defined in the DCMI Abstract Model (http://dublincore.org/documents/abstract-model/). As of December 2007, the DCMI Usage Board is seeking a way to express this intention with a formal range declaration. @en

Requires
Has Version: requires-003
issued: 2000-07-11
Date Modified: 2008-01-14
type: AnnotationProperty
type: NamedIndividual
comment: A related resource that is required by the described resource to support its function, delivery, or coherence. @en
sub property of: Relation
note: This term is intended to be used with non-literal values as defined in the DCMI Abstract Model (http://dublincore.org/documents/abstract-model/). As of December 2007, the DCMI Usage Board is seeking a way to express this intention with a formal range declaration. @en

Source
description: The described resource may be derived from the related resource in whole or in part. Recommended best practice is to identify the related resource by means of a string conforming to a formal identification system. @en
Has Version: sourceT-001
issued: 2008-01-14
Date Modified: 2008-01-14
type: AnnotationProperty
type: NamedIndividual
comment: A related resource from which the described resource is derived. @en
sub property of: Source
sub property of: Relation
note: This term is intended to be used with non-literal values as defined in the DCMI Abstract Model (http://dublincore.org/documents/abstract-model/). As of December 2007, the DCMI Usage Board is seeking a way to express this intention with a formal range declaration. @en

Table Of Contents
Has Version: tableOfContents-003
issued: 2000-07-11
Date Modified: 2008-01-14
type: AnnotationProperty
type: NamedIndividual
comment: A list of subunits of the resource. @en
sub property of: Description

Title
Has Version: titleT-002
issued: 2008-01-14
Date Modified: 2010-10-11
type: AnnotationProperty
type: DatatypeProperty
type: NamedIndividual
comment: A name given to the resource. @en
range: Literal
sub property of: Title

Date Valid
Has Version: valid-003
issued: 2000-07-11
Date Modified: 2008-01-14
type: AnnotationProperty
type: DatatypeProperty
type: NamedIndividual
comment: Date (often a range) of validity of a resource. @en
range: Literal
sub property of: Date

Zmiana właściciela
type: Class
comment: This class comprises transfers of physical custody of objects between instances of E39 Actor. The recording of the donor and/or recipient is optional. It is possible that in an instance of E10 Transfer of Custody there is either no donor or no recipient. Depending on the circumstances it may describe: 1. the beginning of custody 2. the end of custody 3. the transfer of custody 4. the receipt of custody from an unknown source 5. the declared loss of an object The distinction between the legal responsibility for custody and the actual physical possession of the object should be expressed using the property P2 has type (is type of). A specific case of transfer of custody is theft. The interpretation of the museum notion of "accession" differs between institutions. The CRM therefore models legal ownership and physical custody separately. Institutions will then model their specific notions of accession and deaccession as combinations of these. @en
label: Changement de détenteur @fr
label: Transfer of Custody @en
label: Transferência de Custódia @pt
label: Übertragung des Gewahrsams @de
label: Μεταβίβαση Κατοχής @el
label: Передача Опеки @ru
label: 保管作业转移 @zh
subclass of: Działanie

Modyfikacja
type: Class
comment: This class comprises all instances of E7 Activity that create, alter or change E24 Physical Man-Made Thing. This class includes the production of an item from raw materials, and other so far undocumented objects, and the preventive treatment or restoration of an object for conservation. Since the distinction between modification and production is not always clear, modification is regarded as the more generally applicable concept. This implies that some items may be consumed or destroyed in a Modification, and that others may be produced as a result of it. An event should also be documented using E81 Transformation if it results in the destruction of one or more objects and the simultaneous production of others using parts or material from the originals. In this case, the new items have separate identities. If the instance of the E29 Design or Procedure utilized for the modification prescribes the use of specific materials, they should be documented using property P68 foresees use of (use foreseen by): E57 Material of E29 Design or Procedure, rather than via P126 employed (was employed in): E57 Material. @en
label: Bearbeitung @de
label: Modification @en
label: Modificação @pt
label: Τροποποίηση @el
label: Событие Изменения @ru
label: 修改 @zh
subclass of: Działanie

Produkcja
type: Class
comment: This class comprises activities that are designed to, and succeed in, creating one or more new items. It specializes the notion of modification into production. The decision as to whether or not an object is regarded as new is context sensitive. Normally, items are considered “new” if there is no obvious overall similarity between them and the consumed items and material used in their production. In other cases, an item is considered “new” because it becomes relevant to documentation by a modification. For example, the scribbling of a name on a potsherd may make it a voting token. The original potsherd may not be worth documenting, in contrast to the inscribed one. This entity can be collective: the printing of a thousand books, for example, would normally be considered a single event. An event should also be documented using E81 Transformation if it results in the destruction of one or more objects and the simultaneous production of others using parts or material from the originals. In this case, the new items have separate identities and matter is preserved, but identity is not. @en
label: Herstellung @de
label: Production @en
label: Produção @pt
label: Παραγωγή @el
label: Событие Производства @ru
label: 生产 @zh
subclass of: Modyfikacja
subclass of: Początek istnienia

Przypisanie atrybutu
type: Class
comment: This class comprises the actions of making assertions about properties of an object or any relation between two items or concepts. This class allows the documentation of how the respective assignment came about, and whose opinion it was. All the attributes or properties assigned in such an action can also be seen as directly attached to the respective item or concept, possibly as a collection of contradictory values. All cases of properties in this model that are also described indirectly through an action are characterised as "short cuts" of this action. This redundant modelling of two alternative views is preferred because many implementations may have good reasons to model either the action or the short cut, and the relation between both alternatives can be captured by simple rules. In particular, the class describes the actions of people making propositions and statements during certain museum procedures, e.g. the person and date when a condition statement was made, an identifier was assigned, the museum object was measured, etc. Which kinds of such assignments and statements need to be documented explicitly in structures of a schema rather than free text, depends on if this information should be accessible by structured queries. @en
label: Affectation d'attribut @fr
label: Atribuição de Característica @pt
label: Attribute Assignment @en
label: Merkmalszuweisung @de
label: Απόδοση Ιδιοτήτων @el
label: Присвоение Атрибута @ru
label: 屬性指定 @zh
subclass of: Działanie

Ocena stanu
type: Class
comment: This class describes the act of assessing the state of preservation of an object during a particular period. The condition assessment may be carried out by inspection, measurement or through historical research. This class is used to document circumstances of the respective assessment that may be relevant to interpret its quality at a later stage, or to continue research on related documents. @en
label: Avaliação do Estado Material @pt
label: Condition Assessment @en
label: Expertise de l'état matériel @fr
label: Zustandsfeststellung @de
label: Εκτίμηση Κατάστασης @el
label: Оценка Состояния @ru
label: 状态评估 @zh
subclass of: Przypisanie atrybutu

Przypisanie identyfikatora
type: Class
comment: This class comprises activities that result in the allocation of an identifier to an instance of E1 CRM Entity. An E15 Identifier Assignment may include the creation of the identifier from multiple constituents, which themselves may be instances of E41 Appellation. The syntax and kinds of constituents to be used may be declared in a rule constituting an instance of E29 Design or Procedure. Examples of such identifiers include Find Numbers, Inventory Numbers, uniform titles in the sense of librarianship and Digital Object Identifiers (DOI). Documenting the act of identifier assignment and deassignment is especially useful when objects change custody or the identification system of an organization is changed. In order to keep track of the identity of things in such cases, it is important to document by whom, when and for what purpose an identifier is assigned to an item. The fact that an identifier is a preferred one for an organisation can be expressed by using the property E1 CRM Entity. P48 has preferred identifier (is preferred identifier of): E42 Identifier. It can better be expressed in a context independent form by assigning a suitable E55 Type, such as “preferred identifier assignment”, to the respective instance of E15 Identifier Assignment via the P2 has type property. @en
label: Atribuição de Identificador @pt
label: Attribution d’identificateur @fr
label: Identifier Assignment @en
label: Kennzeichenzuweisung @de
label: Απόδοση Αναγνωριστικού @el
label: Назначение Идентификатора @ru
label: 标识符指定 @zh
subclass of: Przypisanie atrybutu

Pomiar
type: Class
comment: This class comprises actions measuring physical properties and other values that can be determined by a systematic procedure. Examples include measuring the monetary value of a collection of coins or the running time of a specific video cassette. The E16 Measurement may use simple counting or tools, such as yardsticks or radiation detection devices. The interest is in the method and care applied, so that the reliability of the result may be judged at a later stage, or research continued on the associated documents. The date of the event is important for dimensions, which may change value over time, such as the length of an object subject to shrinkage. Details of methods and devices are best handled as free text, whereas basic techniques such as "carbon 14 dating" should be encoded using P2 has type (is type of:) E55 Type. @en
label: Measurement @en
label: Medição @pt
label: Messung @de
label: Mesurage @fr
label: Μέτρηση @el
label: Событие Измерения @ru
label: 测量 @zh
subclass of: Przypisanie atrybutu

Przypisanie typu
type: Class
comment: This class comprises the actions of classifying items of whatever kind. Such items include objects, specimens, people, actions and concepts. This class allows for the documentation of the context of classification acts in cases where the value of the classification depends on the personal opinion of the classifier, and the date that the classification was made. This class also encompasses the notion of "determination," i.e. the systematic and molecular identification of a specimen in biology. @en
label: Atribuição de Tipo @pt
label: Attribution de type @fr
label: Type Assignment @en
label: Typuszuweisung @de
label: Απόδοση Τύπου @el
label: Присвоение Типа @ru
label: 类型指定 @zh
subclass of: Przypisanie atrybutu

Rzecz fizyczna
type: Class
comment: This class comprises all persistent physical items with a relatively stable form, man-made or natural. Depending on the existence of natural boundaries of such things, the CRM distinguishes the instances of E19 Physical Object from instances of E26 Physical Feature, such as holes, rivers, pieces of land etc. Most instances of E19 Physical Object can be moved (if not too heavy), whereas features are integral to the surrounding matter. An instance of E18 Physical Thing occupies not only a particular geometric space, but in the course of its existence it also forms a trajectory through spacetime, which occupies a real, that is phenomenal, volume in spacetime. We include in the occupied space the space filled by the matter of the physical thing and all its inner spaces, such as the interior of a box. Physical things consisting of aggregations of physically unconnected objects, such as a set of chessmen, occupy a number of individually contiguous spacetime volumes equal to the number of unconnected objects that constitute the set. We model E18 Physical Thing to be a subclass of E72 Legal Object and of E92 Spacetime volume. The latter is intended as a phenomenal spacetime volume as defined in CRMgeo (Doerr and Hiebel 2013). By virtue of this multiple inheritance we can discuss the physical extent of an E18 Physical Thing without representing each instance of it together with an instance of its associated spacetime volume. This model combines two quite different kinds of substance: an instance of E18 Physical Thing is matter while a spacetime volume is an aggregation of points in spacetime. However, the real spatiotemporal extent of an instance of E18 Physical Thing is regarded to be unique to it, due to all its details and fuzziness; its identity and existence depends uniquely on the identity of the instance of E18 Physical Thing. Therefore this multiple inheritance is unambiguous and effective and furthermore corresponds to the intuitions of natural language. The CIDOC C… @en
label: Chose matérielle @fr
label: Coisa Material @pt
label: Materielles @de
label: Physical Thing @en
label: Υλικό Πράγμα @el
label: Физическая Вещь @ru
label: 实体物 @zh
subclass of: Obiekt prawny
subclass of: Region czasoprzestrzeni

Obiekt fizyczny
type: Class
comment: This class comprises items of a material nature that are units for documentation and have physical boundaries that separate them completely in an objective way from other objects. The class also includes all aggregates of objects made for functional purposes of whatever kind, independent of physical coherence, such as a set of chessmen. Typically, instances of E19 Physical Object can be moved (if not too heavy). In some contexts, such objects, except for aggregates, are also called “bona fide objects” (Smith & Varzi, 2000, pp.401-420), i.e. naturally defined objects. The decision as to what is documented as a complete item, rather than by its parts or components, may be a purely administrative decision or may be a result of the order in which the item was acquired. @en
label: Materieller Gegenstand @de
label: Objet matériel @fr
label: Objeto Material @pt
label: Physical Object @en
label: Υλικό Αντικείμενο @el
label: Физический Объект @ru
label: 实体物件 @zh
subclass of: Rzecz fizyczna

Byt CRM
type: Class
comment: This class comprises all things in the universe of discourse of the CIDOC Conceptual Reference Model. It is an abstract concept providing for three general properties: 1. Identification by name or appellation, and in particular by a preferred identifier 2. Classification by type, allowing further refinement of the specific subclass an instance belongs to 3. Attachment of free text for the expression of anything not captured by formal properties With the exception of E59 Primitive Value, all other classes within the CRM are directly or indirectly specialisations of E1 CRM Entity. @en
label: CRM Entity @en
label: CRM Entität @de
label: CRM Сущность @ru
label: CRM实体 @zh
label: Entidade CRM @pt
label: Entité CRM @fr
label: Οντότητα CIDOC CRM @el

Obiekt biologiczny
type: Class
comment: This class comprises individual items of a material nature, which live, have lived or are natural products of or from living organisms. Artificial objects that incorporate biological elements, such as Victorian butterfly frames, can be documented as both instances of E20 Biological Object and E22 Man-Made Object. @en
label: Biological Object @en
label: Biologischer Gegenstand @de
label: Objet biologique @fr
label: Objeto Biológico @pt
label: Βιολογικό Ακτικείμενο @el
label: Биологический Объект @ru
label: 生物体 @zh
subclass of: Obiekt fizyczny

Osoba
type: Class
comment: This class comprises real persons who live or are assumed to have lived. Legendary figures that may have existed, such as Ulysses and King Arthur, fall into this class if the documentation refers to them as historical figures. In cases where doubt exists as to whether several persons are in fact identical, multiple instances can be created and linked to indicate their relationship. The CRM does not propose a specific form to support reasoning about possible identity. @en
label: Person @de
label: Personne @fr
label: Pessoa @pt
label: Πρόσωπο @el
label: Личность @ru
label: 人物 @zh
subclass of: Obiekt biologiczny
subclass of: Aktor

Artefakt
type: Class
comment: This class comprises physical objects purposely created by human activity. No assumptions are made as to the extent of modification required to justify regarding an object as man-made. For example, an inscribed piece of rock or a preserved butterfly are both regarded as instances of E22 Man-Made Object. @en
label: Künstlicher Gegenstand @de
label: Man-Made Object @en
label: Objet fabriqué @fr
label: Objeto Fabricado @pt
label: Ανθρωπογενές Αντικείμενο @el
label: Рукотворный Объект @ru
label: 人造物件 @zh
subclass of: Obiekt fizyczny
subclass of: Wytwór fizyczny

Wytwór fizyczny
type: Class
comment: This class comprises all persistent physical items that are purposely created by human activity. This class comprises man-made objects, such as a swords, and man-made features, such as rock art. No assumptions are made as to the extent of modification required to justify regarding an object as man-made. For example, a “cup and ring” carving on bedrock is regarded as instance of E24 Physical Man-Made Thing. @en
label: Chose matérielle fabriquée @fr
label: Coisa Material Fabricada @pt
label: Hergestelltes @de
label: Physical Man-Made Thing @en
label: Ανθρωπογενές Υλικό Πράγμα @el
label: Физическая Рукотворная Вещь @ru
label: 人造实体物 @zh
subclass of: Rzecz fizyczna
subclass of: Wytwór

Cecha artefaktualna
type: Class
comment: This class comprises physical features that are purposely created by human activity, such as scratches, artificial caves, artificial water channels, etc. No assumptions are made as to the extent of modification required to justify regarding a feature as man-made. For example, rock art or even “cup and ring” carvings on bedrock a regarded as types of E25 Man-Made Feature. @en
label: Característica Fabricada @pt
label: Caractéristique fabriquée @fr
label: Hergestelltes Merkmal @de
label: Man-Made Feature @en
label: Ανθρωπογενές Μόρφωμα @el
label: Искусственный Признак @ru
label: 人造外貌表征 @zh
subclass of: Wytwór fizyczny
subclass of: Cecha fizyczna
equivalent class: Cecha

Cecha fizyczna
type: Class
comment: This class comprises identifiable features that are physically attached in an integral way to particular physical objects. Instances of E26 Physical Feature share many of the attributes of instances of E19 Physical Object. They may have a one-, two- or three-dimensional geometric extent, but there are no natural borders that separate them completely in an objective way from the carrier objects. For example, a doorway is a feature but the door itself, being attached by hinges, is not. Instances of E26 Physical Feature can be features in a narrower sense, such as scratches, holes, reliefs, surface colours, reflection zones in an opal crystal or a density change in a piece of wood. In the wider sense, they are portions of particular objects with partially imaginary borders, such as the core of the Earth, an area of property on the surface of the Earth, a landscape or the head of a contiguous marble statue. They can be measured and dated, and it is sometimes possible to state who or what is or was responsible for them. They cannot be separated from the carrier object, but a segment of the carrier object may be identified (or sometimes removed) carrying the complete feature. This definition coincides with the definition of "fiat objects" (Smith & Varzi, 2000, pp.401-420), with the exception of aggregates of “bona fide objects”. @en
label: Característica Material @pt
label: Caractéristique matérielle @fr
label: Materielles Merkmal @de
label: Physical Feature @en
label: Υλικό Μόρφωμα @el
label: Физический Признак @ru
label: 实体外貌表征 @zh
subclass of: Rzecz fizyczna

Miejsce
type: Class
comment: This class comprises pieces of land or sea floor. In contrast to the purely geometric notion of E53 Place, this class describes constellations of matter on the surface of the Earth or other celestial body, which can be represented by photographs, paintings and maps. Instances of E27 Site are composed of relatively immobile material items and features in a particular configuration at a particular location @en
label: Gelände @de
label: Lugar @pt
label: Site @en
label: Φυσικός Χώρος @el
label: Участок @ru
label: 场地 @zh
subclass of: Cecha fizyczna

Obiekt pojęciowy
type: Class
comment: This class comprises non-material products of our minds and other human produced data that have become objects of a discourse about their identity, circumstances of creation or historical implication. The production of such information may have been supported by the use of technical devices such as cameras or computers. Characteristically, instances of this class are created, invented or thought by someone, and then may be documented or communicated between persons. Instances of E28 Conceptual Object have the ability to exist on more than one particular carrier at the same time, such as paper, electronic signals, marks, audio media, paintings, photos, human memories, etc. They cannot be destroyed. They exist as long as they can be found on at least one carrier or in at least one human memory. Their existence ends when the last carrier and the last memory are lost. @en
label: Begrifflicher Gegenstand @de
label: Conceptual Object @en
label: Objet conceptuel @fr
label: Objeto Conceitual @pt
label: Νοητικό Αντικείμενο @el
label: Концептуальный Объект @ru
label: 概念物件 @zh
subclass of: Wytwór

Projekt lub Procedura
type: Class
comment: This class comprises documented plans for the execution of actions in order to achieve a result of a specific quality, form or contents. In particular it comprises plans for deliberate human activities that may result in the modification or production of instances of E24 Physical Thing. Instances of E29 Design or Procedure can be structured in parts and sequences or depend on others. This is modelled using P69 has association with (is associated with). Designs or procedures can be seen as one of the following: 1. A schema for the activities it describes 2. A schema of the products that result from their application. 3. An independent intellectual product that may have never been applied, such as Leonardo da Vinci’s famous plans for flying machines. Because designs or procedures may never be applied or only partially executed, the CRM models a loose relationship between the plan and the respective product. @en
label: Conception ou procédure @fr
label: Design or Procedure @en
label: Entwurf oder Verfahren @de
label: Projeto ou Procedimento @pt
label: Σχέδιο @el
label: Проект или Процедура @ru
label: 设计或程序 @zh
subclass of: Obiekt informacyjny

Byt czasowy
type: Class
comment: This class comprises all phenomena, such as the instances of E4 Periods, E5 Events and states, which happen over a limited extent in time. In some contexts, these are also called perdurants. This class is disjoint from E77 Persistent Item. This is an abstract class and has no direct instances. E2 Temporal Entity is specialized into E4 Period, which applies to a particular geographic area (defined with a greater or lesser degree of precision), and E3 Condition State, which applies to instances of E18 Physical Thing. @en
label: Entidade Temporal @pt
label: Entité temporelle @fr
label: Geschehendes @de
label: Temporal Entity @en
label: Έγχρονη Οντότητα @el
label: Временная Сущность @ru
label: 时间实体 @zh
subclass of: Byt CRM

Uprawnienie
type: Class
comment: This class comprises legal privileges concerning material and immaterial things or their derivatives. These include reproduction and property rights @en
label: Direitos @pt
label: Droit @fr
label: Recht @de
label: Right @en
label: Δικαίωμα @el
label: Право @ru
label: 权限 @zh
subclass of: Sąd (w sensie logicznym)

Document
type: Class
comment: This class comprises identifiable immaterial items that make propositions about reality. These propositions may be expressed in text, graphics, images, audiograms, videograms or by other similar means. Documentation databases are regarded as a special case of E31 Document. This class should not be confused with the term “document” in Information Technology, which is compatible with E73 Information Object. @en
label: Documento @pt
label: Dokument
label: Τεκμήριο @el
label: Документ @ru
label: 文献 @zh
subclass of: Obiekt informacyjny

Dokument referencyjny
type: Class
comment: This class comprises encyclopaedia, thesauri, authority lists and other documents that define terminology or conceptual systems for consistent use. @en
label: Authority Document @en
label: Document de référence @fr
label: Documento de Referência @pt
label: Referenzdokument @de
label: Πηγή Καθιερωμένων Όρων @el
label: Официальный Документ @ru
label: 权威文献 @zh
subclass of: Document

Obiekt lingwistyczny
type: Class
comment: This class comprises identifiable expressions in natural language or languages. Instances of E33 Linguistic Object can be expressed in many ways: e.g. as written texts, recorded speech or sign language. However, the CRM treats instances of E33 Linguistic Object independently from the medium or method by which they are expressed. Expressions in formal languages, such as computer code or mathematical formulae, are not treated as instances of E33 Linguistic Object by the CRM. These should be modelled as instances of E73 Information Object. The text of an instance of E33 Linguistic Object can be documented in a note by P3 has note: E62 String @en
label: Linguistic Object @en
label: Objet linguistique @fr
label: Objeto Lingüístico @pt
label: Sprachlicher Gegenstand @de
label: Γλωσσικό Αντικείμενο @el
label: Линвистический Объект @ru
label: 语言物件 @zh
subclass of: Obiekt informacyjny

Napis
type: Class
comment: This class comprises recognisable, short texts attached to instances of E24 Physical Man-Made Thing. The transcription of the text can be documented in a note by P3 has note: E62 String. The alphabet used can be documented by P2 has type: E55 Type. This class does not intend to describe the idiosyncratic characteristics of an individual physical embodiment of an inscription, but the underlying prototype. The physical embodiment is modelled in the CRM as E24 Physical Man-Made Thing. The relationship of a physical copy of a book to the text it contains is modelled using E84 Information Carrier. P128 carries (is carried by): E33 Linguistic Object. @en
label: Inschrift @de
label: Inscription @en
label: Inscrição @pt
label: Επιγραφή @el
label: Надпись @ru
label: 题字 @zh
subclass of: Obiekt lingwistyczny
subclass of: Znak

Tytuł
type: Class
comment: This class comprises the names assigned to works, such as texts, artworks or pieces of music. Titles are proper noun phrases or verbal phrases, and should not be confused with generic object names such as “chair”, “painting” or “book” (the latter are common nouns that stand for instances of E55 Type). Titles may be assigned by the creator of the work itself, or by a social group. This class also comprises the translations of titles that are used as surrogates for the original titles in different social contexts. @en
label: Titel @de
label: Title @en
label: Titre @fr
label: Título @pt
label: Τίτλος @el
label: Заголовок @ru
label: 题目 @zh
subclass of: Obiekt lingwistyczny
subclass of: Opis

Obiekt wizualny
type: Class
comment: This class comprises the intellectual or conceptual aspects of recognisable marks and images. This class does not intend to describe the idiosyncratic characteristics of an individual physical embodiment of a visual item, but the underlying prototype. For example, a mark such as the ICOM logo is generally considered to be the same logo when used on any number of publications. The size, orientation and colour may change, but the logo remains uniquely identifiable. The same is true of images that are reproduced many times. This means that visual items are independent of their physical support. The class E36 Visual Item provides a means of identifying and linking together instances of E24 Physical Man-Made Thing that carry the same visual symbols, marks or images etc. The property P62 depicts (is depicted by) between E24 Physical Man-Made Thing and depicted subjects (E1 CRM Entity) can be regarded as a short-cut of the more fully developed path from E24 Physical Man-Made Thing through P65 shows visual item (is shown by), E36 Visual Item, P138 represents (has representation) to E1CRM Entity, which in addition captures the optical features of the depiction. @en
label: Bildliches @de
label: Item Visual @pt
label: Item visuel @fr
label: Visual Item @en
label: Οπτικό Στοιχείο @el
label: Визуальный Предмет @ru
label: 视觉项目 @zh
subclass of: Obiekt informacyjny

Znak
type: Class
comment: This class comprises symbols, signs, signatures or short texts applied to instances of E24 Physical Man-Made Thing by arbitrary techniques in order to indicate the creator, owner, dedications, purpose, etc. This class specifically excludes features that have no semantic significance, such as scratches or tool marks. These should be documented as instances of E25 Man-Made Feature. @en
label: Marca @pt
label: Mark @en
label: Marke @de
label: Marque @fr
label: Σήμανση @el
label: Пометка @ru
label: 标志 @zh
subclass of: Obiekt wizualny

Obraz
type: Class
comment: This class comprises distributions of form, tone and colour that may be found on surfaces such as photos, paintings, prints and sculptures or directly on electronic media. The degree to which variations in the distribution of form and colour affect the identity of an instance of E38 Image depends on a given purpose. The original painting of the Mona Lisa in the Louvre may be said to bear the same instance of E38 Image as reproductions in the form of transparencies, postcards, posters or T-shirts, even though they may differ in size and carrier and may vary in tone and colour. The images in a “spot the difference” competition are not the same with respect to their context, however similar they may at first appear. @en
label: Bild @de
label: Image @en
label: Imagem @pt
label: Εικόνα @el
label: Изображение @ru
label: 图像 @zh
subclass of: Obiekt wizualny

Aktor
type: Class
comment: This class comprises people, either individually or in groups, who have the potential to perform intentional actions of kinds for which someone may be held responsible. The CRM does not attempt to model the inadvertent actions of such actors. Individual people should be documented as instances of E21 Person, whereas groups should be documented as instances of either E74 Group or its subclass E40 Legal Body. @en
label: Actor @en
label: Agent @fr
label: Agente @pt
label: Akteur @de
label: Δράστης @el
label: Агент @ru
label: 角色 @zh
subclass of: Byt trwający w czasie

Stan
type: Class
comment: This class comprises the states of objects characterised by a certain condition over a time-span. An instance of this class describes the prevailing physical condition of any material object or feature during a specific E52 Time Span. In general, the time-span for which a certain condition can be asserted may be shorter than the real time-span, for which this condition held. The nature of that condition can be described using P2 has type. For example, the E3 Condition State “condition of the SS Great Britain between 22 September 1846 and 27 August 1847” can be characterized as E55 Type “wrecked”. @en
label: Condition State @en
label: Estado Material @pt
label: Zustandsphase @de
label: État matériel @fr
label: Κατάσταση @el
label: Состояние @ru
label: 状态 @zh
subclass of: Byt czasowy

Osoba prawna
type: Class
comment: This class comprises institutions or groups of people that have obtained a legal recognition as a group and can act collectively as agents. This means that they can perform actions, own property, create or destroy things and can be held collectively responsible for their actions like individual people. The term 'personne morale' is often used for this in French. @en
label: Collectivité @fr
label: Juristische Person @de
label: Legal Body @en
label: Pessoa Jurídica @pt
label: Νομικό Πρόσωπο @el
label: Юридическое Лицо @ru
label: 法律组织 @zh
subclass of: Grupa

Opis
type: Class
comment: This class comprises signs, either meaningful or not, or arrangements of signs following a specific syntax, that are used or can be used to refer to and identify a specific instance of some class or category within a certain context. Instances of E41 Appellation do not identify things by their meaning, even if they happen to have one, but instead by convention, tradition, or agreement. Instances of E41 Appellation are cultural constructs; as such, they have a context, a history, and a use in time and space by some group of users. A given instance of E41 Appellation can have alternative forms, i.e., other instances of E41 Appellation that are always regarded as equivalent independent from the thing it denotes. Specific subclasses of E41 Appellation should be used when instances of E41 Appellation of a characteristic form are used for particular objects. Instances of E49 Time Appellation, for example, which take the form of instances of E50 Date, can be easily recognised. E41 Appellation should not be confused with the act of naming something. Cf. E15 Identifier Assignment @en
label: Appellation @en
label: Benennung @de
label: Designação @pt
label: Ονομασία @el
label: Обозначение @ru
label: 称号 @zh
subclass of: Obiekt symboliczny

Identyfikator
type: Class
comment: This class comprises strings or codes assigned to instances of E1 CRM Entity in order to identify them uniquely and permanently within the context of one or more organisations. Such codes are often known as inventory numbers, registration codes, etc. and are typically composed of alphanumeric sequences. The class E42 Identifier is not normally used for machine-generated identifiers used for automated processing unless these are also used by human agents. @en
label: Identificador de Objeto @pt
label: Identificateur d'objet @fr
label: Identifier @en
label: Kennung @de
label: Κωδικός Αναγνώρισης @el
label: Идентификатор Объекта @ru
label: 标识符 @zh
subclass of: Opis

Opis miejsca
type: Class
comment: This class comprises any sort of identifier characteristically used to refer to an E53 Place. Instances of E44 Place Appellation may vary in their degree of precision and their meaning may vary over time - the same instance of E44 Place Appellation may be used to refer to several places, either because of cultural shifts, or because objects used as reference points have moved around. Instances of E44 Place Appellation can be extremely varied in form: postal addresses, instances of E47 Spatial Coordinate, and parts of buildings can all be considered as instances of E44 Place Appellation. @en
label: Appellation de lieu @fr
label: Designação de Local @pt
label: Ortsbenennung @de
label: Place Appellation @en
label: Ονομασία Τόπου @el
label: Обозначение Места @ru
label: 地点称号 @zh
subclass of: Opis

Adres
type: Class
comment: This class comprises identifiers expressed in coding systems for places, such as postal addresses used for mailing. An E45 Address can be considered both as the name of an E53 Place and as an E51 Contact Point for an E39 Actor. This dual aspect is reflected in the multiple inheritance. However, some forms of mailing addresses, such as a postal box, are only instances of E51 Contact Point, since they do not identify any particular Place. These should not be documented as instances of E45 Address. @en
label: Address @en
label: Adresse @de
label: Endereço @pt
label: Διεύθυνση @el
label: Адрес @ru
label: 地址 @zh
subclass of: Opis miejsca
subclass of: Kontakt

Opis granicy
type: Class
comment: This class comprises areas of objects referred to in terms specific to the general geometry or structure of its kind. The 'prow' of the boat, the 'frame' of the picture, the 'front' of the building are all instances of E46 Section Definition. The class highlights the fact that parts of objects can be treated as locations. This holds in particular for features without natural boundaries, such as the “head” of a marble statue made out of one block (cf. E53 Place). In answer to the question 'where is the signature?' one might reply 'on the lower left corner'. (Section Definition is closely related to the term “segment” in Gerstl, P.& Pribbenow, S, 1996 “ A conceptual theory of part – whole relations and its applications”, Data & Knowledge Engineering 20 305-322, North Holland- Elsevier ). @en
label: Abschnittsdefinition @de
label: Designação de Seção @pt
label: Désignation de section @fr
label: Section Definition @en
label: Ονομασία Τμήματος @el
label: Определение Района @ru
label: 区域定义 @zh
subclass of: Opis miejsca

Współrzędne przestrzenne
type: Class
comment: This class comprises the textual or numeric information required to locate specific instances of E53 Place within schemes of spatial identification. Coordinates are a specific form of E44 Place Appellation, that is, a means of referring to a particular E53 Place. Coordinates are not restricted to longitude, latitude and altitude. Any regular system of reference that maps onto an E19 Physical Object can be used to generate coordinates. @en
label: Coordenadas Espaciais @pt
label: Coordonnées spatiales @fr
label: Raumkoordinaten @de
label: Spatial Coordinates @en
label: Χωρικές Συντεταγμένες @el
label: Пространственные Координаты @ru
label: 空间坐标 @zh
subclass of: Opis miejsca

Nazwa miejsca
type: Class
comment: This class comprises particular and common forms of E44 Place Appellation. Place Names may change their application over time: the name of an E53 Place may change, and a name may be reused for a different E53 Place. Instances of E48 Place Name are typically subject to place name gazetteers. @en
label: Nome de Local @pt
label: Orts- oder Flurname @de
label: Place Name @en
label: Toponyme @fr
label: Τοπωνύμιο @el
label: Название Места @ru
label: 地名 @zh
subclass of: Opis miejsca

Opis czasu
type: Class
comment: This class comprises all forms of names or codes, such as historical periods, and dates, which are characteristically used to refer to a specific E52 Time-Span. The instances of E49 Time Appellation may vary in their degree of precision, and they may be relative to other time frames, “Before Christ” for example. Instances of E52 Time-Span are often defined by reference to a cultural period or an event e.g. ‘the duration of the Ming Dynasty’. @en
label: Appellation temporelle @fr
label: Designação de Tempo @pt
label: Time Appellation @en
label: Zeitbenennung @de
label: Ονομασία Χρόνου @el
label: Обозначение Времени @ru
label: 时间称号 @zh
subclass of: Opis

Okres
type: Class
comment: This class comprises sets of coherent phenomena or cultural manifestations occurring in time and space. It is the social or physical coherence of these phenomena that identify an E4 Period and not the associated spatiotemporal extent. This extent is only the "ground" or space in an abstract physical sense that the actual process of growth, spread and retreat has covered. Consequently, different periods can overlap and coexist in time and space, such as when a nomadic culture exists in the same area and time as a sedentary culture. This also means that overlapping land use rights, common among first nations, amounts to overlapping periods. Often, this class is used to describe prehistoric or historic periods such as the "Neolithic Period", the "Ming Dynasty" or the "McCarthy Era", but also geopolitical units and activities of settlements are regarded as special cases of E4 Period. However, there are no assumptions about the scale of the associated phenomena. In particular all events are seen as synthetic processes consisting of coherent phenomena. Therefore E4 Period is a superclass of E5 Event. For example, a modern clinical E67 Birth can be seen as both an atomic E5 Event and as an E4 Period that consists of multiple activities performed by multiple instances of E39 Actor. As the actual extent of an E4 Period in spacetime we regard the trajectories of the participating physical things during their participation in an instance of E4 Period. This includes the open spaces via which these things have interacted and the spaces by which they had the potential to interact during that period or event in the way defined by the type of the respective period or event. Examples include the air in a meeting room transferring the voices of the participants. Since these phenomena are fuzzy, we assume the spatiotemporal extent to be contiguous, except for cases of phenomena spreading out over islands or other separated areas, including geopolitical units distributed over disconnec… @en
label: Period @en
label: Período @pt
label: Phase @de
label: Période @fr
label: Περίοδος @el
label: Период @ru
label: 期间 @zh
subclass of: Byt czasowy
subclass of: Region czasoprzestrzeni

Data
type: Class
comment: This class comprises specific forms of E49 Time Appellation. @en
label: Date @en
label: Datum @de
label: Ημερομηνία @el
label: Дата @ru
label: 日期 @zh
subclass of: Opis czasu

Kontakt
type: Class
comment: This class comprises identifiers employed, or understood, by communication services to direct communications to an instance of E39 Actor. These include E-mail addresses, telephone numbers, post office boxes, Fax numbers, URLs etc. Most postal addresses can be considered both as instances of E44 Place Appellation and E51 Contact Point. In such cases the subclass E45 Address should be used. URLs are addresses used by machines to access another machine through an http request. Since the accessed machine acts on behalf of the E39 Actor providing the machine, URLs are considered as instances of E51 Contact Point to that E39 Actor. @en
label: Contact Point @en
label: Coordonnées individuelles @fr
label: Kontaktpunkt @de
label: Ponto de Contato @pt
label: Στοιχείο Επικοινωνίας @el
label: Контакт @ru
label: 联系方式 @zh
subclass of: Opis

Trwanie
type: Class
comment: This class comprises abstract temporal extents, in the sense of Galilean physics, having a beginning, an end and a duration. Time Span has no other semantic connotations. Time-Spans are used to define the temporal extent of instances of E4 Period, E5 Event and any other phenomena valid for a certain time. An E52 Time-Span may be identified by one or more instances of E49 Time Appellation. Since our knowledge of history is imperfect, instances of E52 Time-Span can best be considered as approximations of the actual Time-Spans of temporal entities. The properties of E52 Time-Span are intended to allow these approximations to be expressed precisely. An extreme case of approximation, might, for example, define an E52 Time-Span having unknown beginning, end and duration. Used as a common E52 Time-Span for two events, it would nevertheless define them as being simultaneous, even if nothing else was known. Automatic processing and querying of instances of E52 Time-Span is facilitated if data can be parsed into an E61 Time Primitive. @en
label: Durée @fr
label: Período de Tempo @pt
label: Time-Span @en
label: Zeitspanne @de
label: Χρονικό Διάστημα @el
label: Интервал Времени @ru
label: 时段 @zh
subclass of: Byt CRM

Miejsce
type: Class
comment: This class comprises extents in space, in particular on the surface of the earth, in the pure sense of physics: independent from temporal phenomena and matter. The instances of E53 Place are usually determined by reference to the position of “immobile” objects such as buildings, cities, mountains, rivers, or dedicated geodetic marks. A Place can be determined by combining a frame of reference and a location with respect to this frame. It may be identified by one or more instances of E44 Place Appellation. It is sometimes argued that instances of E53 Place are best identified by global coordinates or absolute reference systems. However, relative references are often more relevant in the context of cultural documentation and tend to be more precise. In particular, we are often interested in position in relation to large, mobile objects, such as ships. For example, the Place at which Nelson died is known with reference to a large mobile object – H.M.S Victory. A resolution of this Place in terms of absolute coordinates would require knowledge of the movements of the vessel and the precise time of death, either of which may be revised, and the result would lack historical and cultural relevance. Any object can serve as a frame of reference for E53 Place determination. The model foresees the notion of a "section" of an E19 Physical Object as a valid E53 Place determination. @en
label: Lieu @fr
label: Local @pt
label: Ort @de
label: Place @en
label: Τόπος @el
label: Место @ru
label: 地点 @zh
subclass of: Byt CRM

Wymiar
type: Class
comment: This class comprises quantifiable properties that can be measured by some calibrated means and can be approximated by values, i.e. points or regions in a mathematical or conceptual space, such as natural or real numbers, RGB values etc. An instance of E54 Dimension represents the true quantity, independent from its numerical approximation, e.g. in inches or in cm. The properties of the class E54 Dimension allow for expressing the numerical approximation of the values of an instance of E54 Dimension. If the true values belong to a non-discrete space, such as spatial distances, it is recommended to record them as approximations by intervals or regions of indeterminacy enclosing the assumed true values. For instance, a length of 5 cm may be recorded as 4.5-5.5 cm, according to the precision of the respective observation. Note, that interoperability of values described in different units depends critically on the representation as value regions. Numerical approximations in archaic instances of E58 Measurement Unit used in historical records should be preserved. Equivalents corresponding to current knowledge should be recorded as additional instances of E54 Dimension as appropriate. @en
label: Dimension @en
label: Dimensions @fr
label: Dimensão @pt
label: Maß @de
label: Μέγεθος @el
label: Величина @ru
label: 规模数量 @zh
subclass of: Byt CRM

Typ
type: Class
comment: This class comprises concepts denoted by terms from thesauri and controlled vocabularies used to characterize and classify instances of CRM classes. Instances of E55 Type represent concepts in contrast to instances of E41 Appellation which are used to name instances of CRM classes. E55 Type is the CRM’s interface to domain specific ontologies and thesauri. These can be represented in the CRM as subclasses of E55 Type, forming hierarchies of terms, i.e. instances of E55 Type linked via P127 has broader term (has narrower term). Such hierarchies may be extended with additional properties. @en
label: Tipo @pt
label: Type @en
label: Typus @de
label: Τύπος @el
label: Тип @ru
label: 类型 @zh
subclass of: Obiekt pojęciowy

Język
type: Class
comment: This class is a specialization of E55 Type and comprises the natural languages in the sense of concepts. This type is used categorically in the model without reference to instances of it, i.e. the Model does not foresee the description of instances of instances of E56 Language, e.g.: “instances of Mandarin Chinese”. It is recommended that internationally or nationally agreed codes and terminology are used to denote instances of E56 Language, such as those defined in ISO 639:1988. @en
label: Language @en
label: Langue @fr
label: Língua @pt
label: Sprache @de
label: Γλώσσα @el
label: Язык @ru
label: 语言 @zh
subclass of: Typ

Materiał
type: Class
comment: This class is a specialization of E55 Type and comprises the concepts of materials. Instances of E57 Material may denote properties of matter before its use, during its use, and as incorporated in an object, such as ultramarine powder, tempera paste, reinforced concrete. Discrete pieces of raw-materials kept in museums, such as bricks, sheets of fabric, pieces of metal, should be modelled individually in the same way as other objects. Discrete used or processed pieces, such as the stones from Nefer Titi's temple, should be modelled as parts (cf. P46 is composed of). This type is used categorically in the model without reference to instances of it, i.e. the Model does not foresee the description of instances of instances of E57 Material, e.g.: “instances of gold”. It is recommended that internationally or nationally agreed codes and terminology are used. @en
label: Material @de
label: Matériau @fr
label: Υλικό @el
label: Материал @ru
label: 材料 @zh
subclass of: Typ

Jednostka miary
type: Class
comment: This class is a specialization of E55 Type and comprises the types of measurement units: feet, inches, centimetres, litres, lumens, etc. This type is used categorically in the model without reference to instances of it, i.e. the Model does not foresee the description of instances of instances of E58 Measurement Unit, e.g.: “instances of cm”. Syst?me International (SI) units or internationally recognized non-SI terms should be used whenever possible. (ISO 1000:1992). Archaic Measurement Units used in historical records should be preserved. @en
label: Maßeinheit @de
label: Measurement Unit @en
label: Unidade de Medida @pt
label: Unité de mesure @fr
label: Μονάδα Μέτρησης @el
label: Единица Измерения @ru
label: 测量单位 @zh
subclass of: Typ

Zdarzenie
type: Class
comment: This class comprises changes of states in cultural, social or physical systems, regardless of scale, brought about by a series or group of coherent physical, cultural, technological or legal phenomena. Such changes of state will affect instances of E77 Persistent Item or its subclasses. The distinction between an E5 Event and an E4 Period is partly a question of the scale of observation. Viewed at a coarse level of detail, an E5 Event is an ‘instantaneous’ change of state. At a fine level, the E5 Event can be analysed into its component phenomena within a space and time frame, and as such can be seen as an E4 Period. The reverse is not necessarily the case: not all instances of E4 Period give rise to a noteworthy change of state. @en
label: Ereignis @de
label: Event @en
label: Evento @pt
label: Événement @fr
label: Συμβάν @el
label: Событие @ru
label: 事件 @zh
subclass of: Okres

Początek istnienia
type: Class
comment: This class comprises events that bring into existence any E77 Persistent Item. It may be used for temporal reasoning about things (intellectual products, physical items, groups of people, living beings) beginning to exist; it serves as a hook for determination of a terminus post quem and ante quem. @en
label: Beginning of Existence @en
label: Daseinsbeginn @de
label: Début d'existence @fr
label: Início da Existência @pt
label: Αρχή Ύπαρξης @el
label: Начало Существования @ru
label: 存在开始 @zh
subclass of: Zdarzenie

Koniec istnienia
type: Class
comment: This class comprises events that end the existence of any E77 Persistent Item. It may be used for temporal reasoning about things (physical items, groups of people, living beings) ceasing to exist; it serves as a hook for determination of a terminus postquem and antequem. In cases where substance from a Persistent Item continues to exist in a new form, the process would be documented by E81 Transformation. @en
label: Daseinsende @de
label: End of Existence @en
label: Fim da Existência @pt
label: Fin d'existence @fr
label: Τέλος Ύπαρξης @el
label: Конец Существования @ru
label: 存在结束 @zh
subclass of: Zdarzenie

Wytworzenie
type: Class
comment: This class comprises events that result in the creation of conceptual items or immaterial products, such as legends, poems, texts, music, images, movies, laws, types etc. @en
label: Begriffliche Schöpfung @de
label: Creation @en
label: Criação @pt
label: Création @fr
label: Δημιουργία @el
label: Событие Творения @ru
label: 创造 @zh
subclass of: Początek istnienia
subclass of: Działanie

Tworzenie
type: Class
comment: This class comprises events that result in the formation of a formal or informal E74 Group of people, such as a club, society, association, corporation or nation. E66 Formation does not include the arbitrary aggregation of people who do not act as a collective. The formation of an instance of E74 Group does not require that the group is populated with members at the time of formation. In order to express the joining of members at the time of formation, the respective activity should be simultaneously an instance of both E66 Formation and E85 Joining. @en
label: Formation @en
label: Formação @pt
label: Gruppenbildung @de
label: Συγκρότηση Ομάδας @el
label: Событие Формирования @ru
label: 组成 @zh
subclass of: Początek istnienia
subclass of: Działanie

Narodziny
type: Class
comment: This class comprises the births of human beings. E67 Birth is a biological event focussing on the context of people coming into life. (E63 Beginning of Existence comprises the coming into life of any living beings). Twins, triplets etc. are brought into life by the same E67 Birth event. The introduction of the E67 Birth event as a documentation element allows the description of a range of family relationships in a simple model. Suitable extensions may describe more details and the complexity of motherhood with the intervention of modern medicine. In this model, the biological father is not seen as a necessary participant in the E67 Birth event. @en
label: Birth @en
label: Geburt @de
label: Naissance @fr
label: Nascimento @pt
label: Γέννηση @el
label: Рождение @ru
label: 诞生 @zh
subclass of: Początek istnienia

Rozwiązanie
type: Class
comment: This class comprises the events that result in the formal or informal termination of an E74 Group of people. If the dissolution was deliberate, the Dissolution event should also be instantiated as an E7 Activity. @en
label: Dissolution @en
label: Dissolução @pt
label: Gruppenauflösung @de
label: Διάλυση Ομάδας @el
label: Роспуск @ru
label: 解散 @zh
subclass of: Koniec istnienia

Śmierć
type: Class
comment: This class comprises the deaths of human beings. If a person is killed, their death should be instantiated as E69 Death and as E7 Activity. The death or perishing of other living beings should be documented using E64 End of Existence. @en
label: Death @en
label: Mort @fr
label: Morte @pt
label: Tod @de
label: Θάνατος @el
label: Смерть @ru
label: 死亡 @zh
subclass of: Koniec istnienia

Zniszczenie
type: Class
comment: This class comprises events that destroy one or more instances of E18 Physical Thing such that they lose their identity as the subjects of documentation. Some destruction events are intentional, while others are independent of human activity. Intentional destruction may be documented by classifying the event as both an E6 Destruction and E7 Activity. The decision to document an object as destroyed, transformed or modified is context sensitive: 1. If the matter remaining from the destruction is not documented, the event is modelled solely as E6 Destruction. 2. An event should also be documented using E81 Transformation if it results in the destruction of one or more objects and the simultaneous production of others using parts or material from the original. In this case, the new items have separate identities. Matter is preserved, but identity is not. 3. When the initial identity of the changed instance of E18 Physical Thing is preserved, the event should be documented as E11 Modification. @en
label: Destruction @en
label: Destruição @pt
label: Zerstörung @de
label: Καταστροφή @el
label: Разрушение @ru
label: 摧毁 @zh
subclass of: Koniec istnienia

Rzecz
type: Class
comment: This general class comprises discrete, identifiable, instances of E77 Persistent Item that are documented as single units, that either consist of matter or depend on being carried by matter and are characterized by relative stability. They may be intellectual products or physical things. They may for instance have a solid physical form, an electronic encoding, or they may be a logical concept or structure. @en
label: Chose @fr
label: Coisa @pt
label: Sache @de
label: Thing @en
label: Πράγμα @el
label: Вещь @ru
label: 万物 @zh
subclass of: Byt trwający w czasie

Wytwór
type: Class
comment: This class comprises discrete, identifiable man-made items that are documented as single units. These items are either intellectual products or man-made physical things, and are characterized by relative stability. They may for instance have a solid physical form, an electronic encoding, or they may be logical concepts or structures. @en
label: Chose fabriquée @fr
label: Coisa Fabricada @pt
label: Künstliches @de
label: Man-Made Thing @en
label: Ανθρώπινο Δημιούργημα @el
label: Рукотворная Вещь @ru
label: 人造物 @zh
subclass of: Rzecz

Obiekt prawny
type: Class
comment: This class comprises those material or immaterial items to which instances of E30 Right, such as the right of ownership or use, can be applied. This is true for all E18 Physical Thing. In the case of instances of E28 Conceptual Object, however, the identity of the E28 Conceptual Object or the method of its use may be too ambiguous to reliably establish instances of E30 Right, as in the case of taxa and inspirations. Ownership of corporations is currently regarded as out of scope of the CRM. @en
label: Legal Object @en
label: Objet juridique @fr
label: Objeto Jurídico @pt
label: Rechtsobjekt @de
label: Νομικό Αντικείμενο @el
label: Объект Права @ru
label: 法律物件 @zh
subclass of: Rzecz

Obiekt informacyjny
type: Class
comment: This class comprises identifiable immaterial items, such as a poems, jokes, data sets, images, texts, multimedia objects, procedural prescriptions, computer program code, algorithm or mathematical formulae, that have an objectively recognizable structure and are documented as single units. The encoding structure known as a "named graph" also falls under this class, so that each "named graph" is an instance of an E73 Information Object. An E73 Information Object does not depend on a specific physical carrier, which can include human memory, and it can exist on one or more carriers simultaneously. Instances of E73 Information Object of a linguistic nature should be declared as instances of the E33 Linguistic Object subclass. Instances of E73 Information Object of a documentary nature should be declared as instances of the E31 Document subclass. Conceptual items such as types and classes are not instances of E73 Information Object, nor are ideas without a reproducible expression. @en
label: Information Object @en
label: Informationsgegenstand @de
label: Objet d'information @fr
label: Objeto de Informação @pt
label: Πληροφοριακό Αντικείμενο @el
label: Информационный Объект @ru
label: 信息物件 @zh
subclass of: Sąd (w sensie logicznym)
subclass of: Obiekt symboliczny

Grupa
type: Class
comment: This class comprises any gatherings or organizations of E39 Actors that act collectively or in a similar way due to any form of unifying relationship. In the wider sense this class also comprises official positions which used to be regarded in certain contexts as one actor, independent of the current holder of the office, such as the president of a country. In such cases, it may happen that the Group never had more than one member. A joint pseudonym (i.e., a name that seems indicative of an individual but that is actually used as a persona by two or more people) is a particular case of E74 Group. A gathering of people becomes an E74 Group when it exhibits organizational characteristics usually typified by a set of ideas or beliefs held in common, or actions performed together. These might be communication, creating some common artifact, a common purpose such as study, worship, business, sports, etc. Nationality can be modeled as membership in an E74 Group (cf. HumanML markup). Married couples and other concepts of family are regarded as particular examples of E74 Group. @en
label: Group @en
label: Groupe @fr
label: Grupo @pt
label: Menschliche Gruppe @de
label: Ομάδα @el
label: Группа @ru
label: 群组 @zh
subclass of: Aktor

Opis obiektu pojęciowego
type: Class
comment: This class comprises appellations that are by their form or syntax specific to identifying instances of E28 Conceptual Object, such as intellectual products, standardized patterns etc. @en
label: Appellation d'objet conceptuel @fr
label: Begriff- oder Konzeptbenennung @de
label: Conceptual Object Appellation @en
label: Designação de Objeto Conceitual @pt
label: Ονομασία Νοητικού Αντικειμένου @el
label: Обозначение Концептуального Объекта @ru
label: 概念物件称号 @zh
subclass of: Opis

Byt trwający w czasie
type: Class
comment: This class comprises items that have a persistent identity, sometimes known as “endurants” in philosophy. They can be repeatedly recognized within the duration of their existence by identity criteria rather than by continuity or observation. Persistent Items can be either physical entities, such as people, animals or things, or conceptual entities such as ideas, concepts, products of the imagination or common names. The criteria that determine the identity of an item are often difficult to establish -; the decision depends largely on the judgement of the observer. For example, a building is regarded as no longer existing if it is dismantled and the materials reused in a different configuration. On the other hand, human beings go through radical and profound changes during their life-span, affecting both material composition and form, yet preserve their identity by other criteria. Similarly, inanimate objects may be subject to exchange of parts and matter. The class E77 Persistent Item does not take any position about the nature of the applicable identity criteria and if actual knowledge about identity of an instance of this class exists. There may be cases, where the identity of an E77 Persistent Item is not decidable by a certain state of knowledge. The main classes of objects that fall outside the scope the E77 Persistent Item class are temporal objects such as periods, events and acts, and descriptive properties. @en
label: Entidade Persistente @pt
label: Entité persistante @fr
label: Persistent Item @en
label: Seiendes @de
label: Ον @el
label: Постоянная Сущность @ru
label: 持续性项目 @zh
subclass of: Byt CRM

Zbiór
type: Class
comment: This class comprises aggregations of instances of E18 Physical Thing that are assembled and maintained ("curated" and "preserved", in museological terminology) by one or more instances of E39 Actor over time for a specific purpose and audience, and according to a particular collection development plan. Items may be added or removed from an E78 Collection in pursuit of this plan. This class should not be confused with the E39 Actor maintaining the E78 Collection often referred to with the name of the E78 Collection (e.g. “The Wallace Collection decided…”). Collective objects in the general sense, like a tomb full of gifts, a folder with stamps or a set of chessmen, should be documented as instances of E19 Physical Object, and not as instances of E78 Collection. This is because they form wholes either because they are physically bound together or because they are kept together for their functionality. @en
label: Coleção @pt
label: Collection @en
label: Sammlung @de
label: Συλλογή @el
label: Коллекция @ru
label: 收藏 @zh
subclass of: Wytwór fizyczny

Dodanie części
type: Class
comment: This class comprises activities that result in an instance of E24 Physical Man-Made Thing being increased, enlarged or augmented by the addition of a part. Typical scenarios include the attachment of an accessory, the integration of a component, the addition of an element to an aggregate object, or the accessioning of an object into a curated E78 Collection. Objects to which parts are added are, by definition, man-made, since the addition of a part implies a human activity. Following the addition of parts, the resulting man-made assemblages are treated objectively as single identifiable wholes, made up of constituent or component parts bound together either physically (for example the engine becoming a part of the car), or by sharing a common purpose (such as the 32 chess pieces that make up a chess set). This class of activities forms a basis for reasoning about the history and continuity of identity of objects that are integrated into other objects over time, such as precious gemstones being repeatedly incorporated into different items of jewellery, or cultural artifacts being added to different museum instances of E78 Collection over their lifespan. @en
label: Addition d'élément @fr
label: Adição de Parte @pt
label: Part Addition @en
label: Teilhinzufügung @de
label: Προσθήκη Μερών @el
label: Добавление Части @ru
label: 部件增加 @zh
subclass of: Modyfikacja

Działanie
type: Class
comment: This class comprises actions intentionally carried out by instances of E39 Actor that result in changes of state in the cultural, social, or physical systems documented. This notion includes complex, composite and long-lasting actions such as the building of a settlement or a war, as well as simple, short-lived actions such as the opening of a door. @en
label: Activity @en
label: Activité @fr
label: Atividade @pt
label: Handlung @de
label: Δράση @el
label: Деятельность @ru
label: 活动 @zh
subclass of: Zdarzenie

Usunięcie części
type: Class
comment: This class comprises the activities that result in an instance of E18 Physical Thing being decreased by the removal of a part. Typical scenarios include the detachment of an accessory, the removal of a component or part of a composite object, or the deaccessioning of an object from a curated E78 Collection. If the E80 Part Removal results in the total decomposition of the original object into pieces, such that the whole ceases to exist, the activity should instead be modelled as an E81 Transformation, i.e. a simultaneous destruction and production. In cases where the part removed has no discernible identity prior to its removal but does have an identity subsequent to its removal, the activity should be regarded as both E80 Part Removal and E12 Production. This class of activities forms a basis for reasoning about the history, and continuity of identity over time, of objects that are removed from other objects, such as precious gemstones being extracted from different items of jewelry, or cultural artifacts being deaccessioned from different museum collections over their lifespan. @en
label: Part Removal @en
label: Remoção de Parte @pt
label: Soustraction d'élément @fr
label: Teilentfernung @de
label: Αφαίρεση Μερών @el
label: Удаление Части @ru
label: 部件删除 @zh
subclass of: Modyfikacja

Przemiana
type: Class
comment: This class comprises the events that result in the simultaneous destruction of one or more than one E77 Persistent Item and the creation of one or more than one E77 Persistent Item that preserves recognizable substance from the first one(s) but has fundamentally different nature and identity. Although the old and the new instances of E77 Persistent Item are treated as discrete entities having separate, unique identities, they are causally connected through the E81 Transformation; the destruction of the old E77 Persistent Item(s) directly causes the creation of the new one(s) using or preserving some relevant substance. Instances of E81 Transformation are therefore distinct from re-classifications (documented using E17 Type Assignment) or modifications (documented using E11 Modification) of objects that do not fundamentally change their nature or identity. Characteristic cases are reconstructions and repurposing of historical buildings or ruins, fires leaving buildings in ruins, taxidermy of specimen in natural history and the reorganization of a corporate body into a new one. @en
label: Transformation @en
label: Transformação @pt
label: Umwandlung @de
label: Μετατροπή @el
label: Трансформация @ru
label: 转变 @zh
subclass of: Początek istnienia
subclass of: Koniec istnienia

Opis aktora
type: Class
comment: This class comprises any sort of name, number, code or symbol characteristically used to identify an E39 Actor. An E39 Actor will typically have more than one E82 Actor Appellation, and instances of E82 Actor Appellation in turn may have alternative representations. The distinction between corporate and personal names, which is particularly important in library applications, should be made by explicitly linking the E82 Actor Appellation to an instance of either E21 Person or E74 Group/E40 Legal Body. If this is not possible, the distinction can be made through the use of the P2 has type mechanism. @en
label: Actor Appellation @en
label: Akteurbenennung @de
label: Appellation d'agent @fr
label: Designação de Agente @pt
label: Ονομασία Δράστη @el
label: Обозначение Агента @ru
label: 角色称号 @zh
subclass of: Opis

Wytworzenie typu
type: Class
comment: This class comprises activities formally defining new types of items. It is typically a rigorous scholarly or scientific process that ensures a type is exhaustively described and appropriately named. In some cases, particularly in archaeology and the life sciences, E83 Type Creation requires the identification of an exemplary specimen and the publication of the type definition in an appropriate scholarly forum. The activity of E83 Type Creation is central to research in the life sciences, where a type would be referred to as a “taxon,” the type description as a “protologue,” and the exemplary specimens as “orgininal element” or “holotype”. @en
label: Criação de Tipo @pt
label: Création de type @fr
label: Type Creation @en
label: Typuserfindung @de
label: Δημιουργία Τύπου @el
label: Создание Типа @ru
label: 类型创造 @zh
subclass of: Wytworzenie

Nośnik informacji
type: Class
comment: This class comprises all instances of E22 Man-Made Object that are explicitly designed to act as persistent physical carriers for instances of E73 Information Object. An E84 Information Carrier may or may not contain information, e.g., a diskette. Note that any E18 Physical Thing may carry information, such as an E34 Inscription. However, unless it was specifically designed for this purpose, it is not an Information Carrier. Therefore the property P128 carries (is carried by) applies to E18 Physical Thing in general. @en
label: Information Carrier @en
label: Informationsträger @de
label: Suporte de Informação @pt
label: Support d'information @fr
label: Φορέας Πληροφορίας @el
label: Носитель Информации @ru
label: 信息载体 @zh
subclass of: Artefakt

Dołączenie
type: Class
comment: This class comprises the activities that result in an instance of E39 Actor becoming a member of an instance of E74 Group. This class does not imply initiative by either party. It may be the initiative of a third party. Typical scenarios include becoming a member of a social organisation, becoming employee of a company, marriage, the adoption of a child by a family and the inauguration of somebody into an official position. @en
label: Beitritt @de
label: Joining @en
label: 加入 @zh
subclass of: Działanie

Opuszczenie
type: Class
comment: This class comprises the activities that result in an instance of E39 Actor to be disassociated from an instance of E74 Group. This class does not imply initiative by either party. It may be the initiative of a third party. Typical scenarios include the termination of membership in a social organisation, ending the employment at a company, divorce, and the end of tenure of somebody in an official position. @en
label: Austritt @de
label: Leaving @en
label: 脱离 @zh
subclass of: Działanie

Ochrona
type: Class
comment: This class comprises the activities that result in the continuity of management and the preservation and evolution of instances of E78 Collection, following an implicit or explicit curation plan. It specializes the notion of activity into the curation of a collection and allows the history of curation to be recorded. Items are accumulated and organized following criteria like subject, chronological period, material type, style of art etc. and can be added or removed from an E78 Collection for a specific purpose and/or audience. The initial aggregation of items of a collection is regarded as an instance of E12 Production Event while the activity of evolving, preserving and promoting a collection is regarded as an instance of E87 Curation Activity. @en
label: Curation Activity @en
label: Kuratorische Tätigkeit @de
label: 典藏管理 @zh
subclass of: Działanie

Sąd (w sensie logicznym)
type: Class
comment: This class comprises immaterial items, including but not limited to stories, plots, procedural prescriptions, algorithms, laws of physics or images that are, or represent in some sense, sets of propositions about real or imaginary things and that are documented as single units or serve as topics of discourse. This class also comprises items that are “about” something in the sense of a subject. In the wider sense, this class includes expressions of psychological value such as non-figural art and musical themes. However, conceptual items such as types and classes are not instances of E89 Propositional Object. This should not be confused with the definition of a type, which is indeed an instance of E89 Propositional Object. @en
label: Aussagenobjekt @de
label: Propositional Object @en
label: 陈述性物件 @zh
subclass of: Obiekt pojęciowy

Nabycie
type: Class
comment: This class comprises transfers of legal ownership from one or more instances of E39 Actor to one or more other instances of E39 Actor. The class also applies to the establishment or loss of ownership of instances of E18 Physical Thing. It does not, however, imply changes of any other kinds of right. The recording of the donor and/or recipient is optional. It is possible that in an instance of E8 Acquisition there is either no donor or no recipient. Depending on the circumstances, it may describe: 1. the beginning of ownership 2. the end of ownership 3. the transfer of ownership 4. the acquisition from an unknown source 5. the loss of title due to destruction of the item It may also describe events where a collector appropriates legal title, for example by annexation or field collection. The interpretation of the museum notion of "accession" differs between institutions. The CRM therefore models legal ownership (E8 Acquisition) and physical custody (E10 Transfer of Custody) separately. Institutions will then model their specific notions of accession and deaccession as combinations of these. @en
label: Acquisition @en
label: Aquisição @pt
label: Erwerb @de
label: Απόκτηση @el
label: Событие Приобретения @ru
label: 征集取得 @zh
subclass of: Działanie

Obiekt symboliczny
type: Class
comment: This class comprises identifiable symbols and any aggregation of symbols, such as characters, identifiers, traffic signs, emblems, texts, data sets, images, musical scores, multimedia objects, computer program code or mathematical formulae that have an objectively recognizable structure and that are documented as single units. It includes sets of signs of any nature, which may serve to designate something, or to communicate some propositional content. An instance of E90 Symbolic Object does not depend on a specific physical carrier, which can include human memory, and it can exist on one or more carriers simultaneously. An instance of E90 Symbolic Object may or may not have a specific meaning, for example an arbitrary character string. In some cases, the content of an instance of E90 Symbolic Object may completely be represented by a serialized content model, such.. as the property P3 has note allows for describing this content model…P3.1 has type: E55 Type to specify the encoding.. @en
label: Symbolic Object @en
label: Symbolisches Objekt @de
label: 符号物件 @zh
subclass of: Obiekt pojęciowy
subclass of: Obiekt prawny

Region czasoprzestrzeni
type: Class
comment: This class comprises 4 dimensional point sets (volumes) in physical spacetime regardless its true geometric form. They may derive their identity from being the extent of a material phenomenon or from being the interpretation of an expression defining an extent in spacetime. Intersections of instances of E92 Spacetime Volume, Place and Timespan are also regarded as instances of E92 Spacetime Volume. An instance of E92 Spacetime Volume is either contiguous or composed of a finite number of contiguous subsets. Its boundaries may be fuzzy due to the properties of the phenomena it derives from or due to the limited precision up to which defining expression can be identified with a real extent in spacetime. The duration of existence of an instance of a spacetime volume is trivially its projection on time. @en
label: Spacetime Volume @en
subclass of: Byt CRM

Obecność
type: Class
comment: This class comprises instances of E92 Spacetime Volume that result from intersection of instances of E92 Spacetime Volume with an instance of E52 Time-Span. The identity of an instance of this class is determined by the identities of the constituing spacetime volume and the time-span. This class can be used to define temporal snapshots at a particular time-span, such as the extent of the Roman Empire at 33 B.C., or the extent occupied by a museum object at rest in an exhibit. In particular, it can be used to define the spatial projection of a spacetime volume during a particular time-span, such as the maximal spatial extent of a flood at some particular hour, or all areas covered by the Poland within the 20th century AD. @en
label: Presence @en
subclass of: Region czasoprzestrzeni

Ruch
type: Class
comment: This class comprises changes of the physical location of the instances of E19 Physical Object. Note, that the class E9 Move inherits the property P7 took place at (witnessed): E53 Place. This property should be used to describe the trajectory or a larger area within which a move takes place, whereas the properties P26 moved to (was destination of), P27 moved from (was origin of) describe the start and end points only. Moves may also be documented to consist of other moves (via P9 consists of (forms part of)), in order to describe intermediate stages on a trajectory. In that case, start and end points of the partial moves should match appropriately between each other and with the overall event. @en
label: Déplacement @fr
label: Locomoção @pt
label: Move @en
label: Objektbewegung @de
label: Μετακίνηση @el
label: Перемещение @ru
label: 移动 @zh
subclass of: Działanie

Tod von
type: ObjectProperty
comment: This property property links an E69 Death event to the E21 Person that died. @en
domain: Śmierć
label: a été la mort de @fr
label: foi a morte para @pt
label: was death of @en
label: ήταν θάνατος του/της @el
label: был смертью для @ru
label: 灭亡了 @zh
range: Osoba
sub property of: a fait cesser d’exister

died in
type: ObjectProperty
domain: Osoba
label: est mort par @fr
label: morreu em @pt
label: starb in @de
label: πέθανε σε @el
label: умер в @ru
label: 死亡於 @zh
range: Śmierć
sub property of: a cessé d’exister du fait de

avait comme utilisation générale
type: ObjectProperty
comment: This property links an instance of E70 Thing to an E55 Type of usage. It allows the relationship between particular things, both physical and immaterial, and general methods and techniques of use to be documented. Thus it can be asserted that a baseball bat had a general use for sport and a specific use for threatening people during the Great Train Robbery. @en
domain: Rzecz
label: had as general use @en
label: hatte die allgemeine Verwendung @de
label: tem como uso geral @pt
label: είχε ως γενική χρήση @el
label: имел основное применение @ru
label: 被惯用於 @zh
range: Typ

foi uso de
type: ObjectProperty
domain: Typ
label: war die Verwendung von @de
label: was use of @en
label: était l’utilisation de @fr
label: ήταν χρήση του/της @el
label: был применением для @ru
label: 可使用 @zh
range: Rzecz

a pour titre
type: ObjectProperty
comment: This property describes the E35 Title applied to an instance of E71 Man-Made Thing. The E55 Type of Title is assigned in a sub property. The P102.1 has type property of the P102 has title (is title of) property enables the relationship between the Title and the thing to be further clarified, for example, if the Title was a given Title, a supplied Title etc. It allows any man-made material or immaterial thing to be given a Title. It is possible to imagine a Title being created without a specific object in mind. @en
domain: Wytwór
label: has title @en
label: tem título @pt
label: trägt den Titel @de
label: έχει τίτλο @el
label: имеет заголовок @ru
label: 有标题 @zh
range: Tytuł
sub property of: est identifiée par

est le titre de
type: ObjectProperty
domain: Tytuł
label: is title of @en
label: ist der Titel von @de
label: é título de @pt
label: είναι τίτλος του/της @el
label: является заголовком для @ru
label: 被用为标题来称呼 @zh
range: Wytwór
sub property of: bezeichnet

bestimmt für
type: ObjectProperty
comment: This property links an instance of E71 Man-Made Thing to an E55 Type of usage. It creates a property between specific man-made things, both physical and immaterial, to Types of intended methods and techniques of use. Note: A link between specific man-made things and a specific use activity should be expressed using P19 was intended use of (was made for). @en
domain: Wytwór
label: era destinado à @pt
label: was intended for @en
label: était destiné à @fr
label: προοριζόταν για @el
label: был задуман для @ru
label: 被制作来用於 @zh
range: Typ

era a destinação de
type: ObjectProperty
domain: Typ
label: war Bestimmung von @de
label: was intention of @en
label: était la raison d'être de @fr
label: ήταν προορισμός του @el
label: был интенцией для @ru
range: Wytwór

Gegenstand von
type: ObjectProperty
comment: This property links a particular E72 Legal Object to the instances of E30 Right to which it is subject. The Right is held by an E39 Actor as described by P75 possesses (is possessed by). @en
domain: Obiekt prawny
label: est sujet à @fr
label: está sujeito à @pt
label: is subject to @en
label: υπόκειται σε @el
label: является объектом для @ru
label: 受制於 @zh
range: Uprawnienie

applies to
type: ObjectProperty
domain: Uprawnienie
label: findet Anwendung auf @de
label: se aplicam à @pt
label: s’applique à @fr
label: ισχύει για @el
label: применяется к @ru
label: 被应用於 @zh
range: Obiekt prawny

Rechte stehen zu
type: ObjectProperty
comment: This property identifies the E39 Actor who holds the instances of E30 Right to an E72 Legal Object. It is a superproperty of P52 has current owner (is current owner of) because ownership is a right that is held on the owned object. P105 right held by (has right on) is a shortcut of the fully developed path from E72 Legal Object through P104 is subject to (applies to), E30 Right, P75 possesses (is possessed by) to E39 Actor. @en
domain: Obiekt prawny
label: droit détenu par @fr
label: right held by @en
label: são direitos de @pt
label: δικαίωμα κατέχεται από @el
label: право принадлежит @ru
label: 有权限持有者 @zh
range: Aktor

détient un droit sur
type: ObjectProperty
domain: Aktor
label: has right on @en
label: hat Rechte an @de
label: possui direitos sobre @pt
label: έχει δικαίωμα σε @el
label: владеет правом на @ru
label: 持有权限来管制 @zh
range: Obiekt prawny

est composé de
type: ObjectProperty
comment: This property associates an instance of E90 Symbolic Object with a part of it that is by itself an instance of E90 Symbolic Object, such as fragments of texts or clippings from an image. @en
domain: Obiekt symboliczny
label: is composed of @en
label: ist zusammengesetzt aus @de
label: é composto de @pt
label: αποτελείται από @el
label: составлен из @ru
label: 有组成元素 @zh
range: Obiekt symboliczny

bildet Teil von
type: ObjectProperty
domain: Obiekt symboliczny
label: fait partie de @fr
label: faz parte de @pt
label: forms part of @en
label: αποτελεί μέρος του/της @el
label: формирует часть @ru
label: 组成了 @zh
range: Obiekt symboliczny

a pour membre actuel ou ancien
type: ObjectProperty
comment: This property relates an E39 Actor to the E74 Group of which that E39 Actor is a member. Groups, Legal Bodies and Persons, may all be members of Groups. A Group necessarily consists of more than one member. This property is a shortcut of the more fully developed path from E74 Group through P144 joined with (gained member by), E85 Joining, P143 joined (was joined by) to E39 Actor The property P107.1 kind of member can be used to specify the type of membership or the role the member has in the group. @en
domain: Grupa
label: has current or former member @en
label: hat derzeitiges oder früheres Mitglied @de
label: tem ou teve membro @pt
label: έχει ή είχε μέλος @el
label: имеет действующего или бывшего члена @ru
label: 有现任或前任成员 @zh
range: Aktor

est actuel ou ancien membre de
type: ObjectProperty
domain: Aktor
label: is current or former member of @en
label: ist derzeitiges oder früheres Mitglied von @de
label: é ou foi membro de @pt
label: είναι ή ήταν μέλος του/της @el
label: является действующим или бывшим членом @ru
label: 目前或曾经加入群组 @zh
range: Grupa

a produit
type: ObjectProperty
comment: This property identifies the E24 Physical Man-Made Thing that came into existence as a result of an E12 Production. The identity of an instance of E24 Physical Man-Made Thing is not defined by its matter, but by its existence as a subject of documentation. An E12 Production can result in the creation of multiple instances of E24 Physical Man-Made Thing. @en
domain: Produkcja
label: has produced @en
label: hat hergestellt @de
label: produziu @pt
label: παρήγαγε @el
label: произвел @ru
label: 有产出物 @zh
range: Wytwór fizyczny
sub property of: a modifié
sub property of: a fait exister

a été produit par
type: ObjectProperty
domain: Wytwór fizyczny
label: foi produzido por @pt
label: was produced by @en
label: wurde hergestellt durch @de
label: παρήχθη από @el
label: был произведен посредством @ru
label: 被制作於 @zh
range: Produkcja
sub property of: a été modifié par
sub property of: a commencé à exister du fait de

a pour conservateur actuel ou ancien
type: ObjectProperty
comment: This property identifies the E39 Actor or Actors who assume or have assumed overall curatorial responsibility for an E78 Collection. It does not allow a history of curation to be recorded. This would require use of an Event initiating a curator being responsible for a Collection. @en
domain: Zbiór
label: has current or former curator @en
label: hat derzeitigen oder früheren Kurator @de
label: tem ou teve curador @pt
label: έχει ή είχε επιμελητή @el
label: имеет действующего или бывшего хранителя @ru
label: 有现任或前任典藏管理员 @zh
range: Aktor
sub property of: est ou a été détenu par

est ou a été le conservateur de
type: ObjectProperty
domain: Aktor
label: is current or former curator of @en
label: ist derzeitiger oder früherer Kurator von @de
label: é ou foi curador de @pt
label: είναι ή ήταν επιμελητής του/της @el
label: является действующим или бывшим хранителем @ru
label: 目前或曾经典藏管理 @zh
range: Zbiór
sub property of: est ou a été détenteur de

está contido em
type: ObjectProperty
comment: This property associates an instance of E92 Spacetime Volume with another instance of E92 Spacetime Volume that falls within the latter. In other words, all points in the former are also points in the latter. @en
domain: Region czasoprzestrzeni
label: falls within @en
label: fällt in @de
label: s’insère dans le cours de @fr
label: εμπίπτει @el
label: находится в пределах @ru
label: 发生时间涵盖於 @zh
range: Region czasoprzestrzeni

contains
type: ObjectProperty
domain: Region czasoprzestrzeni
label: contient @fr
label: contém @pt
label: enthält @de
label: περιλαμβάνει @el
label: содержит @ru
label: 时间上涵盖 @zh
range: Region czasoprzestrzeni

a augmenté
type: ObjectProperty
comment: This property identifies the E24 Physical Man-Made Thing that is added to (augmented) in an E79 Part Addition. Although a Part Addition event normally concerns only one item of Physical Man-Made Thing, it is possible to imagine circumstances under which more than one item might be added to (augmented). For example, the artist Jackson Pollock trailing paint onto multiple canvasses. @en
domain: Dodanie części
label: augmented @en
label: aumentou @pt
label: erweiterte @de
label: επαύξησε @el
label: увеличил @ru
label: 扩增了 @zh
range: Wytwór fizyczny
sub property of: a modifié

a été augmenté par
type: ObjectProperty
domain: Wytwór fizyczny
label: foi aumentada por @pt
label: was augmented by @en
label: wurde erweitert durch @de
label: επαυξήθηκε από @el
label: был увеличен посредством @ru
label: 被扩增於 @zh
range: Dodanie części
sub property of: a été modifié par

a ajouté
type: ObjectProperty
comment: This property identifies the E18 Physical Thing that is added during an E79 Part Addition activity @en
domain: Dodanie części
label: added @en
label: adicionou @pt
label: fügte hinzu @de
label: προσέθεσε @el
label: добавил @ru
label: 附加上部件 @zh
range: Rzecz fizyczna
sub property of: est arrivé en présence de
sub property of: a utilisé l'objet spécifique

a été ajouté par
type: ObjectProperty
domain: Rzecz fizyczna
label: foi adicionado por @pt
label: was added by @en
label: wurde hinzugefügt durch @de
label: προστέθηκε από @el
label: был добавлен посредством @ru
label: 被附加於 @zh
range: Dodanie części
sub property of: estava presente no
sub property of: a été utilisé pour

a diminué
type: ObjectProperty
comment: This property identifies the E24 Physical Man-Made Thing that was diminished by E80 Part Removal. Although a Part removal activity normally concerns only one item of Physical Man-Made Thing, it is possible to imagine circumstances under which more than one item might be diminished by a single Part Removal activity. @en
domain: Usunięcie części
label: diminished @en
label: diminuiu @pt
label: verminderte @de
label: εξάλειψε @el
label: уменьшил @ru
label: 缩减了 @zh
range: Wytwór fizyczny
sub property of: a modifié

a été diminué par
type: ObjectProperty
domain: Wytwór fizyczny
label: foi diminuído por @pt
label: was diminished by @en
label: wurde vermindert durch @de
label: εξαλείφθηκε από @el
label: был уменьшен посредством @ru
label: 被缩减於 @zh
range: Usunięcie części
sub property of: a été modifié par

a enlevé
type: ObjectProperty
comment: This property identifies the E18 Physical Thing that is removed during an E80 Part Removal activity. @en
domain: Usunięcie części
label: entfernte @de
label: removed @en
label: removeu @pt
label: αφαίρεσε @el
label: удален @ru
label: 移除了 @zh
range: Rzecz fizyczna
sub property of: est arrivé en présence de

a été enlevée par
type: ObjectProperty
domain: Rzecz fizyczna
label: foi removido por @pt
label: was removed by @en
label: wurde entfernt durch @de
label: αφαιρέθηκε από @el
label: был удален посредством @ru
label: 被移除於 @zh
range: Usunięcie części
sub property of: estava presente no

est temporellement égale à
type: ObjectProperty
comment: This symmetric property allows the instances of E2 Temporal Entity with the same E52 Time-Span to be equated. This property is only necessary if the time span is unknown (otherwise the equivalence can be calculated). This property is the same as the "equal" relationship of Allen’s temporal logic (Allen, 1983, pp. 832-843). @en
domain: Byt czasowy
label: is equal in time to @en
label: zeitgleich zu @de
label: é temporalmente igual a @pt
label: συμπίπτει χρονικά με @el
label: равен по времени @ru
label: 时段相同於 @zh
range: Byt czasowy

beendet
type: ObjectProperty
comment: This property allows the ending point for a E2 Temporal Entity to be situated by reference to the ending point of another temporal entity of longer duration. This property is only necessary if the time span is unknown (otherwise the relationship can be calculated). This property is the same as the "finishes / finished-by" relationships of Allen’s temporal logic (Allen, 1983, pp. 832-843). @en
domain: Byt czasowy
label: finaliza @pt
label: finishes @en
label: termine @fr
label: περατώνει @el
label: заканчивает @ru
label: 结束了 @zh
range: Byt czasowy

est terminée par
type: ObjectProperty
domain: Byt czasowy
label: is finished by @en
label: wurde beendet mit @de
label: é finalizada por @pt
label: περατώνεται με @el
label: заканчивается @ru
label: 被结束于 @zh
range: Byt czasowy

beginnt
type: ObjectProperty
comment: This property allows the starting point for a E2 Temporal Entity to be situated by reference to the starting point of another temporal entity of longer duration. This property is only necessary if the time span is unknown (otherwise the relationship can be calculated). This property is the same as the "starts / started-by" relationships of Allen’s temporal logic (Allen, 1983, pp. 832-843). @en
domain: Byt czasowy
label: commence @fr
label: inicia @pt
label: starts @en
label: αρχίζει @el
label: начинает @ru
label: 开始了 @zh
range: Byt czasowy

est commencée par
type: ObjectProperty
domain: Byt czasowy
label: is started by @en
label: wurde begonnen mit @de
label: é iniciada por @pt
label: αρχίζει με @el
label: начинается @ru
label: 被开始于 @zh
range: Byt czasowy

a lieu pendant
type: ObjectProperty
comment: This property allows the entire E52 Time-Span of an E2 Temporal Entity to be situated within the Time-Span of another temporal entity that starts before and ends after the included temporal entity. This property is only necessary if the time span is unknown (otherwise the relationship can be calculated). This property is the same as the "during / includes" relationships of Allen’s temporal logic (Allen, 1983, pp. 832-843). @en
domain: Byt czasowy
label: fällt in @de
label: occurs during @en
label: ocorre durante @pt
label: εμφανίζεται κατά τη διάρκεια @el
label: появляется во течение @ru
label: 时段被涵盖於 @zh
range: Byt czasowy

beinhaltet
type: ObjectProperty
domain: Byt czasowy
label: comporte @fr
label: includes @en
label: inclui @pt
label: περιλαμβάνει @el
label: включает @ru
label: 时段涵盖了 @zh
range: Byt czasowy

est partiellement recouverte dans le temps par
type: ObjectProperty
comment: This property identifies an overlap between the instances of E52 Time-Span of two instances of E2 Temporal Entity. It implies a temporal order between the two entities: if A overlaps in time B, then A must start before B, and B must end after A. This property is only necessary if the relevant time spans are unknown (otherwise the relationship can be calculated). This property is the same as the "overlaps / overlapped-by" relationships of Allen’s temporal logic (Allen, 1983, pp. 832-843). @en
domain: Byt czasowy
label: overlaps in time with @en
label: sobrepõe temporalmente @pt
label: überlappt zeitlich mit @de
label: προηγείται μερικώς επικαλύπτοντας @el
label: перекрывает во времени @ru
label: 时段重叠了 @zh
range: Byt czasowy

is overlapped in time by
type: ObjectProperty
domain: Byt czasowy
label: recouvre partiellement dans le temps @fr
label: wird zeitlich überlappt von @de
label: é sobreposto temporalmente por @pt
label: έπεται μερικώς επικαλυπτόμενο @el
label: перекрывается во времени @ru
label: 时段被重叠于 @zh
range: Byt czasowy

est temporellement contiguë avec
type: ObjectProperty
comment: This property indicates that one E2 Temporal Entity immediately follows another. It implies a particular order between the two entities: if A meets in time with B, then A must precede B. This property is only necessary if the relevant time spans are unknown (otherwise the relationship can be calculated). This property is the same as the "meets / met-by" relationships of Allen’s temporal logic (Allen, 1983, pp. 832-843). @en
domain: Byt czasowy
label: meets in time with @en
label: trifft zeitlich auf @de
label: é temporalmente contíguo com @pt
label: προηγείται @el
label: следует во времени за @ru
label: 紧接续了 @zh
range: Byt czasowy

est immédiatement précédé par
type: ObjectProperty
domain: Byt czasowy
label: is met in time by @en
label: wird zeitlich getroffen von @de
label: é imediatamente precedido por @pt
label: έπεται @el
label: предшествует во времени @ru
label: 紧接续於 @zh
range: Byt czasowy

a eu pour participant
type: ObjectProperty
comment: This property describes the active or passive participation of instances of E39 Actors in an E5 Event. It connects the life-line of the related E39 Actor with the E53 Place and E50 Date of the event. The property implies that the Actor was involved in the event but does not imply any causal relationship. The subject of a portrait can be said to have participated in the creation of the portrait. @en
domain: Zdarzenie
label: had participant @en
label: hatte Teilnehmer @de
label: tem participante @pt
label: είχε συμμέτοχο @el
label: имел участника @ru
label: 有参与者 @zh
range: Aktor
sub property of: est arrivé en présence de

a participé à
type: ObjectProperty
domain: Aktor
label: nahm Teil an @de
label: participa em @pt
label: participated in @en
label: συμμετείχε σε @el
label: участвовал в @ru
label: 参与了 @zh
range: Zdarzenie
sub property of: estava presente no

a lieu avant
type: ObjectProperty
comment: This property identifies the relative chronological sequence of two temporal entities. It implies that a temporal gap exists between the end of A and the start of B. This property is only necessary if the relevant time spans are unknown (otherwise the relationship can be calculated). This property is the same as the "before / after" relationships of Allen’s temporal logic (Allen, 1983, pp. 832-843). @en
domain: Byt czasowy
label: kommt vor @de
label: occurs before @en
label: ocorre antes @pt
label: εμφανίζεται πριν @el
label: появляется до @ru
label: 发生时段先於 @zh
range: Byt czasowy

a lieu après
type: ObjectProperty
domain: Byt czasowy
label: kommt nach @de
label: occurs after @en
label: ocorre depois @pt
label: εμφανίζεται μετά @el
label: появляется после @ru
label: 发生时段后於 @zh
range: Byt czasowy

chevauche
type: ObjectProperty
comment: This symmetric property allows the instances of E53 Place with overlapping geometric extents to be associated with each other. It does not specify anything about the shared area. This property is purely spatial, in contrast to Allen operators, which are purely temporal. @en
domain: Miejsce
label: overlaps with @en
label: sobrepõe com @pt
label: überlappt mit @de
label: επικαλύπτεται με @el
label: пересекается с @ru
label: 空间重叠于 @zh
range: Miejsce

borders with
type: ObjectProperty
comment: This symmetric property allows the instances of E53 Place which share common borders to be related as such. This property is purely spatial, in contrast to Allen operators, which are purely temporal. @en
domain: Miejsce
label: fronteira com @pt
label: grenzt an @de
label: jouxte @fr
label: συνορεύει με @el
label: граничит с @ru
label: 接壤于 @zh
range: Miejsce

a eu pour résultat
type: ObjectProperty
comment: This property identifies the E77 Persistent Item or items that are the result of an E81 Transformation. New items replace the transformed item or items, which cease to exist as units of documentation. The physical continuity between the old and the new is expressed by the link to the common Transformation. @en
domain: Przemiana
label: ergab @de
label: resulted in @en
label: resultou em @pt
label: είχε ως αποτέλεσμα @el
label: повлек появление @ru
label: 转变出 @zh
range: Byt trwający w czasie
sub property of: a fait exister

ergab sich aus
type: ObjectProperty
domain: Byt trwający w czasie
label: est le résultat de @fr
label: resultado de @pt
label: resulted from @en
label: προέκυψε από @el
label: был результатом @ru
label: 肇因於 @zh
range: Przemiana
sub property of: a commencé à exister du fait de

a transformé
type: ObjectProperty
comment: This property identifies the E77 Persistent Item or items that cease to exist due to a E81 Transformation. It is replaced by the result of the Transformation, which becomes a new unit of documentation. The continuity between both items, the new and the old, is expressed by the link to the common Transformation. @en
domain: Przemiana
label: transformed @en
label: transformou @pt
label: wandelte um @de
label: μετέτρεψε @el
label: трансформировал @ru
label: 转变了 @zh
range: Byt trwający w czasie
sub property of: a fait cesser d’exister

a été transformé par
type: ObjectProperty
domain: Byt trwający w czasie
label: foi transformado por @pt
label: was transformed by @en
label: wurde umgewandelt durch @de
label: μετατράπηκε από @el
label: был трансформирован посредством @ru
label: 被转变於 @zh
range: Przemiana
sub property of: a cessé d’exister du fait de

a employé un objet du type
type: ObjectProperty
comment: This property defines the kind of objects used in an E7 Activity, when the specific instance is either unknown or not of interest, such as use of "a hammer". @en
domain: Działanie
label: benutzte Objekt des Typus @de
label: used object of type @en
label: usou objeto do tipo @pt
label: χρησιμοποίησε αντικείμενο τύπου @el
label: использовал объект типа @ru
label: 有使用物件类型 @zh
range: Typ

Objekt des Typus ... wurde benutzt in
type: ObjectProperty
domain: Typ
label: foi tipo do objeto usado em @pt
label: was type of object used in @en
label: était le type d’objet employé par @fr
label: ήταν o τύπος αντικείμενου που χρησιμοποιήθηκε σε @el
label: был типом объекта использованного в @ru
label: 被使用於 @zh
range: Działanie

a employé
type: ObjectProperty
comment: This property identifies E57 Material employed in an E11 Modification. The E57 Material used during the E11 Modification does not necessarily become incorporated into the E24 Physical Man-Made Thing that forms the subject of the E11 Modification. @en
domain: Modyfikacja
label: employed @en
label: empregou @pt
label: verwendete @de
label: χρησιμοποίησε @el
label: использовал @ru
label: 采用了材料 @zh
range: Materiał

a été employé dans
type: ObjectProperty
domain: Materiał
label: foi empregado em @pt
label: was employed in @en
label: wurde verwendet bei @de
label: χρησιμοποιήθηκε σε @el
label: использовался в @ru
label: 被使用於 @zh
range: Modyfikacja

a pour terme générique
type: ObjectProperty
comment: This property identifies a super-Type to which an E55 Type is related. It allows Types to be organised into hierarchies. This is the sense of "broader term generic (BTG)" as defined in ISO 2788 @en
domain: Typ
label: has broader term @en
label: hat den Oberbegriff @de
label: tem termo genérico @pt
label: έχει ευρύτερο όρο @el
label: имеет вышестоящий термин @ru
label: 有广义术语 @zh
range: Typ

a pour terme spécifique
type: ObjectProperty
domain: Typ
label: has narrower term @en
label: hat den Unterbegriff @de
label: tem termo específico @pt
label: έχει στενότερο όρο @el
label: 有狭义术语 @zh
range: Typ

carries
type: ObjectProperty
comment: This property identifies an E90 Symbolic Object carried by an instance of E18 Physical Thing. @en
domain: Rzecz fizyczna
label: est le support de @fr
label: trägt @de
label: é o suporte de @pt
label: φέρει @el
label: несет @ru
label: 承载信息 @zh
range: Obiekt symboliczny
sub property of: apresenta características de

a pour support
type: ObjectProperty
domain: Obiekt symboliczny
label: is carried by @en
label: wird getragen von @de
label: é suportado por @pt
label: φέρεται από @el
label: переносится посредством @ru
label: 被承载于 @zh
range: Rzecz fizyczna
sub property of: Merkmale auch auf

est au sujet de
type: ObjectProperty
comment: This property documents that an E89 Propositional Object has as subject an instance of E1 CRM Entity. @en
domain: Sąd (w sensie logicznym)
label: handelt über @de
label: is about @en
label: é sobre @pt
label: έχει ως θέμα @el
label: касается @ru
label: 陈述关於 @zh
range: Byt CRM
sub property of: fait référence à

est le sujet de
type: ObjectProperty
domain: Byt CRM
label: is subject of @en
label: wird behandelt in @de
label: é assunto de @pt
label: είναι θέμα του/της @el
label: является предметом для @ru
label: 被陈述於 @zh
range: Sąd (w sensie logicznym)
sub property of: est référencé par

est arrivé en présence de
type: ObjectProperty
comment: This property describes the active or passive presence of an E77 Persistent Item in an E5 Event without implying any specific role. It connects the history of a thing with the E53 Place and E50 Date of an event. For example, an object may be the desk, now in a museum on which a treaty was signed. The presence of an immaterial thing implies the presence of at least one of its carriers. @en
domain: Zdarzenie
label: fand statt im Beisein von @de
label: occurred in the presence of @en
label: ocorreu na presença de @pt
label: συνέβη παρουσία του/της @el
label: появился в присутствии @ru
label: 发生现场存在 @zh
range: Byt trwający w czasie

estava presente no
type: ObjectProperty
domain: Byt trwający w czasie
label: war anwesend bei @de
label: was present at @en
label: était présent à @fr
label: ήταν παρών/παρούσα/παρόν σε @el
label: присутствовал при @ru
label: 当时在场於 @zh
range: Zdarzenie

apresenta características de
type: ObjectProperty
comment: This property generalises the notions of "copy of" and "similar to" into a directed relationship, where the domain expresses the derivative, if such a direction can be established. Otherwise, the relationship is symmetric. If the reason for similarity is a sort of derivation process, i.e., that the creator has used or had in mind the form of a particular thing during the creation or production, this process should be explicitly modelled. Moreover it expresses similarity in cases that can be stated between two objects only, without historical knowledge about its reasons. @en
domain: Rzecz
label: présente des caractéristiques de @fr
label: shows features of @en
label: zeigt Merkmale von @de
label: παρουσιάζει χαρακτηριστικά του/της @el
label: демонстрирует признаки @ru
label: 外观特征原出现於 @zh
range: Rzecz

Merkmale auch auf
type: ObjectProperty
domain: Rzecz
label: a des caractéristiques se trouvant aussi sur @fr
label: características são também encontradas em @pt
label: features are also found on @en
label: χαρακτηριστικά του βρίσκονται επίσης σε @el
label: признаки также найдены на @ru
label: 外观特征被复制於 @zh
range: Rzecz

est identifié par
type: ObjectProperty
comment: This property identifies a name used specifically to identify an E39 Actor. This property is a specialisation of P1 is identified by (identifies) is identified by. @en
domain: Aktor
label: is identified by @en
label: wird identifziert durch @de
label: é identificado por @pt
label: αναγνωρίζεται ως @el
label: идентифицируется посредством @ru
label: 有称号 @zh
range: Opis aktora
sub property of: est identifiée par

identifica
type: ObjectProperty
domain: Opis aktora
label: identifie @fr
label: identifies @en
label: identifiziert @de
label: είναι αναγνωριστικό @el
label: идентифицирует @ru
label: 被用来识别 @zh
range: Aktor
sub property of: bezeichnet

chevauche
type: ObjectProperty
comment: This symmetric property associates two instances of E92 Spacetime Volume that have some of their extent in common. @en
domain: Region czasoprzestrzeni
label: overlaps with @en
label: sobrepõe @pt
label: überlappt mit @de
label: επικαλύπτεται με @el
label: пересекается с @ru
label: 时空重叠于 @zh
range: Region czasoprzestrzeni

est séparée de
type: ObjectProperty
comment: This symmetric property associates two instances of E92 Spacetime Volume that have no extent in common. @en
domain: Region czasoprzestrzeni
label: getrennt von @de
label: is separated from @en
label: é separado de @pt
label: διαχωρίζεται από @el
label: отделен от @ru
label: 时空不重叠于 @zh
range: Region czasoprzestrzeni

continued
type: ObjectProperty
comment: This property associates two instances of E7 Activity, where the domain is considered as an intentional continuation of the range. A continuation of an activity may happen when the continued activity is still ongoing or after the continued activity has completely ended. The continuing activity may have started already before it decided to continue the other one. Continuation implies a coherence of intentions and outcomes of the involved activities. @en
domain: Działanie
label: continuou @pt
label: est la suite de @fr
label: setzte sich fort in @de
label: συνέχισε @el
label: продолжил @ru
label: 延续了 @zh
range: Działanie
sub property of: a été influencée par

a été continuée par
type: ObjectProperty
domain: Działanie
label: foi continuada por @pt
label: was continued by @en
label: wurde fortgesetzt durch @de
label: συνεχίστηκε από @el
label: был продолжен @ru
label: 有延续活动 @zh
range: Działanie
sub property of: a influencé

a créé le type
type: ObjectProperty
comment: This property identifies the E55 Type, which is created in an E83Type Creation activity. @en
domain: Wytworzenie typu
label: created type @en
label: criou tipo @pt
label: erschuf Typus @de
label: δημιούργησε τύπο @el
label: создал тип @ru
label: 创造了类型 @zh
range: Typ
sub property of: a créé

a été créé par
type: ObjectProperty
domain: Typ
label: foi criado por @pt
label: was created by @en
label: wurde geschaffen durch @de
label: δημιουργήθηκε από @el
label: был создан посредством @ru
label: 被创造於 @zh
range: Wytworzenie typu
sub property of: a été créé par

foi baseado em
type: ObjectProperty
comment: This property identifies one or more items that were used as evidence to declare a new E55 Type. The examination of these items is often the only objective way to understand the precise characteristics of a new Type. Such items should be deposited in a museum or similar institution for that reason. The taxonomic role renders the specific relationship of each item to the Type, such as "holotype" or "original element". @en
domain: Wytworzenie typu
label: stützte sich auf @de
label: s’est fondée sur @fr
label: was based on @en
label: βασίστηκε σε @el
label: был основан на @ru
label: 根据了 @zh
range: Byt CRM
sub property of: a été influencée par

a justifié la création de type
type: ObjectProperty
domain: Byt CRM
label: belegte @de
label: suportou a criação de tipo @pt
label: supported type creation @en
label: υποστήριξε τη δημιουργία τύπου @el
label: поддержал создание типа @ru
label: 提供證據给类型创造 @zh
range: Wytworzenie typu
sub property of: a influencé

erläutert
type: ObjectProperty
comment: This property allows an item to be declared as a particular example of an E55 Type or taxon The P137.1 in the taxonomic role property of P137 exemplifies (is exemplified by) allows differentiation of taxonomic roles. The taxonomic role renders the specific relationship of this example to the Type, such as "prototypical", "archetypical", "lectotype", etc. The taxonomic role "lectotype" is not associated with the Type Creation (E83) itself, but selected in a later phase. @en
domain: Byt CRM
label: exemplifie @fr
label: exemplifies @en
label: é exemplificado por @pt
label: δειγματίζει @el
label: поясняет @ru
label: 例示了 @zh
range: Typ
sub property of: est de type

erläutert durch Beispiel
type: ObjectProperty
domain: Typ
label: est exemplifié par @fr
label: exemplifica @pt
label: is exemplified by @en
label: δειγματίζεται από @el
label: поясняется посредством @ru
label: 有例示 @zh
range: Byt CRM
sub property of: est le type de

representa
type: ObjectProperty
comment: This property establishes the relationship between an E36 Visual Item and the entity that it visually represents. Any entity may be represented visually. This property is part of the fully developed path from E24 Physical Man-Made Thing through P65 shows visual item (is shown by), E36 Visual Item, P138 represents (has representation) to E1 CRM Entity, which is shortcut by P62depicts (is depicted by). P138.1 mode of representation allows the nature of the representation to be refined. This property is also used for the relationship between an original and a digitisation of the original by the use of techniques such as digital photography, flatbed or infrared scanning. Digitisation is here seen as a process with a mechanical, causal component rendering the spatial distribution of structural and optical properties of the original and does not necessarily include any visual similarity identifiable by human observation. @en
domain: Obiekt wizualny
label: represents @en
label: représente @fr
label: stellt dar @de
label: παριστάνει @el
label: представляет @ru
label: 描绘了 @zh
range: Byt CRM
sub property of: fait référence à

est représentée par
type: ObjectProperty
domain: Byt CRM
label: has representation @en
label: tem representação @pt
label: wird dargestellt durch @de
label: παριστάνεται από @el
label: имеет представление @ru
label: 有图像描绘 @zh
range: Obiekt wizualny
sub property of: est référencé par

a pour autre forme
type: ObjectProperty
comment: This property establishes a relationship of equivalence between two instances of E41 Appellation independent from any item identified by them. It is a dynamic asymmetric relationship, where the range expresses the derivative, if such a direction can be established. Otherwise, the relationship is symmetric. The relationship is not transitive. The equivalence applies to all cases of use of an instance of E41 Appellation. Multiple names assigned to an object, which are not equivalent for all things identified with a specific instance of E41 Appellation, should be modelled as repeated values of P1 is identified by (identifies). P139.1 has type allows the type of derivation, such as “transliteration from Latin 1 to ASCII” be refined.. @en
domain: Opis
label: has alternative form @en
label: hat alternative Form @de
label: tem forma alternativa @pt
label: έχει εναλλακτική μορφή @el
label: имеет альтернативную форму @ru
label: 有替代称号 @zh
range: Opis

a détruit
type: ObjectProperty
comment: This property allows specific instances of E18 Physical Thing that have been destroyed to be related to a destruction event. Destruction implies the end of an item’s life as a subject of cultural documentation – the physical matter of which the item was composed may in fact continue to exist. A destruction event may be contiguous with a Production that brings into existence a derived object composed partly of matter from the destroyed object. @en
domain: Zniszczenie
label: destroyed @en
label: destruiu @pt
label: zerstörte @de
label: κατέστρεψε @el
label: уничтожил @ru
label: 毁灭了 @zh
range: Rzecz fizyczna
sub property of: a fait cesser d’exister

a été détruite par
type: ObjectProperty
domain: Rzecz fizyczna
label: foi destruído por @pt
label: was destroyed by @en
label: wurde zerstört durch @de
label: καταστράφηκε από @el
label: был уничтожен посредством @ru
label: 被毁灭於 @zh
range: Zniszczenie
sub property of: a cessé d’exister du fait de

a affecté un attribut à
type: ObjectProperty
comment: This property indicates the item to which an attribute or relation is assigned. @en
domain: Przypisanie atrybutu
label: assigned attribute to @en
label: atribuiu atributo para @pt
label: wies Merkmal zu @de
label: απέδωσε ιδιότητα σε @el
label: присвоил атрибут для @ru
label: 指定属性给 @zh
range: Byt CRM

a reçu un attribut par
type: ObjectProperty
domain: Byt CRM
label: bekam Merkmal zugewiesen durch @de
label: foi atribuído por @pt
label: was attributed by @en
label: χαρακτηρίστηκε από @el
label: получил атрибут посредством @ru
label: 被指定属性於 @zh
range: Przypisanie atrybutu

a attribué
type: ObjectProperty
comment: This property indicates the attribute that was assigned or the item that was related to the item denoted by a property P140 assigned attribute to in an Attribute assignment action. @en
domain: Przypisanie atrybutu
label: assigned @en
label: atribuiu @pt
label: wies zu @de
label: απέδωσε @el
label: присвоил @ru
label: 指定了属性值 @zh
range: Byt CRM

a été attribué par
type: ObjectProperty
domain: Byt CRM
label: foi atribuído por @pt
label: was assigned by @en
label: wurde zugewiesen durch @de
label: αποδόθηκε από @el
label: был присвоен посредством @ru
label: 被指定了属性值於 @zh
range: Przypisanie atrybutu

benutzte Bestandteil
type: ObjectProperty
comment: This property associates the event of assigning an instance of E42 Identifier to an entity, with the instances of E41 Appellation that were used as elements of the identifier. @en
domain: Przypisanie identyfikatora
label: used constituent @en
label: 使用称号构成部分 @zh
range: Obiekt symboliczny
sub property of: a utilisé l'objet spécifique

was used in
type: ObjectProperty
domain: Obiekt symboliczny
label: wurde benutzt in @de
label: 被用来构成称号於 @zh
range: Przypisanie identyfikatora
sub property of: a été utilisé pour

joined
type: ObjectProperty
comment: This property identifies the instance of E39 Actor that becomes member of a E74 Group in an E85 Joining. Joining events allow for describing people becoming members of a group with a more detailed path from E74 Group through P144 joined with (gained member by), E85 Joining, P143 joined (was joined by) to E39 Actor, compared to the shortcut offered by P107 has current or former member (is current or former member of). @en
domain: Dołączenie
label: verband @de
label: 加入了成员 @zh
range: Aktor
sub property of: a eu pour participant

was joined by
type: ObjectProperty
domain: Aktor
label: wurde verbunden durch @de
label: 被加入为成员於 @zh
range: Dołączenie
sub property of: a participé à

joined with
type: ObjectProperty
comment: This property identifies the instance of E74 Group of which an instance of E39 Actor becomes a member through an instance of E85 Joining. Although a Joining activity normally concerns only one instance of E74 Group, it is possible to imagine circumstances under which becoming member of one Group implies becoming member of another Group as well. Joining events allow for describing people becoming members of a group with a more detailed path from E74 Group through P144 joined with (gained member by), E85 Joining, P143 joined (was joined by) to E39 Actor, compared to the shortcut offered by P107 has current or former member (is current or former member of). The property P144.1 kind of member can be used to specify the type of membership or the role the member has in the group. @en
domain: Dołączenie
label: verband mit @de
label: 加入成员到 @zh
range: Grupa
sub property of: a eu pour participant

erwarb Mitglied durch
type: ObjectProperty
domain: Grupa
label: gained member by @en
label: 获得成员於 @zh
range: Dołączenie
sub property of: a participé à

entließ
type: ObjectProperty
comment: This property identifies the instance of E39 Actor that leaves an instance of E74 Group through an instance of E86 Leaving. @en
domain: Opuszczenie
label: separated @en
label: 分离了成员 @zh
range: Aktor
sub property of: a eu pour participant

left by
type: ObjectProperty
domain: Aktor
label: wurde entlassen durch @de
label: 脱离群组於 @zh
range: Opuszczenie
sub property of: a participé à

entließ von
type: ObjectProperty
comment: This property identifies the instance of E74 Group an instance of E39 Actor leaves through an instance of E86 Leaving. Although a Leaving activity normally concerns only one instance of E74 Group, it is possible to imagine circumstances under which leaving one E74 Group implies leaving another E74 Group as well. @en
domain: Opuszczenie
label: separated from @en
label: 脱离了群组 @zh
range: Grupa
sub property of: a eu pour participant

lost member by
type: ObjectProperty
domain: Grupa
label: verlor Mitglied durch @de
label: 失去成员於 @zh
range: Opuszczenie
sub property of: a participé à

betreute kuratorisch
type: ObjectProperty
comment: This property associates an instance of E87 Curation Activity with the instance of E78 Collection that is subject of that curation activity. @en
domain: Ochrona
label: curated @en
label: 典藏管理了 @zh
range: Zbiór

was curated by
type: ObjectProperty
domain: Zbiór
label: wurde kuratorisch betreut durch @de
label: 被典藏管理於 @zh
range: Ochrona

has component
type: ObjectProperty
comment: This property associates an instance of E89 Propositional Object with a structural part of it that is by itself an instance of E89 Propositional Object. @en
domain: Sąd (w sensie logicznym)
label: hat Bestandteil @de
label: 有组件 @zh
range: Sąd (w sensie logicznym)

is component of
type: ObjectProperty
domain: Sąd (w sensie logicznym)
label: ist Bestandteil von @de
label: 被用来组成 @zh
range: Sąd (w sensie logicznym)

is identified by
type: ObjectProperty
comment: This property identifies an instance of E28 Conceptual Object using an instance of E75 Conceptual Object Appellation. @en
domain: Obiekt pojęciowy
range: Opis obiektu pojęciowego
sub property of: est identifiée par

identifies
type: ObjectProperty
domain: Opis obiektu pojęciowego
range: Obiekt pojęciowy
sub property of: bezeichnet

carried out by
type: ObjectProperty
comment: This property describes the active participation of an E39 Actor in an E7 Activity. It implies causal or legal responsibility. The P14.1 in the role of property of the property allows the nature of an Actor’s participation to be specified. @en
domain: Działanie
label: realizada por @pt
label: réalisée par @fr
label: wurde ausgeführt von @de
label: πραγματοποιήθηκε από @el
label: выполнялся @ru
label: 有执行者 @zh
range: Aktor
sub property of: a eu pour participant

a exécuté
type: ObjectProperty
domain: Aktor
label: executou @pt
label: führte aus @de
label: performed @en
label: πραγματοποίησε @el
label: выполнял @ru
label: 执行了 @zh
range: Działanie
sub property of: a participé à

defines typical parts of
type: ObjectProperty
comment: This property associates an instance of E55 Type “A” with an instance of E55 Type “B”, when items of type “A” typically form part of items of type “B”, such as “car motors” and “cars”. It allows types to be organised into hierarchies based on one type describing a typical part of another. This property is equivalent to "broader term partitive (BTP)" as defined in ISO 2788 and “broaderPartitive” in SKOS. @en
domain: Typ
range: Typ

defines typical wholes for
type: ObjectProperty
domain: Typ
range: Typ

was formed from
type: ObjectProperty
comment: This property associates an instance of E66 Formation with an instance of E74 Group from which the new group was formed preserving a sense of continuity such as in mission, membership or tradition. @en
domain: Tworzenie
range: Grupa
sub property of: a eu pour participant

participated in
type: ObjectProperty
domain: Grupa
range: Tworzenie
sub property of: a participé à

has parent
type: ObjectProperty
comment: This property associates an instance of E21 Person with another instance of E21 Person who plays the role of the first instance’s parent, regardless of whether the relationship is biological parenthood, assumed or pretended biological parenthood or an equivalent legal status of rights and obligations obtained by a social or legal act. This property is, among others, a shortcut of the fully developed paths from ‘E21Person’ through ‘P98i was born’, ‘E67 Birth’, ‘P96 by mother’ to ‘E21 Person’, and from ‘E21Person’ through ‘P98i was born’, ‘E67 Birth’, ‘P97 from father’ to ‘E21 Person’. @en
domain: Osoba
range: Osoba

is parent of
type: ObjectProperty
domain: Osoba
range: Osoba

occupies
type: ObjectProperty
comment: This property describes the largest volume in space that an instance of E18 Physical Thing has occupied at any time during its existence, with respect to the reference space relative to itself. This allows you to describe the thing itself as a place that may contain other things, such as a box that may contain coins. In other words, it is the volume that contains all the points which the thing has covered at some time during its existence. In the case of an E26 Physical Feature the default reference space is the one in which the object that bears the feature or at least the surrounding matter of the feature is at rest. In this case there is a 1:1 relation of E26 Feature and E53 Place. For simplicity of implementation multiple inheritance (E26 Feature IsA E53 Place) may be a practical approach. For instances of E19 Physical Objects the default reference space is the one which is at rest to the object itself, i.e. which moves together with the object. We include in the occupied space the space filled by the matter of the physical thing and all its inner spaces. This property is a subproperty of P161 has spatial projection because it refers to its own domain as reference space for its range, whereas P161 has spatial projection may refer to a place in terms of any reference space. For some instances of E18 Physical Object the relative stability of form may not be sufficient to define a useful local reference space, for instance for an amoeba. In such cases the fully developed path to an external reference space and using a temporal validity component may be adequate to determine the place they have occupied. In contrast to P156 occupies, the property P53 has former or current location identifies an instance of E53 Place at which a thing is or has been for some unspecified time span. Further it does not constrain the reference space of the referred instance of P53 Place. @en
domain: Rzecz fizyczna
range: Miejsce
sub property of: has spatial projection

is occupied by
type: ObjectProperty
domain: Miejsce
range: Rzecz fizyczna
sub property of: is spatial projection of

is at rest relative to
type: ObjectProperty
comment: This property associates an instance of P53 Place with the instance of E18 Physical Thing that determines a reference space for this instance of P53 Place by being at rest with respect to this reference space. The relative stability of form of an E18 Physical Thing defines its default reference space. The reference space is not spatially limited to the referred thing. For example, a ship determines a reference space in terms of which other ships in its neighbourhood may be described. Larger constellations of matter, such as continental plates, may comprise many physical features that are at rest with them and define the same reference space. @en
domain: Miejsce
range: Rzecz fizyczna
sub property of: befindet sich auf oder in

provides reference space for
type: ObjectProperty
domain: Rzecz fizyczna
range: Miejsce
sub property of: a pour section

a été influencée par
type: ObjectProperty
comment: This is a high level property, which captures the relationship between an E7 Activity and anything that may have had some bearing upon it. The property has more specific sub properties. @en
domain: Działanie
label: foi influenciado por @pt
label: was influenced by @en
label: wurde beeinflußt durch @de
label: επηρεάστηκε από @el
label: находился под влиянием @ru
label: 有影响事物 @zh
range: Byt CRM

a influencé
type: ObjectProperty
domain: Byt CRM
label: beeinflußte @de
label: influenced @en
label: influenciou @pt
label: επηρέασε @el
label: оказал влияние на @ru
label: 影响了 @zh
range: Działanie

has temporal projection
type: ObjectProperty
comment: This property describes the temporal projection of an instance of an E92 Spacetime Volume. The property P4 has time-span is the same as P160 has temporal projection if it is used to document an instance of E4 Period or any subclass of it. @en
domain: Region czasoprzestrzeni
range: Trwanie

is temporal projection of
type: ObjectProperty
domain: Trwanie
range: Region czasoprzestrzeni

has spatial projection
type: ObjectProperty
comment: This property associates an instance of a E92 Spacetime Volume with an instance of E53 Place that is the result of the spatial projection of the instance of a E92 Spacetime Volume on a reference space. In general there can be more than one useful reference space to describe the spatial projection of a spacetime volume, such as that of a battle ship versus that of the seafloor. Therefore the projection is not unique. This is part of the fully developed path that is shortcut by P7took place at (witnessed).The more fully developed path from E4 Period through P161 has spatial projection, E53 Place, P89 falls within (contains) to E53 Place. @en
domain: Region czasoprzestrzeni
range: Miejsce

is spatial projection of
type: ObjectProperty
domain: Miejsce
range: Region czasoprzestrzeni

during
type: ObjectProperty
comment: This property relates an instance of E93 Presence with an arbitrary instance of E52 Time-Span that defines the section of the spacetime volume that this instance of E93 Presence is related to by the property P166 was a presence of (had presence). @en
domain: Obecność
range: Trwanie
sub property of: has temporal projection

was time-span of
type: ObjectProperty
domain: Trwanie
range: Obecność
sub property of: is temporal projection of

incorporates
type: ObjectProperty
comment: This property associates an instance of E73 Information Object with an instance of E90 Symbolic Object (or any of its subclasses) that was included in it. This property makes it possible to recognise the autonomous status of the incorporated signs, which were created in a distinct context, and can be incorporated in many distinct self-contained expressions, and to highlight the difference between structural and accidental whole-part relationships between conceptual entities. It accounts for many cultural facts that are quite frequent and significant: the inclusion of a poem in an anthology, the re-use of an operatic aria in a new opera, the use of a reproduction of a painting for a book cover or a CD booklet, the integration of textual quotations, the presence of lyrics in a song that sets those lyrics to music, the presence of the text of a play in a movie based on that play, etc. In particular, this property allows for modelling relationships of different levels of symbolic specificity, such as the natural language words making up a particular text, the characters making up the words and punctuation, the choice of fonts and page layout for the characters. A digital photograph of a manuscript page incorporates the text of the manuscript page. @en
domain: Obiekt informacyjny
range: Obiekt symboliczny
sub property of: est composé de

is incorporated in
type: ObjectProperty
domain: Obiekt symboliczny
range: Obiekt informacyjny
sub property of: bildet Teil von

was a presence of
type: ObjectProperty
comment: This property relates an E93 Presence with the STV it is part of… @en
domain: Obecność
range: Region czasoprzestrzeni

had presence
type: ObjectProperty
domain: Region czasoprzestrzeni
range: Obecność

at
type: ObjectProperty
comment: This property points to a wider area in which my thing /event was… @en
domain: Obecność
range: Miejsce

was place of
type: ObjectProperty
domain: Miejsce
range: Obecność

place is defined by
type: DatatypeProperty
comment: This property associates an instance of E53 Place with an instance of E94 Space Primitive that defines it. Syntactic variants or use of different scripts may result in multiple instances of E94 Space Primitive defining exactly the same place. Transformations between different reference systems in general result in new definitions of places approximating each other and not in alternative definitions. Note that it is possible for a place to be defined by phenomena causal to it or other forms of identification rather than by an instance of E94 Space Primitive. In this case, this property must not be used for approximating the respective instance of E53 Place with an instance of E94 Space Primitive. @en
domain: Miejsce
range: Literal

a utilisé l'objet spécifique
type: ObjectProperty
comment: This property describes the use of material or immaterial things in a way essential to the performance or the outcome of an E7 Activity. This property typically applies to tools, instruments, moulds, raw materials and items embedded in a product. It implies that the presence of the object in question was a necessary condition for the action. For example, the activity of writing this text required the use of a computer. An immaterial thing can be used if at least one of its carriers is present. For example, the software tools on a computer. Another example is the use of a particular name by a particular group of people over some span to identify a thing, such as a settlement. In this case, the physical carriers of this name are at least the people understanding its use. @en
domain: Działanie
label: benutzte das bestimmte Objekt @de
label: used specific object @en
label: usou objeto específico @pt
label: χρησιμοποίησε αντικείμενο @el
label: использовал особый объект @ru
label: 使用特定物 @zh
range: Rzecz
sub property of: est arrivé en présence de
sub property of: a été influencée par

a été utilisé pour
type: ObjectProperty
domain: Rzecz
label: foi usado por @pt
label: was used for @en
label: wurde benutzt für @de
label: χρησιμοποιήθηκε για @el
label: был использован для @ru
label: 被用於 @zh
range: Działanie
sub property of: estava presente no
sub property of: a influencé

a été motivée par
type: ObjectProperty
comment: This property describes an item or items that are regarded as a reason for carrying out the E7 Activity. For example, the discovery of a large hoard of treasure may call for a celebration, an order from head quarters can start a military manoeuvre. @en
domain: Działanie
label: foi motivado por @pt
label: was motivated by @en
label: wurde angeregt durch @de
label: είχε ως αφορμή @el
label: был обусловлен посредством @ru
label: 有促动事物 @zh
range: Byt CRM
sub property of: a été influencée par

a motivé
type: ObjectProperty
domain: Byt CRM
label: motivated @en
label: motivou @pt
label: regte an @de
label: ήταν αφορμή @el
label: обусловил @ru
label: 促动了 @zh
range: Działanie
sub property of: a influencé

era prevista a utilização de
type: ObjectProperty
comment: This property relates an E7 Activity with objects created specifically for use in the activity. This is distinct from the intended use of an item in some general type of activity such as the book of common prayer which was intended for use in Church of England services (see P101 had as general use (was use of)). @en
domain: Działanie
label: war beabsichtigteter Gebrauch von @de
label: was intended use of @en
label: était l'utilisation prévue de @fr
label: ήταν προορισμένη χρήση του @el
label: был предполагаемым использованием для @ru
label: 特别使用了 @zh
range: Wytwór

a été fabriquée pour
type: ObjectProperty
domain: Wytwór
label: foi feito para @pt
label: was made for @en
label: wurde hergestellt für @de
label: έγινε για @el
label: был создан для @ru
label: 被制造来用於 @zh
range: Działanie

est identifiée par
type: ObjectProperty
comment: This property describes the naming or identification of any real world item by a name or any other identifier. This property is intended for identifiers in general use, which form part of the world the model intends to describe, and not merely for internal database identifiers which are specific to a technical system, unless these latter also have a more general use outside the technical context. This property includes in particular identification by mathematical expressions such as coordinate systems used for the identification of instances of E53 Place. The property does not reveal anything about when, where and by whom this identifier was used. A more detailed representation can be made using the fully developed (i.e. indirect) path through E15 Identifier Assignment. @en
domain: Byt CRM
label: is identified by @en
label: wird bezeichnet als @de
label: é identificado por @pt
label: αναγνωρίζεται ως @el
label: идентифицируется посредством @ru
label: 有识别称号 @zh
range: Opis

bezeichnet
type: ObjectProperty
domain: Opis
label: identifica @pt
label: identifie @fr
label: identifies @en
label: είναι αναγνωριστικό @el
label: идентифицирует @ru
label: 被用来识别 @zh
range: Byt CRM

avait pour but spécifique
type: ObjectProperty
comment: This property identifies the relationship between a preparatory activity and the event it is intended to be preparation for. This includes activities, orders and other organisational actions, taken in preparation for other activities or events. P20 had specific purpose (was purpose of) implies that an activity succeeded in achieving its aim. If it does not succeed, such as the setting of a trap that did not catch anything, one may document the unrealized intention using P21 had general purpose (was purpose of):E55 Type and/or P33 used specific technique (was used by): E29 Design or Procedure. @en
domain: Działanie
label: had specific purpose @en
label: hatte den bestimmten Zweck @de
label: tinha propósito específico @pt
label: είχε συγκεκριμένο σκοπό @el
label: имел конкретную цель @ru
label: 有特定目地 @zh
range: Zdarzenie

era o propósito de
type: ObjectProperty
domain: Zdarzenie
label: war Zweck von @de
label: was purpose of @en
label: était le but de @fr
label: ήταν σκοπός του/της @el
label: был целью для @ru
label: 之準備活動是 @zh
range: Działanie

avait pour but général
type: ObjectProperty
comment: This property describes an intentional relationship between an E7 Activity and some general goal or purpose. This may involve activities intended as preparation for some type of activity or event. P21had general purpose (was purpose of) differs from P20 had specific purpose (was purpose of) in that no occurrence of an event is implied as the purpose. @en
domain: Działanie
label: had general purpose @en
label: hatte den allgemeinen Zweck @de
label: tinha propósito geral @pt
label: είχε γενικό σκοπό @el
label: имел общую цель @ru
label: 有通用目地 @zh
range: Typ

era o propósito de
type: ObjectProperty
domain: Typ
label: war Zweck von @de
label: was purpose of @en
label: était le but de @fr
label: ήταν σκοπός του/της @el
label: был целью для @ru
label: 可利用 @zh
range: Działanie

a fait passer le droit de propriété à
type: ObjectProperty
comment: This property identifies the E39 Actor that acquires the legal ownership of an object as a result of an E8 Acquisition. The property will typically describe an Actor purchasing or otherwise acquiring an object from another Actor. However, title may also be acquired, without any corresponding loss of title by another Actor, through legal fieldwork such as hunting, shooting or fishing. In reality the title is either transferred to or from someone, or both. @en
domain: Nabycie
label: transferiu os direitos de propriedade para @pt
label: transferred title to @en
label: übertrug Besitztitel auf @de
label: μετεβίβασε τον τίτλο σε @el
label: передал право собственности @ru
label: 转交所有权给 @zh
range: Aktor
sub property of: carried out by

a acquis le droit de propriété du fait de
type: ObjectProperty
domain: Aktor
label: acquired title through @en
label: adquiriu os direitos de propriedade por meio da @pt
label: erwarb Besitztitel durch @de
label: απέκτησε τον τίτλο μέσω @el
label: получил право собственности через @ru
label: 获取所有权於 @zh
range: Nabycie
sub property of: a exécuté

a fait passer le droit de propriété de
type: ObjectProperty
comment: This property identifies the E39 Actor or Actors who relinquish legal ownership as the result of an E8 Acquisition. The property will typically be used to describe a person donating or selling an object to a museum. In reality title is either transferred to or from someone, or both. @en
domain: Nabycie
label: transferiu os direitos de propriedade de @pt
label: transferred title from @en
label: übertrug Besitztitel von @de
label: μετεβίβασε τον τίτλο από @el
label: передал право собственности от @ru
label: 原所有权者是 @zh
range: Aktor
sub property of: carried out by

a perdu le droit de propriété du fait de
type: ObjectProperty
domain: Aktor
label: perdeu os direitos de propriedade por meio da @pt
label: surrendered title through @en
label: trat Besitztitel ab in @de
label: παρέδωσε τον τίτλο μέσω @el
label: право собственности отдано через @ru
label: 交出所有权於 @zh
range: Nabycie
sub property of: a exécuté

a fait passer le droit de propriété sur
type: ObjectProperty
comment: This property identifies the E18 Physical Thing or things involved in an E8 Acquisition. In reality, an acquisition must refer to at least one transferred item. @en
domain: Nabycie
label: transferiu os direitos de propriedade sobre o @pt
label: transferred title of @en
label: übertrug Besitz über @de
label: μετεβίβασε τον τίτλο του/της @el
label: передал право собственности на @ru
label: 转移所有权的标的物是 @zh
range: Rzecz fizyczna

a changé de mains du fait de
type: ObjectProperty
domain: Rzecz fizyczna
label: changed ownership through @en
label: ging über in Besitz durch @de
label: mudou de proprietário por meio de @pt
label: άλλαξε ιδιοκτησία μέσω @el
label: сменил владельца через @ru
label: 转移了所有权於 @zh
range: Nabycie

a déplacé
type: ObjectProperty
comment: This property identifies an instance of E19 Physical Object that was moved by a move event. A move must concern at least one object. The property implies the object's passive participation. For example, Monet's painting "Impression sunrise" was moved for the first Impressionist exhibition in 1874. @en
domain: Ruch
label: bewegte @de
label: locomoveu @pt
label: moved @en
label: μετεκίνησε @el
label: переместил @ru
label: 移动了 @zh
range: Obiekt fizyczny
sub property of: est arrivé en présence de

a été déplacé par
type: ObjectProperty
domain: Obiekt fizyczny
label: foi locomovido por @pt
label: moved by @en
label: wurde bewegt durch @de
label: μετακινήθηκε από @el
label: перемещен посредством @ru
label: 被移动於 @zh
range: Ruch
sub property of: estava presente no

a déplacé vers
type: ObjectProperty
comment: This property identifies a destination of a E9 Move. A move will be linked to a destination, such as the move of an artefact from storage to display. A move may be linked to many terminal instances of E53 Place by multiple instances of this property. In this case the move describes a distribution of a set of objects. The area of the move includes the origin(s), route and destination(s). Therefore the described destination is an instance of E53 Place which P89 falls within (contains) the instance of E53 Place the move P7 took place at. @en
domain: Ruch
label: bewegte bis zu @de
label: locomoveu para @pt
label: moved to @en
label: μετακινήθηκε προς @el
label: перемещен в @ru
label: 移入物件至 @zh
range: Miejsce

a été la destination de
type: ObjectProperty
domain: Miejsce
label: era destinação de @pt
label: war Zielort von @de
label: was destination of @en
label: ήταν προορισμός του/της @el
label: был пунктом назначения для @ru
label: 被作为移入地於 @zh
range: Ruch
sub property of: a été témoin de

a retiré de
type: ObjectProperty
comment: This property identifies a starting E53 Place of an E9 Move. A move will be linked to an origin, such as the move of an artefact from storage to display. A move may be linked to many starting instances of E53 Place by multiple instances of this property. In this case the move describes the picking up of a set of objects. The area of the move includes the origin(s), route and destination(s). Therefore the described origin is an instance of E53 Place which P89 falls within (contains) the instance of E53 Place the move P7 took place at. @en
domain: Ruch
label: bewegte weg von @de
label: locomoveu de @pt
label: moved from @en
label: μετακινήθηκε από @el
label: перемещен из @ru
label: 有移出地 @zh
range: Miejsce

a été l'origine de
type: ObjectProperty
domain: Miejsce
label: era origem de @pt
label: war Ausgangsort von @de
label: was origin of @en
label: ήταν αφετηρία του/της @el
label: был исходной точкой для @ru
label: 被作为移出地於 @zh
range: Ruch
sub property of: a été témoin de

changement de détenteur au détriment de
type: ObjectProperty
comment: This property identifies the E39 Actor or Actors who surrender custody of an instance of E18 Physical Thing in an E10 Transfer of Custody activity. The property will typically describe an Actor surrendering custody of an object when it is handed over to someone else’s care. On occasion, physical custody may be surrendered involuntarily – through accident, loss or theft. In reality, custody is either transferred to someone or from someone, or both. @en
domain: Zmiana właściciela
label: custody surrendered by @en
label: custódia concedida por @pt
label: übergab Gewahrsam an @de
label: μετεβίβασε κατοχή από @el
label: опека отдана @ru
label: 有原保管人 @zh
range: Aktor
sub property of: carried out by

a cessé d’être détenteur à cause de
type: ObjectProperty
domain: Aktor
label: final da custódia por meio de @pt
label: surrendered custody through @en
label: wurde Gewahrsam übergeben durch @de
label: παρέδωσε κατοχή μέσω @el
label: опека отдана через @ru
label: 交出保管作业於 @zh
range: Zmiana właściciela
sub property of: a exécuté

changement de détenteur au profit de
type: ObjectProperty
comment: This property identifies the E39 Actor or Actors who receive custody of an instance of E18 Physical Thing in an E10 Transfer of Custody activity. The property will typically describe Actors receiving custody of an object when it is handed over from another Actor’s care. On occasion, physical custody may be received involuntarily or illegally – through accident, unsolicited donation, or theft. In reality, custody is either transferred to someone or from someone, or both. @en
domain: Zmiana właściciela
label: custody received by @en
label: custódia recebida por @pt
label: übertrug Gewahrsam auf @de
label: μετεβίβασε κατοχή σε @el
label: опека получена @ru
label: 移转保管作业给 @zh
range: Aktor
sub property of: carried out by

erhielt Gewahrsam durch
type: ObjectProperty
domain: Aktor
label: est devenu détenteur grâce à @fr
label: início da custódia por meio de @pt
label: received custody through @en
label: παρέλαβε κατοχή μέσω @el
label: получил опеку через @ru
label: 取得保管作业於 @zh
range: Zmiana właściciela
sub property of: a exécuté

est de type
type: ObjectProperty
comment: This property allows sub typing of CRM entities - a form of specialisation – through the use of a terminological hierarchy, or thesaurus. The CRM is intended to focus on the high-level entities and relationships needed to describe data structures. Consequently, it does not specialise entities any further than is required for this immediate purpose. However, entities in the isA hierarchy of the CRM may by specialised into any number of sub entities, which can be defined in the E55 Type hierarchy. E51 Contact Point, for example, may be specialised into “e-mail address”, “telephone number”, “post office box”, “URL” etc. none of which figures explicitly in the CRM hierarchy. Sub typing obviously requires consistency between the meaning of the terms assigned and the more general intent of the CRM entity in question. @en
domain: Byt CRM
label: has type @en
label: hat den Typus @de
label: é do tipo @pt
label: έχει τύπο @el
label: имеет тип @ru
label: 有类型 @zh
range: Typ

est le type de
type: ObjectProperty
domain: Typ
label: is type of @en
label: ist Typus von @de
label: é o tipo de @pt
label: είναι ο τύπος του/της @el
label: является типом для @ru
label: 被用来分类 @zh
range: Byt CRM

changement de détenteur concernant
type: ObjectProperty
comment: This property identifies an item or items of E18 Physical Thing concerned in an E10 Transfer of Custody activity. The property will typically describe the object that is handed over by an E39 Actor to another Actor’s custody. On occasion, physical custody may be transferred involuntarily or illegally – through accident, unsolicited donation, or theft. @en
domain: Zmiana właściciela
label: transferida custódia de @pt
label: transferred custody of @en
label: übertrug Gewahrsam über @de
label: μετεβίβασε κατοχή του/της/των @el
label: передало опеку на @ru
label: 有保管标的物 @zh
range: Rzecz fizyczna

a changé de détenteur du fait de
type: ObjectProperty
domain: Rzecz fizyczna
label: custody transferred through @en
label: custódia transferida por meio de @pt
label: wechselte Gewahrsam durch @de
label: άλλαξε κατοχή μέσω @el
label: опека передана через @ru
label: 被移转了保管作业於 @zh
range: Zmiana właściciela

a modifié
type: ObjectProperty
comment: This property identifies the E24 Physical Man-Made Thing modified in an E11 Modification. If a modification is applied to a non-man-made object, it is regarded as an E22 Man-Made Object from that time onwards. @en
domain: Modyfikacja
label: has modified @en
label: modificou @pt
label: veränderte @de
label: τροποποίησε @el
label: изменил @ru
label: 修改了 @zh
range: Wytwór fizyczny
sub property of: est arrivé en présence de

a été modifié par
type: ObjectProperty
domain: Wytwór fizyczny
label: foi modificada por @pt
label: was modified by @en
label: wurde verändert durch @de
label: τροποποιήθηκε από @el
label: был изменен посредством @ru
label: 被修改於 @zh
range: Modyfikacja
sub property of: estava presente no

a employé comme technique générique
type: ObjectProperty
comment: This property identifies the technique or method that was employed in an activity. These techniques should be drawn from an external E55 Type hierarchy of consistent terminology of general techniques or methods such as embroidery, oil-painting, carbon dating, etc. Specific documented techniques should be described as instances of E29 Design or Procedure. This property identifies the technique that was employed in an act of modification. @en
domain: Działanie
label: benutzte das allgemeine Verfahren @de
label: used general technique @en
label: usou técnica geral @pt
label: χρησιμοποίησε γενική τεχνική @el
label: использовал общую технику @ru
label: 使用通用技术 @zh
range: Typ
sub property of: a employé un objet du type

a été la technique mise en œuvre dans
type: ObjectProperty
domain: Typ
label: foi técnica da @pt
label: war Verfahren von @de
label: was technique of @en
label: ήταν τεχνική του/της @el
label: был техникой для @ru
label: 被使用於 @zh
range: Działanie
sub property of: Objekt des Typus ... wurde benutzt in

a employé comme technique spécifique
type: ObjectProperty
comment: This property identifies a specific instance of E29 Design or Procedure in order to carry out an instance of E7 Activity or parts of it. The property differs from P32 used general technique (was technique of) in that P33 refers to an instance of E29 Design or Procedure, which is a concrete information object in its own right rather than simply being a term or a method known by tradition. Typical examples would include intervention plans for conservation or the construction plans of a building. @en
domain: Działanie
label: benutzte das bestimmte Verfahren @de
label: used specific technique @en
label: usou técnica específica @pt
label: χρησιμοποίησε συγκεκριμένη τεχνική @el
label: использовал особую технику @ru
label: 使用特定技术 @zh
range: Projekt lub Procedura
sub property of: a utilisé l'objet spécifique

a été employée par
type: ObjectProperty
domain: Projekt lub Procedura
label: foi usada por @pt
label: was used by @en
label: wurde benutzt von @de
label: χρησιμοποιήθηκε για @el
label: был использован посредством @ru
label: 被特别使用於 @zh
range: Działanie
sub property of: a été utilisé pour

a concerné
type: ObjectProperty
comment: This property identifies the E18 Physical Thing that was assessed during an E14 Condition Assessment activity. Conditions may be assessed either by direct observation or using recorded evidence. In the latter case the E18 Physical Thing does not need to be present or extant. @en
domain: Ocena stanu
label: betraf @de
label: concerned @en
label: interessada @pt
label: αφορούσε σε @el
label: имел дело с @ru
label: 评估了 @zh
range: Rzecz fizyczna
sub property of: a affecté un attribut à

expertisé par le biais de
type: ObjectProperty
domain: Rzecz fizyczna
label: foi avaliada por @pt
label: was assessed by @en
label: wurde beurteilt durch @de
label: εκτιμήθηκε από @el
label: был оценен посредством @ru
label: 被评估於 @zh
range: Ocena stanu
sub property of: a reçu un attribut par

a identifié
type: ObjectProperty
comment: This property identifies the E3 Condition State that was observed in an E14 Condition Assessment activity. @en
domain: Ocena stanu
label: has identified @en
label: hat identifiziert @de
label: identificou @pt
label: έχει διαπιστώσει @el
label: идентифицировал @ru
label: 评估认定了 @zh
range: Stan
sub property of: a attribué

est identifié par
type: ObjectProperty
domain: Stan
label: foi identificado por @pt
label: was identified by @en
label: wurde identifiziert durch @de
label: έχει διαπιστωθεί από @el
label: идентифицирован посредством @ru
label: 被评估认定於 @zh
range: Ocena stanu
sub property of: a été attribué par

a attribué
type: ObjectProperty
comment: This property records the identifier that was assigned to an item in an Identifier Assignment activity. The same identifier may be assigned on more than one occasion. An Identifier might be created prior to an assignment. @en
domain: Przypisanie identyfikatora
label: assigned @en
label: atribuiu @pt
label: wies zu @de
label: απέδωσε @el
label: назначил @ru
label: 指定标识符为 @zh
range: Identyfikator
sub property of: a attribué

a été attribuée par
type: ObjectProperty
domain: Identyfikator
label: foi atribuído por @pt
label: was assigned by @en
label: wurde zugewiesen durch @de
label: αποδόθηκε ως ιδιότητα από @el
label: был присвоен посредством @ru
label: 被指定为标识符於 @zh
range: Przypisanie identyfikatora
sub property of: a été attribué par

a désattribué
type: ObjectProperty
comment: This property records the identifier that was deassigned from an instance of E1 CRM Entity. Deassignment of an identifier may be necessary when an item is taken out of an inventory, a new numbering system is introduced or items are merged or split up. The same identifier may be deassigned on more than one occasion. @en
domain: Przypisanie identyfikatora
label: deassigned @en
label: hob Zuweisung auf von @de
label: retirou a atribuição do @pt
label: ακύρωσε @el
label: отменил назначение @ru
label: 取消标识符 @zh
range: Identyfikator
sub property of: a attribué

a été désattribué par
type: ObjectProperty
domain: Identyfikator
label: foi retirada a atribuição por @pt
label: was deassigned by @en
label: wurde aufgehoben durch @de
label: ακυρώθηκε από @el
label: был отменен посредством @ru
label: 被取消标识符於 @zh
range: Przypisanie identyfikatora
sub property of: a été attribué par

a mesuré
type: ObjectProperty
comment: This property associates an instance of E16 Measurement with the instance of E1 CRM Entity to which it applied. An instance of E1 CRM Entity may be measured more than once. Material and immaterial things and processes may be measured, e.g. the number of words in a text, or the duration of an event. @en
domain: Pomiar
label: measured @en
label: mediu @pt
label: vermaß @de
label: μέτρησε @el
label: измерил @ru
label: 测量了 @zh
range: Byt CRM
sub property of: a affecté un attribut à

a été mesuré par
type: ObjectProperty
domain: Byt CRM
label: foi medida por @pt
label: was measured by @en
label: wurde vermessen durch @de
label: μετρήθηκε από @el
label: был измерен посредством @ru
label: 被测量於 @zh
range: Pomiar
sub property of: a reçu un attribut par

a pour note
type: DatatypeProperty
comment: This property is a container for all informal descriptions about an object that have not been expressed in terms of CRM constructs. In particular it captures the characterisation of the item itself, its internal structures, appearance etc. Like property P2 has type (is type of), this property is a consequence of the restricted focus of the CRM. The aim is not to capture, in a structured form, everything that can be said about an item; indeed, the CRM formalism is not regarded as sufficient to express everything that can be said. Good practice requires use of distinct note fields for different aspects of a characterisation. The P3.1 has type property of P3 has note allows differentiation of specific notes, e.g. “construction”, “decoration” etc. An item may have many notes, but a note is attached to a specific item. @en
domain: Byt CRM
label: has note @en
label: hat Anmerkung @de
label: tem nota @pt
label: έχει επεξήγηση @el
label: имеет примечание @ru
label: 有说明 @zh
range: Literal

a relevé comme dimension
type: ObjectProperty
comment: This property records the dimension that was observed in an E16 Measurement Event. E54 Dimension can be any quantifiable aspect of E70 Thing. Weight, image colour depth and monetary value are dimensions in this sense. One measurement activity may determine more than one dimension of one object. Dimensions may be determined either by direct observation or using recorded evidence. In the latter case the measured Thing does not need to be present or extant. Even though knowledge of the value of a dimension requires measurement, the dimension may be an object of discourse prior to, or even without, any measurement being made. @en
domain: Pomiar
label: beobachtete Dimension @de
label: observed dimension @en
label: verificou a dimensão @pt
label: παρατήρησε @el
label: определил величину @ru
label: 观察认定的规模是 @zh
range: Wymiar
sub property of: a attribué

a été relevée au cours de
type: ObjectProperty
domain: Wymiar
label: foi verificada durante @pt
label: was observed in @en
label: wurde beobachtet in @de
label: παρατηρήθηκε από @el
label: наблюдался в @ru
label: 被观察认定於 @zh
range: Pomiar
sub property of: a été attribué par

a classifié
type: ObjectProperty
comment: This property records the item to which a type was assigned in an E17 Type Assignment activity. Any instance of a CRM entity may be assigned a type through type assignment. Type assignment events allow a more detailed path from E1 CRM Entity through P41 classified (was classified), E17 Type Assignment, P42 assigned (was assigned by) to E55 Type for assigning types to objects compared to the shortcut offered by P2 has type (is type of). @en
domain: Przypisanie typu
label: classificou @pt
label: classified @en
label: klassifizierte @de
label: χαρακτήρισε @el
label: классифицировал @ru
label: 分类了 @zh
range: Byt CRM
sub property of: a affecté un attribut à

a été classifiée par le biais de
type: ObjectProperty
domain: Byt CRM
label: foi classificada por @pt
label: was classified by @en
label: wurde klassifiziert durch @de
label: χαρακτηρίσθηκε από @el
label: был классифицирован посредством @ru
label: 被分类於 @zh
range: Przypisanie typu
sub property of: a reçu un attribut par

a attribué
type: ObjectProperty
comment: This property records the type that was assigned to an entity by an E17 Type Assignment activity. Type assignment events allow a more detailed path from E1 CRM Entity through P41 classified (was classified by), E17 Type Assignment, P42 assigned (was assigned by) to E55 Type for assigning types to objects compared to the shortcut offered by P2 has type (is type of). For example, a fragment of an antique vessel could be assigned the type “attic red figured belly handled amphora” by expert A. The same fragment could be assigned the type “shoulder handled amphora” by expert B. A Type may be intellectually constructed independent from assigning an instance of it. @en
domain: Przypisanie typu
label: assigned @en
label: atribuiu @pt
label: wies zu @de
label: απέδωσε ως ιδιότητα @el
label: назначил @ru
label: 指定类型为 @zh
range: Typ
sub property of: a attribué

a été attribué par
type: ObjectProperty
domain: Typ
label: foi atribuído por @pt
label: was assigned by @en
label: wurde zugewiesen durch @de
label: αποδόθηκε από @el
label: был присвоен посредством @ru
label: 被指定类型於 @zh
range: Przypisanie typu
sub property of: a été attribué par

a pour dimension
type: ObjectProperty
comment: This property records a E54 Dimension of some E70 Thing. It is a shortcut of the more fully developed path from E70 Thing through P39 measured (was measured by), E16 Measurement P40 observed dimension (was observed in) to E54 Dimension. It offers no information about how and when an E54 Dimension was established, nor by whom. An instance of E54 Dimension is specific to an instance of E70 Thing. @en
domain: Rzecz
label: has dimension @en
label: hat Dimension @de
label: tem dimensão @pt
label: έχει μέγεθος @el
label: имеет величину @ru
label: 有规模数量 @zh
range: Wymiar

est dimension de
type: ObjectProperty
domain: Wymiar
label: is dimension of @en
label: ist Dimension von @de
label: é dimensão de @pt
label: είναι μέγεθος του @el
label: является величиной для @ru
label: 估量的标的物是 @zh
range: Rzecz

a pour état matériel
type: ObjectProperty
comment: This property records an E3 Condition State for some E18 Physical Thing. It is a shortcut of the more fully developed path from E18 Physical Thing through P34 concerned (was assessed by), E14 Condition Assessment P35 has identified (was identified by) to E3 Condition State. It offers no information about how and when the E3 Condition State was established, nor by whom. An instance of Condition State is specific to an instance of Physical Thing. @en
domain: Rzecz fizyczna
label: has condition @en
label: hat Zustand @de
label: tem estado material @pt
label: έχει κατάσταση @el
label: имеет условие @ru
label: 有状态 @zh
range: Stan

estado material de
type: ObjectProperty
domain: Stan
label: is condition of @en
label: ist Zustand von @de
label: état matériel de @fr
label: είναι κατάσταση του @el
label: является условием для @ru
label: 描述的标的物是 @zh
range: Rzecz fizyczna

besteht aus
type: ObjectProperty
comment: This property identifies the instances of E57 Materials of which an instance of E18 Physical Thing is composed. All physical things consist of physical materials. P45 consists of (is incorporated in) allows the different Materials to be recorded. P45 consists of (is incorporated in) refers here to observed Material as opposed to the consumed raw material. A Material, such as a theoretical alloy, may not have any physical instances @en
domain: Rzecz fizyczna
label: consiste de @pt
label: consiste en @fr
label: consists of @en
label: αποτελείται από @el
label: составлен из @ru
label: 有构成材料 @zh
range: Materiał

est présent dans
type: ObjectProperty
domain: Materiał
label: está presente em @pt
label: is incorporated in @en
label: ist enthalten in @de
label: είναι ενσωματωμένος/η/ο σε @el
label: входит в состав @ru
label: 被用来构成 @zh
range: Rzecz fizyczna

est composée de
type: ObjectProperty
comment: This property allows instances of E18 Physical Thing to be analysed into component elements. Component elements, since they are themselves instances of E18 Physical Thing, may be further analysed into sub-components, thereby creating a hierarchy of part decomposition. An instance of E18 Physical Thing may be shared between multiple wholes, for example two buildings may share a common wall. This property does not specify when and for how long a component element resided in the respective whole. If a component is not part of a whole from the beginning of existence or until the end of existence of the whole, the classes E79 Part Addition and E90 Part Removal can be used to document when a component became part of a particular whole and/or when it stopped being a part of it. For the time-span of being part of the respective whole, the component is completely contained in the place the whole occupies. This property is intended to describe specific components that are individually documented, rather than general aspects. Overall descriptions of the structure of an instance of E18 Physical Thing are captured by the P3 has note property. The instances of E57 Material of which an item of E18 Physical Thing is composed should be documented using P45 consists of (is incorporated in). @en
domain: Rzecz fizyczna
label: is composed of @en
label: ist zusammengesetzt aus @de
label: é composto de @pt
label: αποτελείται από @el
label: составлен из @ru
label: 有组件 @zh
range: Rzecz fizyczna

bildet Teil von
type: ObjectProperty
domain: Rzecz fizyczna
label: fait partie de @fr
label: faz parte de @pt
label: forms part of @en
label: αποτελεί μέρος του/της @el
label: формирует часть @ru
label: 被用来组成 @zh
range: Rzecz fizyczna

a pour identificateur retenu
type: ObjectProperty
comment: This property records the preferred E42 Identifier that was used to identify an instance of E1 CRM Entity at the time this property was recorded. More than one preferred identifier may have been assigned to an item over time. Use of this property requires an external mechanism for assigning temporal validity to the respective CRM instance. P48 has preferred identifier (is preferred identifier of), is a shortcut for the path from E1 CRM Entity through P140 assigned attribute to (was attributed by), E15 Identifier Assignment, P37 assigned (was assigned by) to E42 Identifier. The fact that an identifier is a preferred one for an organisation can be better expressed in a context independent form by assigning a suitable E55 Type to the respective instance of E15 Identifier Assignment using the P2 has type property. @en
domain: Byt CRM
label: has preferred identifier @en
label: hat bevorzugtes Kennzeichen @de
label: tem identificador preferido @pt
label: έχει προτιμώμενο αναγνωριστικό @el
label: имеет предпочтительный идентификатор @ru
label: 有首选标识符 @zh
range: Identyfikator
sub property of: est identifiée par

est l’identificateur retenu de
type: ObjectProperty
domain: Identyfikator
label: is preferred identifier of @en
label: ist bevorzugtes Kennzeichen für @de
label: é o identificador preferido de @pt
label: είναι προτιμώμενο αναγνωριστικό @el
label: является предпочтительным идентификатором для @ru
label: 首选标识符的标的物是 @zh
range: Byt CRM
sub property of: bezeichnet

est ou a été détenu par
type: ObjectProperty
comment: This property identifies the E39 Actor or Actors who have or have had custody of an instance of E18 Physical Thing at some time. This property leaves open the question if parts of this physical thing have been added or removed during the time-spans it has been under the custody of this actor, but it is required that at least a part which can unambiguously be identified as representing the whole has been under this custody for its whole time. The way, in which a representative part is defined, should ensure that it is unambiguous who keeps a part and who the whole and should be consistent with the identity criteria of the kept instance of E18 Physical Thing. The distinction with P50 has current keeper (is current keeper of) is that P49 has former or current keeper (is former or current keeper of) leaves open the question as to whether the specified keepers are current. P49 has former or current keeper (is former or current keeper of) is a shortcut for the more detailed path from E18 Physical Thing through P30 transferred custody of (custody transferred through), E10 Transfer of Custody, P28 custody surrendered by (surrendered custody through) or P29 custody received by (received custody through) to E39 Actor. @en
domain: Rzecz fizyczna
label: has former or current keeper @en
label: hat früheren oder derzeitigen Betreuer @de
label: é ou foi guardada por @pt
label: είναι ή ήταν στην κατοχή του @el
label: имеет бывшего или текущего смотрителя @ru
label: 有前任或现任保管者 @zh
range: Aktor

est ou a été détenteur de
type: ObjectProperty
domain: Aktor
label: is former or current keeper of @en
label: ist früherer oder derzeitiger Betreuer von @de
label: é ou foi guardador de @pt
label: κατέχει ή κατείχε @el
label: является бывшим или текущим смотрителем для @ru
label: 目前或曾经保管 @zh
range: Rzecz fizyczna

a pour durée
type: ObjectProperty
comment: This property describes the temporal confinement of an instance of an E2 Temporal Entity. The related E52 Time-Span is understood as the real Time-Span during which the phenomena were active, which make up the temporal entity instance. It does not convey any other meaning than a positioning on the “time-line” of chronology. The Time-Span in turn is approximated by a set of dates (E61 Time Primitive). A temporal entity can have in reality only one Time-Span, but there may exist alternative opinions about it, which we would express by assigning multiple Time-Spans. Related temporal entities may share a Time-Span. Time-Spans may have completely unknown dates but other descriptions by which we can infer knowledge. @en
domain: Byt czasowy
label: has time-span @en
label: hat Zeitspanne @de
label: tem período de tempo @pt
label: βρισκόταν σε εξέλιξη @el
label: имеет временной отрезок @ru
label: 发生时段是 @zh
range: Trwanie

est la durée de
type: ObjectProperty
domain: Trwanie
label: is time-span of @en
label: ist Zeitspanne von @de
label: é o período de tempo de @pt
label: είναι χρονικό διάστημα του/της @el
label: является временным отрезком для @ru
label: 开始并完成了 @zh
range: Byt czasowy

est actuellement détenu par
type: ObjectProperty
comment: This property identifies the E39 Actor or Actors who had custody of an instance of E18 Physical Thing at the time of validity of the record or database containing the statement that uses this property. P50 has current keeper (is current keeper of) is a shortcut for the more detailed path from E18 Physical Thing through P30 transferred custody of (custody transferred through), E10 Transfer of Custody, P29 custody received by (received custody through) to E39 Actor. @en
domain: Rzecz fizyczna
label: has current keeper @en
label: hat derzeitigen Betreuer @de
label: é guardada por @pt
label: είναι στην κατοχή του @el
label: имеет текущего смотрителя @ru
label: 有现任保管者 @zh
range: Aktor
sub property of: est ou a été détenu par

est actuel détenteur de
type: ObjectProperty
domain: Aktor
label: is current keeper of @en
label: ist derzeitiger Betreuer von @de
label: é guardador de @pt
label: κατέχει @el
label: является текущим смотрителем для @ru
label: 目前保管 @zh
range: Rzecz fizyczna
sub property of: est ou a été détenteur de

est ou a été possédée par
type: ObjectProperty
comment: This property identifies the E39 Actor that is or has been the legal owner (i.e. title holder) of an instance of E18 Physical Thing at some time. The distinction with P52 has current owner (is current owner of) is that P51 has former or current owner (is former or current owner of) does not indicate whether the specified owners are current. P51 has former or current owner (is former or current owner of) is a shortcut for the more detailed path from E18 Physical Thing through P24 transferred title of (changed ownership through), E8 Acquisition, P23 transferred title from (surrendered title through), or P22 transferred title to (acquired title through) to E39 Actor. @en
domain: Rzecz fizyczna
label: has former or current owner @en
label: hat früheren oder derzeitigen Besitzer @de
label: é ou foi propriedade de @pt
label: έχει ή είχε ιδιοκτήτη @el
label: имеет бывшего или текущего владельца @ru
label: 有前任或现任物主 @zh
range: Aktor

est ou a été propriétaire de
type: ObjectProperty
domain: Aktor
label: is former or current owner of @en
label: ist früherer oder derzeitiger Besitzer von @de
label: é ou foi proprietário de @pt
label: είναι ή ήταν ιδιοκτήτης του/της @el
label: является бывшим или текущим владельцем для @ru
label: 目前或曾经拥有 @zh
range: Rzecz fizyczna

est actuellement possédée par
type: ObjectProperty
comment: This property identifies the E21 Person, E74 Group or E40 Legal Body that was the owner of an instance of E18 Physical Thing at the time of validity of the record or database containing the statement that uses this property. P52 has current owner (is current owner of) is a shortcut for the more detailed path from E18 Physical Thing through P24 transferred title of (changed ownership through), E8 Acquisition, P22 transferred title to (acquired title through) to E39 Actor, if and only if this acquisition event is the most recent. @en
domain: Rzecz fizyczna
label: has current owner @en
label: hat derzeitigen Besitzer @de
label: é propriedade de @pt
label: έχει ιδιοκτήτη @el
label: имеет текущего владельца @ru
label: 有现任物主 @zh
range: Aktor
sub property of: Rechte stehen zu
sub property of: est ou a été possédée par

est le propriétaire actuel de
type: ObjectProperty
domain: Aktor
label: is current owner of @en
label: ist derzeitiger Besitzer von @de
label: é proprietário de @pt
label: είναι ιδιοκτήτης του @el
label: является текущим владельцем для @ru
label: 目前拥有 @zh
range: Rzecz fizyczna
sub property of: détient un droit sur
sub property of: est ou a été propriétaire de

a ou a eu pour localisation
type: ObjectProperty
comment: This property allows an instance of E53 Place to be associated as the former or current location of an instance of E18 Physical Thing. In the case of E19 Physical Objects, the property does not allow any indication of the Time-Span during which the Physical Object was located at this Place, nor if this is the current location. In the case of immobile objects, the Place would normally correspond to the Place of creation. P53 has former or current location (is former or current location of) is a shortcut. A more detailed representation can make use of the fully developed (i.e. indirect) path from E19 Physical Object through P25 moved (moved by), E9 Move, P26 moved to (was destination of) or P27 moved from (was origin of) to E53 Place. @en
domain: Rzecz fizyczna
label: has former or current location @en
label: hat früheren oder derzeitigen Standort @de
label: é ou foi localizada em @pt
label: βρίσκεται ή βρισκόταν σε @el
label: имеет текущее или бывшее местоположение @ru
label: 目前或曾经被置放於 @zh
range: Miejsce

est ou a été localisation de
type: ObjectProperty
domain: Miejsce
label: is former or current location of @en
label: ist früherer oder derzeitiger Standort von @de
label: é ou foi localização de @pt
label: είναι ή ήταν θέση του @el
label: является текущим или бывшим местоположением для @ru
label: 目前或曾经被置放了 @zh
range: Rzecz fizyczna

a actuellement pour localisation à demeure
type: ObjectProperty
comment: This property records the foreseen permanent location of an instance of E19 Physical Object at the time of validity of the record or database containing the statement that uses this property. P54 has current permanent location (is current permanent location of) is similar to P55 has current location (currently holds). However, it indicates the E53 Place currently reserved for an object, such as the permanent storage location or a permanent exhibit location. The object may be temporarily removed from the permanent location, for example when used in temporary exhibitions or loaned to another institution. The object may never actually be located at its permanent location. @en
domain: Obiekt fizyczny
label: has current permanent location @en
label: hat derzeitigen permanenten Standort @de
label: é localizado permanentemente em @pt
label: έχει μόνιμη θέση @el
label: имеет текущее постоянное местоположение @ru
label: 目前的永久位置位於 @zh
range: Miejsce

est actuellement localisation à demeure de
type: ObjectProperty
domain: Miejsce
label: is current permanent location of @en
label: ist derzeitiger permanenter Standort von @de
label: é localização permanente de @pt
label: είναι μόνιμη θέση του/της @el
label: является текущим постоянным местоположением для @ru
label: 目前被用来永久置放 @zh
range: Obiekt fizyczny

a pour localisation actuelle
type: ObjectProperty
comment: This property records the location of an E19 Physical Object at the time of validity of the record or database containing the statement that uses this property. This property is a specialisation of P53 has former or current location (is former or current location of). It indicates that the E53 Place associated with the E19 Physical Object is the current location of the object. The property does not allow any indication of how long the Object has been at the current location. P55 has current location (currently holds) is a shortcut. A more detailed representation can make use of the fully developed (i.e. indirect) path from E19 Physical Object through P25 moved (moved by), E9 Move P26 moved to (was destination of) to E53 Place if and only if this Move is the most recent. @en
domain: Obiekt fizyczny
label: has current location @en
label: hat derzeitigen Standort @de
label: é localizado em @pt
label: βρίσκεται σε @el
label: в данный момент находится в @ru
label: 目前被置放於 @zh
range: Miejsce
sub property of: a ou a eu pour localisation

currently holds
type: ObjectProperty
domain: Miejsce
label: est localisation actuelle de @fr
label: hält derzeitig @de
label: é localização atual de @pt
label: είναι θέση του @el
label: в данный момент содержит @ru
label: 目前置放了 @zh
range: Obiekt fizyczny
sub property of: est ou a été localisation de

bears feature
type: ObjectProperty
comment: This property links an instance of E19 Physical Object to an instance of E26 Physical Feature that it bears. An E26 Physical Feature can only exist on one object. One object may bear more than one E26 Physical Feature. An E27 Site should be considered as an E26 Physical Feature on the surface of the Earth. An instance B of E26 Physical Feature being a detail of the structure of another instance A of E26 Physical Feature can be linked to B by use of the property P46 is composed of (forms part of). This implies that the subfeature B is P56i found on the same E19 Physical Object as A. P56 bears feature (is found on) is a shortcut. A more detailed representation can make use of the fully developed (i.e. indirect) path from E19 Physical Object through P59 has section (is located on or Definition of the CIDOC Conceptual Reference Model 149 within), E53 Place, P53 has former or current location (is former or current location of) to E26 Physical Feature. @en
domain: Obiekt fizyczny
label: possui característica @pt
label: présente pour caractéristique @fr
label: trägt Merkmal @de
label: φέρει μόρφωμα @el
label: несет признак @ru
label: 有外貌表征 @zh
range: Cecha fizyczna
sub property of: est composée de

is found on
type: ObjectProperty
domain: Cecha fizyczna
label: se trouve sur @fr
label: wird gefunden auf @de
label: é encontrada em @pt
label: βρίσκεται σε @el
label: найден на @ru
label: 被见於 @zh
range: Obiekt fizyczny
sub property of: bildet Teil von

a pour nombre de parties
type: DatatypeProperty
comment: This property documents the E60 Number of parts of which an instance of E19 Physical Object is composed. This may be used as a method of checking inventory counts with regard to aggregate or collective objects. What constitutes a part or component depends on the context and requirements of the documentation. Normally, the parts documented in this way would not be considered as worthy of individual attention. For a more complete description, objects may be decomposed into their components and constituents using P46 is composed of (forms parts of) and P45 consists of (is incorporated in). This allows each element to be described individually. @en
domain: Obiekt fizyczny
label: has number of parts @en
label: hat Anzahl Teile @de
label: tem número de partes @pt
label: έχει αριθμό μερών @el
label: имеет число частей @ru
label: 有组件数目 @zh
range: Literal

a pour désignation de section
type: ObjectProperty
comment: This property links an area (section) named by a E46 Section Definition to the instance of E18 Physical Thing upon which it is found. The CRM handles sections as locations (instances of E53 Place) within or on E18 Physical Thing that are identified by E46 Section Definitions. Sections need not be discrete and separable components or parts of an object. This is part of a more developed path from E18 Physical Thing through P58, E46 Section Definition, P87 is identified by (identifies) that allows a more precise definition of a location found on an object than the shortcut P59 has section (is located on or within). A particular instance of a Section Definition only applies to one instance of Physical Thing. @en
domain: Rzecz fizyczna
label: has section definition @en
label: hat Abschittsdefinition @de
label: tem designação de seção @pt
label: έχει ορισμό τμήματος @el
label: имеет определение района @ru
label: 有区域定义 @zh
range: Opis granicy

define uma seção de
type: ObjectProperty
domain: Opis granicy
label: defines section @en
label: definiert Abschitt auf oder von @de
label: définit une section de @fr
label: ορίζει τμήμα σε @el
label: определяет район @ru
label: 界定了区域於 @zh
range: Rzecz fizyczna

a pour section
type: ObjectProperty
comment: This property links an area to the instance of E18 Physical Thing upon which it is found. It is typically used when a named E46 Section Definition is not appropriate. E18 Physical Thing may be subdivided into arbitrary regions. P59 has section (is located on or within) is a shortcut. If the E53 Place is identified by a Section Definition, a more detailed representation can make use of the fully developed (i.e. indirect) path from E18 Physical Thing through P58 has section definition (defines section), E46 Section Definition, P87 is identified by (identifies) to E53 Place. A Place can only be located on or within one Physical Object. @en
domain: Rzecz fizyczna
label: has section @en
label: hat Bereich @de
label: tem seção @pt
label: έχει τομέα @el
label: имеет район @ru
label: 有区域 @zh
range: Miejsce

befindet sich auf oder in
type: ObjectProperty
domain: Miejsce
label: está localizada sobre ou dentro de @pt
label: is located on or within @en
label: se situe sur ou dans @fr
label: βρίσκεται σε ή εντός @el
label: находится на или внутри @ru
label: 位於 @zh
range: Rzecz fizyczna

besteht aus
type: ObjectProperty
comment: This property describes the decomposition of an E3 Condition State into discrete, subsidiary states. It is assumed that the sub-states into which the condition state is analysed form a logical whole - although the entire story may not be completely known – and that the sub-states are in fact constitutive of the general condition state. For example, a general condition state of “in ruins” may be decomposed into the individual stages of decay @en
domain: Stan
label: consiste de @pt
label: consiste en @fr
label: consists of @en
label: αποτελείται από @el
label: состоит из @ru
label: 包含 @zh
range: Stan

bildet Teil von
type: ObjectProperty
domain: Stan
label: fait partie de @fr
label: faz parte de @pt
label: forms part of @en
label: αποτελεί μέρος του/της @el
label: формирует часть @ru
label: 组成了 @zh
range: Stan

bildet ab
type: ObjectProperty
comment: This property identifies something that is depicted by an instance of E24 Physical Man-Made Thing. Depicting is meant in the sense that the surface of the E24 Physical Man-Made Thing shows, through its passive optical qualities or form, a representation of the entity depicted. It does not pertain to inscriptions or any other information encoding. This property is a shortcut of the more fully developed path from E24 Physical Man-Made Thing through P65 shows visual item (is shown by), E36 Visual Item, P138 represents (has representation) to E1 CRM Entity. P62.1 mode of depiction allows the nature of the depiction to be refined. @en
domain: Wytwór fizyczny
label: depicts @en
label: figure @fr
label: retrata @pt
label: απεικονίζει @el
label: описывает @ru
label: 描绘 @zh
range: Byt CRM

est figurée sur
type: ObjectProperty
domain: Byt CRM
label: is depicted by @en
label: wird abgebildet durch @de
label: é retratada por @pt
label: απεικονίζεται σε @el
label: описан посредством @ru
label: 被描绘於 @zh
range: Wytwór fizyczny

apresenta item visual
type: ObjectProperty
comment: This property documents an E36 Visual Item shown by an instance of E24 Physical Man-Made Thing. This property is similar to P62 depicts (is depicted by) in that it associates an item of E24 Physical Man-Made Thing with a visual representation. However, P65 shows visual item (is shown by) differs from the P62 depicts (is depicted by) property in that it makes no claims about what the E36 Visual Item is deemed to represent. E36 Visual Item identifies a recognisable image or visual symbol, regardless of what this image may or may not represent. For example, all recent British coins bear a portrait of Queen Elizabeth II, a fact that is correctly documented using P62 depicts (is depicted by). Different portraits have been used at different periods, however. P65 shows visual item (is shown by) can be used to refer to a particular portrait. P65 shows visual item (is shown by) may also be used for Visual Items such as signs, marks and symbols, for example the 'Maltese Cross' or the 'copyright symbol’ that have no particular representational content. This property is part of the fully developed path from E24 Physical Man-Made Thing through P65 shows visual item (is shown by), E36 Visual Item, P138 represents (has representation) to E1 CRM Entity which is shortcut by, P62 depicts (is depicted by). @en
domain: Wytwór fizyczny
label: présente l'item visuel @fr
label: shows visual item @en
label: zeigt Bildliches @de
label: εμφανίζει οπτικό στοιχείο @el
label: показывает визуальный предмет @ru
label: 显示视觉项目 @zh
range: Obiekt wizualny
sub property of: carries

est présenté par
type: ObjectProperty
domain: Obiekt wizualny
label: is shown by @en
label: wird gezeigt durch @de
label: é apresentado por @pt
label: εμφανίζεται σε @el
label: показан посредством @ru
label: 被显示於 @zh
range: Wytwór fizyczny
sub property of: a pour support

fait référence à
type: ObjectProperty
comment: This property documents that an E89 Propositional Object makes a statement about an instance of E1 CRM Entity. P67 refers to (is referred to by) has the P67.1 has type link to an instance of E55 Type. This is intended to allow a more detailed description of the type of reference. This differs from P129 is about (is subject of), which describes the primary subject or subjects of the E89 Propositional Object. @en
domain: Sąd (w sensie logicznym)
label: referencia @pt
label: refers to @en
label: verweist auf @de
label: αναφέρεται σε @el
label: ссылается на @ru
label: 论及 @zh
range: Byt CRM

est référencé par
type: ObjectProperty
domain: Byt CRM
label: is referred to by @en
label: wird angeführt von @de
label: é referenciado por @pt
label: αναφέρεται από @el
label: имеет ссылку на себя от @ru
label: 被论及於 @zh
range: Sąd (w sensie logicznym)

foresees use of
type: ObjectProperty
comment: This property identifies an E57 Material foreseeen to be used by an E29 Design or Procedure. E29 Designs and procedures commonly foresee the use of particular E57 Materials. The fabrication of adobe bricks, for example, requires straw, clay and water. This property enables this to be documented. This property is not intended for the documentation of E57 Materials that were used on a particular occasion when an instance of E29 Design or Procedure was executed. @en
domain: Projekt lub Procedura
label: normalmente emprega @pt
label: sieht den Gebrauch vor von @de
label: utilise habituellement @fr
label: συνήθως χρησιμοποιεί @el
label: обычно применяет @ru
label: 指定使用材料 @zh
range: Materiał
sub property of: fait référence à

est habituellement utilisé par
type: ObjectProperty
domain: Materiał
label: use foreseen by @en
label: vorgesehen für Gebrauch durch defined @de
label: é empregado por @pt
label: συνήθως χρησιμοποιείται από @el
label: обычно используется посредством @ru
label: 被指定使用於 @zh
range: Projekt lub Procedura
sub property of: est référencé par

est associée à
type: ObjectProperty
comment: This property generalises relationships like whole-part, sequence, prerequisite or inspired by between instances of E29 Design or Procedure. Any instance of E29 Design or Procedure may be associated with other designs or procedures. The property is considered to be symmetrical unless otherwise indicated by P69.1 has type. The P69.1 has type property of P69 has association with allows the nature of the association to be specified reading from domain to range; examples of types of association between instances of E29 Design or Procedure include: has part, follows, requires, etc. The property can typically be used to model the decomposition of the description of a complete workflow into a series of separate procedures. @en
domain: Projekt lub Procedura
label: is associated with @en
label: ist verbunden mit @de
label: é associado com @pt
label: σχετίζεται με @el
label: ассоциирован с @ru
label: 相关於 @zh
range: Projekt lub Procedura

belegt
type: ObjectProperty
comment: This property describes the CRM Entities documented by instances of E31 Document. Documents may describe any conceivable entity, hence the link to the highest-level entity in the CRM hierarchy. This property is intended for cases where a reference is regarded as being of a documentary character, in the scholarly or scientific sense. @en
domain: Document
label: documenta @pt
label: documents @en
label: mentionne @fr
label: τεκμηριώνει @el
label: документирует @ru
label: 记录了 @zh
range: Byt CRM
sub property of: fait référence à

est mentionnée dans
type: ObjectProperty
domain: Byt CRM
label: is documented in @en
label: wird belegt in @de
label: é documentado em @pt
label: τεκμηριώνεται σε @el
label: документирован в @ru
label: 被记录於 @zh
range: Document
sub property of: est référencé par

define
type: ObjectProperty
comment: This property documents a source E32 Authority Document for an instance of an E1 CRM Entity. @en
domain: Dokument referencyjny
label: définit @fr
label: listet @de
label: lists @en
label: περιλαμβάνει @el
label: перечисляет @ru
label: 条列出 @zh
range: Byt CRM
sub property of: fait référence à

est défini par
type: ObjectProperty
domain: Byt CRM
label: is listed in @en
label: wird aufgelistet in @de
label: é definido por @pt
label: περιλαμβάνεται σε @el
label: перечислен в @ru
label: 被条列於 @zh
range: Dokument referencyjny
sub property of: est référencé par

est en langue
type: ObjectProperty
comment: This property describes the E56 Language of an E33 Linguistic Object. Linguistic Objects are composed in one or more human Languages. This property allows these languages to be documented. @en
domain: Obiekt lingwistyczny
label: has language @en
label: hat Sprache @de
label: é da língua @pt
label: έχει γλώσσα @el
label: имеет язык @ru
label: 使用语言 @zh
range: Język

est la langue de
type: ObjectProperty
domain: Język
label: is language of @en
label: ist Sprache von @de
label: é a língua de @pt
label: είναι γλώσσα του/της @el
label: является языком для @ru
label: 被用来撰写 @zh
range: Obiekt lingwistyczny

a pour traduction
type: ObjectProperty
comment: This property describes the source and target of instances of E33Linguistic Object involved in a translation. When a Linguistic Object is translated into a new language it becomes a new Linguistic Object, despite being conceptually similar to the source object. @en
domain: Obiekt lingwistyczny
label: has translation @en
label: hat Übersetzung @de
label: tem tradução @pt
label: έχει μετάφραση @el
label: имеет перевод @ru
label: 有译文 @zh
range: Obiekt lingwistyczny
sub property of: Merkmale auch auf

est la traduction de
type: ObjectProperty
domain: Obiekt lingwistyczny
label: is translation of @en
label: ist Übersetzung von @de
label: é tradução de @pt
label: είναι μετάφραση του/της @el
label: является переводом @ru
label: 翻译自 @zh
range: Obiekt lingwistyczny
sub property of: apresenta características de

has current or former residence
type: ObjectProperty
comment: This property describes the current or former E53 Place of residence of an E39 Actor. The residence may be either the Place where the Actor resides, or a legally registered address of any kind. @en
domain: Aktor
label: hat derzeitigen oder früheren Sitz @de
label: reside ou residiu em @pt
label: réside ou a résidé à @fr
label: έχει ή είχε κατοικία @el
label: имеет текущее или бывшее местожительства @ru
label: 目前或曾经居住於 @zh
range: Miejsce

est ou a été la résidence de
type: ObjectProperty
domain: Miejsce
label: is current or former residence of @en
label: ist derzeitiger oder früherer Sitz von @de
label: é ou foi residência de @pt
label: είναι ή ήταν κατοικία του/της @el
label: является текущим или бывшим местом жительства для @ru
label: 历年来的居住者包括 @zh
range: Aktor

besitzt
type: ObjectProperty
comment: This property identifies former or current instances of E30 Rights held by an E39 Actor. @en
domain: Aktor
label: est détenteur de @fr
label: possesses @en
label: é detentor de @pt
label: κατέχει @el
label: владеет @ru
label: 拥有 @zh
range: Uprawnienie

est détenu par
type: ObjectProperty
domain: Uprawnienie
label: is possessed by @en
label: sind im Besitz von @de
label: são detidos por @pt
label: κατέχεται από @el
label: принадлежит @ru
label: 有拥有者 @zh
range: Aktor

a pour coordonnées individuelles
type: ObjectProperty
comment: This property identifies an E51 Contact Point of any type that provides access to an E39 Actor by any communication method, such as e-mail or fax. @en
domain: Aktor
label: has contact point @en
label: hat Kontaktpunkt @de
label: possui ponto de contato @pt
label: έχει σημείο επικοινωνίας @el
label: имеет контакт @ru
label: 有联系方式 @zh
range: Kontakt

bietet Zugang zu
type: ObjectProperty
domain: Kontakt
label: permettent de contacter @fr
label: provides access to @en
label: é ponto de contado de @pt
label: παρέχει πρόσβαση σε @el
label: предоставляет доступ к @ru
label: 被用来联系 @zh
range: Aktor

est identifiée par
type: ObjectProperty
comment: This property identifies an E52 Time-Span using an E49Time Appellation. @en
domain: Trwanie
label: is identified by @en
label: wird bezeichnet als @de
label: é identificado por @pt
label: αναγνωρίζεται ως @el
label: идентифицируется посредством @ru
label: 有识别称号 @zh
range: Opis czasu
sub property of: est identifiée par

bezeichnet
type: ObjectProperty
domain: Opis czasu
label: identifica @pt
label: identifie @fr
label: identifies @en
label: είναι αναγνωριστικό @el
label: идентифицирует @ru
label: 被用来识别 @zh
range: Trwanie
sub property of: bezeichnet

beginning is qualified by
type: DatatypeProperty
comment: This property qualifies the beginning of an E52 Time-Span in some way. The nature of the qualification may be certainty, precision, source etc. @en
domain: Trwanie
label: début est qualifié par @fr
label: hat Anfangsbegründung @de
label: início é qualificado por @pt
label: αρχή προσδιορίζεται από @el
label: начало ограничено @ru
label: 起点认定的性质是 @zh
range: Literal
sub property of: a pour note

a eu lieu dans
type: ObjectProperty
comment: This property describes the spatial location of an instance of E4 Period. The related E53 Place should be seen as an approximation of the geographical area within which the phenomena that characterise the period in question occurred. P7took place at (witnessed) does not convey any meaning other than spatial positioning (generally on the surface of the earth). For example, the period "Révolution française" can be said to have taken place in “France”, the “Victorian” period, may be said to have taken place in “Britain” and its colonies, as well as other parts of Europe and north America. A period can take place at multiple locations. It is a shortcut of the more fully developed path from E4 Period through P161 has spatial projection, E53 Place, P89 falls within (contains) to E53 Place. @en
domain: Okres
label: fand statt in @de
label: ocorreu em @pt
label: took place at @en
label: έλαβε χώρα σε @el
label: совершался на @ru
label: 发生地在 @zh
range: Miejsce

a été témoin de
type: ObjectProperty
domain: Miejsce
label: bezeugte @de
label: testemunhou @pt
label: witnessed @en
label: υπήρξε τόπος του @el
label: был местом совершения @ru
label: 发生过 @zh
range: Okres

end is qualified by
type: DatatypeProperty
comment: This property qualifies the end of an E52 Time-Span in some way. The nature of the qualification may be certainty, precision, source etc. @en
domain: Trwanie
label: fin est qualifiée par @fr
label: final é qualificado por @pt
label: hat Begründung des Endes @de
label: τέλος προσδιορίζεται από @el
label: конец ограничен @ru
label: 终点认定的性质是 @zh
range: Literal
sub property of: a pour note

abrange no mínimo
type: DatatypeProperty
comment: This property describes the minimum period of time covered by an E52 Time-Span. Since Time-Spans may not have precisely known temporal extents, the CRM supports statements about the minimum and maximum temporal extents of Time-Spans. This property allows a Time-Span’s minimum temporal extent (i.e. its inner boundary) to be assigned an E61 Time Primitive value. Time Primitives are treated by the CRM as application or system specific date intervals, and are not further analysed. @en
domain: Trwanie
label: andauernd während @de
label: couvre au moins @fr
label: ongoing throughout @en
label: καθόλη τη διάρκεια του/της @el
label: длится в течение @ru
label: 时段的数值至少涵盖 @zh
range: Literal

Ende des Anfangs
type: DatatypeProperty
comment: This is defined as the first boundary of the property P81 @en
domain: Trwanie
label: end of the begin @en
label: fim do início @pt
label: fin du début @fr
label: τέλος της αρχής @el
label: конец начала @ru
range: dateTime
sub property of: abrange no mínimo

Anfang vom Ende
type: DatatypeProperty
comment: This is defined as the second boundary of the property P81 @en
domain: Trwanie
label: begin of the end @en
label: começar do fim @pt
label: début de la fin @fr
label: αρχή του τέλους @el
label: начать в конце @ru
range: dateTime
sub property of: abrange no mínimo

abrange no máximo
type: DatatypeProperty
comment: This property describes the maximum period of time within which an E52 Time-Span falls. Since Time-Spans may not have precisely known temporal extents, the CRM supports statements about the minimum and maximum temporal extents of Time-Spans. This property allows a Time-Span’s maximum temporal extent (i.e. its outer boundary) to be assigned an E61 Time Primitive value. Time Primitives are treated by the CRM as application or system specific date intervals, and are not further analysed. @en
domain: Trwanie
label: at some time within @en
label: couvre au plus @fr
label: irgendwann innerhalb von @de
label: κάποτε εντός @el
label: некоторое время в течение @ru
label: 时段的数值不会超越 @zh
range: Literal

Anfang des Anfangs
type: DatatypeProperty
comment: This is defined as the first boundary of the property P82 @en
domain: Trwanie
label: begin of the begin @en
label: começar do início @pt
label: début du début @fr
label: αρχή της αρχής @el
label: начать с начала @ru
range: dateTime
sub property of: abrange no máximo

Ende vom Ende
type: DatatypeProperty
comment: This is defined as the second boundary of the property P82 @en
domain: Trwanie
label: end of the end @en
label: fim do fim @pt
label: fin de la fin @fr
label: τέλος του τέλους @el
label: конец конец @ru
range: dateTime
sub property of: abrange no máximo

a duré au moins
type: ObjectProperty
comment: This property describes the minimum length of time covered by an E52 Time-Span. It allows an E52 Time-Span to be associated with an E54 Dimension representing it’s minimum duration (i.e. it’s inner boundary) independent from the actual beginning and end. @en
domain: Trwanie
label: durou no mínimo @pt
label: had at least duration @en
label: hatte Mindestdauer @de
label: είχε ελάχιστη διάρκεια @el
label: имеет длительность по крайней мере больше чем @ru
label: 时间最少持续了 @zh
range: Wymiar

a été la durée minimum de
type: ObjectProperty
domain: Wymiar
label: foi a duração mínima de @pt
label: war Mindestdauer von @de
label: was minimum duration of @en
label: είναι ελάχιστη διάρκεια του/της @el
label: был минимальной длительностью для @ru
range: Trwanie

a duré au plus
type: ObjectProperty
comment: This property describes the maximum length of time covered by an E52 Time-Span. It allows an E52 Time-Span to be associated with an E54 Dimension representing it’s maximum duration (i.e. it’s outer boundary) independent from the actual beginning and end. @en
domain: Trwanie
label: durou no máximo @pt
label: had at most duration @en
label: hatte Höchstdauer @de
label: είχε μέγιστη διάρκεια @el
label: имеет длительность меньше чем @ru
label: 时间最多持续了 @zh
range: Wymiar

a été la durée maximum de
type: ObjectProperty
domain: Wymiar
label: foi a duração máxima de @pt
label: war längste Dauer von @de
label: was maximum duration of @en
label: είναι μέγιστη διάρκεια του/της @el
label: был максимальной длительностью для @ru
label: 是的最大持续时间 @zh
range: Trwanie

está contido em
type: ObjectProperty
comment: This property describes the inclusion relationship between two instances of E52 Time-Span. This property supports the notion that a Time-Span’s temporal extent falls within the temporal extent of another Time-Span. It addresses temporal containment only, and no contextual link between the two instances of Time-Span is implied. @en
domain: Trwanie
label: falls within @en
label: fällt in @de
label: s’insère dans @fr
label: περιέχεται σε @el
label: содержится в @ru
label: 时间上被涵盖於 @zh
range: Trwanie

contains
type: ObjectProperty
domain: Trwanie
label: contém @pt
label: enthält @de
label: inclut @fr
label: περιέχει @el
label: содержит @ru
label: 时间上涵盖了 @zh
range: Trwanie

est identifié par
type: ObjectProperty
comment: This property identifies an E53 Place using an E44 Place Appellation. Examples of Place Appellations used to identify Places include instances of E48 Place Name, addresses, E47 Spatial Coordinates etc. @en
domain: Miejsce
label: is identified by @en
label: wird bezeichnet als @de
label: é identificado por @pt
label: αναγνωρίζεται ως @el
label: идентифицируется посредством @ru
label: 有辨认码 @zh
range: Opis miejsca
sub property of: est identifiée par

bezeichnet
type: ObjectProperty
domain: Opis miejsca
label: identifica @pt
label: identifie @fr
label: identifies @en
label: είναι αναγνωριστικό @el
label: идентифицирует @ru
label: 被用来辨认 @zh
range: Miejsce
sub property of: bezeichnet

está contido em
type: ObjectProperty
comment: This property identifies an instance of E53 Place that falls wholly within the extent of another E53 Place. It addresses spatial containment only, and does not imply any relationship between things or phenomena occupying these places. @en
domain: Miejsce
label: falls within @en
label: fällt in @de
label: s’insère dans @fr
label: περιέχεται σε @el
label: содержится в @ru
label: 空间上被包围於 @zh
range: Miejsce

contains
type: ObjectProperty
domain: Miejsce
label: contém @pt
label: enthält @de
label: inclut @fr
label: περιέχει @el
label: содержит @ru
label: 空间上包含了 @zh
range: Miejsce

a eu lieu sur ou dans
type: ObjectProperty
comment: This property describes the location of an instance of E4 Period with respect to an E19 Physical Object. P8 took place on or within (witnessed) is a shortcut of the more fully developed path from E4 Period through P7 took place at, E53 Place, P156 occupies (is occupied by) to E18 Physical Thing. It describes a period that can be located with respect to the space defined by an E19 Physical Object such as a ship or a building. The precise geographical location of the object during the period in question may be unknown or unimportant. For example, the French and German armistice of 22 June 1940 was signed in the same railway carriage as the armistice of 11 November 1918. @en
domain: Okres
label: fand statt auf oder innerhalb von @de
label: ocorreu em ou dentro @pt
label: took place on or within @en
label: έλαβε χώρα σε ή εντός @el
label: имел место на или в @ru
label: 发生所在物件是 @zh
range: Rzecz fizyczna

a été témoin de
type: ObjectProperty
domain: Rzecz fizyczna
label: bezeugte @de
label: testemunhou @pt
label: witnessed @en
label: υπήρξε τόπος του @el
label: являлся местом для @ru
label: 发生过 @zh
range: Okres

a la valeur
type: DatatypeProperty
comment: This property allows an E54 Dimension to be approximated by an E60 Number primitive. @en
domain: Wymiar
label: has value @en
label: hat Wert @de
label: tem valor @pt
label: έχει τιμή @el
label: имеет значение @ru
label: 有数值 @zh
range: Literal

a pour unité
type: ObjectProperty
comment: This property shows the type of unit an E54 Dimension was expressed in. @en
domain: Wymiar
label: has unit @en
label: hat Einheit @de
label: tem unidade @pt
label: έχει μονάδα μέτρησης @el
label: имеет единицу @ru
label: 有单位 @zh
range: Jednostka miary

est l'unité de
type: ObjectProperty
domain: Jednostka miary
label: is unit of @en
label: ist Einheit von @de
label: é unidade de @pt
label: αποτελεί μονάδα μέτρησης του/της @el
label: является единицей для @ru
label: 被当做单位来表示 @zh
range: Wymiar

a fait exister
type: ObjectProperty
comment: This property allows an E63 Beginning of Existence event to be linked to the E77 Persistent Item brought into existence by it. It allows a “start” to be attached to any Persistent Item being documented i.e. E70 Thing, E72 Legal Object, E39 Actor, E41 Appellation, E51 Contact Point and E55 Type @en
domain: Początek istnienia
label: brachte in Existenz @de
label: brought into existence @en
label: trouxe à existência @pt
label: γέννησε @el
label: создал @ru
label: 开始了 @zh
range: Byt trwający w czasie
sub property of: est arrivé en présence de

a commencé à exister du fait de
type: ObjectProperty
domain: Byt trwający w czasie
label: passou a existir por @pt
label: was brought into existence by @en
label: wurde in Existenz gebracht durch @de
label: γεννήθηκε από @el
label: был создан посредством @ru
label: 被开始於 @zh
range: Początek istnienia
sub property of: estava presente no

a fait cesser d’exister
type: ObjectProperty
comment: This property allows an E64 End of Existence event to be linked to the E77 Persistent Item taken out of existence by it. In the case of immaterial things, the E64 End of Existence is considered to take place with the destruction of the last physical carrier. This allows an “end” to be attached to any Persistent Item being documented i.e. E70 Thing, E72 Legal Object, E39 Actor, E41 Appellation, E51 Contact Point and E55 Type. For many Persistent Items we know the maximum life-span and can infer, that they must have ended to exist. We assume in that case an End of Existence, which may be as unnoticeable as forgetting the secret knowledge by the last representative of some indigenous nation. @en
domain: Koniec istnienia
label: beendete die Existenz von @de
label: cessou a existência de @pt
label: took out of existence @en
label: αναίρεσε @el
label: положил конец существованию @ru
label: 结束了 @zh
range: Byt trwający w czasie
sub property of: est arrivé en présence de

a cessé d’exister du fait de
type: ObjectProperty
domain: Byt trwający w czasie
label: deixou de existir @pt
label: was taken out of existence by @en
label: wurde seiner Existenz beraubt durch @de
label: αναιρέθηκε από @el
label: прекратил существование посредством @ru
label: 被结束於 @zh
range: Koniec istnienia
sub property of: estava presente no

a créé
type: ObjectProperty
comment: This property allows a conceptual E65 Creation to be linked to the E28 Conceptual Object created by it. It represents the act of conceiving the intellectual content of the E28 Conceptual Object. It does not represent the act of creating the first physical carrier of the E28 Conceptual Object. As an example, this is the composition of a poem, not its commitment to paper. @en
domain: Wytworzenie
label: criou @pt
label: has created @en
label: hat erschaffen @de
label: δημιούργησε @el
label: создал @ru
label: 创造了 @zh
range: Obiekt pojęciowy
sub property of: a fait exister

a été créé par
type: ObjectProperty
domain: Obiekt pojęciowy
label: foi criado por @pt
label: was created by @en
label: wurde erschaffen durch @de
label: δημιουργήθηκε από @el
label: был создан посредством @ru
label: 被创造於 @zh
range: Wytworzenie
sub property of: a commencé à exister du fait de

a fondé
type: ObjectProperty
comment: This property links the founding or E66 Formation for an E74 Group with the Group itself. @en
domain: Tworzenie
label: formou @pt
label: has formed @en
label: hat gebildet @de
label: σχημάτισε @el
label: сформировал @ru
label: 组成了 @zh
range: Grupa
sub property of: a fait exister

a été fondé par
type: ObjectProperty
domain: Grupa
label: foi formado por @pt
label: was formed by @en
label: wurde gebildet von @de
label: σχηματίστηκε από @el
label: была сформирована посредством @ru
label: 被组成於 @zh
range: Tworzenie
sub property of: a commencé à exister du fait de

by mother
type: ObjectProperty
comment: This property links an E67 Birth event to an E21 Person as a participant in the role of birth-giving mother. Note that biological fathers are not necessarily participants in the Birth (see P97 from father (was father for)). The Person being born is linked to the Birth with the property P98 brought into life (was born). This is not intended for use with general natural history material, only people. There is no explicit method for modelling conception and gestation except by using extensions. This is a sub-property of P11 had participant (participated in). @en
domain: Narodziny
label: de mère @fr
label: durch Mutter @de
label: pela mãe @pt
label: είχε μητέρα @el
label: посредством матери @ru
label: 来自生母 @zh
range: Osoba
sub property of: a eu pour participant

a donné naissance à
type: ObjectProperty
domain: Osoba
label: deu nascimento @pt
label: gave birth @en
label: gebar @de
label: ήταν μητέρα του/της @el
label: дал рождение @ru
label: 成为生母於 @zh
range: Narodziny
sub property of: a participé à

de père
type: ObjectProperty
comment: This property links an E67 Birth event to an E21 Person in the role of biological father. Note that biological fathers are not seen as necessary participants in the Birth, whereas birth-giving mothers are (see P96 by mother (gave birth)). The Person being born is linked to the Birth with the property P98 brought into life (was born). This is not intended for use with general natural history material, only people. There is no explicit method for modelling conception and gestation except by using extensions. A Birth event is normally (but not always) associated with one biological father. @en
domain: Narodziny
label: from father @en
label: gab Vaterschaft @de
label: pelo pai @pt
label: είχε πατέρα @el
label: от отца @ru
label: 来自父亲 @zh
range: Osoba

a été père dans
type: ObjectProperty
domain: Osoba
label: foi pai para @pt
label: war Vater für @de
label: was father for @en
label: ήταν πατέρας του/της @el
label: был отцом для @ru
label: 成为生父於 @zh
range: Narodziny

a donné vie à
type: ObjectProperty
comment: This property links an E67Birth event to an E21 Person in the role of offspring. Twins, triplets etc. are brought into life by the same Birth event. This is not intended for use with general Natural History material, only people. There is no explicit method for modelling conception and gestation except by using extensions. @en
domain: Narodziny
label: brachte zur Welt @de
label: brought into life @en
label: trouxe à vida @pt
label: έφερε στη ζωή @el
label: породил @ru
label: 诞生了 @zh
range: Osoba
sub property of: a fait exister

est né
type: ObjectProperty
domain: Osoba
label: veio à vida pelo @pt
label: was born @en
label: wurde geboren durch @de
label: γεννήθηκε @el
label: был рожден @ru
label: 诞生於 @zh
range: Narodziny
sub property of: a commencé à exister du fait de

a dissous
type: ObjectProperty
comment: This property links the disbanding or E68 Dissolution of an E74 Group to the Group itself. @en
domain: Rozwiązanie
label: dissolved @en
label: dissolveu @pt
label: löste auf @de
label: διέλυσε @el
label: распустил @ru
label: 解散了 @zh
range: Grupa
sub property of: a eu pour participant
sub property of: a fait cesser d’exister

a été dissous par
type: ObjectProperty
domain: Grupa
label: foi dissolvido por @pt
label: was dissolved by @en
label: wurde aufgelöst durch @de
label: διαλύθηκε από @el
label: был распущен посредством @ru
label: 被解散於 @zh
range: Rozwiązanie
sub property of: a participé à
sub property of: a cessé d’exister du fait de

consiste de
type: ObjectProperty
comment: This property associates an instance of E4 Period with another instance of E4 Period that is defined by a subset of the phenomena that define the former. Therefore the spacetime volume of the latter must fall within the spacetime volume of the former. @en
domain: Okres
label: consiste en @fr
label: consists of @en
label: setzt sich zusammen aus @de
label: αποτελείται από @el
label: состоит из @ru
label: 包含子时期 @zh
range: Okres
sub property of: contains

bildet Teil von
type: ObjectProperty
domain: Okres
label: fait partie de @fr
label: faz parte de @pt
label: forms part of @en
label: αποτελεί μέρος του/της @el
label: формирует часть @ru
label: 附属於 @zh
range: Okres
sub property of: está contido em

Cecha
type: Class

Obiekt przestrzenny
type: Class
subclass of: Region czasoprzestrzeni

ma charakterystykę przestrzenną
type: ObjectProperty
inverse of: jest charakterystyką przestrzenną

Geometria
type: Class
subclass of: Restriction
  max qualified cardinality: 1
  on class: manifestacja jednostki podziału administracyjnego
  on property: jest charakterystyką przestrzenną
subclass of: Restriction
  max qualified cardinality: 1
  on class: manifestacja jednostki osadniczej
  on property: jest charakterystyką przestrzenną

ontohgis
type: Ontology
comment: Mapped onto DBpedia ontology (2014) @en
comment: Mapped onto Geonames feature codes @en
comment: Mapped onto linkedgeodata.org ontology (2014-09-09) @en
comment: Mapped onto types of GOV ontology (http://gov.genealogy.net/) @en
comment: Ontologia powstała w ramach projektu 'Ontologiczne podstawy budowy historycznych systemów informacji geograficznej' (2bH 15 0216 83) finansowanego przez Narodowy Programu Rozwoju Humanistyki 2015 r., IV edycja, moduł "Rozwój" 2 b.
comment: Ontology was developed thanks to the Ontological Foundations for Building Historical Geoinformation Systems (2bH 15 0216 83) grant funded by National Programme for the Development of Humanities (http://nprh.org/). @en
comment: This ontology uses the min 0 cardinality constraints to convey the possibility of a given restriction. The intent here is to identify properties that typically have a value for a given concept, although there are situations in which they would be undefined. This follows the pattern described in https://github.com/edmcouncil/fibo/blob/master/ONTOLOGY_GUIDE.md#overarching-principles. @en
comment: This version of ontohgis was founded on CIDOC CRM as specified in http://www.cidoc-crm.org/sites/default/files/cidoc_crm_v6.2.1-2018April.rdfs. We extended it with the labels in Polish. @en
imports: oc.ttl
version info: 3.3

about in
type: ObjectProperty

ma właściwość w obszarze
type: FunctionalProperty
type: ObjectProperty
domain: manifestacja organu administracji
label: administers over @en
range: manifestacja obszaru administracyjnego
sub property of: topObjectProperty
ma komentarz od zespołu tworzącego ontologię: Jeżeli organ administracji musi być zlokalizowany na obszarze swojej właściwości, relacja ta jest podrelacją isPartOf. @en

supervises
type: ObjectProperty
domain: manifestacja jednostki podziału administracyjnego
range: manifestacja jednostki podziału administracyjnego
sub property of: feature contains feature

administers
type: ObjectProperty
domain: manifestacja jednostki podziału administracyjnego
range: manifestacja jednostki osadniczej
sub property of: feature contains feature
inverse of: settlement unit is administered by administrative unit

administrative unit is administered by administrative unit
type: ObjectProperty
sub property of: feature is contained in feature

Rzeczpospolita Polska (1918-1939)
creator: Bogumił Szady
type: NamedIndividual
type: system administracji
comment: Chronologia obowiązywania systemu administracyjnego ma charakter generalny. Obejmuje także okres kształtowania się systemu administracyjnego w okresie przejściowym po odzyskaniu niepodległości.
comment: Konstytucja Rzeczypospolitej Polskie z 17 marca 1921 r.; Rozporządzenie Prezydenta Rzeczypospolitej z dnia 19 stycznia 1928 r. o organizacji i zakresie działania władz administracji ogólnej; Ustawa z dnia 23 marca 1933 r. o częściowej zmianie ustroju samorządu terytorjalnego. (tzw. ustawa scaleniowa)
comment: The chronology of the administrative system is of gerenal nature. it covers also the origins of the system in the transition period after regaining independence @en
label: The Second Polish Republic @en
kończy obowiązywać w: 1939-12-31
ma początek: 1918-01-01
ma koniec: 1939-12-31
ma podstawę prawną w: Konstytucja Rzeczypospolitej Polskie z 17 marca 1921 r.; Rozporządzenie Prezydenta Rzeczypospolitej z dnia 19 stycznia 1928 r. o organizacji i zakresie działania władz administracji ogólnej; Ustawa z dnia 23 marca 1933 r. o częściowej zmianie ustroju samorządu terytorjalnego. (tzw. ustawa scaleniowa)
ma zasięg: terytorium II RP
zobacz też obiekt: Podziały terytorialno-administracyjne II Rzeczypospolitej w zakresie administracji zespolonej
zobacz też obiekt: Państwowe, administracyjne, wojskowe i wyznaniowe podziały terytorialne na ziemiach polskich: (zarys dziejów)
zobacz też obiekt: Ustrój administracji ogólnej na Wileńszczyźnie w okresie międzywojennym
zobacz też obiekt: Proces ujednolicania ustroju samorządu terytorialnego w II Rzeczypospolitej
zobacz też obiekt: Z dziejów unifikacji administracji II Rzeczypospolitej: Rola przepisów pruskich
zobacz też obiekt: Niedostatki unifikacji administracji ogólnej. Doktryna i praktycy o koniecznych uzupełnieniach rozporządzenia Prezydenta RP z dnia 19 stycznia 1928 r
zobacz też obiekt: Województwo w Drugiej Rzeczypospolitej: z dziejów podziałów terytorialnych w latach 1919-1939
zobacz też obiekt: Próba zreformowania podziału terytorialnego Drugiej Rzeczypospolitej w latach 1928-1933
zaczyna obowiązywać od: 1918-01-01

Królestwo Galicji i Lodomerii (1867-1918)
creator: Bogumił Szady
type: NamedIndividual
type: system administracji
label: The Kingdom of Galicia and Lodomeria (1867-1918) @en
kończy obowiązywać w: 1918-12-31
ma początek: 1867-01-01
ma koniec: 1918-12-31
ma podstawę prawną w: reforma administracyjna 1865-1867 (zniesienie cyrkułów, zniesienie rządu krajowego w Krakowie)
ma zasięg: terytorium Galicji
zobacz też obiekt: Kancelaria organów władzy w Galicji: Wybór źródeł
zobacz też obiekt: Galizien unter österreichischer Herrschaft: Verwaltung - Kirche - Bevölkerung
zobacz też obiekt: Historia państwa i prawa Polski. T. 4, Od uwłaszczenia do odrodzenia państwa
zobacz też obiekt: Galicja 1848-1914: Historia ustroju politycznego na tle historii ustroju Austrii
zobacz też IRI: https://www.wikidata.org/wiki/Q2396442
zaczyna obowiązywać od: 1867-01-01

Królestwo Polskie (1837-1866)
creator: Tomasz Panecki
type: NamedIndividual
type: system administracji
label: Congress Poland (1837-1866) @en
kończy obowiązywać w: 1866-12-31
ma początek: 1837-01-01
ma koniec: 1866-12-31
ma podstawę prawną w: Ukaz carski z 7.3.1837 (Dziennik Praw Królestwa Polskiego, nr 68-70, t. 20, Warszawa 1836-1837, s. 412); Ukaz carski z 11.10.1842 (Dziennik Praw Królestwa Polskiego, nr 97, t. 30, Warszawa: 1842, s. 281-285)
ma zasięg: terytorium Królestwa Polskiego
zobacz też obiekt: Administracja gmin wiejskich w Królestwie Polskim w latach 1815–1864
zobacz też obiekt: Historia ustroju Polski X-XX w.
zobacz też obiekt: Podział administracyjny Królestwa Polskiego 1815-1918
zobacz też IRI: https://www.wikidata.org/wiki/Q221457
zaczyna obowiązywać od: 1842-01-01

Królestwo Saksonii (1815-1918)
creator: Anna Orłowska
type: NamedIndividual
type: system administracji
label: The Kingdom of Saxony (1815-1918) @en
kończy obowiązywać w: 1918-12-31
ma początek: 1815-01-01
ma koniec: 1918-12-31
ma zasięg: terytorium Królestwa Saksonii, obejmuje część Łużyc leżących obecnie w Polsce (Bogatynia, Zgorzelec)
zobacz też IRI: https://www.wikidata.org/wiki/Q153015
zaczyna obowiązywać od: 1815-01-01

Królestwo Prus (1713-1805)
creator: Witold Matwiejczyk
type: NamedIndividual
type: system administracji
comment: After Frederic William's ascension to the throne (1713-1740) a lengthy process of administrative system reform starts. In 1814, the interim period, when the Frederick's system was connected with the new one intorduced by Stein'. in 1723 - the General Directorate (Das Generaldirektorium) was established. @en
comment: Edykt królewski z 13.08.1713 o niepodzielności wszystkich terytoriów Hohenzollernów tworzących integralne terytorium Królestwa Prus. Instrukcja królewska z 19 stycznia 1723 r. o utworzeniu General- Ober- Finanz- Kriegs- und Domänen-Direktorium.
comment: Po wstąpieniu na tron Fryderyk Wilhelm I (1713-1740) rozpoczyna długotrwały proces reform administracyjnych swego państwa. 1814 - koniec okresu przejściowego, w którym stary system fryderycjański łączył się z nowym, wprowadzonym przez reformy Steina. 1723 - Utworzenie Generalnego Dyrektorium (Das Generaldirektorium)
label: The Kingdom of Prussia (1713-1805) @en
kończy obowiązywać w: 1806-12-31
ma początek: 1713-01-01
ma koniec: 1814-12-31
ma podstawę prawną w: Edykt królewski z 13.08.1713 o niepodzielności wszystkich terytoriów Hohenzollernów tworzących integralne terytorium Królestwa Prus. Instrukcja królewska z 19 stycznia 1723 r. o utworzeniu General- Ober- Finanz- Kriegs- und Domänen-Direktorium.
ma zasięg: terytorium Królestwa Prus, obejmuje obecne ziemie zachodniej i północnej Polski
zobacz też obiekt: Deutsche Verwaltungsgeschichte
zobacz też obiekt: Prusy w okresie monarchii absolutnej (1701-1806)
zobacz też obiekt: Ziemie polskie pod zaborem pruskim. Prusy Południowe 1793-1806. Studium historycznoprawne
zobacz też obiekt: M. Bär, Die Behördenverfassung in Westpreußen seit der Ordenszeit
zobacz też IRI: https://www.wikidata.org/wiki/Q27306
zaczyna obowiązywać od: 1723-01-01

Rzeczpospolita Obojga Narodów (1569-1795)
creator: Tomasz Związek
type: NamedIndividual
type: system administracji
label: The Polish-Lithuanian Commonwealth (1569-1795) @en
alternative label: Commonwealth of Both Nations (1569-1795) @en
alternative label: Polish-Lithuanian Republic (1569-1795) @en
alternative label: The Republic of the Two Nations (1569-1795) @en
kończy obowiązywać w: 1791-12-31
ma początek: 1569-01-01
ma koniec: 1795-12-31
ma podstawę prawną w: Akt unii lubelskiej z dnia 1 lipca 1569 r.; Konstytucja 3 maja 1791 r.;
ma zasięg: terytorium Rzeczypospolitej Obojga Narodów
zobacz też obiekt: Ustawy okołokonstytucyjne Sejmu Wielkiego z 1791 i 1792 r.
zobacz też obiekt: Historia Polski 1572-1795
zobacz też obiekt: Historia państwa i prawa Polski do roku 1795, t. 1-2
zobacz też obiekt: Historia administracji nowożytnej
zobacz też obiekt: Historia ustroju i prawa polskiego
zobacz też IRI: https://www.wikidata.org/wiki/Q172107
zaczyna obowiązywać od: 1569-01-01

Elektorat Saksonii (1545-1805)
creator: Anna Orłowska
type: NamedIndividual
type: system administracji
label: The Electorate of Saxony (1545-1805) @en
kończy obowiązywać w: 1805-12-31
ma początek: 1545-01-01
ma koniec: 1805-12-31
ma zasięg: terytorium Elektoratu Saksonii, obejmuje część Łużyc leżących obecnie w Polsce (Bogatynia, Zgorzelec)
zobacz też IRI: https://www.wikidata.org/wiki/Q156199
zaczyna obowiązywać od: 1545-01-01

Gubernium Morawsko-Śląskie (1783-1848)
creator: Wiesława Duży
type: NamedIndividual
type: system administracji
label: Provincial government of Moravian-Silesian Region (1783-1848) @en
kończy obowiązywać w: 1783-01-01
ma początek: 1783-01-01
ma koniec: 1848-12-31
ma zasięg: terytorium Gubernium Morawsko-Śląskiego, obejmuje obecną ziemię cieszyńską
zobacz też obiekt: Moravskoslezské gubernium v letech 1783-1849
zobacz też obiekt: Przemiany struktur aparatu biurokratycznego na przykładzie Moraw
zobacz też obiekt: Historia ustroju społeczno-politycznego Galicji 1772-1848
zobacz też IRI: https://www.wikidata.org/wiki/Q12038643
zaczyna obowiązywać od: 1783-01-01

Królestwo Galicji i Lodomerii (1772-1848)
creator: Bogumił Szady
type: NamedIndividual
type: system administracji
comment: Edict from 11 September 1772 on establishing a geovernorate in Lvov, November-December 1773: division into 6 circles (Ger. Kreis) and 59 districts (Ger. Kreisdistricten); decree from 22 March 1782 on waiving the circles @en
comment: Edykt z 11 września 1772 r. o utworzeniu guberium we Lwowie; listopad-grudzień 1773 r: podział na 6 cyrkułów (Kreis) oraz 59 okręgów (Kreisdistricten); dekret z 22 marca 1782 r. o zniesieniu okręgów
label: The Kingdom of Galitia and Lodomeria (1772-1848) @en
kończy obowiązywać w: 1848-12-31
ma początek: 1772-01-01
ma koniec: 1848-12-31
ma podstawę prawną w: Edykt z 11 września 1772 r. o utworzeniu guberium we Lwowie; listopad-grudzień 1773 r: podział na 6 cyrkułów (Kreis) oraz 59 okręgów (Kreisdistricten); dekret z 22 marca 1782 r. o zniesieniu okręgów
ma zasięg: terytorium Galicji, bez Wolnego Miasta Krakowa w latach 1815-1846
zobacz też obiekt: Historia państwa i prawa Polski. T. 3, Od rozbiorów do uwłaszczenia
zobacz też obiekt: Ustrój i prawo Wolnego Miasta Krakowa: (1815-1846)
zobacz też obiekt: Pierwsze podziały administracyjne Galicji
zobacz też obiekt: Kancelaria organów władzy w Galicji: Wybór źródeł
zobacz też obiekt: Historia ustroju społeczno-politycznego Galicji 1772-1848
zobacz też obiekt: Galicja Zachodnia 1795-1809: Studium z dziejów ziem polskich zaboru austriackiego po III rozbiorze
zobacz też obiekt: Galizien unter österreichischer Herrschaft: Verwaltung - Kirche - Bevölkerung
zobacz też IRI: https://www.wikidata.org/wiki/Q2396442
zaczyna obowiązywać od: 1773-01-01

Królestwo Węgier (1200-1918)
creator: Bogumił Szady
type: NamedIndividual
type: system administracji
comment: The administrative division based on counties (konitat/Hun.megye) and districts (powiat/processus Hun. szolgabírói járás) had emerged in the Middle Ages since the 11th c., and despite the numerous administrative reforms is still valid. The key reforms were introduced in 1785-1790 and 1849-1860 and attempted ot centralise the adminittation within the entire Austrian monarchy. @en
comment: Ustrój terytoriualny oparty o komitaty (megye) i powiaty (processus, reambulatio, węg. szolgabírói járás) ukształtował się w średniowieczu, od XI wieku, i mimo wielu prób reform administracyjnych obowiązuje zasadniczo po dzień dzisiejszy. Najważniejsze reformy miały miejsce w latach 1785-1790, 1849-1860 i były związane z próbą centralizacji administracyjnej w ramach monarchii austriackiej.
label: the Kingom of Hungary (1200-1918) @en
kończy obowiązywać w: 1918-12-31
ma początek: 1200-01-01
ma koniec: 1918-12-31
ma podstawę prawną w: Ustrój terytoriualny oparty o komitaty (megye) i powiaty (processus, reambulatio, węg. szolgabírói járás) ukształtował się w średniowieczu, od XI wieku, i mimo wielu prób reform administracyjnych obowiązuje zasadniczo po dzień dzisiejszy. Najważniejsze reformy miały miejsce w latach 1785-1790, 1849-1860 i były związane z próbą centralizacji administracyjnej w ramach monarchii austriackiej.
ma zasięg: terytorium Królestwa Węgier, obejmuje południowe skrawki obecnej Polski, okolice Orawy i Niedzicy (dawne komitaty Spisz i Orawa)
zobacz też obiekt: Historia Węgier
zobacz też obiekt: Dzieje Węgier w zarysie, t. 2-3
zobacz też obiekt: Osadnictwo polskie na Górnych Węgrzech do początku XVIII wieku
zobacz też obiekt: Górny Spisz za panowania Władysława II Jagiełły (1386-1434)
zobacz też IRI: https://www.wikidata.org/wiki/Q171150
zaczyna obowiązywać od: 1200-01-01

Śląsk (1372-1782)
creator: Wiesława Duży
type: NamedIndividual
type: system administracji
label: Silesia (1372-1782) @en
kończy obowiązywać w: 1742-12-31
ma początek: 1372-01-01
ma koniec: 1782-12-31
ma zasięg: terytorium Śląska
zobacz też obiekt: Ustrój polityczno-prawny Śląska Austriackiego w latach 1742-1848. (Próba syntezy)
zobacz też obiekt: Granice i zmiany przynależności Śląska Cieszyńskiego do 1918 roku
zobacz też obiekt: Historyczno-Geograficzne podstawy Śląska
zobacz też obiekt: Dzieje Śląska Cieszyńskiego od zarania do czasów współczesnych
zobacz też obiekt: Historia ustroju Śląska 1202-1740
zobacz też obiekt: Slezsko - země Koruny české. Historie a kultura 1300-1740
zobacz też obiekt: The Long Formation of the Region (c. 1000-1526)
zobacz też obiekt: Terra - Ducatus - Marchionatus - Regio
zobacz też obiekt: Slezsko v dějinách českého státu, I: od pravěku do roku 1490
zobacz też obiekt: Slezsko v dějinách českého státu. II. 1490-1763
zobacz też obiekt: Polskie Górne Łużyce
zaczyna obowiązywać od: 1372-01-01

Księstwo Pomorskie (1230-1648)
creator: Witold Matwiejczyk
type: NamedIndividual
type: system administracji
comment: "Jako datę początkową przyjęto w przybliżeniu 1230 r., kiedy następuje likwidacja systemu grodów kasztelańskich i kasztelanii. W 1160 r. podział na dwie dzielnice: 1. Księstwo Szczecińskie rządzone przez Bogusława I, obejmowało południową część księstwa. W jego skład wchodziły okręgi: Szczecina, Gardźca, Bani, Cedyni, Pyrzyc, ziemia wkrzańska, Uznam, Rochów, Szczytno, Lesiany (Lassan), Groźwin, Wkryujście (Ueckermuende); 2. Księstwo Dymińskie rządzone przez Kazimierza I obejmowało pas nadbrzeża i zdobyte ziemie wieleckie. W jego skład wchodziły okręgi: Barda, Trzebudzic, Chockowa, Ostrożna (Wusterhusen), Łosic (Loitz); ziemie: bezrzecka (Beseritz), dołęska (Tolense), biezdziedzka (okolice Gnojna), stargardzka; okręgi grodowe: Dymina, Wolina, Kamienia, Trzebiatowa, Nowogardu i Stargardu nad Iną. Prawdopodobnie również Łobez i Resko. Kasztelania kołobrzeska i okręg Świdwina stanowiły współwłasność obu książąt. W latach 1180-1214 zjednoczenie obu księstw. W 1181 r. Księstwo Pomorskie w bezpośredniej zależności lennej jako księstwo Rzeszy. W 1214 r. rozpad na dwa księstwa dzielnicowe: nadmorskie Księstwo Wołogojskie (północne) i śródlądowe Księstwo Szczecińskie (południowe) oraz władztwo terytorialne biskupów kamieńskich obejmujące ziemię kołobrzeską, koszalińską, bobolicką (od 1339) oraz pas między Sianowem i Polanowem (od 1348). W 1250 r. władcy obu księstw składają hołd lenny i otrzymują w lenno od margrabiów brandenburskich całe Pomorze. W latach 1264-1295 zjednoczenie w jedno Księstwo Pomorskie. W 1295 r. kolejny rozpad na Księstwo Wołogojskie i Księstwo Szczecińskie. Od połowy XIV w. dalsze podziały na mniejsze księstwa dzielnicowe. W 1348 r. Karol IV jako król rzymski nadaje inwestyturę książętom pomorskim bez dodatkowych ograniczeń – księstwa pomorskie stają się lennami Rzeszy. W latach 1478-1531 zjednoczenie w jedno Księstwo Pomorskie. W 1531 r. podział na Księstwo Szczecińskie i Księstwo Wołogojskie. W 1625 r. zjednoczenie w jedno Księstwo Pomorskie, zaś po po…
comment: 1230, when the system of castellanies was abolished is assumed as a starting point. In 1160 – the division into two provinces: 1. The Duchy of Stettin ruled by Bogusław I covering the southern part of the Duchy of Pomerania. It included the districts of Stettin, Gardźca, Bania, Cedynia, Pyrzyce, Wkra lands, Uznam, Rochów, Szczytno, Lassan, Goźwin, Wkryujście (Ueckermünde); 2. The Duchy of Demmin ruled by Kazimierz I covering the coastal region and the regained Veleti lands (Pl. ziemie wieleckie). It included the following regions: Bardo, Trzebudzice, Chockowo, Ostrożno, Wusterhusen), Łosice (Loitz); Bezrzecze (Beseritz) lands, Dołęża (Tolense) lands, Bieździedza lands (near Gnojno), Starogard lands; and gord districts: Dymin, Wolin, Kamień, Trzebiatów, Nowogard and Stargardu, as well as, probably, Łobez and Resko. The Kołobrzeg castellany and Swidwina district belonged to both of the dukes simultaneously. In 1180-1214 the two Duchies were joined and in 1181 the Duchy of Pomerania was a direct vassal to the German Empire. In 1214 it divided into two provinces (duchies): Wołogoszcz (north) and Stettin (south) as well as the territory of the diocese of Kamieniec Podolski including the Kołobrzeg, Koszalin, and Bobolice (since 1339) lands, as well as the belt between Sianowo and Polanowo (since 1348). IN 1250 the rules of the two Duchies pay fealty to Margraviate of Brandenburg receiving the entire Pomerania.In years 1264-1295 the two Duchies were unified.In 1295 another fragmentation into Wołogoszcz and Stetin Duchy. Since the second half of the 14th c the following feudal fragmentation resulted into division into smaller principalities.In 1348 Karol IV grants full fiefdom to the Pomeranian Dukes- the Duchy of Pomerania becomes a vassal to the German Empire.In 1478-1531 - the two duchies are unified into one Duchy of Pomerania. 1531 division into Stettin Duchy and Wołogoszcz Duchy. 1625 – unification into the Duchy of Pomerania again, after the Peace of Westphalia in 16… @en
label: The Duchy of Pomerania (1230-1648) @en
kończy obowiązywać w: 1648-12-31
ma początek: 1230-01-01
ma koniec: 1648-12-31
ma zasięg: terytorium Księstwa Pomorskiego, obejmuje obecne obszary Pomorza Zachodniego
zobacz też obiekt: Deutsche Verwaltungsgeschichte
zobacz też obiekt: Historia Pomorza, t. I do roku 1466...
zaczyna obowiązywać od: 1250-01-01

Marchia Brandenburska (1540-1713)
creator: Witold Matwiejczyk
type: NamedIndividual
type: system administracji
comment: W 1535 Nowa Marchia przeszła pod panowanie margrafa Jana i jako wydzielona prowincja uzyskała odrębną strukturę administracyjną (patrz. Nowa Marchia). Ponownie włączona w 1571 zachowała jednak swoją odrębność administracyjną. Po przejściu na luteranizm (1.11.1539) w roku następnym stany państwa brandenburskiego przejęły spłatę elektorskich długów i same utworzyły organ kontrolny i wykonawczy do sciągania danin i podatków.
label: The Margraviate of Branderburg (1540-1713) @en
kończy obowiązywać w: 1713-12-31
ma początek: 1540-01-01
ma koniec: 1713-12-31
ma podstawę prawną w: Hofordnung 1537, Kanzleiordnungen 1537, 1562, 1577; Geheime-Rats-Ordnung 13.12.1604
ma zasięg: terytorium Marchii Brandenburskiej, obejmuje obecne ziemie zachodniej Polski
zobacz też obiekt: Deutsche Verwaltungsgeschichte
zobacz też obiekt: Dzieje Brandenburgii-Prus. Na progu czasów nowożytnych (1500-1701)
zobacz też IRI: https://www.wikidata.org/wiki/Q148499
zaczyna obowiązywać od: 1550-01-01

Księstwo Siewierskie (1443-1790)
creator: Tomasz Związek
type: NamedIndividual
type: system administracji
label: The Duchy of Siewierz (1443-1790) @en
kończy obowiązywać w: 1790-12-31
ma początek: 1443-01-01
ma koniec: 1790-12-31
ma zasięg: terytorium Księstwa Siewierskiego, obejmuje obecnie okolice miast Siewierz, Czeladź i Koziegłowy
zobacz też obiekt: Dzieje ustroju i prawa księstwa siewierskiego
zobacz też obiekt: Siewierz
zobacz też obiekt: Księstwo Siewierskie. Prawo i ustrój a zakres suwerenności względem Korony Królestwa Polskiego
zaczyna obowiązywać od: 1443-01-01

Marchia Brandenburska (1323-1540)
creator: Witold Matwiejczyk
type: NamedIndividual
type: system administracji
comment: In 1320, the dynasty of the house of Ascan had come to an end and the power moved to the house of Wittelsbach and Luxemburg. The emperor Luis IV Wittelsbach grants the Marach to his son Luis V the Brandenburger @en
comment: W 1320 r. wygasła dynastia askańczyków. Władzę w Marchii przejmują Wittelsbachowie i Luksemburgowie. Po wygaśnięciu dynastii Askańczyków cesarz Ludwik Wittelsbach nadaje marchię swemu synowi Ludwikowi
label: The Margraviate of Branderburg (1323-1540) @en
alternative label: Marquisate of Brandenburg @en
kończy obowiązywać w: 1540-12-31
ma początek: 1323-01-01
ma koniec: 1550-12-31
ma podstawę prawną w: Landbuch der Mark Brandenburg 1375 i następne decyzje margrafów
ma zasięg: terytorium Marchii Brandenburskiej, obejmuje obecne ziemie zachodniej Polski
zobacz też obiekt: Deutsche Verwaltungsgeschichte
zobacz też IRI: https://www.wikidata.org/wiki/Q148499
zaczyna obowiązywać od: 1350-01-01

System średniowieczny (do XIV w.)
creator: Tomasz Związek
type: NamedIndividual
type: system administracji
comment: Data umowna, koniec panowania Piastów, ostateczne przejście Śląska w ręce czeskie (1372), unia w Krewie (1385 r.), podział Rusi Halicko-Włodzimierskiej (1387)
comment: The approximate date marks the end of the Piasts' rule, the final Chech rule in Sląsk (1372), Union of Krevo (1385), division of Kingdom of Valitia-Volhynia (1387). @en
kończy obowiązywać w: 1370-12-31
ma początek: 1000-01-01
ma koniec: 1370-12-31
ma zasięg: terytorium obecnej Polski
zaczyna obowiązywać od: 1000-01-01

Państwo Krzyżackie (1226-1525)
creator: Wiesława Duży
bildet Teil von: Kościół katolicki ob. łacińskiego
type: NamedIndividual
type: system administracji
comment: Częściowo, w sprawach związanych z działalnością zakonną, podległość Stolicy Apostolskiej
comment: Plemiona pruskie nie wytworzyły państwowości i administracji terytorialnej przed XIII w.: W. Długokęcki, Prusy w starożytności i we wczesnym średniowieczu, [w:] M. Biskup, i in., Państwo zakonu krzyżackiego w Prusach. Władza i społeczeństwo, Warszawa 2008, s. 38-39, 43: "Mniejsza niż plemię jednostka terytorialna nosiła nazwę territorium (Dusburg), a także terrula, districtus. W literaturze określa się ją też jako włość, mała ziemia lub używa pruskiej nazwy pulka. [...] Podstawową jednostkę osadniczą stanowiło pole (prus. lauks, łac. campus, niem. Feld). Tworzyło ono topograficzno-gospodarczą całość, bez wytyczonych granic linearnych [...] Obraz ustroju politycznego Estów i Prusów przekazany przez źródła IX-XIII w. wyraźnie wskazuje na rozdrobnienie polityczne i brak silnych ośrodków władzy publicznej. Zasadnicze znaczenie miały wiece różnych struktur terytorialnych (prus. wayde, waite). W XIII w. funkcjonowały wiece międzyplemienne, plemienne i na poziomie małej ziemi. Wzmianki o wiecach z XIII w. dotyczą przede wszystkim wieców wojennych [...]". R. Czaja, i in. [w:] ibidem, s. 75-76: "Przywilej chełmiński, będący formalnie dokumentem lokacyjnym Chełmna i Torunia, w rzeczywistości pełnił funkcję przywileju "krajowego". Niektóre bowiem przepisy w nim zawarte dotyczyły także rycerzy (np. te, które odnosiły się do statusu prawnego dóbr obciążonych służbą wojskową), postanowienia zaś odnoszące się do monety, wymiaru łana, zwolnień celnych, wolnego targu obejmowały wszystkich mieszkańców ziemi chełmińskiej. Prawo chełmińskie służyło wyodrębnieniu z władztwa księcia Konrada obszaru poddanego kontroli Zakonu: tam, gdzie były stosowane postanowienia przywileju, sięgała władza Krzyżaków". 1309 - zajęcie Pomorza Gdańskiego, przeniesienie siedziby wielkiego mistrza zakonnego do Malborka (mimo że nie było jeszcze wtedy jasne czy Malbork zostanie stolicą państwa). 1466 - inkorporacja ziem pruskich do Korony przez króla Kazimierz Jagiellończyka doprowadziła do wybuchu wojny trzy…
label: The State of the Teutonic Order (1226-1525) @en
kończy obowiązywać w: 1466-12-31
ma początek: 1233-01-01
ma koniec: 1525-12-31
ma podstawę prawną w: Przywilej chełmiński 1233, statuty zakonu, akt inkorporacji ziem pruskich z 6 marca 1454; traktat toruński z 1466; traktat krakowski z 1525
ma zasięg: terytorium państwa zakonnego, obejmuje obecne obszary północnej Polski (Pomorze, Warmia i Mazury)
zobacz też obiekt: Władztwo Polski w Prusiech Zakonnych i Książęcych
zobacz też obiekt: Struktura administracyjna i własnościowa Pomorza Gdańskiego pod rządami zakonu krzyżackiego w latach 1309-1454
zobacz też obiekt: Gerard Labuda, Dzieje zakonu krzyżackiego w Prusach. Gospodarka-Społeczeństwo-Pańswo-Ideologia
zobacz też obiekt: Państwo zakonu krzyżackiego w Prusach. Władza i społeczeństwo
zobacz też obiekt: Zakon Krzyżacki w Prusach i Inflantach. Podziały admiinistracyjne i kościelne w XIII-XVI wieku
zobacz też obiekt: A. Radzimiński, Die Kirche im Deutschordensstaat in Preussen...
zobacz też obiekt: A. Radzimiński, Biskupstwa państwa krzyżackiego...
zaczyna obowiązywać od: 1309-01-01

Kościół katolicki ob. łacińskiego
bildet Teil von: Stolica Apostolska
type: NamedIndividual
type: system administracji
label: Latin Church @en
alternative label: Kościół rzymskokatolicki
alternative label: Roman Catholic Church @en
kończy obowiązywać w: 1939-12-31
ma początek: 1000-01-01
ma koniec: 1939-12-31
ma zasięg: terytorium Polski
jest utworzony przez: obrządek łaciński
jest utworzony przez: religia chrześcijańska
jest utworzony przez: wyznanie katolickie
zobacz też obiekt: Dekanat
zobacz też obiekt: Archidiakonat
zobacz też obiekt: Diecezja
zobacz też obiekt: Parafia
zobacz też obiekt: Granice metropolii i diecezji polskich 966-1939
zobacz też obiekt: Ustrój i organizacja Kościoła polskiego w okresie niewoli narodowej: (1772-1918)
zobacz też obiekt: Atlas Kościoła łacińskiego w Rzeczypospolitej Obojga Narodów w XVIII wieku
zobacz też obiekt: Kościół łaciński w Rzeczypospolitej około 1772 roku: Struktury administracyjne
zobacz też obiekt: Struktury religijne na przykładzie „Atlasu wyznań i religii w Rzeczypospolitej w drugiej połowie XVIII w.
zobacz też obiekt: Geografia struktur religijnych i wyznaniowych w Koronie w II połowie XVIII wieku
zobacz też obiekt: Parish
zobacz też IRI: Latin Church
zobacz też IRI: Q597526
zaczyna obowiązywać od: 1000-01-01

Kościół katolicki ob. greckiego
bildet Teil von: Stolica Apostolska
type: NamedIndividual
type: system administracji
label: Greek Catholic Church @en
alternative label: Kościół greckokatolicki
alternative label: Kościół unicki
alternative label: Uniate Church @en
kończy obowiązywać w: 1939-12-31
ma początek: 1596-01-01
ma koniec: 1939-12-31
ma podstawę prawną w: 1596, akt unii brzeskiej; 1720, synod w Zamościu
ma zasięg: terytorium Polski, zwłaszcza wschodniej
jest utworzony przez: grecki
jest utworzony przez: religia chrześcijańska
jest utworzony przez: wyznanie katolickie
zobacz też obiekt: Dekanat
zobacz też obiekt: Archidiakonat
zobacz też obiekt: Diecezja
zobacz też obiekt: Parafia
zobacz też obiekt: Struktury religijne na przykładzie „Atlasu wyznań i religii w Rzeczypospolitej w drugiej połowie XVIII w.
zobacz też obiekt: Geografia struktur religijnych i wyznaniowych w Koronie w II połowie XVIII wieku
zobacz też obiekt: Ènciklopedičeskij slovarʹ Brokgauza i Efrona
zobacz też obiekt: Organizacja Kościoła wschodniego w Polsce
zobacz też obiekt: Kościoły wschodnie w Rzeczypospolitej około 1772 roku: Struktury administracyjne
zobacz też obiekt: Kościoły wschodnie na ziemiach dawnej Rzeczypospolitej 1772-1914: Rozprawa habilitacyjna
zobacz też obiekt: Protopope
zobacz też obiekt: Schism and Russia’s Old Believers
zobacz też IRI: Category:Uniate Church in the Polish–Lithuanian Commonwealth
zobacz też IRI: Greek-Catholic-church
zobacz też IRI: Q51077355
zobacz też IRI: Q9539355
zaczyna obowiązywać od: 1596-01-01

Kościół prawosławny
type: NamedIndividual
type: system administracji
label: Orthodox Church @en
kończy obowiązywać w: 1939-12-31
ma początek: 1000-01-01
ma koniec: 1939-12-31
ma zasięg: terytorium Polski, zwłaszcza wschodniej
jest utworzony przez: religia chrześcijańska
jest utworzony przez: wyznanie prawosławne
zobacz też obiekt: Struktury religijne na przykładzie „Atlasu wyznań i religii w Rzeczypospolitej w drugiej połowie XVIII w.
zobacz też obiekt: Geografia struktur religijnych i wyznaniowych w Koronie w II połowie XVIII wieku
zobacz też obiekt: Ènciklopedičeskij slovarʹ Brokgauza i Efrona
zobacz też obiekt: Organizacja Kościoła wschodniego w Polsce
zobacz też obiekt: Kościoły wschodnie w Rzeczypospolitej około 1772 roku: Struktury administracyjne
zobacz też obiekt: Kościoły wschodnie na ziemiach dawnej Rzeczypospolitej 1772-1914: Rozprawa habilitacyjna
zobacz też obiekt: Kościół prawosławny na ziemiach polskich w XIX i XX wieku
zobacz też obiekt: Kościół prawosławny a Rzeczpospolita Polska: Zarys historyczny 1370-1632
zobacz też obiekt: Kościoły wschodnie w państwie polsko-litewskim w procesie przemian i adaptacji: Metropolia kijowska w latach 1458-1795
zobacz też IRI: Eastern Orthodox Church
zobacz też IRI: Polish Orthodox Church
zobacz też IRI: http://vocab.getty.edu/aat/300022034
zobacz też IRI: Q35032
zobacz też IRI: Q463406
zaczyna obowiązywać od: 1000-01-01

Kościół ewangelicko-augsburski w Rzeczypospolitej Obojga Narodów
type: NamedIndividual
type: system administracji
label: Evangelical Augsburg Church in the Polish-Lithuanian Commonwealth @en
alternative label: Kościół luterański w Rzeczypospolitej Obojga Narodów
alternative label: Lutheran Church in the Polish-Lithuanian Commonwealth @en
kończy obowiązywać w: 1772-12-31
ma początek: 1565-01-01
ma koniec: 1795-12-31
ma zasięg: Wielkopolska i Litwa, luteranie w Małopolsce i w Prusach Królewskich nie wytworzyli własnej struktury organizacyjnej
jest utworzony przez: ewangelicko-augsburski
jest utworzony przez: religia chrześcijańska
jest utworzony przez: wyznanie protestanckie
zobacz też obiekt: Struktury religijne na przykładzie „Atlasu wyznań i religii w Rzeczypospolitej w drugiej połowie XVIII w.
zobacz też obiekt: Geografia struktur religijnych i wyznaniowych w Koronie w II połowie XVIII wieku
zobacz też obiekt: Ewangelicy polscy i litewscy w epoce saskiej (1696-1763): Sytuacja prawna, organizacja i stosunki międzywyznaniowe
zobacz też obiekt: Kancelarie i dokumenty Kościołów protestanckich w XVI-XVIII wieku
zobacz też obiekt: Kościoły luterańskie na ziemiach polskich (XVI - XX w.)
zobacz też obiekt: Kneifel, E.
zobacz też obiekt: Die evangelisch-augsburgischen Gemeinden in Polen 1555-1939: Eine Parochialgeschichte in Einzeldarstellungen
zobacz też IRI: Evangelical Church of the Augsburg Confession in Poland
zobacz też IRI: Q1379796
zaczyna obowiązywać od: 1565-01-01

Rzeczpospolita Polska (1999-2016)
creator: Bogumił Szady
type: NamedIndividual
type: system administracji
comment: This administration system is introduced for the auxiliary purposes, has no historical value and is currently used. @en
comment: Wprowadzenie tego systemu ma rolę pomocniczą, nie ma on charakteru historycznego i jest współcześnie obowiązujący
label: The Republic of Poland (1999-2016) @en
kończy obowiązywać w: 2016-12-21
ma początek: 1999-01-01
ma koniec: 2016-12-31
ma podstawę prawną w: Ustawa z dnia 24 lipca 1998 r. o wprowadzeniu zasadniczego trójstopniowego podziału terytorialnego państwa (Dz.U. z 1998 r. Nr 96, poz. 603)
ma zasięg: terytorium III RP
zobacz też obiekt: Państwowe, administracyjne, wojskowe i wyznaniowe podziały terytorialne na ziemiach polskich: (zarys dziejów)
zobacz też obiekt: Ustrój terytorialny państwa a decentralizacja systemu władzy publicznej
zobacz też obiekt: Podział terytorialny Rzeczypospolitej - spojrzenie krytyczne
zobacz też obiekt: Gminny podział administracyjny w świetle 25 lat funkcjonowania samorządu terytorialnego w Polsce
zobacz też obiekt: Nowa organizacja terytorialna Polski i układ regionalny
zobacz też obiekt: Podział kraju na województwa: Próba obiektywizacji
zobacz też obiekt: Zasady podziału terytorialnego państwa na szczeblu regionalnym. Próba uporządkowania i zastosowania na przykładzie Polski
zobacz też obiekt: Decentralisation and regionalisation after communism: administrative and territorial reform in Poland and the Czech Republic
zobacz też IRI: https://www.wikidata.org/wiki/Q36
zaczyna obowiązywać od: 1999-01-01

Jednota Braci Czeskich w Polsce
type: NamedIndividual
type: system administracji
label: Unity of Brethren in Poland @en
alternative label: Kościół braci czeskich w Rzeczypospolitej Obojga Narodów
alternative label: The Czech Brethren in the Polish-Lithuanian Commonwealth @en
kończy obowiązywać w: 1645-12-31
ma początek: 1560-01-01
ma koniec: 1645-12-31
ma zasięg: Wielkopolska
jest utworzony przez: czesko-braterski
jest utworzony przez: religia chrześcijańska
jest utworzony przez: wyznanie protestanckie
zobacz też obiekt: Struktury religijne na przykładzie „Atlasu wyznań i religii w Rzeczypospolitej w drugiej połowie XVIII w.
zobacz też obiekt: Geografia struktur religijnych i wyznaniowych w Koronie w II połowie XVIII wieku
zobacz też obiekt: Ewangelicy polscy i litewscy w epoce saskiej (1696-1763): Sytuacja prawna, organizacja i stosunki międzywyznaniowe
zobacz też obiekt: Kancelarie i dokumenty Kościołów protestanckich w XVI-XVIII wieku
zobacz też obiekt: Bracia czescy w Wielkopolsce w XVI i XVII wieku
zobacz też obiekt: Ustroje kościołów ewangelicko‑reformowanych w Rzeczypospolitej Obojga Narodów na przełomie XVI i XVII wieku
zobacz też obiekt: Bracia czescy a kalwini w Rzeczypospolitej, połowa XVI - połowa XVII wieku: Studium porównawcze
zobacz też IRI: Unity of the Brethren
zobacz też IRI: Q1019741
zaczyna obowiązywać od: 1560-01-01

Kościół kalwiński w Rzeczypospolitej Obojga Narodów
type: NamedIndividual
type: system administracji
label: Calvinist Church in the Polish-Lithuanian Commonwealth @en
alternative label: Evangelical Reformed Church in the Polish-Lithuanian Commonwealth @en
alternative label: Kościół ewangelicko-reformowany w Rzeczypospolitej Obojga Narodów
kończy obowiązywać w: 1795-12-31
ma początek: 1560-01-01
ma koniec: 1795-12-31
ma zasięg: Małopolska i Wielkie Księstwo Litewskie
jest utworzony przez: ewangelicko-reformowany
jest utworzony przez: religia chrześcijańska
jest utworzony przez: wyznanie protestanckie
zobacz też obiekt: Struktury religijne na przykładzie „Atlasu wyznań i religii w Rzeczypospolitej w drugiej połowie XVIII w.
zobacz też obiekt: Geografia struktur religijnych i wyznaniowych w Koronie w II połowie XVIII wieku
zobacz też obiekt: Ewangelicy polscy i litewscy w epoce saskiej (1696-1763): Sytuacja prawna, organizacja i stosunki międzywyznaniowe
zobacz też obiekt: Kancelarie i dokumenty Kościołów protestanckich w XVI-XVIII wieku
zobacz też obiekt: Bracia czescy w Wielkopolsce w XVI i XVII wieku
zobacz też obiekt: Ustroje kościołów ewangelicko‑reformowanych w Rzeczypospolitej Obojga Narodów na przełomie XVI i XVII wieku
zobacz też obiekt: Bracia czescy a kalwini w Rzeczypospolitej, połowa XVI - połowa XVII wieku: Studium porównawcze
zobacz też obiekt: Kościoły ewangelickie na Kresach Wschodnich II Rzeczypospolitej
zobacz też obiekt: Litewska jednota ewangelicko-reformowana od połowy XVII w. do 1939 r.
zobacz też IRI: Polish Reformed Church
zobacz też IRI: Q7209974
zaczyna obowiązywać od: 1560-01-01

Kościół ewangelicko-augsburski w Prusach 1525-1817
type: NamedIndividual
type: system administracji
comment: Pominięte zostały dość dynamiczne zmiany dotyczące rozwoju struktur luterańskich na ziemiach polskich w latach 1772-1828 (w tym na obszarze Księstwa Warszawskiego), związane z włączaniem ich do systemu państw zaborczych (zob. A. Rhode). Reforma Steina, czyli patenty królewskie z 16 i 26 grudnia 1808 wprowadzały kontrole państwa nad strukturami kościołów ewangelickich. Zniesiono luterańskie Oberkonsistorium i Konsistorien w prowincjach, oraz reformierte Kirchendirktorium.
comment: Toeppen 287: w miejsce dwóch diecezji pruskich powołano w 1587 r. dwa konsystorze: dla części sambijskiej w Królewcu zaś dla części pomezańskiej w Zalewie; konsystorz, lub jego odpowiednik generalna superintendetura był podzielony na inspekcje (Inspektion, Erzpriestertum, Superintendentur). W 1750 r. powstał nadkonsystorz w Berlinie, któremu zostały podporządkowane konsystorze sambijski i pomezański. W roku następnym zostały połączone w oba konsystorze w jeden konsystorz prowincjonalny dla Prus Wschodnich, podlegający nadkonsystorzowi w Berlinie; podobnie wg. Harnoch XXV
label: Evangelical Augsburg Church in Prussia 1525-1817 @en
alternative label: Evangelical Church of the Augsurg Confession in Prussia 1525-1817 @en
kończy obowiązywać w: 1808-12-31
ma początek: 1525-01-01
ma koniec: 1817-12-31
ma zasięg: Prusy, Pomorze, Śląsk
jest utworzony przez: ewangelicko-augsburski
jest utworzony przez: religia chrześcijańska
jest utworzony przez: wyznanie protestanckie
zobacz też obiekt: Struktury religijne na przykładzie „Atlasu wyznań i religii w Rzeczypospolitej w drugiej połowie XVIII w.
zobacz też obiekt: Geografia struktur religijnych i wyznaniowych w Koronie w II połowie XVIII wieku
zobacz też obiekt: Kneifel, E.
zobacz też obiekt: Historisch-comparative Geographie von Preussen
zobacz też obiekt: Chronik und Statistik der evangelischen Kirchen in den Provinzen Ost- und Westpreussen
zobacz też obiekt: Geschichte der evangelischen Kirche Ostpreussens
zobacz też obiekt: Die kirchliche Organisation um 1785
zobacz też obiekt: Śląsk w końcu XVIII wieku
zobacz też obiekt: Historia protestantyzmu w Polsce: Od połowy XVIII wieku do pierwszej wojny światowej
zaczyna obowiązywać od: 1587-01-01

Kościół ewangelicko-reformowany w Prusach 1713-1817
type: NamedIndividual
type: system administracji
comment: Pominięte zostały dość dynamiczne zmiany dotyczące rozwoju struktur luterańskich na ziemiach polskich w latach 1772-1828 (w tym na obszarze Księstwa Warszawskiego), związane z włączaniem ich do systemu państw zaborczych. Reforma Steina, czyli patenty królewskie z 16 i 26 grudnia 1808 wprowadzały kontrole państwa nad strukturami kościołów ewangelickich. Zniesiono luterańskie Oberkonsistorium i Konsistorien w prowincjach, oraz reformierte Kirchendirktorium.
label: Evangelical Reformed Church in Prussia 1713-1817 @en
label: Reformierte Kirche in Preußen 1713-1817 @de
kończy obowiązywać w: 1808-12-31
ma początek: 1713-01-01
ma koniec: 1817-12-31
ma zasięg: Prusy, Pomorze, Śląsk
jest utworzony przez: ewangelicko-reformowany
jest utworzony przez: religia chrześcijańska
jest utworzony przez: wyznanie protestanckie
zobacz też obiekt: Struktury religijne na przykładzie „Atlasu wyznań i religii w Rzeczypospolitej w drugiej połowie XVIII w.
zobacz też obiekt: Geografia struktur religijnych i wyznaniowych w Koronie w II połowie XVIII wieku
zobacz też obiekt: Historisch-comparative Geographie von Preussen
zobacz też obiekt: Chronik und Statistik der evangelischen Kirchen in den Provinzen Ost- und Westpreussen
zobacz też obiekt: Geschichte der evangelischen Kirche Ostpreussens
zobacz też obiekt: Die kirchliche Organisation um 1785
zobacz też obiekt: Śląsk w końcu XVIII wieku
zobacz też obiekt: Historia protestantyzmu w Polsce: Od połowy XVIII wieku do pierwszej wojny światowej
zobacz też obiekt: Im Blickpunkt der Geschichte der Reformation: Evangelisch-Reformierte in (Ost-)Preußen
zobacz też IRI: Q48968279
zaczyna obowiązywać od: 1713-01-01

Kościół ewangelicki w Prusach 1817-1939
type: NamedIndividual
type: system administracji
comment: Reforma Steina, czyli patenty królewskie z 16 i 26 grudnia 1808 wprowadzały kontrole państwa nad strukturami kościołów ewangelickich. Zniesiono luterańskie Oberkonsistorium i Konsistorien w prowincjach, oraz reformierte Kirchendirktorium. W ich miejsce powołano Wydział Wyznań (Kultussektion) w ministerstwie spraw wewnętrznych jako najwyższy organ administracji kościelnej. W 1817 roku wydział ten przeniesiono do ministerstwa wyznań. Na poziomie nowo utworzonych rejencji powstają wydziały szkolne i kościelne, które administrują sprawami kościelnymi w następstwie dawnych konsystorzy prowincjonalnych. W 1815 roku powrócono do konsystorzy prowincjonalnych, które były jednak organami administracji państwowej. Od 1828 roku dla każdej prowincji był Generalsuperintendent, któremu przypadała władza podobna do biskupiej, ale nie miał tytułu biskupa.
label: Evangelical Church in Prussia 1817-1939 @en
label: Evangelische Kirche in Preußen 1817-1939 @de
hidden label: Evangelische Kirche der altpreußischen Union, 1875-1922 @de
hidden label: Evangelische Kirche in Preußen, 1821-1845 @de
hidden label: Evangelische Landeskirche der älteren Provinzen Preußens, 1922-1953 @de
hidden label: Evangelische Landeskirche in Preußen, 1845-1875 @de
kończy obowiązywać w: 1939-12-31
ma początek: 1808-01-01
ma koniec: 1939-12-31
ma zasięg: Prusy
jest utworzony przez: ewangelicki
jest utworzony przez: religia chrześcijańska
jest utworzony przez: wyznanie protestanckie
zobacz też obiekt: Historisch-comparative Geographie von Preussen
zobacz też obiekt: Chronik und Statistik der evangelischen Kirchen in den Provinzen Ost- und Westpreussen
zobacz też obiekt: Geschichte der evangelischen Kirche Ostpreussens
zobacz też obiekt: Historia protestantyzmu w Polsce: Od połowy XVIII wieku do pierwszej wojny światowej
zobacz też obiekt: Niemcy w Polsce w XX wieku
zobacz też obiekt: Protestantyzm w Poznańskiem 1815-1918
zobacz też IRI: German Evangelical Church
zobacz też IRI: Prussian Union of churches
zobacz też IRI: Q1202401
zobacz też IRI: Q163202
zaczyna obowiązywać od: 1821-01-01

Kościół ewangelicki w Królestwie Polskim 1828-1849
type: NamedIndividual
type: system administracji
comment: Pominięte zostały dość dynamiczne zmiany dotyczące rozwoju struktur luterańskich na ziemiach polskich w latach 1772-1828 (w tym na obszarze Księstwa Warszawskiego), związane z włączaniem ich do systemu państw zaborczych oraz tendencjami unijnymi (próby powołania wspólnego konsystorza dla luteran i reformowanych).
label: Evangelical Church in Kingdom of Poland 1828-1849 @en
kończy obowiązywać w: 1849-12-31
ma początek: 1828-01-01
ma koniec: 1849-12-31
ma zasięg: Królestwo Polskie
jest utworzony przez: ewangelicki
jest utworzony przez: religia chrześcijańska
jest utworzony przez: wyznanie protestanckie
zobacz też obiekt: Kościoły ewangelickie na Kresach Wschodnich II Rzeczypospolitej
zobacz też obiekt: Kneifel, E.
zobacz też obiekt: Die evangelisch-augsburgischen Gemeinden in Polen 1555-1939: Eine Parochialgeschichte in Einzeldarstellungen
zobacz też obiekt: Historia protestantyzmu w Polsce: Od połowy XVIII wieku do pierwszej wojny światowej
zobacz też obiekt: Polacy-ewangelicy w Królestwie Polskim 1815-1914: Kształtowanie sie środowisk ich działalność społeczna i narodowa
zaczyna obowiązywać od: 1828-01-01

Kościół ewangelicko-augsburski w Polsce 1849-1939
type: NamedIndividual
type: system administracji
comment: pominięty został wąski skrawek na wschodzie należący do Rosji (konsystorz kurlandzki i petersburski); tamtejsze struktury Kościoła luterańskiego oparte były na przepisach rosyjskich z 1832 r. ale niewiele różniły się od tych obowiązujących z Królestwie od 1849 r.; jedna z różnic polegała na tym, że w Rosji były dwa typy konsystorzy: szereg prowincjonalnych i jeden generalny w Petersburgu
label: Evangelical Augsburg Church in Poland 1849-1939 @en
kończy obowiązywać w: 1936-12-31
ma początek: 1849-01-01
ma koniec: 1939-12-31
ma podstawę prawną w: Ustawa z 1849 r.; 25 listopada 1936, dekret Prezydenta RP: "co spowodowały zmiany w tytulaturze i nazewnictwie poszczególnych zwierzchników i ich jednostek kościelnych" (Kłaczkow, s. 42), trudno więc to uznać za zmianę ustroju kościoła ewangelickiego.
ma zasięg: Królestwo Polskie, II Rzeczpospolita
jest utworzony przez: ewangelicko-augsburski
jest utworzony przez: religia chrześcijańska
jest utworzony przez: wyznanie protestanckie
zobacz też obiekt: Kościoły ewangelickie na Kresach Wschodnich II Rzeczypospolitej
zobacz też obiekt: Kneifel, E.
zobacz też obiekt: Die evangelisch-augsburgischen Gemeinden in Polen 1555-1939: Eine Parochialgeschichte in Einzeldarstellungen
zobacz też obiekt: Historia protestantyzmu w Polsce: Od połowy XVIII wieku do pierwszej wojny światowej
zobacz też obiekt: Polacy-ewangelicy w Królestwie Polskim 1815-1914: Kształtowanie sie środowisk ich działalność społeczna i narodowa
zobacz też obiekt: Kościół Ewangelicko-Augsburski w Polsce w latach 1918-1939
zobacz też IRI: Evangelical Church of the Augsburg Confession in Poland
zobacz też IRI: Q1379796
zaczyna obowiązywać od: 1849-01-01

Kościół ewangelicko-reformowany w Polsce 1849-1939
type: NamedIndividual
type: system administracji
label: Evangelical Reformed Church in Poland 1849-1939 @en
kończy obowiązywać w: 1936-12-31
ma początek: 1849-01-01
ma koniec: 1939-12-31
ma zasięg: Królestwo Polskie, II Rzeczpospolita
jest utworzony przez: ewangelicko-reformowany
jest utworzony przez: religia chrześcijańska
jest utworzony przez: wyznanie protestanckie
zobacz też obiekt: Kościoły ewangelickie na Kresach Wschodnich II Rzeczypospolitej
zobacz też obiekt: Litewska jednota ewangelicko-reformowana od połowy XVII w. do 1939 r.
zobacz też obiekt: Historia protestantyzmu w Polsce: Od połowy XVIII wieku do pierwszej wojny światowej
zobacz też obiekt: Polacy-ewangelicy w Królestwie Polskim 1815-1914: Kształtowanie sie środowisk ich działalność społeczna i narodowa
zobacz też obiekt: Organizacja kościoła ewangelicko-reformowanego w b. zaborze rosyjskim
zobacz też IRI: Polish Reformed Church
zobacz też IRI: Q7209974
zaczyna obowiązywać od: 1849-01-01

Kościół ewangelicki w Galicji 1781-1918
type: NamedIndividual
type: system administracji
kończy obowiązywać w: 1918-12-31
ma początek: 1781-01-01
ma koniec: 1918-12-31
ma podstawę prawną w: Od 1861 r. powołany oficjalnie
ma zasięg: Galicja
jest utworzony przez: ewangelicki
jest utworzony przez: religia chrześcijańska
jest utworzony przez: wyznanie protestanckie
zaczyna obowiązywać od: 1781-01-01

Żydzi w Rzeczypospolitej Obojga Narodów
type: NamedIndividual
type: system administracji
kończy obowiązywać w: 1764-12-31
ma początek: 1623-01-01
ma koniec: 1764-12-31
ma zasięg: terytorium obecnej Polski
jest utworzony przez: religia mojżeszowa
zaczyna obowiązywać od: 1623-01-01

Wolne Państwo Prusy (1920-1945)
creator: Witold Matwiejczyk
type: NamedIndividual
type: system administracji
comment: "Verordnung wegen verbesserter Einrichtung der Provinzial- Polizei- und Finanzbehörden vom 26. Dezember 1808 (GS S. 481). Städteordnung 1808, 1831, 1853. Verordnung wegen verbesserter Einrichtung der Provinzial-Behörden vom 30. April 1815 (GS S. 85). Gesetz über Verpflichtung zur Armenpflege vom 31.Dez. 1842. Kreisordnung für die östlichen 6 Provinzen vom 13. Dez. 1872." @de
comment: 1920-1933 Wolne Państwo Prusy jako państwo członkowskie Republiki Związkowej. 1933-1945 Wolne Państwo Prusy jako państwo członkowskie III Rzeszy.
label: Freistaat Preußen @de
label: The Free State of Prussia @en
kończy obowiązywać w: 1945-12-31
ma początek: 1920-01-01
ma koniec: 1945-12-31
ma podstawę prawną w: Verordnung wegen verbesserter Einrichtung der Provinzial- Polizei- und Finanzbehörden vom 26. Dezember 1808 (GS S. 481); Städteordnung 1808, 1831, 1853; Verordnung wegen verbesserter Einrichtung der Provinzial-Behörden vom 30. April 1815 (GS S. 85); Gesetz über Verpflichtung zur Armenpflege vom 31. Dez. 1842; Kreisordnung für die östlichen 6 Provinzen vom 13. Dez. 1872.
ma zasięg: terytorium Wolnego Państwa Prus, obejmuje obecne ziemie zachodniej i północnej Polski
zobacz też obiekt: Deutsche Verwaltungsgeschichte
zobacz też obiekt: M. Bär, Die Behördenverfassung in Westpreußen seit der Ordenszeit
zobacz też obiekt: Heinrich G., Henning F.W., Jeserich K. G. A., Verwaltungsgeschichte Ostdeutschlands 1815-1945
zobacz też obiekt: Handbuch der Preußischen Geschichte...
zobacz też obiekt: Deutsche Verfassungsgeschichte
zobacz też obiekt: Roger W., Frotscher W., „Überblick über die Verwaltungsorganisation in den Bundesstaaten
zobacz też IRI: https://www.wikidata.org/wiki/Q38872
zaczyna obowiązywać od: 1920-01-01

Wielkie Księstwo Litewskie (1385-1569)
creator: Bogumił Szady
type: NamedIndividual
type: system administracji
comment: The typology and taxonomy of territorial units in Lithuanian land in the Middle Ages was inconsistent and provoked heated discussion among historians. The terms are often interchangable and fluid, e.g. land, wolost. For instance, until the second half of the 15th c. the baillifs (pl. Starosta) od Drohiczyn and Biels lands were called "wojewoda", while after the 15th c. the governors in Poldlachia were called "Starosta". Only after the 16th c. a relatively stable administrative system was established. It included: voividships and districts (województwa, powiaty). Broadly speaking, the voidoships replaced the principalities and lands, while districts replaced the vicegerencies/bailiwicks and wolosts. @en
comment: Typologia i nazewnictwo jednostek terytorialnych ziem litewskich w średniowieczu były niekonsekwentne i są przedmiotem dyskusji wśród historyków. Występuję duża zmienność oraz wymienność określeń ich typów: np. ziemia, wołość. Np. do II połowy wieku XV starostowie związani z ziemią drohicką i bielską nazywani byli wojewodami, zaś od połowy XV w. namiestnicy na Podlasiu określani byli mianem starostów. Dopiero w XVI w. ukształtował się względnie stabilny terytorialny system administracyjny oparty o podział na województwa oraz powiaty. Ujmując rzecz bardzo generalnie województwa zastąpiły dawne księstwa i ziemie, zaś powiaty – dawne namiestnictwa-starostwa i wołości.
label: The Grand Duchy of Lithuania @en
kończy obowiązywać w: 1569-12-31
ma początek: 1385-01-01
ma koniec: 1569-12-31
ma zasięg: terytorium Wielkiego Księstwa Litewskiego, przede wszystkich teren historycznego Podlasia i Suwalszczyzny
zobacz też obiekt: Geografia historyczna Wielkiego Księstwa Litewskiego: Stan i perspektywy badań
zobacz też obiekt: Studia z ustroju i dziejów Wielkiego Księstwa Litewskiego
zobacz też obiekt: Oбластное деление и местное управление Литовско-русского государства ко времени издания первого Литовского статута
zobacz też obiekt: Podlasie (Województwo)
zobacz też obiekt: Mapa Wielkiego Księstwa Litewskiego w połowie XVI wieku. 1, Część północna, skala 1:1.600.000: objaśnienia do mapy
zobacz też obiekt: Вялікі гістарычны атлас Беларусі, t. 1-3,
zobacz też obiekt: Studja nad początkami społeczeństwa i państwa litewskiego.
zobacz też obiekt: Organizacja opolna w Polsce średniowiecznej
zobacz też obiekt: Organizacja opolna w Polsce piastowskiej
zobacz też obiekt: Vicinia id est: Poszukiwania alternatywnej koncepcji staropolskiego opola
zobacz też obiekt: Wczesnopiastowska organizacja administracyjna w X i XI wieku
zobacz też obiekt: Powiat w Wielkopolsce XIV-XVI wieku: Z zagadnień zarządu terytorialnego i podziałów Polski późnośredniowiecznej
zobacz też IRI: https://www.wikidata.org/wiki/Q49683
zaczyna obowiązywać od: 1385-01-01

Królestwo Galicji i Lodomerii (1849-1866)
creator: Bogumił Szady
type: NamedIndividual
type: system administracji
label: the Kingdom of Galicia and Lodomeria (1849-1866) @en
kończy obowiązywać w: 1866-12-31
ma początek: 1849-01-01
ma koniec: 1866-12-31
ma podstawę prawną w: 1849-1850: reforma ustrojowa (kraj koronny, namiestnictwa, wprowadzenie powiatów); 1855-1856: reforma administracyjna (zniesienie kompetencji dominiów i magistratów na rzecz ustroju gminnego i powiatów)
ma zasięg: terytorium Galicji
zobacz też obiekt: Die österreichische Monarchie, geographisch, statistisch, topographisch und historisch dargestellt
zobacz też obiekt: Historia państwa i prawa Polski. T. 3, Od rozbiorów do uwłaszczenia
zobacz też obiekt: Kancelaria organów władzy w Galicji: Wybór źródeł
zobacz też obiekt: Galizien unter österreichischer Herrschaft: Verwaltung - Kirche - Bevölkerung
zobacz też obiekt: Historia państwa i prawa Polski. T. 4, Od uwłaszczenia do odrodzenia państwa
zobacz też obiekt: Galicja 1848-1914: Historia ustroju politycznego na tle historii ustroju Austrii
zobacz też IRI: https://www.wikidata.org/wiki/Q2396442
zaczyna obowiązywać od: 1855-01-01

Księstwo Warszawskie (1807-1815)
creator: Tomasz Panecki
type: NamedIndividual
type: system administracji
comment: Chronologia obowiązywania systemu administracyjnego ma charakter generalny. Obejmuje również okres okupacji wojennej przez Rosję (1812-1816)
comment: The administrative system's chronology is of general nature. It also includes the period of Russian occupation (1812-1816). @en
label: The Duchy of Warsaw (1807-1815) @en
kończy obowiązywać w: 1814-12-31
ma początek: 1807-01-01
ma koniec: 1814-12-31
ma podstawę prawną w: Dziennik Praw [Księstwa Warszawskiego], t. 1, s. XXXIV
ma zasięg: terytorium Księstwa Warszawskiego
zobacz też obiekt: Historia ustroju i prawa Księstwa Warszawskiego
zobacz też obiekt: Organy administracji terenowej w Księstwie Warszawskim
zobacz też obiekt: Historia ustroju Polski X-XX w.
zobacz też obiekt: Polska na królu pruskim zdobyta. „Ustrój, administracja i sądownictwo doby Komisji Rządzącej w 1807 roku"
zobacz też obiekt: Organy administracji terytorialnej w Księstwie Warszawskim
zobacz też IRI: https://www.wikidata.org/wiki/Q58519480
zaczyna obowiązywać od: 1807-01-01

Królestwo Polskie (1815-1836)
creator: Tomasz Panecki
type: NamedIndividual
type: system administracji
label: Kingdom of Poland (1815-1837) @en
kończy obowiązywać w: 1837-12-31
ma początek: 1815-01-01
ma koniec: 1842-12-31
ma podstawę prawną w: Dekret Namiestnika Królestwa Polskiego gen. Józefa Zajączka z dn. 16 stycznia 1816 r. (Dziennik Praw, T. 1, s. 115)
ma zasięg: terytorium Królestwa Polskiego
zobacz też obiekt: Administracja gmin wiejskich w Królestwie Polskim w latach 1815–1864
zobacz też obiekt: Historia ustroju Polski X-XX w.
zobacz też obiekt: Podział administracyjny Królestwa Polskiego 1815-1918
zobacz też IRI: https://www.wikidata.org/wiki/Q221457
zaczyna obowiązywać od: 1815-01-01

Królestwo Polskie (1370-1568)
creator: Tomasz Związek
type: NamedIndividual
type: system administracji
label: The Kingdom of Poland (1370-1568) @en
alternative label: The Crown of Poland @en
kończy obowiązywać w: 1568-12-31
ma początek: 1370-01-01
ma koniec: 1568-12-31
ma podstawę prawną w: reformy ustrojowe XIV w.; statuty wiślicko-piotrowskie (1356-1362 r.)
ma zasięg: terytorium Królestwa Polskiego
zobacz też obiekt: Powiat w Wielkopolsce XIV-XVI wieku: Z zagadnień zarządu terytorialnego i podziałów Polski późnośredniowiecznej
zobacz też obiekt: Powiat w Polsce późnośredniowiecznej
zobacz też obiekt: Typ i forma państwa polskiego w okresie demokracji szlacheckiej
zobacz też obiekt: Historia Polski 1572-1795
zobacz też obiekt: Królestwo Polskie 1295-1370
zobacz też obiekt: Historia państwa i prawa Polski do roku 1795, t. 1-2
zobacz też IRI: https://www.wikidata.org/wiki/Q1649871
zaczyna obowiązywać od: 1370-01-01

Prusy Książęce (1525-1701)
creator: Wiesława Duży
type: NamedIndividual
type: system administracji
comment: Plemiona pruskie nie wytworzyły państwowości i administracji terytorialnej przed XIII w.: W. Długokęcki, Prusy w starożytności i we wczesnym średniowieczu, [w:] M. Biskup, i in., Państwo zakonu krzyżackiego w Prusach. Władza i społeczeństwo, Warszawa 2008, s. 38-39, 43: "Mniejsza niż plemię jednostka terytorialna nosiła nazwę territorium (Dusburg), a także terrula, districtus. W literaturze określa się ją też jako włość, mała ziemia lub używa pruskiej nazwy pulka. [...] Podstawową jednostkę osadniczą stanowiło pole (prus. lauks, łac. campus, niem. Feld). Tworzyło ono topograficzno-gospodarczą całość, bez wytyczonych granic linearnych [...] Obraz ustroju politycznego Estów i Prusów przekazany przez źródła IX-XIII w. wyraźnie wskazuje na rozdrobnienie polityczne i brak silnych ośrodków władzy publicznej. Zasadnicze znaczenie miały wiece różnych struktur terytorialnych (prus. wayde, waite). W XIII w. funkcjonowały wiece międzyplemienne, plemienne i na poziomie małej ziemi. Wzmianki o wiecach z XIII w. dotyczą przede wszystkim wieców wojennych [...]". R. Czaja, i in. [w:] ibidem, s. 75-76: "Przywilej chełmiński, będący formalnie dokumentem lokacyjnym Chełmna i Torunia, w rzeczywistości pełnił funkcję przywileju "krajowego". Niektóre bowiem przepisy w nim zawarte dotyczyły także rycerzy (np. te, które odnosiły się do statusu prawnego dóbr obciążonych służbą wojskową), postanowienia zaś odnoszące się do monety, wymiaru łana, zwolnień celnych, wolnego targu obejmowały wszystkich mieszkańców ziemi chełmińskiej. Prawo chełmińskie służyło wyodrębnieniu z władztwa księcia Konrada obszaru poddanego kontroli Zakonu: tam, gdzie były stosowane postanowienia przywileju, sięgała władza Krzyżaków". 1309 - zajęcie Pomorza Gdańskiego, przeniesienie siedziby wielkiego mistrza zakonnego do Malborka (mimo że nie było jeszcze wtedy jasne czy Malbork zostanie stolicą państwa). 1466 - inkorporacja ziem pruskich do Korony przez króla Kazimierz Jagiellończyka doprowadziła do wybuchu wojny trzy…
label: The Duchy of Prussia (1525-1701) @en
kończy obowiązywać w: 1701-12-31
ma początek: 1525-01-01
ma koniec: 1701-12-31
ma zasięg: terytorium Prus Książęcych
zobacz też obiekt: Historisch-comparative Geographie von Preussen
zobacz też obiekt: Prusy Książęce a Prusy Królewskie w latach 1525-1548. Studium z dziejów polskiej polityki księcia Albrechta Hohenzollerna
zobacz też obiekt: Ustawa o rządzie (Regimentsnottel) Prus Książęcych z 1542 roku. Studium z dziejów przemian społecznych i politycznych w lennie pruskim
zobacz też obiekt: Organizacja władzy naczelnej Prus Książęcych
zobacz też obiekt: Geneza i znaczenie hołdu pruskiego 1525 roku
zobacz też obiekt: Starostwa dziedziczne Prus Książęcych w XVII i XVIII wieku
zobacz też obiekt: Władztwo Polski w Prusiech Zakonnych i Książęcych
zobacz też IRI: https://www.wikidata.org/wiki/Q153091
zobacz też IRI: https://www.wikidata.org/wiki/Q38872
zaczyna obowiązywać od: 1525-01-01

Kościół katolicki ob. ormiańskiego
bildet Teil von: Stolica Apostolska
type: NamedIndividual
type: system administracji
kończy obowiązywać w: 1939-12-31
ma początek: 1632-01-01
ma koniec: 1939-12-31
ma podstawę prawną w: 1632, unia kościoła ormiańskiego z Rzymem
ma zasięg: terytorium Polski, zwłaszcza wschodniej
jest utworzony przez: obrządek ormiański
jest utworzony przez: religia chrześcijańska
jest utworzony przez: wyznanie katolickie
zaczyna obowiązywać od: 1632-01-01

Królestwo Polskie (1867-1918)
creator: Tomasz Panecki
type: NamedIndividual
type: system administracji
label: Congress Poland (1867-1918) @en
kończy obowiązywać w: 1918-12-31
ma początek: 1867-01-01
ma koniec: 1918-12-31
ma podstawę prawną w: Ukaz carski z 13.01.1867 (Dziennik Praw Królestwa Polskiego), nr 66, Warszawa 1866, s. 115-243.
ma zasięg: terytorium Królestwa Polskiego
zobacz też obiekt: Administracja gmin wiejskich w Królestwie Polskim w latach 1815–1864
zobacz też obiekt: Historia ustroju Polski X-XX w.
zobacz też obiekt: Podział administracyjny Królestwa Polskiego 1815-1918
zobacz też IRI: https://www.wikidata.org/wiki/Q221457
zaczyna obowiązywać od: 1867-01-01

Republika Słowacka (1996-2020)
creator: Bogumił Szady
type: NamedIndividual
type: system administracji
label: Slovak Republic (1996-2020) @en
label: Slovenská republika (1996-2020) @sk
alternative label: Slovakia (1996-2020) @en
alternative label: Slovensko (1996-2020) @sk
alternative label: Słowacja (1996-2020)
ma początek: 1996-01-01
ma zasięg: terytorium Słowacji
zobacz też IRI: Slovakia
zobacz też IRI: Q15057583

Święte Cesarstwo Rzymskie (962-1806)
creator: Bogumił Szady
type: NamedIndividual
type: system administracji
label: Holy Roman Empire (962-1806) @en
kończy obowiązywać w: 1806-08-06
ma początek: 0800-12-25
ma koniec: 1806-08-06
ma zasięg: terytorium wielokrotnie zmieniało swój zasięg, obejmowało głównie kraje Europy Środkowej i Wschodniej, w przeważającej części zamieszkiwane przez ludność posługującą się językiem niemieckim
zobacz też IRI: Q12548
zaczyna obowiązywać od: 0962-02-02

Wolne Miasto Gdańsk (1920-1939)
creator: Witold Matwiejczyk
type: NamedIndividual
type: system administracji
label: The Free City of Danzig (1920-1939) @en
kończy obowiązywać w: 1939-12-31
ma początek: 1920-01-01
ma koniec: 1939-12-31
ma zasięg: terytorium Wolnego Miasta Gdańska
zobacz też obiekt: Zachodnia granica Polski
zobacz też obiekt: Wolne Miasto Gdańsk a Liga Narodów 1920-1939
zobacz też obiekt: Ustrój polityczny Wolnego Miasta Gdańska w latach 1920-1933
zobacz też obiekt: Polska i Wolne Miasto Gdańsk (1920-1939). Stosunki polityczne
zobacz też obiekt: Województwo pomorskie i Wolne Miasto Gdańsk
zobacz też IRI: https://www.wikidata.org/wiki/Q216173
zaczyna obowiązywać od: 1920-01-01

Stolica Apostolska
type: NamedIndividual
type: system administracji
label: Holy See @en
label: Sancta Sedes @la
label: Santa Sede @it
ma początek: 0313-01-01
jest utworzony przez: religia chrześcijańska
zobacz też IRI: Holy See
zobacz też IRI: http://vocab.getty.edu/tgn/7001168
zobacz też IRI: Q159583

Wolne Państwo Saksonia (1919-1945)
creator: Anna Orłowska
type: NamedIndividual
type: system administracji
comment: 1920-1933 Wolne Państwo Saksonia jako państwo członkowskie Republiki Związkowej. 1933-1945 Wolne Państwo Saksonia jako państwo członkowskie III Rzeszy.
label: Freistaat Sachsen (1919-1945) @de
label: The Free State of Saxony (1919-1945) @en
kończy obowiązywać w: 1945-12-31
ma początek: 1919-01-01
ma koniec: 1945-12-31
ma zasięg: terytorium Wolnego Państwa Saksonia, obejmuje część Łużyc leżących obecnie w Polsce (Bogatynia)
zobacz też IRI: https://www.wikidata.org/wiki/Q1202
zaczyna obowiązywać od: 1919-01-01

Królestwo Prus (1806-1919)
creator: Witold Matwiejczyk
bildet Teil von: Święte Cesarstwo Rzymskie (962-1806)
type: NamedIndividual
type: system administracji
comment: "Verordnung wegen verbesserter Einrichtung der Provinzial- Polizei- und Finanzbehörden vom 26. Dezember 1808 (GS S. 481). Städteordnung 1808, 1831, 1853. Verordnung wegen verbesserter Einrichtung der Provinzial-Behörden vom 30. April 1815 (GS S. 85). Gesetz über Verpflichtung zur Armenpflege vom 31.Dez. 1842. Kreisordnung für die östlichen 6 Provinzen vom 13. Dez. 1872." @de
label: Königreich Preußen (1806-1919) @de
label: The Kingdom of Prussia (1806-1919) @en
kończy obowiązywać w: 1945-12-31
ma początek: 1806-01-01
ma koniec: 1919-12-31
ma podstawę prawną w: Verordnung wegen verbesserter Einrichtung der Provinzial- Polizei- und Finanzbehörden vom 26. Dezember 1808 (GS S. 481); Städteordnung 1808, 1831, 1853; Verordnung wegen verbesserter Einrichtung der Provinzial-Behörden vom 30. April 1815 (GS S. 85); Gesetz über Verpflichtung zur Armenpflege vom 31. Dez. 1842; Kreisordnung für die östlichen 6 Provinzen vom 13. Dez. 1872.
ma zasięg: terytorium Królestwa Prus, obejmuje obecne ziemie zachodniej i północnej Polski
zobacz też obiekt: Deutsche Verwaltungsgeschichte
zobacz też obiekt: Heinrich G., Henning F.W., Jeserich K. G. A., Verwaltungsgeschichte Ostdeutschlands 1815-1945
zobacz też obiekt: Handbuch der Preußischen Geschichte...
zobacz też obiekt: Deutsche Verfassungsgeschichte
zobacz też obiekt: Roger W., Frotscher W., „Überblick über die Verwaltungsorganisation in den Bundesstaaten
zobacz też IRI: https://www.wikidata.org/wiki/Q27306
zaczyna obowiązywać od: 1815-01-01

Cesarstwo Rosyjskie (1775-1917)
creator: Bogumił Szady
type: NamedIndividual
type: system administracji
comment: Dekret Piotra I z dnia 18 grudnia 1708 r.; ukaz Piotra I z dnia 29 maja 1719 r.; dekret Katarzyny II z 7 listopada 1775 r.; dekret Pawa I z 12 grudnia 1796 r.; 1861: reforma uwłaszczeniowa i wprowadzenie gmin
comment: The foundation of the administrative divisions were established by Peter the Great's decree on 18th od December 1708. First, the governorates (gubernjas) were not divided into districts (uyezds). in 1710-1713 they were divided into dolas ( Ru. доля, Ger. Landratsamt). Another reform, so called the second reform of Peter the Great, following a decree of 29th of May 1719, waived the dolas, while the governorates were divided into provinces and consequently districts. In 1727, the districts were abolished, while governorates and provinces were divided into districts (uyezds). On the 7th of November 1775, Catherine the Great decreed an administrative division reform dividing the state into governorates-vicegerencies-circles operating as governorates. The units were divided into districts (uyezds). Some vast governorates were divided into circes (oblasti), which comprised an intermediary level between a vicegerency and district. The decree by Pawel I Romanov, on 12th of December 1796 abolished vicegerencies. @en
comment: Zasadniczy system podziału na gubernie został zapoczątkowany dekretem Piotra I z 18 grudnia 1708 r. W pierwszym okresie gubernie nie dzieliły się na powiaty (ujezdy). W latach 1710-1713 zostały podzielone na dole landrackie (доля). Kolejna reforma, tzw. druga reforma Piotra I, na podstawie ukazu z 29 maja 1719 roku, zniosła dole landrackie, gubernie zostały podzielone na prowincje, zaś prowincje na dystrykty. W 1727 roku zostały zniesione dystrykty, a gubernie i prowincje podzielone na powiaty (ujezdy). 7 listopada 1775 r. Katarzyna II wydała dekret o reformie administracyjnej państwa wprowadzając system podziału na gubernie-namiestnictwa-obwody na prawach guberni. W ramach tych jednostek funkcjonowały powiaty (ujezdy). Niektóre rozległe namiestnictwa dzielone były na zwykłe obwody (obłasti), które tworzyły szczebel pośredni między namiestnictwem (lub gubernią) i powiatem (ujezdem). Ukaz Pawła I z 12 grudnia 1796 r. zamienił namiestnictwa, pozostawiając gubernie i obwody na prawach guberni.
label: Russian Empire (1775-1917) @en
label: Российская империя @ru
kończy obowiązywać w: 1917-12-31
ma początek: 1775-01-01
ma koniec: 1917-12-31
ma podstawę prawną w: Dekret Piotra I z dnia 18 grudnia 1708 r.; ukaz Piotra I z dnia 29 maja 1719 r.; dekret Katarzyny II z 7 listopada 1775 r.; dekret Pawa I z 12 grudnia 1796 r.; 1861: reforma uwłaszczeniowa i wprowadzenie gmin
ma zasięg: terytorium Cesarstwa Rosyjskiego, obejmuje część obecnego Podlasia (Białowieża)
zobacz też obiekt: Zmiany podziałów administracyjnych w Cesarstwie Rosyjskim, w Związku Radzieckim oraz w Federacji Rosyjskiej
zobacz też obiekt: Правительственный аппарат самодержавной России
zobacz też obiekt: Институт генерал-губернаторства в Российской империи
zobacz też obiekt: Изменение административно-территориального деления России за последние 300 лет, „География“
zobacz też obiekt: Изменение административно-территориального деления России в XIII—XX вв
zobacz też obiekt: Ландратура Санкт-Петербургской губернии: штат, функции, место в системе управления (mатериалы к исследованию)
zobacz też obiekt: Evolution of Administrative and Territorial Transformations in the XVIII Century Northeastern Asian Part of Russia
zobacz też IRI: Q34266
zaczyna obowiązywać od: 1796-01-01

Księstwo Górnego i Dolnego Śląska (1849-1918)
creator: Wiesława Duży
type: NamedIndividual
type: system administracji
label: The Duchy of Upper and Lower Silesia (1849-1918) @en
kończy obowiązywać w: 1918-12-31
ma początek: 1849-01-01
ma koniec: 1918-12-31
ma zasięg: terytorium kraju koronnego Śląsk Austriacki, obejmuje obecną ziemię cieszyńską
zobacz też obiekt: Granice Śląska. Zmiany granic Śląska w czasie i przestrzeni. Śląsk na dawnej mapie. Obraz Sudetów w dawnej kartografii,
zobacz też obiekt: Sytuacja polityczna i prawno-administracyjna miasta i okolicy w latach konstytucjonalizmu
zobacz też obiekt: Dzieje Śląska Cieszyńskiego od zarania do czasów współczesnych
zaczyna obowiązywać od: 1849-01-01

gmina miejska (Wolne Państwo Prusy (1920-1945))
type: Class
comment: "1808: Städte-Ordnung. Gminy miejskie i gminy wiejskie były jednostkami organizacji samorządowej (komunalnej), ale równocześnie pełniły funkcje podstawowych jednostek administracji terytorialnej. M. Bär, s. 228: „Die Landgemeinde ist außer einem Kommunalverband auch ein Bezirk der allgemeinen Landesverwaltung für die mannigfachen Geschäfte des staatlichen Polizei- und Finanzwesens, insbesondere für die Handhabung der Ortspolizei, und der Gemeindevorsteher ist das Organ des Amtsvorstehers für die örtliche Polizeiverwaltung“. W. Roger W.Frotscher, „Überblick über die Verwaltungsorganisation in den Bundesstaaten, w: Deutsche Verwaltungsgeschichte, Bd. 3 hrsg. von K.G.A. Jeserich, H. Pohl und G. Ch. v. Unruh, Stuttgart 1984, S. 417: „Der preußische Staat endete beim Landrat. In diesem oft zitierten Satz kommt zum Ausdruck, dass Gemeindeorgane, auch soweit sie staatliche Angelegenheiten wahrnahmen, nicht als staatliche, sondern als kommunale Behörden tätig wurden. Sie handelten, etwa als Ortspolizei `für den Staat` in einem ihnen übertragenen Wirkungskreis." @de
label: Stadtgemeinde (Freistaat Preußen) @de
label: town commune (The Free State of Prussia) @en
subclass of: gmina (Wolne Państwo Prusy (1920-1945))
jest zdefiniowany przez obiekt: Wolne Państwo Prusy (1920-1945)
jest przedstawiony za pomocą symbolu: gmina, obszar dworski, dominium

powiat (Rzeczpospolita Polska (1918-1939))
type: Class
label: land district (The Second Polish Republic) @en
subclass of: obszar administracji świeckiej
subclass of: Restriction
  on property: bildet Teil von
  some values from: województwo (Rzeczpospolita Polska (1918-1939))
jest zdefiniowany przez obiekt: Rzeczpospolita Polska (1918-1939)
jest przedstawiony za pomocą symbolu: powiat, komturstwo, okręg
zobacz też IRI: http://gov.genealogy.net/types.owl#32
zobacz też IRI: https://www.wikidata.org/wiki/Q247073

województwo (Rzeczpospolita Polska (1918-1939))
type: Class
comment: Ustawy z lat 1919-1925 decydowały o utworzeniu poszczególnych województw (jako ostatnie zostało utworzone woj. wileńskie); na poziomie województwa (III stopień) klasyfikowane było także w ramach podziału terytorialnego administracji zespolonej miasto Warszawa, Mielcarek, s. 52.
label: voivodeship (The Second Polish Republic) @en
subclass of: obszar administracji świeckiej
alternative label: province @en
alternative label: vojvodship @en
jest zdefiniowany przez obiekt: Rzeczpospolita Polska (1918-1939)
jest przedstawiony za pomocą symbolu: województwo, gubernia, komitat, obwód, rejencja, landwójtostwo

powiat (Śląsk (1372-1782))
type: Class
label: Kreis @de
label: district (Silesia (1372-1782)) @en
label: terra @la
subclass of: obszar administracji świeckiej
alternative label: Circul @de
alternative label: Weichbild @de
alternative label: dystrykt
alternative label: hrabstwo
alternative label: księstwo
alternative label: okręg
alternative label: ziemia
jest zdefiniowany przez obiekt: Śląsk (1372-1782)
jest przedstawiony za pomocą symbolu: powiat, komturstwo, okręg

miasto-ziemia (Księstwo Pomorskie (1230-1648))
type: Class
label: town (The Duchy of Pomerania (1230-1648)) @en
subclass of: obszar administracji świeckiej
subclass of: Restriction
  on property: bildet Teil von
  some values from: landwójtostwo (Księstwo Pomorskie (1230-1648))
jest zdefiniowany przez obiekt: Księstwo Pomorskie (1230-1648)
jest przedstawiony za pomocą symbolu: ziemia, cyrkuł, obwód, departament

miasto polokacyjne (Księstwo Pomorskie (1230-1648))
type: Class
comment: Miasta pokolokacyjne zastąpiły wcześniejszy, rodzimy (słowiański) system grodów kasztelańskich. Władzę sprawowali w nich w imieniu księcia mianowani spośród mieszczan sołtysi (sculteti) zwani również wójtami lub podwójtami (advocati minores, subadvocati).
label: charter town (The Duchy of Pomerania (1230-1648)) @en
subclass of: miasto-ziemia (Księstwo Pomorskie (1230-1648))
jest zdefiniowany przez obiekt: Księstwo Pomorskie (1230-1648)
jest przedstawiony za pomocą symbolu: ziemia, cyrkuł, obwód, departament

ziemia (Księstwo Pomorskie (1230-1648))
type: Class
comment: Dawne opola przekształcono w niewielkie jednostki terytorialne (Land), stanowiące zespół dóbr panującego, lub obszary będące lennami wielkich feudałów. Władzę sprawują wójtowie.
label: Land @de
label: land (The Duchy of Pomerania (1230-1648)) @en
subclass of: miasto-ziemia (Księstwo Pomorskie (1230-1648))
jest zdefiniowany przez obiekt: Księstwo Pomorskie (1230-1648)
jest przedstawiony za pomocą symbolu: ziemia, cyrkuł, obwód, departament

landwójtostwo (Księstwo Pomorskie (1230-1648))
type: Class
comment: "Powstały przeważnie z dawnych kasztelanii, zarządzane przez landwójtów (advocatus maior, Grosswogt, Landwogt). Zakres władzy: sądy nad rycerstwem, sądy odwoławcze w sprawach miejskich i chłopów z domen panujących; zarząd domen książęcych i egzekucja powinności; nadzór nad zamkami książęcymi i miastami. Od poł. XVI wieku równolegle powstają okręgi zarządów domen. Okręgi zarządów domen powstawały w wyniku sekularyzacji i przejmowania przez książąt pomorskich dóbr kościelnych, jednak nie objęły terytorium całego kraju i „nie były jeszcze w pełnym tego słowa znaczeniu okręgami administracji państwowej” (Historia Pomorza, II, 1, s. 842)."
label: rural bailiwick (The Duchy of Pomerania (1230-1648)) @en
subclass of: obszar administracji świeckiej
jest zdefiniowany przez obiekt: Księstwo Pomorskie (1230-1648)
jest przedstawiony za pomocą symbolu: województwo, gubernia, komitat, obwód, rejencja, landwójtostwo

urząd dominialny (Marchia Brandenburska (1540-1713))
type: Class
label: Kreis @de
label: rural district (The Margraviate of Branderburg (1540-1713)) @en
subclass of: obszar administracji świeckiej
subclass of: Restriction
  on property: bildet Teil von
  some values from: landwójtostwo (Marchia Brandenburska (1540-1713))
alternative label: Amt @de
alternative label: Domänenamt @de
alternative label: okręg
alternative label: powiat ziemski
jest zdefiniowany przez obiekt: Marchia Brandenburska (1540-1713)
jest przedstawiony za pomocą symbolu: powiat, komturstwo, okręg

landwójtostwo (Marchia Brandenburska (1540-1713))
type: Class
comment: Landvogtei (landwójtostwo) (zwane również okręgiem, w którym władzę sprawuje Landeshauptmann). Powstało w XIV w. w wyniku zmian politycznych (zmiana dynastii) oraz osłabienia dawnego systemu wójtostw, spowodowanego obficie udzielanymi przez margrafów przywilejami ekonomicznymi i sądowniczymi dla miast, klasztorów i dóbr rycerskich. Ponadto kolonizacja pustek, zmuszała do tworzenia znacznie większych obszarów administracji lokalnej niż poprzednie wójtostwa.
label: rural bailiwick (The Margraviate of Branderburg (1540-1713)) @en
subclass of: obszar administracji świeckiej
subclass of: Restriction
  on property: bildet Teil von
  some values from: prowincja (Marchia Brandenburska (1540-1713))
alternative label: voyt's rural dominion @en
jest zdefiniowany przez obiekt: Marchia Brandenburska (1540-1713)
jest przedstawiony za pomocą symbolu: województwo, gubernia, komitat, obwód, rejencja, landwójtostwo

prowincja (Marchia Brandenburska (1540-1713))
type: Class
label: Kreis @de
label: Province (The Margraviate of Branderburg (1540-1713)) @en
subclass of: obszar administracji świeckiej
equivalent class: prowincja (Wolne Państwo Prusy (1920-1945))
jest zdefiniowany przez obiekt: Marchia Brandenburska (1540-1713)
jest przedstawiony za pomocą symbolu: prowincja, starostwo generalne, generalne gubernatorstwo

wójtostwo (Marchia Brandenburska (1323-1540))
type: Class
comment: Vogtei (wójtostwo) i równolegle lub na ich bazie powstający Kreis (powiat) ziemski oraz Amt zwany również Domänenamt (okręg, urząd dominialny)
label: Vogtei @de
label: bailiwick (The Margraviate of Branderburg (1323-1540)) @en
subclass of: obszar administracji świeckiej
subclass of: Restriction
  on property: bildet Teil von
  some values from: landwójtostwo (Marchia Brandenburska (1323-1540))
alternative label: voyt's dominion, @en
jest zdefiniowany przez obiekt: Marchia Brandenburska (1323-1540)
jest przedstawiony za pomocą symbolu: wójtostwo, okręg, prokuratorstwo
zobacz też IRI: http://dbpedia.org/page/Bailiwick

landwójtostwo (Marchia Brandenburska (1323-1540))
type: Class
label: Landvogtei @de
label: rural bailiwick (The Margraviate of Branderburg (1323-1540)) @en
subclass of: obszar administracji świeckiej
subclass of: Restriction
  on property: bildet Teil von
  some values from: prowincja (Marchia Brandenburska (1323-1540))
jest zdefiniowany przez obiekt: Marchia Brandenburska (1323-1540)
jest przedstawiony za pomocą symbolu: województwo, gubernia, komitat, obwód, rejencja, landwójtostwo

prowincja (Marchia Brandenburska (1323-1540))
type: Class
comment: W Nowej Marchii był także starosta generalny dla całej prowincji, stojący ponad landwójtami (Walachowicz, Advocatia, s. 195).
label: province (The Margraviate of Branderburg (1323-1540)) @en
subclass of: obszar administracji świeckiej
equivalent class: prowincja (Wolne Państwo Prusy (1920-1945))
alternative label: starostwo generalne
jest zdefiniowany przez obiekt: Marchia Brandenburska (1323-1540)
jest przedstawiony za pomocą symbolu: prowincja, starostwo generalne, generalne gubernatorstwo

gmina wiejska (Wolne Państwo Prusy (1920-1945))
type: Class
comment: 1818: Edykt o urzędach sołtysów w gminach wiejskich i obszarach dworskich.
label: Landgemeinde @de
label: rural commune (The Free State of Prussia) @en
subclass of: gmina (Wolne Państwo Prusy (1920-1945))
jest zdefiniowany przez obiekt: Wolne Państwo Prusy (1920-1945)
jest przedstawiony za pomocą symbolu: gmina, obszar dworski, dominium

dzielnica (System średniowieczny (do XIV w.))
type: Class
comment: Kasztelania, opole, żupa, pagast; tutaj należy szukać genezy polskich powiatów; inne terytoria zależne nie posiadające statusu księstwa czy marchii (ziemie, miasta, część księstw, regiony)
label: district @en
subclass of: obszar administracji świeckiej
jest zdefiniowany przez obiekt: System średniowieczny (do XIV w.)
jest przedstawiony za pomocą symbolu: powiat, komturstwo, okręg

wójtostwo (Państwo Krzyżackie (1226-1525))
type: Class
comment: Od XIV w. J. Tandecki, Struktury i podziały administracyjne w zakonie krzyżackim w Inflantach, [w:] Zakon Krzyżacki w Prusach i Inflantach. Podziały admiinistracyjne i kościelne w XIII-XVI wieku, red. R. Czaja, A. Radzimiński, Toruń 2013, s. 171: "Od samego początku istnienia terytorium zakonnego w Inflantach podstawowymi jednostkami jego ustroju administracyjnego były wójtostwa (Vogtei) i komturstwa (Komturei), będące zarazem siedzibami krzyżackich konwentów zakonnych"
label: bailiwick (The State of the Teutonic Order (1226-1525)) @en
subclass of: obszar administracji świeckiej
subclass of: Restriction
  on property: bildet Teil von
  some values from: komturstwo (Państwo Krzyżackie (1226-1525))
alternative label: district @en
jest zdefiniowany przez obiekt: Państwo Krzyżackie (1226-1525)
jest przedstawiony za pomocą symbolu: wójtostwo, okręg, prokuratorstwo
zobacz też IRI: http://dbpedia.org/page/Bailiwick

wójtostwo (Państwo Krzyżackie (1226-1525))
type: Class
label: bailiwick (The State of the Teutonic Order (1226-1525)) @en
subclass of: wójtostwo (Państwo Krzyżackie (1226-1525))
alternative label: district @en
jest zdefiniowany przez obiekt: Państwo Krzyżackie (1226-1525)
jest przedstawiony za pomocą symbolu: wójtostwo, okręg, prokuratorstwo
zobacz też IRI: http://dbpedia.org/page/Bailiwick

prokuratorstwo (Państwo Krzyżackie (1226-1525))
type: Class
label: pfleger's dominion (The State of the Teutonic Order (1226-1525)) @en
subclass of: wójtostwo (Państwo Krzyżackie (1226-1525))
jest zdefiniowany przez obiekt: Państwo Krzyżackie (1226-1525)
jest przedstawiony za pomocą symbolu: wójtostwo, okręg, prokuratorstwo

komturstwo (Państwo Krzyżackie (1226-1525))
type: Class
comment: Do 1309 roku właściwie jedyny podział terytorialny; w latach 20. i 30. XIV w. - w wyniku likwidacji komturstwa ziemi chełmińskiej - powstały wójtostwo lipienieckie i nowomiejskie (potem bratiańskie), zaś w wyniku likwidacji komturstw unisławskiego i rogozińskiego powstały prokuratorstwo unisławskie i wójtostwo rogozińskie; wójtostwa istniały też na innych obszarach państwa. J. Tandecki, Podziały administracyjne państwa zakonnego w Prusach, [w:] Zakon Krzyżacki w Prusach i Inflantach. Podziały admiinistracyjne i kościelne w XIII-XVI wieku, red. R. Czaja, A. Radzimiński, Toruń 2013, s. 30: "Od początku istnienia państwa zakonnego w Prusach podstawowymi jednostkami ustroju terytorialnego były komturstwa (Komturei), będące jednocześnie siedzibami krzyżackich konwentów zakonnych".
label: commandery (The State of the Teutonic Order (1226-1525)) @en
subclass of: obszar administracji świeckiej
jest zdefiniowany przez obiekt: Państwo Krzyżackie (1226-1525)
jest przedstawiony za pomocą symbolu: powiat, komturstwo, okręg
zobacz też IRI: https://www.wikidata.org/wiki/Q1434544

obszar dworski (Wolne Państwo Prusy (1920-1945))
type: Class
comment: 1818: Edykt o urzędach sołtysów w gminach wiejskich i obszarach dworskich. 31.12.1842: Terytorialne rozgraniczenie gmin wiejskich i obszarów dworskich w prowincjach wschodnich
label: Gutsbezirk @de
label: manorial demesne (The Free State of Prussia) @en
subclass of: gmina (Wolne Państwo Prusy (1920-1945))
jest zdefiniowany przez obiekt: Wolne Państwo Prusy (1920-1945)
jest przedstawiony za pomocą symbolu: gmina, obszar dworski, dominium
zobacz też IRI: http://gov.genealogy.net/types.owl#109
zobacz też IRI: https://www.wikidata.org/wiki/Q451019

komturstwo (Państwo Krzyżackie (1226-1525))
type: Class
label: commandery (The State of the Teutonic Order (1226-1525)) @en
subclass of: komturstwo (Państwo Krzyżackie (1226-1525))
jest zdefiniowany przez obiekt: Państwo Krzyżackie (1226-1525)
jest przedstawiony za pomocą symbolu: powiat, komturstwo, okręg
zobacz też IRI: http://dbpedia.org/page/Commandry_(military_orders)
zobacz też IRI: http://gov.genealogy.net/types.owl#191
zobacz też IRI: https://www.wikidata.org/wiki/Q1434544

władztwo biskupa i kapituły (Państwo Krzyżackie (1226-1525))
type: Class
label: chapter lands (The State of the Teutonic Order (1226-1525)) @en
subclass of: komturstwo (Państwo Krzyżackie (1226-1525))
alternative label: bishop's lands @en
jest zdefiniowany przez obiekt: Państwo Krzyżackie (1226-1525)
jest przedstawiony za pomocą symbolu: powiat, komturstwo, okręg

parafia (Kościół katolicki ob. łacińskiego)
type: Class
label: Pfarre @de
label: parish (Latin Church) @en
label: parochia @la
label: парафия @ru
subclass of: obszar administracji religijnej
subclass of: Restriction
  min qualified cardinality: 0
  on class: dekanat-archiprezbiterat-wikariat okręgowy (Kościół katolicki ob. łacińskiego)
  on property: bildet Teil von
subclass of: Restriction
  min qualified cardinality: 0
  on class: diecezja (Kościół katolicki ob. łacińskiego)
  on property: bildet Teil von
subclass of: Restriction
  min qualified cardinality: 0
  on class: archidiakonat-dziekania-prepozytura-terytorium (Kościół katolicki ob. łacińskiego)
  on property: bildet Teil von
alternative label: приход @ru
hidden label: community @en
hidden label: gmina
jest zdefiniowany przez obiekt: Kościół katolicki ob. łacińskiego
jest przedstawiony za pomocą symbolu: parafia, gmina
zobacz też IRI: Parish (Catholic Church)
zobacz też IRI: http://gov.genealogy.net/types.owl#29
zobacz też IRI: http://gov.genealogy.net/types.owl#42
zobacz też IRI: http://vocab.getty.edu/aat/300000773
zobacz też IRI: Q17143723

dekanat-archiprezbiterat-wikariat okręgowy (Kościół katolicki ob. łacińskiego)
type: Class
label: deanery-archpresbyterate-forane vicariate (Latin Church) @en
subclass of: obszar administracji religijnej
subclass of: Restriction
  min qualified cardinality: 0
  on class: diecezja (Kościół katolicki ob. łacińskiego)
  on property: bildet Teil von
subclass of: Restriction
  min qualified cardinality: 0
  on class: archidiakonat-dziekania-prepozytura-terytorium (Kościół katolicki ob. łacińskiego)
  on property: bildet Teil von
jest zdefiniowany przez obiekt: Kościół katolicki ob. łacińskiego
jest przedstawiony za pomocą symbolu: dekanat-archiprezbiterat-wikariat okręgowy

archidiakonat-dziekania-prepozytura-terytorium (Kościół katolicki ob. łacińskiego)
type: Class
label: archdeaconry-deaconry-provostship-territory (Latin Church) @en
subclass of: obszar administracji religijnej
subclass of: Restriction
  on property: bildet Teil von
  some values from: diecezja (Kościół katolicki ob. łacińskiego)
jest zdefiniowany przez obiekt: Kościół katolicki ob. łacińskiego
jest przedstawiony za pomocą symbolu: archidiakonat-dziekania-prepozytura-terytorium

diecezja (Kościół katolicki ob. łacińskiego)
type: Class
comment: szczególną kategorią diecezji, jest diecezja metropolitalna zwana inaczej archidiecezją, pozostałe diecezje w metropolii nazywane są sufraganiami
label: Diözese @de
label: diocese (Latin Church) @en
label: dioecesis @la
subclass of: obszar administracji religijnej
subclass of: Restriction
  min qualified cardinality: 0
  on class: metropolia (Kościół katolicki ob. łacińskiego)
  on property: bildet Teil von
hidden label: archidiecezja
hidden label: arcybiskupstwo
hidden label: biskupstwo
hidden label: sufragania
jest zdefiniowany przez obiekt: Kościół katolicki ob. łacińskiego
jest przedstawiony za pomocą symbolu: diecezja
zobacz też IRI: Diocese
zobacz też IRI: http://gov.genealogy.net/types.owl#11
zobacz też IRI: http://vocab.getty.edu/aat/300000799
zobacz też IRI: Q665487

metropolia (Kościół katolicki ob. łacińskiego)
type: Class
label: metropolis @la
label: metropoly (Latin Church) @en
subclass of: obszar administracji religijnej
alternative label: ecclesiastical province @en
alternative label: prowincja kościelna
jest zdefiniowany przez obiekt: Kościół katolicki ob. łacińskiego
jest przedstawiony za pomocą symbolu: metropolia
zobacz też IRI: Metropolis (religious jurisdiction)
zobacz też IRI: Q427961

dekanat (Kościół katolicki ob. łacińskiego)
type: Class
comment: podział na dekanaty był wprowadzany od XII wieku
label: deanery (Latin Church) @en
label: decanatus @la
subclass of: dekanat-archiprezbiterat-wikariat okręgowy (Kościół katolicki ob. łacińskiego)
alternative label: deaconship @en
alternative label: decanate @en
alternative label: decanatus ruralis @la
hidden label: archiprezbiterat
hidden label: wikariat okręgowy
jest zdefiniowany przez obiekt: Kościół katolicki ob. łacińskiego
jest przedstawiony za pomocą symbolu: dekanat-archiprezbiterat-wikariat okręgowy
zobacz też IRI: Deanery
zobacz też IRI: http://gov.genealogy.net/types.owl#9
zobacz też IRI: Q385337

archiprezbiterat (Kościół katolicki ob. łacińskiego)
type: Class
comment: dotyczy diecezji wrocławskiej oraz diecezji pruskich
label: archipresbyteratus @la
label: archpresbyterate (Latin Church) @en
subclass of: dekanat-archiprezbiterat-wikariat okręgowy (Kościół katolicki ob. łacińskiego)
alternative label: archpresbiteriate @en
hidden label: dekanat
hidden label: wikariat okręgowy
jest zdefiniowany przez obiekt: Kościół katolicki ob. łacińskiego
jest przedstawiony za pomocą symbolu: dekanat-archiprezbiterat-wikariat okręgowy
zobacz też IRI: Archpriest
zobacz też IRI: archpresbyterate

wikariat okręgowy (Kościół katolicki ob. łacińskiego)
type: Class
label: forane vicariate (Latin Church) @en
label: vicariatus foraneus @la
subclass of: dekanat-archiprezbiterat-wikariat okręgowy (Kościół katolicki ob. łacińskiego)
alternative label: wikariat rejonowy (Kościół katolicki ob. łacińskiego)
hidden label: archiprezbiterat
hidden label: dekanat
jest zdefiniowany przez obiekt: Kościół katolicki ob. łacińskiego
jest przedstawiony za pomocą symbolu: dekanat-archiprezbiterat-wikariat okręgowy
zobacz też IRI: Archpriest
zobacz też IRI: Dean (Christianity)
zobacz też IRI: vicar-forane
zobacz też IRI: Q17632590

archidiakonat (Kościół katolicki ob. łacińskiego)
type: Class
comment: podział na archidiakonaty był wprowadzany od XII wieku; archdiakonaty zostały zlikwidowane w II połowie XVIII i początku XIX wieku (zabór austriacki - 1782, 1805, zabór rosyjski - 1818, zabór pruski - 1821)
label: archdeaconry (Latin Church) @en
label: archidiaconatus @la
subclass of: archidiakonat-dziekania-prepozytura-terytorium (Kościół katolicki ob. łacińskiego)
alternative label: archdeaconship @en
hidden label: dziekania
hidden label: prepozytura
hidden label: terytorium
jest zdefiniowany przez obiekt: Kościół katolicki ob. łacińskiego
jest przedstawiony za pomocą symbolu: archidiakonat-dziekania-prepozytura-terytorium
zobacz też IRI: Archdeacon
zobacz też IRI: http://vocab.getty.edu/aat/300387197
zobacz też IRI: Q16528361

dziekania (Kościół katolicki ob. łacińskiego)
type: Class
label: deaconry (Latin Church) @en
label: decanatus @la
subclass of: archidiakonat-dziekania-prepozytura-terytorium (Kościół katolicki ob. łacińskiego)
hidden label: archidiakonat
hidden label: prepozytura
hidden label: terytorium
jest zdefiniowany przez obiekt: Kościół katolicki ob. łacińskiego
jest przedstawiony za pomocą symbolu: archidiakonat-dziekania-prepozytura-terytorium
zobacz też IRI: http://vocab.getty.edu/aat/300387196

prepozytura (Kościół katolicki ob. łacińskiego)
type: Class
label: praepositura @la
label: provostship (Latin Church) @en
subclass of: archidiakonat-dziekania-prepozytura-terytorium (Kościół katolicki ob. łacińskiego)
alternative label: praeposite @en
hidden label: archidiakonat
hidden label: dziekania
hidden label: terytorium
jest zdefiniowany przez obiekt: Kościół katolicki ob. łacińskiego
jest przedstawiony za pomocą symbolu: archidiakonat-dziekania-prepozytura-terytorium
zobacz też IRI: Provost (religion)
zobacz też IRI: Q756215

terytorium (Kościół katolicki ob. łacińskiego)
type: Class
label: territorium @la
label: territory (Latin Church) @en
subclass of: archidiakonat-dziekania-prepozytura-terytorium (Kościół katolicki ob. łacińskiego)
hidden label: archidiakonat
hidden label: dziekania
hidden label: prepozytura
jest zdefiniowany przez obiekt: Kościół katolicki ob. łacińskiego
jest przedstawiony za pomocą symbolu: archidiakonat-dziekania-prepozytura-terytorium

parafia (Kościół katolicki ob. greckiego)
type: Class
label: Pfarre @de
label: parish (Greek Catholic Church) @en
label: парафия @ru
subclass of: obszar administracji religijnej
subclass of: Restriction
  on property: bildet Teil von
  some values from: protopopia-namiestnictwo-dekanat (Kościół katolicki ob. greckiego)
alternative label: приход @ru
hidden label: community @en
jest zdefiniowany przez obiekt: Kościół katolicki ob. greckiego
jest przedstawiony za pomocą symbolu: parafia, gmina
zobacz też IRI: Parish
zobacz też IRI: http://gov.genealogy.net/types.owl#29
zobacz też IRI: http://vocab.getty.edu/aat/300000773
zobacz też IRI: Q102496

protopopia-namiestnictwo-dekanat (Kościół katolicki ob. greckiego)
type: Class
label: protopopy-governorship-deanery (Greek Catholic Church) @en
subclass of: obszar administracji religijnej
subclass of: Restriction
  on property: bildet Teil von
  some values from: namiestnictwo generalne - kryłos - oficjalat (Kościół katolicki ob. greckiego)
jest zdefiniowany przez obiekt: Kościół katolicki ob. greckiego
jest przedstawiony za pomocą symbolu: dekanat-archiprezbiterat-wikariat okręgowy

namiestnictwo generalne - kryłos - oficjalat (Kościół katolicki ob. greckiego)
type: Class
label: general governorship-kliros-officialate (Greek Catholic Church) @en
subclass of: obszar administracji religijnej
subclass of: Restriction
  on property: bildet Teil von
  some values from: eparchia (Kościół katolicki ob. greckiego)
jest zdefiniowany przez obiekt: Kościół katolicki ob. greckiego
jest przedstawiony za pomocą symbolu: archidiakonat-dziekania-prepozytura-terytorium

eparchia (Kościół katolicki ob. greckiego)
type: Class
label: eparchy (Greek Catholic Church) @en
label: епархия @ru
subclass of: obszar administracji religijnej
subclass of: Restriction
  on property: bildet Teil von
  some values from: metropolia (Kościół katolicki ob. greckiego)
alternative label: diecezja
alternative label: diocese @en
hidden label: biskupstwo
jest zdefiniowany przez obiekt: Kościół katolicki ob. greckiego
jest przedstawiony za pomocą symbolu: diecezja
zobacz też IRI: Eparchy
zobacz też IRI: http://gov.genealogy.net/types.owl#11
zobacz też IRI: Q285181

metropolia (Kościół katolicki ob. greckiego)
type: Class
label: metropolis @la
label: metropoly (Greek Catholic Church) @en
label: митрополия @ru
subclass of: obszar administracji religijnej
alternative label: ecclesiastical province @en
alternative label: prowincja kościelna @la
jest zdefiniowany przez obiekt: Kościół katolicki ob. greckiego
jest przedstawiony za pomocą symbolu: metropolia
zobacz też IRI: Metropolis (religious jurisdiction)
zobacz też IRI: Q427961

protopopia (Kościół katolicki ob. greckiego)
type: Class
label: protopopy @en
label: протопопия @ru
subclass of: protopopia-namiestnictwo-dekanat (Kościół katolicki ob. greckiego)
hidden label: dekanat
hidden label: namiestnictwo
jest zdefiniowany przez obiekt: Kościół katolicki ob. greckiego
jest przedstawiony za pomocą symbolu: dekanat-archiprezbiterat-wikariat okręgowy
zobacz też IRI: Deanery
zobacz też IRI: Protopope
zobacz też IRI: Q2735717

namiestnictwo (Kościół katolicki ob. greckiego)
type: Class
label: governorship (Greek Catholic Church) @en
label: наместничество @ru
subclass of: protopopia-namiestnictwo-dekanat (Kościół katolicki ob. greckiego)
hidden label: dekanat
hidden label: protopopia
jest zdefiniowany przez obiekt: Kościół katolicki ob. greckiego
jest przedstawiony za pomocą symbolu: dekanat-archiprezbiterat-wikariat okręgowy
zobacz też IRI: Deanery

dekanat (Kościół katolicki ob. greckiego)
type: Class
label: deanery (Greek Catholic Church) @en
label: деканат @ru
subclass of: protopopia-namiestnictwo-dekanat (Kościół katolicki ob. greckiego)
hidden label: namiestnictwo
hidden label: protopopia
jest zdefiniowany przez obiekt: Kościół katolicki ob. greckiego
jest przedstawiony za pomocą symbolu: dekanat-archiprezbiterat-wikariat okręgowy
zobacz też IRI: Deanery
zobacz też IRI: http://gov.genealogy.net/types.owl#9
zobacz też IRI: Q385337

namiestnictwo generalne (Kościół katolicki ob. greckiego)
type: Class
label: general governorship (Greek Catholic Church) @en
label: генеральное наместничество @ru
subclass of: namiestnictwo generalne - kryłos - oficjalat (Kościół katolicki ob. greckiego)
hidden label: eparchia
hidden label: kryłos
hidden label: oficjalat
jest zdefiniowany przez obiekt: Kościół katolicki ob. greckiego
jest przedstawiony za pomocą symbolu: archidiakonat-dziekania-prepozytura-terytorium

kryłos (Kościół katolicki ob. greckiego)
type: Class
label: kliros (Greek Catholic Church) @en
label: крылос @ru
subclass of: namiestnictwo generalne - kryłos - oficjalat (Kościół katolicki ob. greckiego)
alternative label: клирос @ru
hidden label: eparchia
hidden label: namiestnictwo generalne
hidden label: oficjalat
jest zdefiniowany przez obiekt: Kościół katolicki ob. greckiego
jest przedstawiony za pomocą symbolu: archidiakonat-dziekania-prepozytura-terytorium

oficjalat (Kościół katolicki ob. greckiego)
type: Class
label: officialate (Greek Catholic Church) @en
label: официалат @ru
subclass of: namiestnictwo generalne - kryłos - oficjalat (Kościół katolicki ob. greckiego)
hidden label: eparchia
hidden label: kryłos
hidden label: namiestnictwo generalne
jest zdefiniowany przez obiekt: Kościół katolicki ob. greckiego
jest przedstawiony za pomocą symbolu: archidiakonat-dziekania-prepozytura-terytorium

parafia (Kościół prawosławny)
type: Class
label: Pfarre @de
label: приход @ru
subclass of: obszar administracji religijnej
subclass of: Restriction
  on property: bildet Teil von
  some values from: protopopia-namiestnictwo-okręg (Kościół prawosławny)
alternative label: парафия @ru
hidden label: community @en
jest zdefiniowany przez obiekt: Kościół prawosławny
jest przedstawiony za pomocą symbolu: parafia, gmina
zobacz też IRI: Parish
zobacz też IRI: http://gov.genealogy.net/types.owl#29
zobacz też IRI: http://vocab.getty.edu/aat/300000773
zobacz też IRI: Q102496

protopopia-namiestnictwo-okręg (Kościół prawosławny)
type: Class
subclass of: obszar administracji religijnej
subclass of: Restriction
  on property: bildet Teil von
  some values from: eparchia (Kościół prawosławny)
jest zdefiniowany przez obiekt: Kościół prawosławny
jest przedstawiony za pomocą symbolu: dekanat-archiprezbiterat-wikariat okręgowy
zobacz też tekst: protopopy-governorship-deanery (Orthodox Church) @en

eparchia (Kościół prawosławny)
type: Class
label: eparchy (Orthodox Church) @en
label: епархия @ru
subclass of: obszar administracji religijnej
subclass of: Restriction
  on property: bildet Teil von
  some values from: metropolia (Kościół prawosławny)
alternative label: diecezja
alternative label: diocese @en
hidden label: biskupstwo
jest zdefiniowany przez obiekt: Kościół prawosławny
jest przedstawiony za pomocą symbolu: diecezja
zobacz też IRI: Eparchy
zobacz też IRI: http://gov.genealogy.net/types.owl#11
zobacz też IRI: Q285181

metropolia (Kościół prawosławny)
type: Class
label: metropoly (Orthodox Church) @en
label: митрополия @ru
subclass of: obszar administracji religijnej
subclass of: Restriction
  on property: bildet Teil von
  some values from: patriarchat (Kościół prawosławny)
alternative label: ecclesiastical province @en
alternative label: metropolis @en
alternative label: prowincja kościelna
jest zdefiniowany przez obiekt: Kościół prawosławny
jest przedstawiony za pomocą symbolu: metropolia
zobacz też IRI: Metropolis (religious jurisdiction)
zobacz też IRI: Q427961

patriarchat (Kościół prawosławny)
type: Class
label: patriarchate (Orthodox Church) @en
label: патриархат @ru
subclass of: obszar administracji religijnej
alternative label: patriarchy @en
jest zdefiniowany przez obiekt: Kościół prawosławny
jest przedstawiony za pomocą symbolu: patriarchat
zobacz też IRI: Patriarchate
zobacz też IRI: Q1282276

protopopia (Kościół prawosławny)
type: Class
label: protopopy (Orthodox Church) @en
label: протопопия @ru
subclass of: protopopia-namiestnictwo-okręg (Kościół prawosławny)
hidden label: namiestnictwo
hidden label: okręg
jest zdefiniowany przez obiekt: Kościół prawosławny
jest przedstawiony za pomocą symbolu: dekanat-archiprezbiterat-wikariat okręgowy
zobacz też IRI: Deanery
zobacz też IRI: Protopope
zobacz też IRI: Q2735717

namiestnictwo (Kościół prawosławny)
type: Class
label: governorship (Orthodox Church) @en
label: наместничество @ru
subclass of: protopopia-namiestnictwo-okręg (Kościół prawosławny)
hidden label: okręg
hidden label: protopopia
jest zdefiniowany przez obiekt: Kościół prawosławny
jest przedstawiony za pomocą symbolu: dekanat-archiprezbiterat-wikariat okręgowy
zobacz też IRI: Deanery

okręg (Kościół prawosławny)
type: Class
label: благочиние @ru
subclass of: protopopia-namiestnictwo-okręg (Kościół prawosławny)
alternative label: dekanat
hidden label: namiestnictwo
hidden label: protopopia
jest zdefiniowany przez obiekt: Kościół prawosławny
jest przedstawiony za pomocą symbolu: dekanat-archiprezbiterat-wikariat okręgowy
zobacz też IRI: Deanery
zobacz też IRI: http://gov.genealogy.net/types.owl#9
zobacz też IRI: Q385337

parafia (Kościół ewangelicko-augsburski w Rzeczypospolitej Obojga Narodów)
type: Class
label: Pfarre @de
label: parish (Evangelical Augsburg Church in the Polish-Lithuanian Commonwealth) @en
subclass of: obszar administracji religijnej
subclass of: Restriction
  on property: bildet Teil von
  some values from: dystrykt (Kościół ewangelicko-augsburski w Rzeczypospolitej Obojga Narodów)
alternative label: Gemeinde @de
alternative label: community @en
alternative label: gmina
alternative label: zbór
jest zdefiniowany przez obiekt: Kościół ewangelicko-augsburski w Rzeczypospolitej Obojga Narodów
jest przedstawiony za pomocą symbolu: parafia, gmina
zobacz też IRI: Parish
zobacz też IRI: http://gov.genealogy.net/types.owl#29
zobacz też IRI: http://vocab.getty.edu/aat/300000773
zobacz też IRI: Q102496

dystrykt (Kościół ewangelicko-augsburski w Rzeczypospolitej Obojga Narodów)
type: Class
label: Superintendentur @de
label: district (Evangelical Augsburg Church in the Polish-Lithuanian Commonwealth) @en
subclass of: obszar administracji religijnej
subclass of: Restriction
  on property: bildet Teil von
  some values from: jednota (Kościół ewangelicko-augsburski w Rzeczypospolitej Obojga Narodów)
alternative label: Distrikt @de
alternative label: Seniorat @de
alternative label: seniorat okręgowy
alternative label: superintendentura
jest zdefiniowany przez obiekt: Kościół ewangelicko-augsburski w Rzeczypospolitej Obojga Narodów
jest przedstawiony za pomocą symbolu: dekanat-archiprezbiterat-wikariat okręgowy

jednota (Kościół ewangelicko-augsburski w Rzeczypospolitej Obojga Narodów)
type: Class
label: Kirchenverband @de
label: Union (Evangelical Augsburg Church in the Polish-Lithuanian Commonwealth) @en
subclass of: obszar administracji religijnej
alternative label: seniorat generalny
alternative label: superintendentura generalna
hidden label: konsystorz
jest zdefiniowany przez obiekt: Kościół ewangelicko-augsburski w Rzeczypospolitej Obojga Narodów
jest przedstawiony za pomocą symbolu: diecezja

parafia (Jednota Braci Czeskich w Polsce)
type: Class
label: Pfarre @de
label: parish (Unity of Brethren in Poland) @en
subclass of: obszar administracji religijnej
subclass of: Restriction
  on property: bildet Teil von
  some values from: dystrykt (Jednota Braci Czeskich w Polsce)
alternative label: Gemeinde @de
alternative label: community @en
alternative label: gmina
hidden label: zbór
jest zdefiniowany przez obiekt: Jednota Braci Czeskich w Polsce
jest przedstawiony za pomocą symbolu: parafia, gmina
zobacz też IRI: Parish
zobacz też IRI: http://gov.genealogy.net/types.owl#29
zobacz też IRI: http://vocab.getty.edu/aat/300000773
zobacz też IRI: Q102496

dystrykt (Jednota Braci Czeskich w Polsce)
type: Class
label: Distrikt @de
label: district (Unity of Brethren in Poland) @en
subclass of: obszar administracji religijnej
subclass of: Restriction
  on property: bildet Teil von
  some values from: jednota (Jednota Braci Czeskich w Polsce)
hidden label: Seniorat @de
hidden label: Superintendentur @de
hidden label: seniorat okręgowy
hidden label: superintendentura
jest zdefiniowany przez obiekt: Jednota Braci Czeskich w Polsce
jest przedstawiony za pomocą symbolu: dekanat-archiprezbiterat-wikariat okręgowy

jednota (Jednota Braci Czeskich w Polsce)
type: Class
label: Kirchenverband @de
label: Union (Unity of Brethren in Poland) @en
subclass of: obszar administracji religijnej
alternative label: Unity @en
hidden label: konsystorz
hidden label: seniorat generalny
hidden label: superintendentura generalna
jest zdefiniowany przez obiekt: Jednota Braci Czeskich w Polsce
jest przedstawiony za pomocą symbolu: diecezja
zobacz też IRI: Unity of the Brethren
zobacz też IRI: Q1019741

parafia (Kościół kalwiński w Rzeczypospolitej Obojga Narodów)
type: Class
label: Pfarre @de
label: parish (Calvinist Church in the Polish-Lithuanian Commonwealth) @en
subclass of: obszar administracji religijnej
subclass of: Restriction
  on property: bildet Teil von
  some values from: dystrykt (Kościół kalwiński w Rzeczypospolitej Obojga Narodów)
alternative label: Gemeinde @de
alternative label: community @en
alternative label: gmina
alternative label: zbór
jest zdefiniowany przez obiekt: Kościół kalwiński w Rzeczypospolitej Obojga Narodów
jest przedstawiony za pomocą symbolu: parafia, gmina
zobacz też IRI: Parish
zobacz też IRI: http://gov.genealogy.net/types.owl#29
zobacz też IRI: http://vocab.getty.edu/aat/300000773
zobacz też IRI: Q102496

dystrykt (Kościół kalwiński w Rzeczypospolitej Obojga Narodów)
type: Class
comment: podział na dystrykty w Jednocie Małopolskiej został zniesiony w 1692 r.
label: Distrikt @de
label: district (Calvinist Church in the Polish-Lithuanian Commonwealth) @en
subclass of: obszar administracji religijnej
subclass of: Restriction
  on property: bildet Teil von
  some values from: jednota (Kościół kalwiński w Rzeczypospolitej Obojga Narodów)
alternative label: Seniorat @de
alternative label: Superintendentur @de
alternative label: seniorat okręgowy
alternative label: superintendentura
jest zdefiniowany przez obiekt: Kościół kalwiński w Rzeczypospolitej Obojga Narodów
jest przedstawiony za pomocą symbolu: dekanat-archiprezbiterat-wikariat okręgowy

jednota (Kościół kalwiński w Rzeczypospolitej Obojga Narodów)
type: Class
label: Kirchenverband @de
label: Union (Calvinist Church in the Polish-Lithuanian Commonwealth) @en
subclass of: obszar administracji religijnej
alternative label: seniorat generalny
alternative label: superintendentura generalna
hidden label: konsystorz
jest zdefiniowany przez obiekt: Kościół kalwiński w Rzeczypospolitej Obojga Narodów
jest przedstawiony za pomocą symbolu: diecezja

parafia (Kościół ewangelicko-augsburski w Prusach 1525-1817)
type: Class
label: Pfarre @de
label: parish (Evangelical Augsburg Church in Prussia 1525-1817) @en
subclass of: obszar administracji religijnej
subclass of: Restriction
  on property: bildet Teil von
  some values from: seniorat (Kościół ewangelicko-augsburski w Prusach 1525-1817)
alternative label: Gemeinde @de
alternative label: Kirchspiel @de
alternative label: community @en
alternative label: gmina
alternative label: zbór
jest zdefiniowany przez obiekt: Kościół ewangelicko-augsburski w Prusach 1525-1817
jest przedstawiony za pomocą symbolu: parafia, gmina
zobacz też IRI: Parish
zobacz też IRI: http://gov.genealogy.net/types.owl#29
zobacz też IRI: http://vocab.getty.edu/aat/300000773
zobacz też IRI: Q102496

seniorat (Kościół ewangelicko-augsburski w Prusach 1525-1817)
type: Class
label: Seniorat @de
label: Seniorat (Evangelical Augsburg Church in Prussia 1525-1817) @en
subclass of: obszar administracji religijnej
subclass of: Restriction
  on property: bildet Teil von
  some values from: inspekcja-superintendentura-prepozytura (Kościół ewangelicko-augsburski w Prusach 1525-1817)
alternative label: Lutheran Church district @en
jest zdefiniowany przez obiekt: Kościół ewangelicko-augsburski w Prusach 1525-1817
jest przedstawiony za pomocą symbolu: seniorat
zobacz też IRI: Kirchenkreis
zobacz też IRI: Q877724
zobacz też IRI: Q897303

inspekcja-superintendentura-prepozytura (Kościół ewangelicko-augsburski w Prusach 1525-1817)
type: Class
label: Inspektion-Superintendentur-Praepositur @de
label: inspection-superintendency-provostry (Evangelical Augsburg Church in Prussia 1525-1817) @en
subclass of: obszar administracji religijnej
subclass of: Restriction
  on property: bildet Teil von
  some values from: konsystorz prowincjonalny (Kościół ewangelicko-augsburski w Prusach 1525-1817)
jest zdefiniowany przez obiekt: Kościół ewangelicko-augsburski w Prusach 1525-1817
jest przedstawiony za pomocą symbolu: dekanat-archiprezbiterat-wikariat okręgowy

konsystorz prowincjonalny (Kościół ewangelicko-augsburski w Prusach 1525-1817)
type: Class
label: Konsistorium @de
label: consistory (Evangelical Augsburg Church in Prussia 1525-1817) @en
subclass of: obszar administracji religijnej
subclass of: Restriction
  on property: bildet Teil von
  some values from: konsystorz generalny (Kościół ewangelicko-augsburski w Prusach 1525-1817)
alternative label: General Superintendentur @de
jest zdefiniowany przez obiekt: Kościół ewangelicko-augsburski w Prusach 1525-1817
jest przedstawiony za pomocą symbolu: diecezja
zobacz też IRI: Consistory (Protestantism)
zobacz też IRI: General Superintendent
zobacz też IRI: Q1381335
zobacz też IRI: Q5532221

konsystorz generalny (Kościół ewangelicko-augsburski w Prusach 1525-1817)
type: Class
label: Oberkonsistorium @de
label: general consistory (Evangelical Augsburg Church in Prussia 1525-1817) @en
subclass of: obszar administracji religijnej
alternative label: nadkonsystorz
jest zdefiniowany przez obiekt: Kościół ewangelicko-augsburski w Prusach 1525-1817
jest przedstawiony za pomocą symbolu: metropolia
zobacz też IRI: Consistory (Protestantism)
zobacz też IRI: Q1381335

inspekcja (Kościół ewangelicko-augsburski w Prusach 1525-1817)
type: Class
label: Inspektion @de
label: inspection (Evangelical Augsburg Church in Prussia 1525-1817) @en
subclass of: inspekcja-superintendentura-prepozytura (Kościół ewangelicko-augsburski w Prusach 1525-1817)
hidden label: prepozytura
hidden label: superintendentura
jest zdefiniowany przez obiekt: Kościół ewangelicko-augsburski w Prusach 1525-1817
jest przedstawiony za pomocą symbolu: dekanat-archiprezbiterat-wikariat okręgowy
zobacz też IRI: Kirchenkreis

superintendentura (Kościół ewangelicko-augsburski w Prusach 1525-1817)
type: Class
label: Superintendentur @de
label: superintendency (Evangelical Augsburg Church in Prussia 1525-1817) @en
subclass of: inspekcja-superintendentura-prepozytura (Kościół ewangelicko-augsburski w Prusach 1525-1817)
hidden label: inspekcja
hidden label: prepozytura
jest zdefiniowany przez obiekt: Kościół ewangelicko-augsburski w Prusach 1525-1817
jest przedstawiony za pomocą symbolu: dekanat-archiprezbiterat-wikariat okręgowy
zobacz też IRI: Superintendent (ecclesiastical)
zobacz też IRI: Kirchenkreis

prepozytura (Kościół ewangelicko-augsburski w Prusach 1525-1817)
type: Class
label: Praepositur @de
label: provostry (Evangelical Augsburg Church in Prussia 1525-1817) @en
subclass of: inspekcja-superintendentura-prepozytura (Kościół ewangelicko-augsburski w Prusach 1525-1817)
alternative label: Erzpriestertum @de
hidden label: inspekcja
hidden label: superintendentura
jest zdefiniowany przez obiekt: Kościół ewangelicko-augsburski w Prusach 1525-1817
jest przedstawiony za pomocą symbolu: dekanat-archiprezbiterat-wikariat okręgowy
zobacz też IRI: Provost (religion)
zobacz też IRI: Q756215

parafia (Kościół ewangelicko-reformowany w Prusach 1713-1817)
type: Class
label: Pfarre @de
label: parish (Evangelical Reformed Church in Prussia 1713-1817) @en
subclass of: obszar administracji religijnej
subclass of: Restriction
  on property: bildet Teil von
  some values from: inspekcja (Kościół ewangelicko-reformowany w Prusach 1713-1817)
alternative label: Gemeinde @de
alternative label: Kirchspiel @de
alternative label: gmina
alternative label: zbór
jest zdefiniowany przez obiekt: Kościół ewangelicko-reformowany w Prusach 1713-1817
jest przedstawiony za pomocą symbolu: parafia, gmina
zobacz też IRI: Parish
zobacz też IRI: http://gov.genealogy.net/types.owl#29
zobacz też IRI: http://vocab.getty.edu/aat/300000773
zobacz też IRI: Q102496

inspekcja (Kościół ewangelicko-reformowany w Prusach 1713-1817)
type: Class
label: Inspektion @de
label: inspection (Evangelical Reformed Church in Prussia 1713-1817) @en
subclass of: obszar administracji religijnej
subclass of: Restriction
  on property: bildet Teil von
  some values from: konsystorz generalny (Kościół ewangelicko-reformowany w Prusach 1713-1817)
alternative label: Superintendentur @de
alternative label: superintendency @en
jest zdefiniowany przez obiekt: Kościół ewangelicko-reformowany w Prusach 1713-1817
jest przedstawiony za pomocą symbolu: dekanat-archiprezbiterat-wikariat okręgowy
zobacz też IRI: Superintendent (ecclesiastical)
zobacz też IRI: Kirchenkreis

konsystorz generalny (Kościół ewangelicko-reformowany w Prusach 1713-1817)
type: Class
label: Oberkonsistorium @de
label: general consistory (Evangelical Reformed Church in Prussia 1713-1817) @en
subclass of: obszar administracji religijnej
alternative label: Generalseniorat @de
alternative label: Kirchendirectorium @de
alternative label: nadkonsystorz
jest zdefiniowany przez obiekt: Kościół ewangelicko-reformowany w Prusach 1713-1817
jest przedstawiony za pomocą symbolu: metropolia
zobacz też IRI: Consistory (Protestantism)
zobacz też IRI: Q1381335

parafia (Kościół ewangelicki w Prusach 1817-1939)
type: Class
label: Pfarre @de
label: parish (Evangelical Church in Prussia 1817-1939) @en
subclass of: obszar administracji religijnej
subclass of: Restriction
  on property: bildet Teil von
  some values from: superintendentura (Kościół ewangelicki w Prusach 1817-1939)
alternative label: Gemeinde @de
alternative label: Kirchspiel @de
alternative label: community @en
alternative label: gmina
alternative label: zbór
jest zdefiniowany przez obiekt: Kościół ewangelicki w Prusach 1817-1939
jest przedstawiony za pomocą symbolu: parafia, gmina
zobacz też IRI: Parish
zobacz też IRI: http://gov.genealogy.net/types.owl#29
zobacz też IRI: http://vocab.getty.edu/aat/300000773
zobacz też IRI: Q102496

superintendentura (Kościół ewangelicki w Prusach 1817-1939)
type: Class
comment: typ wprowadzony ze względu na podział niechtórych okręgów kościelnych (Kirchenkreis), np. Tilsit-Ragnit, na dwa "Superintendenturbezirke" w 1937 r.
label: Superintendentur @de
label: superintendency (Evangelical Church in Prussia 1817-1939) @en
subclass of: obszar administracji religijnej
subclass of: Restriction
  on property: bildet Teil von
  some values from: okręg kościelny (Kościół ewangelicki w Prusach 1817-1939)
alternative label: Diözese @de
alternative label: diocese @en
jest zdefiniowany przez obiekt: Kościół ewangelicki w Prusach 1817-1939
jest przedstawiony za pomocą symbolu: seniorat
zobacz też IRI: Superintendent (ecclesiastical)
zobacz też IRI: Kirchenkreis

okręg kościelny (Kościół ewangelicki w Prusach 1817-1939)
type: Class
comment: s. 369: Die ältere Theilung des Herzgothums, dann Königsreichs Preussen in geistlichen Inspectionen erlitt schon vor der neuen Kreiseintheilung -- eingerichtet werden @de
comment: s. XXVI: In Folge der Kreiseintheilung von 1816 wurde auch die Sprengel der Superintendenturen mehr nach den Kreisgrenzen festgesetz und zwar --. @de
label: Superintendentur @de
label: district (Evangelical Church in Prussia 1817-1939) @en
subclass of: obszar administracji religijnej
subclass of: Restriction
  on property: bildet Teil von
  some values from: prowincja kościelna (Kościół ewangelicki w Prusach 1817-1939)
alternative label: Diözese @de
alternative label: Inspektion @de
alternative label: Kirchenkreis @de
alternative label: diocese @en
alternative label: inspection @en
alternative label: superintendency @en
jest zdefiniowany przez obiekt: Kościół ewangelicki w Prusach 1817-1939
jest przedstawiony za pomocą symbolu: dekanat-archiprezbiterat-wikariat okręgowy
zobacz też IRI: Superintendent (ecclesiastical)
zobacz też IRI: http://gov.genealogy.net/types.owl#27
zobacz też IRI: Kirchenkreis

gmina miejska (Rzeczpospolita Polska (1918-1939))
type: Class
comment: Zgodnie z treścią konstytucji marcowej (1921) "Dla celów administracyjnych Państwo Polskie podzielone będzie w drodze ustawodawczej na województwa, powiaty i gminy miejskie i wiejskie, które będą równocześnie jednostkami samorządu terytorjalnego". Faktycznie cały okres międzywojenny charakteryzuje proces unifikacji terytorialnej administracji ogólnej, której celem jest likwidacja różnic między byłymi zaborami. Ostatnim ważnym aktem była likwidacja obszarów dworskich na terenie woj. poznańskiego oraz pomorskiego na mocy tzw. ustawy scaleniowej z 1933 r.
label: town commune (The Second Polish Republic) @en
subclass of: gmina
jest zdefiniowany przez obiekt: Rzeczpospolita Polska (1918-1939)
jest przedstawiony za pomocą symbolu: gmina, obszar dworski, dominium

prowincja kościelna (Kościół ewangelicki w Prusach 1817-1939)
type: Class
comment: s. 114: urząd generalnego superintendenta równoważny z sakrą biskupią
comment: s. 45-46: w latach 1776-1793 rozwiązano konsystorze i nadzór przejęły urzędy rejencyjne, powrót do konsystorzy nastąpił w 1815 r., zakres działań konsystorzy był bardzo ograniczony a rolę zarządzającą pełniły urzędy rejencyjne; s. 47: konsystorz był na poziomie prowincji a więc nad rejencją, np. urzędnicy konsystorza w Poznaniu ściśle współpracowali z rejencją poznańską ale już z bydgoską nie
label: Kirchenprovinz @de
label: ecclesiastical province (Evangelical Church in Prussia 1817-1939) @en
subclass of: obszar administracji religijnej
subclass of: Restriction
  on property: bildet Teil von
  some values from: kościół krajowy (Kościół ewangelicki w Prusach 1817-1939)
alternative label: Diözese @de
alternative label: General Superintendentur @de
alternative label: Konsistorium @de
alternative label: consistory @en
alternative label: diecezja
alternative label: diocese @en
alternative label: konsystorz prowincjonalny
jest zdefiniowany przez obiekt: Kościół ewangelicki w Prusach 1817-1939
jest przedstawiony za pomocą symbolu: diecezja
zobacz też IRI: Consistory (Protestantism)
zobacz też IRI: General Superintendent
zobacz też IRI: http://gov.genealogy.net/types.owl#28
zobacz też IRI: Q1381335
zobacz też IRI: Q5532221

kościół krajowy (Kościół ewangelicki w Prusach 1817-1939)
type: Class
label: Landeskirche @de
label: state church (Evangelical Church in Prussia 1817-1939) @en
subclass of: obszar administracji religijnej
subclass of: Restriction
  on property: bildet Teil von
  some values from: konfederacja (Kościół ewangelicki w Prusach 1817-1939)
alternative label: national church @en
jest zdefiniowany przez obiekt: Kościół ewangelicki w Prusach 1817-1939
jest przedstawiony za pomocą symbolu: metropolia
zobacz też IRI: Landeskirche
zobacz też IRI: http://gov.genealogy.net/types.owl#35
zobacz też IRI: Q565744

konfederacja (Kościół ewangelicki w Prusach 1817-1939)
type: Class
label: Kirchenbund @de
label: federation (Evangelical Church in Prussia 1817-1939) @en
subclass of: obszar administracji religijnej
alternative label: union @en
jest zdefiniowany przez obiekt: Kościół ewangelicki w Prusach 1817-1939
jest przedstawiony za pomocą symbolu: konfederacja
zobacz też IRI: http://gov.genealogy.net/types.owl#210

parafia (Kościół ewangelicki w Królestwie Polskim 1828-1849)
type: Class
label: Pfarre @de
label: parish (Evangelical Church in Kingdom of Poland 1828-1849) @en
subclass of: obszar administracji religijnej
subclass of: Restriction
  on property: bildet Teil von
  some values from: diecezja (Kościół ewangelicki w Królestwie Polskim 1828-1849)
alternative label: Gemeinde @de
alternative label: Kirchspiel @de
alternative label: community @en
alternative label: gmina
alternative label: zbór
jest zdefiniowany przez obiekt: Kościół ewangelicki w Królestwie Polskim 1828-1849
jest przedstawiony za pomocą symbolu: parafia, gmina
zobacz też IRI: Parish
zobacz też IRI: http://gov.genealogy.net/types.owl#29
zobacz też IRI: http://vocab.getty.edu/aat/300000773
zobacz też IRI: Q102496

diecezja (Kościół ewangelicki w Królestwie Polskim 1828-1849)
type: Class
label: Diözese @de
label: diocese (Evangelical Church in Kingdom of Poland 1828-1849) @en
subclass of: obszar administracji religijnej
subclass of: Restriction
  on property: bildet Teil von
  some values from: konsystorz generalny (Kościół ewangelicki w Królestwie Polskim 1828-1849)
alternative label: Superintendentur @de
alternative label: superintendentura
jest zdefiniowany przez obiekt: Kościół ewangelicki w Królestwie Polskim 1828-1849
jest przedstawiony za pomocą symbolu: diecezja
zobacz też IRI: Diocese
zobacz też IRI: Superintendent (ecclesiastical)
zobacz też IRI: http://vocab.getty.edu/aat/300000799
zobacz też IRI: Q665487

konsystorz generalny (Kościół ewangelicki w Królestwie Polskim 1828-1849)
type: Class
comment: s. 15: Warszawski Okręg Konsystorski nie został włączony do konsystorza generalnego w Petersburgu po 1832 roku, nie wykonano też żadnych ruchów w tym kiierunku po 1849 r. Wg. autora byłoby to korzystne i część duchownych to dostrzegała
comment: s. 29: Komisja Rządowa Wyznań Religijnych i Oświecenia publicznego zlikwidowała istniejące luterańskie konsystorze departamentowe utworzone po 1807 r.
label: General Konsistorium @de
label: general consistory (Evangelical Church in Kingdom of Poland 1828-1849) @en
subclass of: obszar administracji religijnej
jest zdefiniowany przez obiekt: Kościół ewangelicki w Królestwie Polskim 1828-1849
jest przedstawiony za pomocą symbolu: metropolia
zobacz też IRI: Consistory (Protestantism)
zobacz też IRI: Q1381335

parafia (Kościół ewangelicko-augsburski w Polsce 1849-1939)
type: Class
label: Pfarre @de
label: parish (Evangelical Augsburg Church in Poland 1849-1939) @en
subclass of: obszar administracji religijnej
subclass of: Restriction
  on property: bildet Teil von
  some values from: superintendentura (Kościół ewangelicko-augsburski w Polsce 1849-1939)
alternative label: Gemeinde @de
alternative label: Kirchspiel @de
alternative label: community @en
alternative label: gmina
alternative label: zbór
jest zdefiniowany przez obiekt: Kościół ewangelicko-augsburski w Polsce 1849-1939
jest przedstawiony za pomocą symbolu: parafia, gmina
zobacz też IRI: Parish
zobacz też IRI: http://gov.genealogy.net/types.owl#29
zobacz też IRI: http://vocab.getty.edu/aat/300000773
zobacz też IRI: Q102496

superintendentura (Kościół ewangelicko-augsburski w Polsce 1849-1939)
type: Class
comment: od 1936 diecezja, seniorzy diecezji, seniorat
label: Superintendentur @de
label: superintendecy (Evangelical Augsburg Church in Poland 1849-1939) @en
subclass of: obszar administracji religijnej
subclass of: Restriction
  on property: bildet Teil von
  some values from: konsystorz generalny (Kościół ewangelicko-augsburski w Polsce 1849-1939)
alternative label: Diözese @de
alternative label: diecezja
alternative label: diocese @en
alternative label: seniorat
jest zdefiniowany przez obiekt: Kościół ewangelicko-augsburski w Polsce 1849-1939
jest przedstawiony za pomocą symbolu: diecezja
zobacz też IRI: Diocese
zobacz też IRI: Superintendent (ecclesiastical)
zobacz też tekst: s. 21: Funkcjonowały na poczatku 4 superintendentury, w 1901 r. utworzono piątą

konsystorz generalny (Kościół ewangelicko-augsburski w Polsce 1849-1939)
type: Class
label: Oberkonsistorium @de
label: general consistory (Evangelical Augsburg Church in Poland 1849-1939) @en
subclass of: obszar administracji religijnej
alternative label: bishopric @en
alternative label: biskupstwo
alternative label: generalna superintendentura
alternative label: nadkonsystorz @de
alternative label: superintendency @en
jest zdefiniowany przez obiekt: Kościół ewangelicko-augsburski w Polsce 1849-1939
jest przedstawiony za pomocą symbolu: metropolia
zobacz też IRI: Consistory (Protestantism)
zobacz też IRI: Q1381335
zobacz też tekst: s. 11: początkowo ewangelicy litewscy z Wilna byli związani z konsystorzem w Królewcu; od 1652 r. sami nazywają się konsystorzem, co oznacza rozluźnienie więzów z Prusami; od 1794 r. podporządkowani Justizkolegium w Petersburgu; w 1832 r. został zlikwidowany konsystorz ewangelicko-augsburski w Wilnie i podporządkowanie Mitawie, a ten nadkonsystorzowi w Petersbugu, w 1922 r. wchłonięty do Konsystorza Warszawskiego.
zobacz też tekst: s. 15: Warszawski Okręg Konsystorski nie został włączony do konsystorza generalnego w Petersburgu po 1832 roku, nie wykonano też żadnych ruchów w tym kiierunku po 1849 r.

parafia (Kościół ewangelicko-reformowany w Polsce 1849-1939)
type: Class
label: Pfarre @de
label: parish (Evangelical Reformed Church in Poland 1849-1939) @en
subclass of: obszar administracji religijnej
subclass of: Restriction
  on property: bildet Teil von
  some values from: superintendentura (Kościół ewangelicko-reformowany w Polsce 1849-1939)
alternative label: Gemeinde @de
alternative label: community @en
alternative label: gmina
alternative label: zbór
jest zdefiniowany przez obiekt: Kościół ewangelicko-reformowany w Polsce 1849-1939
jest przedstawiony za pomocą symbolu: parafia, gmina
zobacz też IRI: Parish
zobacz też IRI: http://gov.genealogy.net/types.owl#29
zobacz też IRI: http://vocab.getty.edu/aat/300000773
zobacz też IRI: Q102496

superintendentura (Kościół ewangelicko-reformowany w Polsce 1849-1939)
type: Class
label: superintendency (Evangelical Reformed Church in Poland 1849-1939) @en
subclass of: obszar administracji religijnej
subclass of: Restriction
  on property: bildet Teil von
  some values from: konsystorz generalny (Kościół ewangelicko-reformowany w Polsce 1849-1939)
alternative label: okręg parafialny
jest zdefiniowany przez obiekt: Kościół ewangelicko-reformowany w Polsce 1849-1939
jest przedstawiony za pomocą symbolu: diecezja
zobacz też IRI: Superintendent (ecclesiastical)

konsystorz generalny (Kościół ewangelicko-reformowany w Polsce 1849-1939)
type: Class
label: general consistory (Evangelical Reformed Church in Poland 1849-1939) @en
subclass of: obszar administracji religijnej
alternative label: generalna superintendentura
alternative label: nadkonsystorz
jest zdefiniowany przez obiekt: Kościół ewangelicko-reformowany w Polsce 1849-1939
jest przedstawiony za pomocą symbolu: metropolia
zobacz też IRI: Consistory (Protestantism)
zobacz też IRI: Q1381335

gmina (Kościół ewangelicki w Galicji 1781-1918)
type: Class
label: Gemeinde @de
subclass of: obszar administracji religijnej
subclass of: Restriction
  on property: bildet Teil von
  some values from: seniorat (Kościół ewangelicki w Galicji 1781-1918)
alternative label: Kirchspiel @de
alternative label: Pastorat @de
alternative label: Pfarre @de
alternative label: parafia
alternative label: zbór
jest zdefiniowany przez obiekt: Kościół ewangelicki w Galicji 1781-1918
jest przedstawiony za pomocą symbolu: parafia, gmina

seniorat (Kościół ewangelicki w Galicji 1781-1918)
type: Class
label: Seniorat @de
subclass of: obszar administracji religijnej
subclass of: Restriction
  on property: bildet Teil von
  some values from: superintendentura (Kościół ewangelicki w Galicji 1781-1918)
jest zdefiniowany przez obiekt: Kościół ewangelicki w Galicji 1781-1918
jest przedstawiony za pomocą symbolu: dekanat-archiprezbiterat-wikariat okręgowy

superintendentura (Kościół ewangelicki w Galicji 1781-1918)
type: Class
label: Superintendentur @de
subclass of: obszar administracji religijnej
subclass of: Restriction
  on property: bildet Teil von
  some values from: konsystorz (Kościół ewangelicki w Galicji 1781-1918)
jest zdefiniowany przez obiekt: Kościół ewangelicki w Galicji 1781-1918
jest przedstawiony za pomocą symbolu: diecezja

konsystorz (Kościół ewangelicki w Galicji 1781-1918)
type: Class
label: Konsistorium @de
subclass of: obszar administracji religijnej
alternative label: General Superintendentur @de
jest zdefiniowany przez obiekt: Kościół ewangelicki w Galicji 1781-1918
jest przedstawiony za pomocą symbolu: metropolia

przykahałek (Żydzi w Rzeczypospolitej Obojga Narodów)
type: Class
subclass of: obszar administracji religijnej
subclass of: Restriction
  on property: bildet Teil von
  some values from: gmina (Żydzi w Rzeczypospolitej Obojga Narodów)
jest zdefiniowany przez obiekt: Żydzi w Rzeczypospolitej Obojga Narodów
jest przedstawiony za pomocą symbolu: filia, przykahałek

gmina (Żydzi w Rzeczypospolitej Obojga Narodów)
type: Class
subclass of: obszar administracji religijnej
subclass of: Restriction
  on property: bildet Teil von
  some values from: kahał okręgowy (Żydzi w Rzeczypospolitej Obojga Narodów)
alternative label: kahał
jest zdefiniowany przez obiekt: Żydzi w Rzeczypospolitej Obojga Narodów
jest przedstawiony za pomocą symbolu: parafia, gmina

kahał okręgowy (Żydzi w Rzeczypospolitej Obojga Narodów)
type: Class
label: galil @he
subclass of: obszar administracji religijnej
subclass of: Restriction
  on property: bildet Teil von
  some values from: kahał okręgowy (Żydzi w Rzeczypospolitej Obojga Narodów)
alternative label: podokręg
jest zdefiniowany przez obiekt: Żydzi w Rzeczypospolitej Obojga Narodów
jest przedstawiony za pomocą symbolu: seniorat

kahał okręgowy (Żydzi w Rzeczypospolitej Obojga Narodów)
type: Class
label: galil @he
subclass of: obszar administracji religijnej
subclass of: Restriction
  on property: bildet Teil von
  some values from: kahał główny (Żydzi w Rzeczypospolitej Obojga Narodów)
alternative label: okręg
jest zdefiniowany przez obiekt: Żydzi w Rzeczypospolitej Obojga Narodów
jest przedstawiony za pomocą symbolu: dekanat-archiprezbiterat-wikariat okręgowy

kahał główny (Żydzi w Rzeczypospolitej Obojga Narodów)
type: Class
label: rosz ha-kehila @he
subclass of: obszar administracji religijnej
subclass of: Restriction
  on property: bildet Teil von
  some values from: prowincja (Żydzi w Rzeczypospolitej Obojga Narodów)
alternative label: kahał na prawach ziemstwa
alternative label: kahał pryncypialny
alternative label: raszej ha-kehilot @he
alternative label: ziemstwo
jest zdefiniowany przez obiekt: Żydzi w Rzeczypospolitej Obojga Narodów
jest przedstawiony za pomocą symbolu: diecezja

prowincja (Żydzi w Rzeczypospolitej Obojga Narodów)
type: Class
label: waad @he
subclass of: obszar administracji religijnej
jest zdefiniowany przez obiekt: Żydzi w Rzeczypospolitej Obojga Narodów
jest przedstawiony za pomocą symbolu: metropolia

wołość (Wielkie Księstwo Litewskie (1385-1569))
type: Class
label: wolost (The Grand Duchy of Lithuania) @en
subclass of: obszar administracji świeckiej
subclass of: Restriction
  on property: bildet Teil von
  some values from: ziemia (Wielkie Księstwo Litewskie (1385-1569))
jest zdefiniowany przez obiekt: Wielkie Księstwo Litewskie (1385-1569)
jest przedstawiony za pomocą symbolu: Wielkie Księstwo Litewskie (1385-1569)
zobacz też IRI: http://dbpedia.org/page/Volost
zobacz też IRI: https://www.wikidata.org/wiki/Q687121

ziemia (Wielkie Księstwo Litewskie (1385-1569))
type: Class
label: land (The Grand Duchy of Lithuania) @en
subclass of: ziemia (Królestwo Polskie (1370-1568))
subclass of: Restriction
  on property: bildet Teil von
  some values from: księstwo (Wielkie Księstwo Litewskie (1385-1569))
jest zdefiniowany przez obiekt: Wielkie Księstwo Litewskie (1385-1569)
jest przedstawiony za pomocą symbolu: Wielkie Księstwo Litewskie (1385-1569)

księstwo (Wielkie Księstwo Litewskie (1385-1569))
type: Class
label: duchy (The Grand Duchy of Lithuania) @en
subclass of: obszar administracji świeckiej
jest zdefiniowany przez obiekt: Wielkie Księstwo Litewskie (1385-1569)
jest przedstawiony za pomocą symbolu: Wielkie Księstwo Litewskie (1385-1569)
zobacz też IRI: http://gov.genealogy.net/types.owl#60
zobacz też IRI: https://www.wikidata.org/wiki/Q208500

powiat (Królestwo Saksonii (1815-1918))
type: Class
label: Kreis @de
label: district (The Kingdom of Saxony (1815-1918)) @en
subclass of: obszar administracji świeckiej
jest zdefiniowany przez obiekt: Królestwo Saksonii (1815-1918)
jest przedstawiony za pomocą symbolu: Królestwo Saksonii (1815-1918)

okręg (Królestwo Saksonii (1815-1918))
type: Class
label: Amt @de
label: shire district (The Kingdom of Saxony (1815-1918)) @en
subclass of: obszar administracji świeckiej
subclass of: Restriction
  on property: bildet Teil von
  some values from: powiat (Królestwo Saksonii (1815-1918))
alternative label: county @en
jest zdefiniowany przez obiekt: Królestwo Saksonii (1815-1918)
jest przedstawiony za pomocą symbolu: Królestwo Saksonii (1815-1918)

gmina (Królestwo Saksonii (1815-1918))
type: Class
label: Gemeinde @de
label: municipality (The Kingdom of Saxony (1815-1918)) @en
subclass of: obszar administracji świeckiej
subclass of: Restriction
  on property: bildet Teil von
  some values from: okręg (Królestwo Saksonii (1815-1918))
alternative label: commume @en
jest zdefiniowany przez obiekt: Królestwo Saksonii (1815-1918)
jest przedstawiony za pomocą symbolu: Królestwo Saksonii (1815-1918)
zobacz też IRI: http://dbpedia.org/page/Gemeinde
zobacz też IRI: http://gov.genealogy.net/types.owl#group_31
zobacz też IRI: https://www.wikidata.org/wiki/Q262166

gmina (Księstwo Warszawskie (1807-1815))
type: Class
label: commune (The Duchy of Warsaw (1807-1815)) @en
subclass of: obszar administracji świeckiej
subclass of: Restriction
  on property: bildet Teil von
  some values from: powiat (Księstwo Warszawskie (1807-1815))
jest zdefiniowany przez obiekt: Księstwo Warszawskie (1807-1815)
jest przedstawiony za pomocą symbolu: Księstwo Warszawskie (1807-1815)

powiat (Księstwo Warszawskie (1807-1815))
type: Class
label: district (The Duchy of Warsaw (1807-1815)) @en
subclass of: obszar administracji świeckiej
subclass of: Restriction
  on property: bildet Teil von
  some values from: departament (Księstwo Warszawskie (1807-1815))
jest zdefiniowany przez obiekt: Księstwo Warszawskie (1807-1815)
jest przedstawiony za pomocą symbolu: Księstwo Warszawskie (1807-1815)

departament (Księstwo Warszawskie (1807-1815))
type: Class
label: department (The Duchy of Warsaw (1807-1815)) @en
subclass of: obszar administracji świeckiej
subclass of: Restriction
  on property: bildet Teil von
  some values from: księstwo (Księstwo Warszawskie (1807-1815))
jest zdefiniowany przez obiekt: Księstwo Warszawskie (1807-1815)
jest przedstawiony za pomocą symbolu: Księstwo Warszawskie (1807-1815)

księstwo (Księstwo Warszawskie (1807-1815))
type: Class
label: Duchy (The Duchy of Warsaw (1807-1815)) @en
subclass of: obszar administracji świeckiej
jest zdefiniowany przez obiekt: Księstwo Warszawskie (1807-1815)
jest przedstawiony za pomocą symbolu: Księstwo Warszawskie (1807-1815)
zobacz też IRI: http://gov.genealogy.net/types.owl#60
zobacz też IRI: https://www.wikidata.org/wiki/Q208500

municypalność (Księstwo Warszawskie (1807-1815))
type: Class
comment: najniższa jednostka administracyjna, bez rozróżnienia na miejską i wiejską (niewprowadzone w życie) (M. Kallas, s. 212)
label: municipality (The Duchy of Warsaw (1807-1815)) @en
subclass of: gmina (Księstwo Warszawskie (1807-1815))
jest zdefiniowany przez obiekt: Księstwo Warszawskie (1807-1815)
jest przedstawiony za pomocą symbolu: Księstwo Warszawskie (1807-1815)

zgromadzenie gminne (Księstwo Warszawskie (1807-1815))
type: Class
comment: dekret królewski z 19.12.1807 (J. Goclon, s. 107)
label: communal assembly (The Duchy of Warsaw (1807-1815)) @en
subclass of: gmina (Księstwo Warszawskie (1807-1815))
jest zdefiniowany przez obiekt: Księstwo Warszawskie (1807-1815)
jest przedstawiony za pomocą symbolu: Księstwo Warszawskie (1807-1815)

gmina wiejska (Księstwo Warszawskie (1807-1815))
type: Class
comment: od 23.02.1809 (M. Kallas, s. 212)
label: rural commune (The Duchy of Warsaw (1807-1815)) @en
subclass of: gmina (Księstwo Warszawskie (1807-1815))
jest zdefiniowany przez obiekt: Księstwo Warszawskie (1807-1815)
jest przedstawiony za pomocą symbolu: Księstwo Warszawskie (1807-1815)

gmina miejska (Księstwo Warszawskie (1807-1815))
type: Class
comment: od 23.02.1809 (M. Kallas, s. 212)
label: town commune (The Duchy of Warsaw (1807-1815)) @en
subclass of: gmina (Księstwo Warszawskie (1807-1815))
jest zdefiniowany przez obiekt: Księstwo Warszawskie (1807-1815)
jest przedstawiony za pomocą symbolu: Księstwo Warszawskie (1807-1815)

metropolia (Kościół katolicki ob. ormiańskiego)
type: Class
subclass of: obszar administracji religijnej
jest zdefiniowany przez obiekt: Kościół katolicki ob. ormiańskiego
jest przedstawiony za pomocą symbolu: Kościół katolicki ob. ormiańskiego

gmina (Wolne Państwo Prusy (1920-1945))
type: Class
label: Gemeinde @de
label: commune (The Free State of Prussia) @en
subclass of: obszar administracji świeckiej
subclass of: Restriction
  on property: bildet Teil von
  some values from: wójtostwo (Wolne Państwo Prusy (1920-1945))
jest zdefiniowany przez obiekt: Wolne Państwo Prusy (1920-1945)
jest przedstawiony za pomocą symbolu: gmina, obszar dworski, dominium
zobacz też IRI: http://dbpedia.org/page/Gemeinde
zobacz też IRI: http://gov.genealogy.net/types.owl#group_31
zobacz też IRI: https://www.wikidata.org/wiki/Q262166

diecezja (Kościół katolicki ob. ormiańskiego)
type: Class
subclass of: obszar administracji religijnej
subclass of: Restriction
  on property: bildet Teil von
  some values from: metropolia (Kościół katolicki ob. ormiańskiego)
jest zdefiniowany przez obiekt: Kościół katolicki ob. ormiańskiego
jest przedstawiony za pomocą symbolu: Kościół katolicki ob. ormiańskiego

parafia (Kościół katolicki ob. ormiańskiego)
type: Class
subclass of: obszar administracji religijnej
subclass of: Restriction
  on property: bildet Teil von
  some values from: diecezja (Kościół katolicki ob. ormiańskiego)
jest zdefiniowany przez obiekt: Kościół katolicki ob. ormiańskiego
jest przedstawiony za pomocą symbolu: Kościół katolicki ob. ormiańskiego

gmina (Królestwo Polskie (1815-1836))
type: Class
label: commune (Kingdom of Poland (1815-1837)) @en
subclass of: obszar administracji świeckiej
subclass of: Restriction
  on property: bildet Teil von
  some values from: powiat (Królestwo Polskie (1815-1836))
alternative label: municipality @en
jest zdefiniowany przez obiekt: Królestwo Polskie (1815-1836)
jest przedstawiony za pomocą symbolu: Królestwo Polskie (1815-1836)

powiat (Królestwo Polskie (1815-1836))
type: Class
label: district (Kingdom of Poland (1815-1837)) @en
subclass of: obszar administracji świeckiej
jest zdefiniowany przez obiekt: Królestwo Polskie (1815-1836)
jest przedstawiony za pomocą symbolu: Królestwo Polskie (1815-1836)

obwód (Królestwo Polskie (1815-1836))
type: Class
label: district (Kingdom of Poland (1815-1837)) @en
subclass of: obszar administracji świeckiej
subclass of: Restriction
  on property: bildet Teil von
  some values from: województwo (Królestwo Polskie (1815-1836))
jest zdefiniowany przez obiekt: Królestwo Polskie (1815-1836)
jest przedstawiony za pomocą symbolu: Królestwo Polskie (1815-1836)

województwo (Królestwo Polskie (1815-1836))
type: Class
comment: W 1815 wprowadzono podział na województwa, który pokrywał się z Departamentami z Księstwa Warszawskiego (M. Kallas, s. 238). W 1837 na mocy ukazu carskiego wprowadzono gubernie w miejsce województw.
label: voivodeship (Kingdom of Poland (1815-1837)) @en
subclass of: obszar administracji świeckiej
subclass of: Restriction
  on property: bildet Teil von
  some values from: królestwo (Królestwo Polskie (1815-1836)) (Królestwo Polskie (1815-1836))
alternative label: province @en
jest zdefiniowany przez obiekt: Królestwo Polskie (1815-1836)
jest przedstawiony za pomocą symbolu: Królestwo Polskie (1815-1836)

królestwo (Królestwo Polskie (1815-1836)) (Królestwo Polskie (1815-1836))
type: Class
label: kingdom (Kingdom of Poland (1815-1837)) @en
subclass of: obszar administracji świeckiej
jest zdefiniowany przez obiekt: Królestwo Polskie (1815-1836)
jest przedstawiony za pomocą symbolu: Królestwo Polskie (1815-1836)
zobacz też IRI: http://gov.genealogy.net/types.owl#group_26
zobacz też IRI: https://www.wikidata.org/wiki/Q417175

gmina miejska (Królestwo Polskie (1815-1836))
type: Class
label: town commune (Kingdom of Poland (1815-1837)) @en
subclass of: gmina (Królestwo Polskie (1815-1836))
jest zdefiniowany przez obiekt: Królestwo Polskie (1815-1836)
jest przedstawiony za pomocą symbolu: Królestwo Polskie (1815-1836)

gmina wiejska (Królestwo Polskie (1815-1836))
type: Class
label: rural commune (Kingdom of Poland (1815-1837)) @en
subclass of: gmina (Królestwo Polskie (1815-1836))
jest zdefiniowany przez obiekt: Królestwo Polskie (1815-1836)
jest przedstawiony za pomocą symbolu: Królestwo Polskie (1815-1836)

wójtostwo (Wolne Państwo Prusy (1920-1945))
type: Class
comment: "Od 1.01. 1873 z wyłączeniem Prowincji Poznańskiej. W Prowincji Poznańskiej w l 1818-1833 w okręgach wiejskich (Bezirke), łączących kilka gmin, władzę wójtowską sprawowali właściciele dóbr ziemskich. Od 1833 roku do 1918 pełnili te funkcje okręgowi komisarze policji."
label: Amtsbezirk @de
label: bailiwick (The Free State of Prussia) @en
subclass of: obszar administracji świeckiej
subclass of: Restriction
  on property: bildet Teil von
  some values from: powiat (Wolne Państwo Prusy (1920-1945))
alternative label: administrative district @en
alternative label: bailwick @en
jest zdefiniowany przez obiekt: Wolne Państwo Prusy (1920-1945)
jest przedstawiony za pomocą symbolu: wójtostwo, okręg, prokuratorstwo

gmina (Królestwo Polskie (1867-1918))
type: Class
label: commune (Congress Poland (1867-1918)) @en
subclass of: obszar administracji świeckiej
subclass of: Restriction
  on property: bildet Teil von
  some values from: powiat (Królestwo Polskie (1867-1918))
alternative label: municipality @en
jest zdefiniowany przez obiekt: Królestwo Polskie (1867-1918)
jest przedstawiony za pomocą symbolu: Królestwo Polskie (1867-1918)

gmina miejska (Królestwo Polskie (1867-1918))
type: Class
label: town commune (Congress Poland (1867-1918)) @en
subclass of: gmina (Królestwo Polskie (1867-1918))
jest zdefiniowany przez obiekt: Królestwo Polskie (1867-1918)
jest przedstawiony za pomocą symbolu: Królestwo Polskie (1867-1918)

gmina wiejska (Królestwo Polskie (1867-1918))
type: Class
label: rural commune (Congress Poland (1867-1918)) @en
subclass of: gmina (Królestwo Polskie (1867-1918))
jest zdefiniowany przez obiekt: Królestwo Polskie (1867-1918)
jest przedstawiony za pomocą symbolu: Królestwo Polskie (1867-1918)

powiat (Królestwo Polskie (1867-1918))
type: Class
label: district (Congress Poland (1867-1918)) @en
subclass of: obszar administracji świeckiej
subclass of: Restriction
  on property: bildet Teil von
  some values from: gubernia (Królestwo Polskie (1867-1918))
jest zdefiniowany przez obiekt: Królestwo Polskie (1867-1918)
jest przedstawiony za pomocą symbolu: Królestwo Polskie (1867-1918)

gubernia (Królestwo Polskie (1867-1918))
type: Class
label: province (Congress Poland (1867-1918)) @en
subclass of: obszar administracji świeckiej
subclass of: Restriction
  on property: bildet Teil von
  some values from: generał-gubernatorstwo (Królestwo Polskie (1867-1918))
jest zdefiniowany przez obiekt: Królestwo Polskie (1867-1918)
jest przedstawiony za pomocą symbolu: Królestwo Polskie (1867-1918)

generał-gubernatorstwo (Królestwo Polskie (1867-1918))
type: Class
label: general-governorate (Congress Poland (1867-1918)) @en
subclass of: obszar administracji świeckiej
alternative label: kingdom @en
alternative label: kraj
alternative label: królestwo
alternative label: land @en
jest zdefiniowany przez obiekt: Królestwo Polskie (1867-1918)
jest przedstawiony za pomocą symbolu: Królestwo Polskie (1867-1918)

gmina (Wolne Miasto Gdańsk (1920-1939))
type: Class
label: commune (The Free City of Danzig (1920-1939)) @en
subclass of: obszar administracji świeckiej
subclass of: Restriction
  on property: bildet Teil von
  some values from: powiat (Wolne Miasto Gdańsk (1920-1939))
jest zdefiniowany przez obiekt: Wolne Miasto Gdańsk (1920-1939)
jest przedstawiony za pomocą symbolu: Wolne Miasto Gdańsk (1920-1939)
zobacz też IRI: http://dbpedia.org/page/Gemeinde
zobacz też IRI: http://gov.genealogy.net/types.owl#group_31
zobacz też IRI: https://www.wikidata.org/wiki/Q262166

gmina miejska (Wolne Miasto Gdańsk (1920-1939))
type: Class
label: commune (The Free City of Danzig (1920-1939)) @en
subclass of: gmina (Wolne Miasto Gdańsk (1920-1939))
alternative label: municipality @en
alternative label: town @en
jest zdefiniowany przez obiekt: Wolne Miasto Gdańsk (1920-1939)
jest przedstawiony za pomocą symbolu: Wolne Miasto Gdańsk (1920-1939)

gmina wiejska (Wolne Miasto Gdańsk (1920-1939))
type: Class
label: rural commune (The Free City of Danzig (1920-1939)) @en
subclass of: gmina (Wolne Miasto Gdańsk (1920-1939))
alternative label: rural municipality @en
jest zdefiniowany przez obiekt: Wolne Miasto Gdańsk (1920-1939)
jest przedstawiony za pomocą symbolu: Wolne Miasto Gdańsk (1920-1939)

powiat (Wolne Państwo Prusy (1920-1945))
type: Class
label: Kreis @de
label: district (The Free State of Prussia) @en
subclass of: obszar administracji świeckiej
subclass of: Restriction
  on property: bildet Teil von
  some values from: rejencja (Wolne Państwo Prusy (1920-1945))
jest zdefiniowany przez obiekt: Wolne Państwo Prusy (1920-1945)
jest przedstawiony za pomocą symbolu: powiat, komturstwo, okręg
zobacz też IRI: http://gov.genealogy.net/types.owl#32
zobacz też IRI: https://www.wikidata.org/wiki/Q106658

obszar dworski (Wolne Miasto Gdańsk (1920-1939))
type: Class
label: manorial demesne (The Free City of Danzig (1920-1939)) @en
subclass of: gmina (Wolne Miasto Gdańsk (1920-1939))
jest zdefiniowany przez obiekt: Wolne Miasto Gdańsk (1920-1939)
jest przedstawiony za pomocą symbolu: Wolne Miasto Gdańsk (1920-1939)
zobacz też IRI: http://gov.genealogy.net/types.owl#109
zobacz też IRI: https://www.wikidata.org/wiki/Q451019

powiat (Wolne Miasto Gdańsk (1920-1939))
type: Class
label: district (The Free City of Danzig (1920-1939)) @en
subclass of: obszar administracji świeckiej
jest zdefiniowany przez obiekt: Wolne Miasto Gdańsk (1920-1939)
jest przedstawiony za pomocą symbolu: Wolne Miasto Gdańsk (1920-1939)
zobacz też IRI: http://gov.genealogy.net/types.owl#32
zobacz też IRI: https://www.wikidata.org/wiki/Q106658

powiat miejski (Wolne Miasto Gdańsk (1920-1939))
type: Class
label: urban district (The Free City of Danzig (1920-1939)) @en
subclass of: powiat (Wolne Miasto Gdańsk (1920-1939))
jest zdefiniowany przez obiekt: Wolne Miasto Gdańsk (1920-1939)
jest przedstawiony za pomocą symbolu: Wolne Miasto Gdańsk (1920-1939)
zobacz też IRI: http://gov.genealogy.net/types.owl#32

powiat wiejski (Wolne Miasto Gdańsk (1920-1939))
type: Class
label: rural district (The Free City of Danzig (1920-1939)) @en
subclass of: powiat (Wolne Miasto Gdańsk (1920-1939))
jest zdefiniowany przez obiekt: Wolne Miasto Gdańsk (1920-1939)
jest przedstawiony za pomocą symbolu: Wolne Miasto Gdańsk (1920-1939)

powiat (Królestwo Polskie (1370-1568))
type: Class
label: district (The Kingdom of Poland (1370-1568)) @en
subclass of: obszar administracji świeckiej
subclass of: Restriction
  on property: bildet Teil von
  some values from: ziemia (Królestwo Polskie (1370-1568))
jest zdefiniowany przez obiekt: Królestwo Polskie (1370-1568)
jest przedstawiony za pomocą symbolu: Królestwo Polskie (1370-1568)

ziemia (Królestwo Polskie (1370-1568))
type: Class
label: land (The Kingdom of Poland (1370-1568)) @en
subclass of: obszar administracji świeckiej
subclass of: Restriction
  on property: bildet Teil von
  some values from: województwo (Królestwo Polskie (1370-1568))
jest zdefiniowany przez obiekt: Królestwo Polskie (1370-1568)
jest przedstawiony za pomocą symbolu: Królestwo Polskie (1370-1568)

województwo (Królestwo Polskie (1370-1568))
type: Class
label: palatinate (The Kingdom of Poland (1370-1568)) @en
subclass of: obszar administracji świeckiej
subclass of: Restriction
  on property: bildet Teil von
  some values from: prowincja (Królestwo Polskie (1370-1568))
alternative label: county @en
alternative label: province @en
jest zdefiniowany przez obiekt: Królestwo Polskie (1370-1568)
jest przedstawiony za pomocą symbolu: Królestwo Polskie (1370-1568)

prowincja (Królestwo Polskie (1370-1568))
type: Class
label: province (The Kingdom of Poland (1370-1568)) @en
subclass of: obszar administracji świeckiej
jest zdefiniowany przez obiekt: Królestwo Polskie (1370-1568)
jest przedstawiony za pomocą symbolu: Królestwo Polskie (1370-1568)

komornictwo (Prusy Książęce (1525-1701))
type: Class
subclass of: obszar administracji świeckiej
subclass of: Restriction
  on property: bildet Teil von
  some values from: starostwo (Prusy Książęce (1525-1701))
jest zdefiniowany przez obiekt: Prusy Książęce (1525-1701)
jest przedstawiony za pomocą symbolu: Prusy Książęce (1525-1701)

powiat ziemski (Wolne Państwo Prusy (1920-1945))
type: Class
label: Landkreis @de
label: rural district (The Free State of Prussia) (The Duchy of Prussia (1525-1701)) @en
subclass of: powiat (Wolne Państwo Prusy (1920-1945))
jest zdefiniowany przez obiekt: Wolne Państwo Prusy (1920-1945)
jest przedstawiony za pomocą symbolu: powiat, komturstwo, okręg
zobacz też IRI: http://gov.genealogy.net/types.owl#32
zobacz też IRI: https://www.wikidata.org/wiki/Q106658

starostwo (Prusy Książęce (1525-1701))
type: Class
comment: "Ujednolicone (po 1499) wcześniejsze komturstwa, prokuratorie, wójtostwa; na ich czele stali starostowie (na czele starostwa Szaki stał tradycyjnie wójt krajowy Sambii (Landvogt von Samland), a starosta Rybaków nosił tytuł wójta Sambii (Vogt von Samland). Niektóre starostwa dzieliły się na komornictwa: komornictwo Dolno w starostwie Przezmark, komornictwo Orzysz w starostwie Ryn, komornictwo Laptau (i inne) w starostwie Rybaki. Wg ustaleń J. Skibińskiego ""Najniższymi ogniwami pruskiej administracji terenowej w pierwszej połowie XVII wieku były komornictwa (urzędy kameralne), zwane w późniejszym okresie urzędami domenalnymi (Domänenämter)"". Starostwo Wystruć ze względu na dużą powierzchnię i brak wielkiej własności ziemskiej podzielono na 13 starostw sołtysich (Schulzenämter). Liczba starostw nie była stała: Jerzy Skibiński wylicza, że wg recesu sejmu krajowego z 1566 roku było ich łącznie 39, dane z diariuszy sejmowych z 1663 roku wskazują 47 starostw, na początku XVIII wieku z kolei doliczono się 45 starostw."
label: Hauptamt @de
label: county (The Duchy of Prussia (1525-1701)) @en
subclass of: obszar administracji świeckiej
subclass of: Restriction
  on property: bildet Teil von
  some values from: okręg (Prusy Książęce (1525-1701))
alternative label: Amt @de
jest zdefiniowany przez obiekt: Prusy Książęce (1525-1701)
jest przedstawiony za pomocą symbolu: Prusy Książęce (1525-1701)

okręg (Prusy Książęce (1525-1701))
type: Class
comment: Sambia, Natangia, Górne Prusy; podział ten miał charakter głównie polityczny, związany z organizacją zjazdów okręgu i wysyłaniem poselstw
label: Kreis @de
label: district (The Duchy of Prussia (1525-1701)) @en
subclass of: obszar administracji świeckiej
subclass of: Restriction
  on property: bildet Teil von
  some values from: księstwo lenne (Prusy Książęce (1525-1701))
jest zdefiniowany przez obiekt: Prusy Książęce (1525-1701)
jest przedstawiony za pomocą symbolu: Prusy Książęce (1525-1701)

księstwo lenne (Prusy Książęce (1525-1701))
type: Class
comment: lenno do 1657 - traktaty welawsko-bydgoskie zrywały stosunki lenne między Koroną i Prusami Książęcymi
label: Herzogtum @de
label: fiefdom (The Duchy of Prussia (1525-1701)) @en
subclass of: obszar administracji świeckiej
jest zdefiniowany przez obiekt: Prusy Książęce (1525-1701)
jest przedstawiony za pomocą symbolu: Prusy Książęce (1525-1701)
zobacz też IRI: http://gov.genealogy.net/types.owl#60
zobacz też IRI: https://www.wikidata.org/wiki/Q208500

cyrkuł (Gubernium Morawsko-Śląskie (1783-1848))
type: Class
label: tsyrkul (Provincial government of Moravian-Silesian Region (1783-1848)) @en
subclass of: obszar administracji świeckiej
alternative label: circle @en
jest zdefiniowany przez obiekt: Gubernium Morawsko-Śląskie (1783-1848)
jest przedstawiony za pomocą symbolu: Gubernium Morawsko-Śląskie (1783-1848)

gmina (Księstwo Górnego i Dolnego Śląska (1849-1918))
type: Class
label: commune (The Duchy of Upper and Lower Silesia (1849-1918)) @en
subclass of: obszar administracji świeckiej
subclass of: Restriction
  on property: bildet Teil von
  some values from: powiat sądowy (Księstwo Górnego i Dolnego Śląska (1849-1918))
alternative label: municipality @en
jest zdefiniowany przez obiekt: Księstwo Górnego i Dolnego Śląska (1849-1918)
jest przedstawiony za pomocą symbolu: Księstwo Górnego i Dolnego Śląska (1849-1918)
zobacz też IRI: http://dbpedia.org/page/Gemeinde
zobacz też IRI: http://gov.genealogy.net/types.owl#group_31
zobacz też IRI: https://www.wikidata.org/wiki/Q262166

powiat sądowy (Księstwo Górnego i Dolnego Śląska (1849-1918))
type: Class
label: district (The Duchy of Upper and Lower Silesia (1849-1918)) @en
subclass of: obszar administracji świeckiej
subclass of: Restriction
  on property: bildet Teil von
  some values from: powiat polityczny (Księstwo Górnego i Dolnego Śląska (1849-1918))
jest zdefiniowany przez obiekt: Księstwo Górnego i Dolnego Śląska (1849-1918)
jest przedstawiony za pomocą symbolu: Księstwo Górnego i Dolnego Śląska (1849-1918)

powiat polityczny (Księstwo Górnego i Dolnego Śląska (1849-1918))
type: Class
comment: chodzi o miasta, które wcześniej, jeszcze w XIX wieku, miały samorząd miejski; na interesującym nas obszarze było to Bielsko
comment: it pertains to the towns, which previously, as early as the 19th c., had a town council. In the area in question such city was Bielsko @en
label: political district (The Duchy of Upper and Lower Silesia (1849-1918)) @en
subclass of: obszar administracji świeckiej
jest zdefiniowany przez obiekt: Księstwo Górnego i Dolnego Śląska (1849-1918)
jest przedstawiony za pomocą symbolu: Księstwo Górnego i Dolnego Śląska (1849-1918)

starostwo (Księstwo Siewierskie (1443-1790))
type: Class
label: county (The Duchy of Siewierz (1443-1790)) @en
subclass of: obszar administracji świeckiej
jest zdefiniowany przez obiekt: Księstwo Siewierskie (1443-1790)
jest przedstawiony za pomocą symbolu: Księstwo Siewierskie (1443-1790)

gmina (Królestwo Galicji i Lodomerii (1849-1866))
type: Class
comment: Niekiedy jako najniższą jednostkę administracyjną o charakterze pomocniczym podaje się dominia (wiejskie) i magistraty (miejskie). Rozporządzenia z 1848 r. uznały urzędy dominialne za organa tymczasowe sprawujące władzę na koszt i w imieniu państwa a nie dziedzica. Zniesiono je w 1855 r. a ich terytoria podzielono na gminy wiejskie i obszary dworskie.
label: commune (the Kingdom of Galicia and Lodomeria (1849-1866)) @en
subclass of: obszar administracji świeckiej
subclass of: Restriction
  on property: bildet Teil von
  some values from: powiat (Królestwo Galicji i Lodomerii (1849-1866))
jest zdefiniowany przez obiekt: Królestwo Galicji i Lodomerii (1849-1866)
jest przedstawiony za pomocą symbolu: gmina, obszar dworski, dominium

powiat miejski (Wolne Państwo Prusy (1920-1945))
type: Class
comment: Równorzędny z powiatem ziemskim ale nie dzielił się już na mniejsze wójtostwa
label: Stadtkreis @de
label: urban district (The Free State of Prussia) @en
subclass of: powiat (Wolne Państwo Prusy (1920-1945))
jest zdefiniowany przez obiekt: Wolne Państwo Prusy (1920-1945)
jest przedstawiony za pomocą symbolu: powiat, komturstwo, okręg
zobacz też IRI: http://gov.genealogy.net/types.owl#32

gmina wiejska (Królestwo Galicji i Lodomerii (1849-1866))
type: Class
label: rural commune (the Kingdom of Galicia and Lodomeria (1849-1866)) @en
subclass of: gmina (Królestwo Galicji i Lodomerii (1849-1866))
alternative label: village comune @en
jest zdefiniowany przez obiekt: Królestwo Galicji i Lodomerii (1849-1866)
jest przedstawiony za pomocą symbolu: gmina, obszar dworski, dominium

gmina miejska (Królestwo Galicji i Lodomerii (1849-1866))
type: Class
label: town commune (the Kingdom of Galicia and Lodomeria (1849-1866)) @en
subclass of: gmina (Królestwo Galicji i Lodomerii (1849-1866))
jest zdefiniowany przez obiekt: Królestwo Galicji i Lodomerii (1849-1866)
jest przedstawiony za pomocą symbolu: gmina, obszar dworski, dominium

obszar dworski (Królestwo Galicji i Lodomerii (1849-1866))
type: Class
label: manorial demesne (the Kingdom of Galicia and Lodomeria (1849-1866)) @en
subclass of: gmina (Królestwo Galicji i Lodomerii (1849-1866))
jest zdefiniowany przez obiekt: Królestwo Galicji i Lodomerii (1849-1866)
jest przedstawiony za pomocą symbolu: gmina, obszar dworski, dominium
zobacz też IRI: http://gov.genealogy.net/types.owl#109
zobacz też IRI: https://www.wikidata.org/wiki/Q451019

powiat (Królestwo Galicji i Lodomerii (1849-1866))
type: Class
label: district (the Kingdom of Galicia and Lodomeria (1849-1866)) @en
subclass of: obszar administracji świeckiej
subclass of: Restriction
  on property: bildet Teil von
  some values from: cyrkuł-stolica obszaru dworskiego (Królestwo Galicji i Lodomerii (1849-1866))
jest zdefiniowany przez obiekt: Królestwo Galicji i Lodomerii (1849-1866)
jest przedstawiony za pomocą symbolu: powiat, komturstwo, okręg

cyrkuł-stolica obszaru dworskiego (Królestwo Galicji i Lodomerii (1849-1866))
type: Class
label: tsyrkul-provincial capital (the Kingdom of Galicia and Lodomeria (1849-1866)) @en
subclass of: obszar administracji świeckiej
subclass of: Restriction
  on property: bildet Teil von
  some values from: obszar administracyjny (Królestwo Galicji i Lodomerii (1849-1866))
jest zdefiniowany przez obiekt: Królestwo Galicji i Lodomerii (1849-1866)
jest przedstawiony za pomocą symbolu: ziemia, cyrkuł, obwód, departament

cyrkuł (Królestwo Galicji i Lodomerii (1849-1866))
type: Class
label: tsyrkul (the Kingdom of Galicia and Lodomeria (1849-1866)) @en
subclass of: cyrkuł-stolica obszaru dworskiego (Królestwo Galicji i Lodomerii (1849-1866))
alternative label: circle @en
jest zdefiniowany przez obiekt: Królestwo Galicji i Lodomerii (1849-1866)
jest przedstawiony za pomocą symbolu: ziemia, cyrkuł, obwód, departament

stolica obszaru administracyjnego (Królestwo Galicji i Lodomerii (1849-1866))
type: Class
comment: Kraków i Lwów podlegały odpowiednio namiestnictwu we Lwowie i rządowi krajowemu w Krakowie
label: provincial capital (the Kingdom of Galicia and Lodomeria (1849-1866)) @en
subclass of: cyrkuł-stolica obszaru dworskiego (Królestwo Galicji i Lodomerii (1849-1866))
jest zdefiniowany przez obiekt: Królestwo Galicji i Lodomerii (1849-1866)
jest przedstawiony za pomocą symbolu: ziemia, cyrkuł, obwód, departament

obszar administracyjny (Królestwo Galicji i Lodomerii (1849-1866))
type: Class
comment: Galicja była początkowo, w latach 1850-1854 podzielona na 3 okręgi (Regierungsbezirke): Lwów, Kraków, Stanisławów. Następnie po 1854 r. na dwa: Lwów (Statthalterei) oraz Kraków (Landesregierung). Rząd krajowy w Krakowie został zniesiony w 1867 r.
label: province (the Kingdom of Galicia and Lodomeria (1849-1866)) @en
subclass of: obszar administracji świeckiej
jest zdefiniowany przez obiekt: Królestwo Galicji i Lodomerii (1849-1866)
jest przedstawiony za pomocą symbolu: województwo, gubernia, komitat, obwód, rejencja, landwójtostwo

rejencja (Wolne Państwo Prusy (1920-1945))
type: Class
comment: Utworzona w 1808 roku jako pierwszy stopień reform administracyjnych państwa wprowadzonych przez Steina i Hardenberga
label: Regierung @de
label: district government (The Free State of Prussia) @en
subclass of: obszar administracji świeckiej
equivalent class: rejencja (Królestwo Prus (1806-1919))
equivalent class: Restriction
  on property: bildet Teil von
  some values from: prowincja (Wolne Państwo Prusy (1920-1945))
alternative label: okręg rejencyjny
alternative label: regencja
jest zdefiniowany przez obiekt: Wolne Państwo Prusy (1920-1945)
jest przedstawiony za pomocą symbolu: województwo, gubernia, komitat, obwód, rejencja, landwójtostwo
zobacz też IRI: http://gov.genealogy.net/types.owl#46

kraj (Republika Słowacka (1996-2020))
type: Class
label: kraj (štátna správa) @sk
label: region (Slovak Republic (1996-2020)) @en
subclass of: obszar administracji świeckiej
hidden label: województwo
jest zdefiniowany przez obiekt: Republika Słowacka (1996-2020)
jest przedstawiony za pomocą symbolu: województwo, gubernia, komitat, obwód, rejencja, landwójtostwo
zobacz też IRI: Q15057583

okres (Republika Słowacka (1996-2020))
type: Class
label: district (Slovak Republic (1996-2020)) @en
label: okres @sk
subclass of: obszar administracji świeckiej
subclass of: Restriction
  on property: bildet Teil von
  some values from: kraj (Republika Słowacka (1996-2020))
alternative label: powiat
jest zdefiniowany przez obiekt: Republika Słowacka (1996-2020)
jest przedstawiony za pomocą symbolu: powiat, komturstwo, okręg
zobacz też IRI: Q2264478

obec (Republika Słowacka (1996-2020))
type: Class
subclass of: obszar administracji świeckiej
subclass of: Restriction
  on property: bildet Teil von
  some values from: okres (Republika Słowacka (1996-2020))
alternative label: commune (Slovak Republic (1996-2020)) @en
alternative label: gmina
alternative label: obec @en
jest zdefiniowany przez obiekt: Republika Słowacka (1996-2020)
jest przedstawiony za pomocą symbolu: gmina, obszar dworski, dominium
zobacz też IRI: Q2183520

gmina wiejska
type: Class
comment: Zgodnie z treścią konstytucji marcowej (1921) "Dla celów administracyjnych Państwo Polskie podzielone będzie w drodze ustawodawczej na województwa, powiaty i gminy miejskie i wiejskie, które będą równocześnie jednostkami samorządu terytorjalnego". Faktycznie cały okres międzywojenny charakteryzuje proces unifikacji terytorialnej administracji ogólnej, której celem jest likwidacja różnic między byłymi zaborami. Ostatnim ważnym aktem była likwidacja obszarów dworskich na terenie woj. poznańskiego oraz pomorskiego na mocy tzw. ustawy scaleniowej z 1933 r.
label: rural commune @en
subclass of: gmina
jest zdefiniowany przez obiekt: Rzeczpospolita Polska (1918-1939)
jest przedstawiony za pomocą symbolu: gmina, obszar dworski, dominium

prowincja (Wolne Państwo Prusy (1920-1945))
type: Class
label: Provinz @de
label: province (The Free State of Prussia) @en
subclass of: obszar administracji świeckiej
equivalent class: prowincja (Królestwo Prus (1806-1919))
equivalent class: prowincja (Królestwo Prus (1713-1805))
jest zdefiniowany przez obiekt: Wolne Państwo Prusy (1920-1945)
jest przedstawiony za pomocą symbolu: prowincja, starostwo generalne, generalne gubernatorstwo

gmina miejska (Królestwo Prus (1806-1919))
type: Class
label: Stadtgemeinde (Königreich Preußen (1806-1919)) @de
label: town commune (The Kingdom of Prussia (1806-1919)) @en
subclass of: gmina (Królestwo Prus (1806-1919))
jest zdefiniowany przez obiekt: Królestwo Prus (1806-1919)
jest przedstawiony za pomocą symbolu: gmina, obszar dworski, dominium

gmina wiejska (Królestwo Prus (1806-1919))
type: Class
comment: 1818: Edykt o urzędach sołtysów w gminach wiejskich i obszarach dworskich.
label: Landgemeinde @de
label: rural commune (The Kingdom of Prussia (1806-1919)) @en
subclass of: gmina (Królestwo Prus (1806-1919))
alternative label: village community @en
jest zdefiniowany przez obiekt: Królestwo Prus (1806-1919)
jest przedstawiony za pomocą symbolu: gmina, obszar dworski, dominium

obszar dworski (Królestwo Prus (1806-1919))
type: Class
comment: 1818: Edykt o urzędach sołtysów w gminach wiejskich i obszarach dworskich. 31.12.1842: Terytorialne rozgraniczenie gmin wiejskich i obszarów dworskich w prowincjach wschodnich
label: Gutsbezirk @de
label: manorial demesne (The Kingdom of Prussia (1806-1919)) @en
subclass of: gmina (Królestwo Prus (1806-1919))
alternative label: independent estate @en
alternative label: manorial land @en
jest zdefiniowany przez obiekt: Królestwo Prus (1806-1919)
jest przedstawiony za pomocą symbolu: gmina, obszar dworski, dominium
zobacz też IRI: http://gov.genealogy.net/types.owl#109
zobacz też IRI: https://www.wikidata.org/wiki/Q451019

gmina (Królestwo Prus (1806-1919))
type: Class
label: Gemeinde @de
label: commune (The Kingdom of Prussia (1806-1919)) @en
subclass of: obszar administracji świeckiej
subclass of: Restriction
  on property: bildet Teil von
  some values from: wójtostwo (Królestwo Prus (1806-1919))
alternative label: municipality @en
jest zdefiniowany przez obiekt: Królestwo Prus (1806-1919)
jest przedstawiony za pomocą symbolu: gmina, obszar dworski, dominium
zobacz też IRI: http://dbpedia.org/page/Gemeinde
zobacz też IRI: http://gov.genealogy.net/types.owl#group_31
zobacz też IRI: https://www.wikidata.org/wiki/Q262166

wójtostwo (Królestwo Prus (1806-1919))
type: Class
comment: Od 1.01. 1873 z wyłączeniem Prowincji Poznańskiej. W Prowincji Poznańskiej w l 1818-1833 w okręgach wiejskich (Bezirke), łączących kilka gmin, władzę wójtowską sprawowali właściciele dóbr ziemskich. Od 1833 roku do 1918 pełnili te funkcje okręgowi komisarze policji.
label: Amtsbezirk @de
label: bailiwick (The Kingdom of Prussia (1806-1919)) @en
subclass of: obszar administracji świeckiej
subclass of: Restriction
  on property: bildet Teil von
  some values from: powiat (Królestwo Prus (1806-1919))
alternative label: communal union @en
jest zdefiniowany przez obiekt: Królestwo Prus (1806-1919)
jest przedstawiony za pomocą symbolu: wójtostwo, okręg, prokuratorstwo

powiat (Królestwo Prus (1806-1919))
type: Class
label: Kreis @de
label: district (The Kingdom of Prussia (1806-1919)) @en
subclass of: obszar administracji świeckiej
subclass of: Restriction
  on property: bildet Teil von
  some values from: rejencja (Królestwo Prus (1806-1919))
alternative label: county @en
jest zdefiniowany przez obiekt: Królestwo Prus (1806-1919)
jest przedstawiony za pomocą symbolu: powiat, komturstwo, okręg
zobacz też IRI: http://gov.genealogy.net/types.owl#32
zobacz też IRI: https://www.wikidata.org/wiki/Q106658

obszar dworski
type: Class
comment: Obszary dworskie utrzymały się najdłużej na Śląsku oraz w województwach zachodnich, pomorskim i poznańskim, gdzie zostały zniesione na podstawie tzw. ustawy scaleniowej z 1933 r. oraz rozporządzeń wykonawczych z 1934 r.
label: manorial demesne @en
subclass of: gmina
jest zdefiniowany przez obiekt: Rzeczpospolita Polska (1918-1939)
jest przedstawiony za pomocą symbolu: gmina, obszar dworski, dominium
zobacz też IRI: http://gov.genealogy.net/types.owl#108
zobacz też IRI: https://www.wikidata.org/wiki/Q451019

powiat ziemski (Królestwo Prus (1806-1919))
type: Class
label: Landkreis @de
label: rural district (The Kingdom of Prussia (1806-1919)) @en
subclass of: powiat (Królestwo Prus (1806-1919))
jest zdefiniowany przez obiekt: Królestwo Prus (1806-1919)
jest przedstawiony za pomocą symbolu: powiat, komturstwo, okręg
zobacz też IRI: http://gov.genealogy.net/types.owl#32
zobacz też IRI: https://www.wikidata.org/wiki/Q106658

powiat miejski (Królestwo Prus (1806-1919))
type: Class
comment: Równorzędny z powiatem ziemskim ale nie dzielił się już na mniejsze wójtostwa
label: Stadtkreis @de
label: urban district (The Kingdom of Prussia (1806-1919)) @en
subclass of: powiat (Królestwo Prus (1806-1919))
jest zdefiniowany przez obiekt: Królestwo Prus (1806-1919)
jest przedstawiony za pomocą symbolu: powiat, komturstwo, okręg
zobacz też IRI: http://gov.genealogy.net/types.owl#32

rejencja (Królestwo Prus (1806-1919))
type: Class
comment: Utworzona w 1808 roku jako pierwszy stopień reform administracyjnych państwa wprowadzonych przez Steina i Hardenberga
label: Regierungsbezirk @de
label: district government (The Kingdom of Prussia (1806-1919)) @en
subclass of: obszar administracji świeckiej
equivalent class: Restriction
  on property: bildet Teil von
  some values from: prowincja (Królestwo Prus (1806-1919))
alternative label: Regierung @de
alternative label: okręg rejencyjny
alternative label: regencja
jest zdefiniowany przez obiekt: Królestwo Prus (1806-1919)
jest przedstawiony za pomocą symbolu: województwo, gubernia, komitat, obwód, rejencja, landwójtostwo
zobacz też IRI: http://gov.genealogy.net/types.owl#46

prowincja (Królestwo Prus (1806-1919))
type: Class
label: Provinz @de
label: province (The Kingdom of Prussia (1806-1919)) @en
subclass of: obszar administracji świeckiej
jest zdefiniowany przez obiekt: Królestwo Prus (1806-1919)
jest przedstawiony za pomocą symbolu: prowincja, starostwo generalne, generalne gubernatorstwo

gmina (Rzeczpospolita Polska (1999-2016))
type: Class
label: commune (The Republic of Poland (1999-2016)) @en
subclass of: obszar administracji świeckiej
subclass of: Restriction
  on property: bildet Teil von
  some values from: powiat (Rzeczpospolita Polska (1999-2016))
hidden label: district @en
hidden label: municipality @en
jest zdefiniowany przez obiekt: Rzeczpospolita Polska (1999-2016)
jest przedstawiony za pomocą symbolu: gmina, obszar dworski, dominium
zobacz też IRI: Gmina
zobacz też IRI: http://gov.genealogy.net/types.owl#18
zobacz też IRI: gmina
zobacz też IRI: Q15334

powiat (Rzeczpospolita Polska (1999-2016))
type: Class
comment: Do kategorii powiatów należą też miasta na prawach powiatu (66)
label: district (The Republic of Poland (1999-2016)) @en
subclass of: obszar administracji świeckiej
subclass of: Restriction
  on property: bildet Teil von
  some values from: województwo (Rzeczpospolita Polska (1999-2016))
jest zdefiniowany przez obiekt: Rzeczpospolita Polska (1999-2016)
jest przedstawiony za pomocą symbolu: powiat, komturstwo, okręg
zobacz też IRI: Powiat
zobacz też IRI: http://gov.genealogy.net/types.owl#32
zobacz też IRI: http://gov.genealogy.net/types.owl#59
zobacz też IRI: powiat
zobacz też IRI: wojewodztwo
zobacz też IRI: Q247073

województwo (Rzeczpospolita Polska (1999-2016))
type: Class
label: voivodship (The Republic of Poland (1999-2016)) @en
subclass of: obszar administracji świeckiej
alternative label: province @en
jest zdefiniowany przez obiekt: Rzeczpospolita Polska (1999-2016)
jest przedstawiony za pomocą symbolu: województwo, gubernia, komitat, obwód, rejencja, landwójtostwo
zobacz też IRI: Voivodeships of Poland
zobacz też IRI: Q150093

gmina (Cesarstwo Rosyjskie (1775-1917))
type: Class
comment: Jednostka najniższego rzędu wprowadzona na skutek reformy włościańskiej w 1861 r.
comment: small rural district @en
label: volost (Russian Empire (1775-1917)) @en
label: волость @ru
subclass of: obszar administracji świeckiej
subclass of: Restriction
  on property: bildet Teil von
  some values from: powiat (Cesarstwo Rosyjskie (1775-1917))
jest zdefiniowany przez obiekt: Cesarstwo Rosyjskie (1775-1917)
jest przedstawiony za pomocą symbolu: gmina, obszar dworski, dominium
zobacz też IRI: Volost
zobacz też IRI: http://gov.genealogy.net/types.owl#241
zobacz też IRI: Q687121

powiat
type: Class
label: district @en
subclass of: powiat (Rzeczpospolita Polska (1918-1939))
alternative label: county @en
jest zdefiniowany przez obiekt: Rzeczpospolita Polska (1918-1939)
jest przedstawiony za pomocą symbolu: powiat, komturstwo, okręg
zobacz też IRI: http://gov.genealogy.net/types.owl#32
zobacz też IRI: https://www.wikidata.org/wiki/Q247073

powiat (Cesarstwo Rosyjskie (1775-1917))
type: Class
comment: Niekiedy zamiasto określenia powiat używano określenia okręg
label: uyezd (Russian Empire (1775-1917)) @en
label: уезд @ru
subclass of: obszar administracji świeckiej
subclass of: Restriction
  on property: bildet Teil von
  some values from: obwód (Cesarstwo Rosyjskie (1775-1917))
alternative label: округ @ru
jest zdefiniowany przez obiekt: Cesarstwo Rosyjskie (1775-1917)
jest przedstawiony za pomocą symbolu: powiat, komturstwo, okręg
zobacz też IRI: Uyezd
zobacz też IRI: http://gov.genealogy.net/types.owl#240
zobacz też IRI: Q1364324

obwód (Cesarstwo Rosyjskie (1775-1917))
type: Class
comment: Obwody występowały jako jednostka pośrednia między namiestnictwem lub gubernią a powiatem w przypadku rozległych jednostek terytorialnych
label: oblast (Russian Empire (1775-1917)) @en
label: область @ru
subclass of: obszar administracji świeckiej
subclass of: Restriction
  on property: bildet Teil von
  some values from: gubernia (Cesarstwo Rosyjskie (1775-1917))
alternative label: county @en
alternative label: region @en
jest zdefiniowany przez obiekt: Cesarstwo Rosyjskie (1775-1917)
jest przedstawiony za pomocą symbolu: ziemia, cyrkuł, obwód, departament
zobacz też IRI: Oblast
zobacz też IRI: http://gov.genealogy.net/types.owl#38
zobacz też IRI: Q7075127

gubernia (Cesarstwo Rosyjskie (1775-1917))
type: Class
label: guberniya (Russian Empire (1775-1917)) @en
label: губерния @ru
subclass of: obszar administracji świeckiej
subclass of: Restriction
  on property: bildet Teil von
  some values from: generalne gubernatorstwo (Cesarstwo Rosyjskie (1775-1917))
alternative label: governorate @en
jest zdefiniowany przez obiekt: Cesarstwo Rosyjskie (1775-1917)
jest przedstawiony za pomocą symbolu: województwo, gubernia, komitat, obwód, rejencja, landwójtostwo
zobacz też IRI: Governorate (Russia)
zobacz też IRI: http://gov.genealogy.net/types.owl#157
zobacz też IRI: Q86622

gubernia (Cesarstwo Rosyjskie (1775-1917))
type: Class
label: guberniya (Russian Empire (1775-1917)) @en
label: губерния @ru
subclass of: gubernia (Cesarstwo Rosyjskie (1775-1917))
alternative label: governorate @en
jest zdefiniowany przez obiekt: Cesarstwo Rosyjskie (1775-1917)
jest przedstawiony za pomocą symbolu: województwo, gubernia, komitat, obwód, rejencja, landwójtostwo
zobacz też IRI: Governorate (Russia)
zobacz też IRI: http://gov.genealogy.net/types.owl#157
zobacz też IRI: Q86622

obwód (Cesarstwo Rosyjskie (1775-1917))
type: Class
comment: Obwody na prawach guberni
label: oblast (Russian Empire (1775-1917)) @en
label: область @ru
subclass of: gubernia (Cesarstwo Rosyjskie (1775-1917))
alternative label: county @en
alternative label: region @en
jest zdefiniowany przez obiekt: Cesarstwo Rosyjskie (1775-1917)
jest przedstawiony za pomocą symbolu: województwo, gubernia, komitat, obwód, rejencja, landwójtostwo
zobacz też IRI: Oblast
zobacz też IRI: http://gov.genealogy.net/types.owl#38
zobacz też IRI: Q7075127

namiestnictwo (Cesarstwo Rosyjskie (1775-1917))
type: Class
comment: Nazwa jednostki administracyjnej odpowiadającej guberni, która funkcjonowała głównie w latach 1775-1796
label: vicegerency (Russian Empire (1775-1917)) @en
label: наместничество @ru
subclass of: gubernia (Cesarstwo Rosyjskie (1775-1917))
alternative label: viceroyalty @en
jest zdefiniowany przez obiekt: Cesarstwo Rosyjskie (1775-1917)
jest przedstawiony za pomocą symbolu: województwo, gubernia, komitat, obwód, rejencja, landwójtostwo
zobacz też IRI: Category:Viceroyalties of the Russian Empire
zobacz też IRI: Q4312761

generalne gubernatorstwo (Cesarstwo Rosyjskie (1775-1917))
type: Class
comment: Była to jednostka skupiająca kilka guberni. Poziom ten nie obejmował całego państwa, gdyż generalne gubernatorstwa były organizowane głównie na teranach przygranicznych; jednostką równoważną na tym poziomie było namiestnictwo kaukaskie
label: governorate-general (Russian Empire (1775-1917)) @en
label: генерал-губернаторство @ru
subclass of: obszar administracji świeckiej
jest zdefiniowany przez obiekt: Cesarstwo Rosyjskie (1775-1917)
jest przedstawiony za pomocą symbolu: prowincja, starostwo generalne, generalne gubernatorstwo
jest przedstawiony za pomocą symbolu: gubernium, wolne państwo stanowe, księstwo zależne, dzielnica, marchia, hrabstwo, margrabstwo
zobacz też IRI: Governorate-General (Russian Empire)
zobacz też IRI: Q671370

gmina (Królestwo Galicji i Lodomerii (1867-1918))
type: Class
label: commune (The Kingdom of Galicia and Lodomeria (1867-1918)) @en
subclass of: obszar administracji świeckiej
subclass of: Restriction
  on property: bildet Teil von
  some values from: powiat (Królestwo Galicji i Lodomerii (1867-1918))
jest zdefiniowany przez obiekt: Królestwo Galicji i Lodomerii (1867-1918)
jest przedstawiony za pomocą symbolu: gmina, obszar dworski, dominium
zobacz też IRI: http://dbpedia.org/page/Gemeinde
zobacz też IRI: http://gov.genealogy.net/types.owl#group_31
zobacz też IRI: https://www.wikidata.org/wiki/Q262166

miasto na prawach powiatu
type: Class
label: district city @en
subclass of: powiat (Rzeczpospolita Polska (1918-1939))
alternative label: federal city @en
jest zdefiniowany przez obiekt: Rzeczpospolita Polska (1918-1939)
jest przedstawiony za pomocą symbolu: powiat, komturstwo, okręg

gmina wiejska (Królestwo Galicji i Lodomerii (1867-1918))
type: Class
label: rural commune (The Kingdom of Galicia and Lodomeria (1867-1918)) @en
subclass of: gmina (Królestwo Galicji i Lodomerii (1867-1918))
jest zdefiniowany przez obiekt: Królestwo Galicji i Lodomerii (1867-1918)
jest przedstawiony za pomocą symbolu: gmina, obszar dworski, dominium

gmina miejska (Królestwo Galicji i Lodomerii (1867-1918))
type: Class
label: town commune (The Kingdom of Galicia and Lodomeria (1867-1918)) @en
subclass of: gmina (Królestwo Galicji i Lodomerii (1867-1918))
jest zdefiniowany przez obiekt: Królestwo Galicji i Lodomerii (1867-1918)
jest przedstawiony za pomocą symbolu: gmina, obszar dworski, dominium

obszar dworski (Królestwo Galicji i Lodomerii (1867-1918))
type: Class
label: manorial demesne (The Kingdom of Galicia and Lodomeria (1867-1918)) @en
subclass of: gmina (Królestwo Galicji i Lodomerii (1867-1918))
jest zdefiniowany przez obiekt: Królestwo Galicji i Lodomerii (1867-1918)
jest przedstawiony za pomocą symbolu: gmina, obszar dworski, dominium
zobacz też IRI: http://gov.genealogy.net/types.owl#109
zobacz też IRI: https://www.wikidata.org/wiki/Q451019

powiat (Królestwo Galicji i Lodomerii (1867-1918))
type: Class
label: Bezirk @de
label: district (The Kingdom of Galicia and Lodomeria (1867-1918)) @en
subclass of: obszar administracji świeckiej
jest zdefiniowany przez obiekt: Królestwo Galicji i Lodomerii (1867-1918)
jest przedstawiony za pomocą symbolu: powiat, komturstwo, okręg

gmina (Królestwo Polskie (1837-1866))
type: Class
label: commune (Congress Poland (1837-1866)) @en
subclass of: obszar administracji świeckiej
subclass of: Restriction
  on property: bildet Teil von
  some values from: okręg (Królestwo Polskie (1837-1866))
alternative label: municipality @en
jest zdefiniowany przez obiekt: Królestwo Polskie (1837-1866)
jest przedstawiony za pomocą symbolu: gmina, obszar dworski, dominium

gmina miejska (Królestwo Polskie (1837-1866))
type: Class
label: town commune (Congress Poland (1837-1866)) @en
subclass of: gmina (Królestwo Polskie (1837-1866))
jest zdefiniowany przez obiekt: Królestwo Polskie (1837-1866)
jest przedstawiony za pomocą symbolu: gmina, obszar dworski, dominium

gmina wiejska (Królestwo Polskie (1837-1866))
type: Class
label: rural commune (Congress Poland (1837-1866)) @en
subclass of: gmina (Królestwo Polskie (1837-1866))
jest zdefiniowany przez obiekt: Królestwo Polskie (1837-1866)
jest przedstawiony za pomocą symbolu: gmina, obszar dworski, dominium

okręg (Królestwo Polskie (1837-1866))
type: Class
label: district (Congress Poland (1837-1866)) @en
subclass of: obszar administracji świeckiej
subclass of: Restriction
  on property: bildet Teil von
  some values from: powiat (Królestwo Polskie (1837-1866))
jest zdefiniowany przez obiekt: Królestwo Polskie (1837-1866)
jest przedstawiony za pomocą symbolu: wójtostwo, okręg, prokuratorstwo

powiat (Królestwo Polskie (1837-1866))
type: Class
label: district (Congress Poland (1837-1866)) @en
subclass of: obszar administracji świeckiej
subclass of: Restriction
  on property: bildet Teil von
  some values from: gubernia (Królestwo Polskie (1837-1866))
jest zdefiniowany przez obiekt: Królestwo Polskie (1837-1866)
jest przedstawiony za pomocą symbolu: powiat, komturstwo, okręg

miasto Warszawa
type: Class
label: city of Warsaw @en
subclass of: województwo (Rzeczpospolita Polska (1918-1939))
jest zdefiniowany przez obiekt: Rzeczpospolita Polska (1918-1939)
jest przedstawiony za pomocą symbolu: województwo, gubernia, komitat, obwód, rejencja, landwójtostwo

gubernia (Królestwo Polskie (1837-1866))
type: Class
label: province (Congress Poland (1837-1866)) @en
subclass of: obszar administracji świeckiej
jest zdefiniowany przez obiekt: Królestwo Polskie (1837-1866)
jest przedstawiony za pomocą symbolu: województwo, gubernia, komitat, obwód, rejencja, landwójtostwo
zobacz też IRI: http://dbpedia.org/page/Governorate_(Russia)
zobacz też IRI: https://www.wikidata.org/wiki/Q86622

powiat (Królestwo Prus (1713-1805))
type: Class
label: Kreis @de
label: district (The Kingdom of Prussia (1713-1805)) @en
subclass of: obszar administracji świeckiej
subclass of: Restriction
  on property: bildet Teil von
  some values from: departament kamery wojenno-skarbowej (Królestwo Prus (1713-1805))
jest zdefiniowany przez obiekt: Królestwo Prus (1713-1805)
jest przedstawiony za pomocą symbolu: powiat, komturstwo, okręg
zobacz też IRI: http://gov.genealogy.net/types.owl#32
zobacz też IRI: https://www.wikidata.org/wiki/Q106658

powiat ziemski (Królestwo Prus (1713-1805))
type: Class
comment: Od 1701 Landkreis jako jednostka administracyjna początkowo w Brandenburgii; od 1716 na Pomorzu, 1740 na Śląsku, 1752 w Prusach Wschodnich, 1772 Prusach Zachodnich, 1793 w Prusach Południowych i 1795 w Prusach Nowo Wschodnich
label: Landkreis @de
label: rural district (The Kingdom of Prussia (1713-1805)) @en
subclass of: powiat (Królestwo Prus (1713-1805))
jest zdefiniowany przez obiekt: Królestwo Prus (1713-1805)
jest przedstawiony za pomocą symbolu: powiat, komturstwo, okręg
zobacz też IRI: http://gov.genealogy.net/types.owl#32
zobacz też IRI: https://www.wikidata.org/wiki/Q106658

miejski okręg inspekcji podatkowej (Królestwo Prus (1713-1805))
type: Class
comment: Dla miast utworzono okręgi inspekcji podatkowych, które nie pokrywały się z wiejskimi powiatami. Okręgi dominalne w Prusach Książęcych.
label: circut (The Kingdom of Prussia (1713-1805)) @en
subclass of: powiat (Królestwo Prus (1713-1805))
jest zdefiniowany przez obiekt: Królestwo Prus (1713-1805)
jest przedstawiony za pomocą symbolu: powiat, komturstwo, okręg

departament kamery wojenno-skarbowej (Królestwo Prus (1713-1805))
type: Class
label: Kammerdepartment @de
label: Wad and Domain chamber's department (The Kingdom of Prussia (1713-1805)) @en
subclass of: obszar administracji świeckiej
subclass of: Restriction
  on property: bildet Teil von
  some values from: prowincja (Królestwo Prus (1713-1805))
jest zdefiniowany przez obiekt: Królestwo Prus (1713-1805)
jest przedstawiony za pomocą symbolu: ziemia, cyrkuł, obwód, departament

prowincja (Królestwo Prus (1713-1805))
type: Class
label: Provinz @de
label: province (The Kingdom of Prussia (1713-1805)) @en
subclass of: obszar administracji świeckiej
jest zdefiniowany przez obiekt: Królestwo Prus (1713-1805)
jest przedstawiony za pomocą symbolu: prowincja, starostwo generalne, generalne gubernatorstwo

województwo
type: Class
label: voivodeship @en
subclass of: województwo (Rzeczpospolita Polska (1918-1939))
alternative label: province @en
jest zdefiniowany przez obiekt: Rzeczpospolita Polska (1918-1939)
jest przedstawiony za pomocą symbolu: województwo, gubernia, komitat, obwód, rejencja, landwójtostwo

powiat (Rzeczpospolita Obojga Narodów (1569-1795))
type: Class
comment: Korona: w celach skarbowych używano jeszcze niższego podziału - sieci parafialnej. Był on jednak czysto użytkowy i nieoficjalny
label: district (The Polish-Lithuanian Commonwealth (1569-1795)) @en
subclass of: obszar administracji świeckiej
subclass of: Restriction
  on property: bildet Teil von
  some values from: ziemia (Rzeczpospolita Obojga Narodów (1569-1795))
jest zdefiniowany przez obiekt: Rzeczpospolita Obojga Narodów (1569-1795)
jest przedstawiony za pomocą symbolu: powiat, komturstwo, okręg

ziemia (Rzeczpospolita Obojga Narodów (1569-1795))
type: Class
comment: Korona: nie zawsze występuje; wedle literatury po około poł. XV w. ziemie, które zachowały cała strukturę urzędów ziemskich (razem z wojewodą) przekształciły się w województwa; te, których struktura była niepełna nie zmieniły się
label: land (The Polish-Lithuanian Commonwealth (1569-1795)) @en
subclass of: obszar administracji świeckiej
subclass of: Restriction
  on property: bildet Teil von
  some values from: województwo (Rzeczpospolita Obojga Narodów (1569-1795))
jest zdefiniowany przez obiekt: Rzeczpospolita Obojga Narodów (1569-1795)
jest przedstawiony za pomocą symbolu: ziemia, cyrkuł, obwód, departament
zobacz też IRI: https://www.wikidata.org/wiki/Q2560367

województwo (Rzeczpospolita Obojga Narodów (1569-1795))
type: Class
label: palatinate (The Polish-Lithuanian Commonwealth (1569-1795)) @en
subclass of: obszar administracji świeckiej
subclass of: Restriction
  on property: bildet Teil von
  some values from: prowincja (Rzeczpospolita Obojga Narodów (1569-1795))
alternative label: county @en
alternative label: province @en
jest zdefiniowany przez obiekt: Rzeczpospolita Obojga Narodów (1569-1795)
jest przedstawiony za pomocą symbolu: województwo, gubernia, komitat, obwód, rejencja, landwójtostwo

prowincja (Rzeczpospolita Obojga Narodów (1569-1795))
type: Class
comment: Korona: prowincja wielkopolska i małopolska
label: province (The Polish-Lithuanian Commonwealth (1569-1795)) @en
subclass of: obszar administracji świeckiej
subclass of: Restriction
  on property: bildet Teil von
  some values from: dzielnica (Rzeczpospolita Obojga Narodów (1569-1795))
jest zdefiniowany przez obiekt: Rzeczpospolita Obojga Narodów (1569-1795)
jest przedstawiony za pomocą symbolu: prowincja, starostwo generalne, generalne gubernatorstwo

dzielnica (Rzeczpospolita Obojga Narodów (1569-1795))
type: Class
comment: Korona Królestwa Polskiego / Wielkie Księstwo Litewskie. Wszystkie odrębności wynikające z aktu unii lubelskiej zostały zniesiona na mocy konstytucji 3 maja
label: state (The Polish-Lithuanian Commonwealth (1569-1795)) @en
subclass of: obszar administracji świeckiej
alternative label: part @en
jest zdefiniowany przez obiekt: Rzeczpospolita Obojga Narodów (1569-1795)
jest przedstawiony za pomocą symbolu: gubernium, wolne państwo stanowe, księstwo zależne, dzielnica, marchia, hrabstwo, margrabstwo

hrabstwo (Elektorat Saksonii (1545-1805))
type: Class
label: Markgrafschaft @de
subclass of: obszar administracji świeckiej
alternative label: margrabstwo
jest zdefiniowany przez obiekt: Elektorat Saksonii (1545-1805)
jest przedstawiony za pomocą symbolu: gubernium, wolne państwo stanowe, księstwo zależne, dzielnica, marchia, hrabstwo, margrabstwo

dominium-magistrat (Królestwo Galicji i Lodomerii (1772-1848))
type: Class
comment: Niekiedy jako najniższą jednostkę administracyjną o charakterze pomocniczym podaje się dominia (wiejskie) i magistraty (miejskie). Rozporządzenia z 1848 r. uznały urzędy dominialne za organa tymczasowe sprawujące władzę na koszt i w imieniu państwa a nie dziedzica. Zniesiono je w 1855 r. a ich terytoria podzielono na gminy wiejskie i obszary dworskie.
label: dominium-magistrate (The Kingdom of Galitia and Lodomeria (1772-1848)) @en
subclass of: obszar administracji świeckiej
subclass of: Restriction
  on property: bildet Teil von
  some values from: okręg (Królestwo Galicji i Lodomerii (1772-1848))
jest zdefiniowany przez obiekt: Królestwo Galicji i Lodomerii (1772-1848)
jest przedstawiony za pomocą symbolu: gmina, obszar dworski, dominium

gmina
type: Class
label: municipality @en
subclass of: obszar administracji świeckiej
subclass of: Restriction
  on property: bildet Teil von
  some values from: powiat (Rzeczpospolita Polska (1918-1939))
alternative label: community @en
jest zdefiniowany przez obiekt: Rzeczpospolita Polska (1918-1939)
jest przedstawiony za pomocą symbolu: gmina, obszar dworski, dominium

dominium (Królestwo Galicji i Lodomerii (1772-1848))
type: Class
label: dominium (The Kingdom of Galitia and Lodomeria (1772-1848)) @en
subclass of: dominium-magistrat (Królestwo Galicji i Lodomerii (1772-1848))
jest zdefiniowany przez obiekt: Królestwo Galicji i Lodomerii (1772-1848)
jest przedstawiony za pomocą symbolu: gmina, obszar dworski, dominium

magistrat (Królestwo Galicji i Lodomerii (1772-1848))
type: Class
comment: Najniższa jednostka administracji państwowej na terenie miast
label: magistrate (The Kingdom of Galitia and Lodomeria (1772-1848)) @en
subclass of: dominium-magistrat (Królestwo Galicji i Lodomerii (1772-1848))
jest zdefiniowany przez obiekt: Królestwo Galicji i Lodomerii (1772-1848)
jest przedstawiony za pomocą symbolu: gmina, obszar dworski, dominium

okręg (Królestwo Galicji i Lodomerii (1772-1848))
type: Class
label: Distrikt @de
label: district (The Kingdom of Galitia and Lodomeria (1772-1848)) @en
subclass of: obszar administracji świeckiej
alternative label: Bezirk @de
alternative label: Kreisdistrikt @de
jest zdefiniowany przez obiekt: Królestwo Galicji i Lodomerii (1772-1848)
jest przedstawiony za pomocą symbolu: powiat, komturstwo, okręg

cyrkuł (Królestwo Galicji i Lodomerii (1772-1848))
type: Class
label: Kreis @de
label: tsyrkul (The Kingdom of Galitia and Lodomeria (1772-1848)) @en
subclass of: obszar administracji świeckiej
alternative label: Direktoriat @de
alternative label: circle @en
jest zdefiniowany przez obiekt: Królestwo Galicji i Lodomerii (1772-1848)
jest przedstawiony za pomocą symbolu: ziemia, cyrkuł, obwód, departament

powiat (Królestwo Węgier (1200-1918))
type: Class
label: district (the Kingom of Hungary (1200-1918)) @en
label: reambulatio @la
label: szolgabírói járás @hu
subclass of: obszar administracji świeckiej
alternative label: processus @la
jest zdefiniowany przez obiekt: Królestwo Węgier (1200-1918)
jest przedstawiony za pomocą symbolu: powiat, komturstwo, okręg

komitat (Królestwo Węgier (1200-1918))
type: Class
label: county (the Kingom of Hungary (1200-1918)) @en
label: megye @hu
subclass of: obszar administracji świeckiej
jest zdefiniowany przez obiekt: Królestwo Węgier (1200-1918)
jest przedstawiony za pomocą symbolu: województwo, gubernia, komitat, obwód, rejencja, landwójtostwo
zobacz też IRI: http://gov.genealogy.net/types.owl#113
zobacz też IRI: https://www.wikidata.org/wiki/Q852231

Słownik języka polskiego
date: 1807/1814
creator: Linde, Samuel Bogumił
type: Document
type: NamedIndividual
label: Słownik języka polskiego (Linde)

Deutsche Rechtswörterbuch
type: Document
type: NamedIndividual
zobacz też IRI: zeige

Dekanat
creator: Pawluk, T.
date: 1973/2014
Identifier: Encyklopedia katolicka, t. 3, Lublin 1973-2014, s. 1114–1115
type: Document
type: NamedIndividual
label: Pawluk, Dekanat

Archidiakonat
creator: Kumor, B.
date: 1973/2014
Identifier: Encyklopedia katolicka, t. 1, Lublin 1973-2014, s. 869–873
type: Document
type: NamedIndividual
label: Kumor, Archidiakonat

Diecezja
creator: Rybczyński, H.
date: 1973/2014
Identifier: Encyklopedia katolicka, t. 3, Lublin 1973-2014, s. 1307–1309
type: Document
type: NamedIndividual
label: Rybczyński, Diecezja

Parafia
creator: Sitarz, M.
date: 1973/2014
Identifier: Encyklopedia katolicka, t. 14, Lublin 1973-2014, s. 1324–1326
type: Document
type: NamedIndividual
label: Sitarz, Parafia

Granice metropolii i diecezji polskich 966-1939
creator: Kumor, B.
date: 1972
type: Document
type: NamedIndividual
label: Kumor, Granice metropolii i diecezji polskich 966-1939

Ustrój i organizacja Kościoła polskiego w okresie niewoli narodowej: (1772-1918)
creator: Kumor, B.
date: 1980
type: Document
type: NamedIndividual
label: Kumor, Ustrój i organizacja Kościoła polskiego w okresie niewoli narodowe

Atlas Kościoła łacińskiego w Rzeczypospolitej Obojga Narodów w XVIII wieku
creator: Litak, S.
date: 2006
type: Document
type: NamedIndividual
label: Litak, Atlas Kościoła łacińskiego w Rzeczypospolitej Obojga Narodów

Kościół łaciński w Rzeczypospolitej około 1772 roku: Struktury administracyjne
creator: Litak, S.
date: 1996
Identifier: Wspólnoty religijne i narodowe w Rzeczypospolitej w drugiej połowie XVIII wieku, 1
type: Document
type: NamedIndividual
label: Litak, Kościół łaciński w Rzeczypospolitej około 1772 roku: Struktury administracyjne

Struktury religijne na przykładzie „Atlasu wyznań i religii w Rzeczypospolitej w drugiej połowie XVIII w.
creator: Szady, B.
date: 2015
Identifier: „Studia Geohistorica“, 3, 2015, s. 243–257
type: Document
type: NamedIndividual
label: Szady, Struktury religijne

Geografia struktur religijnych i wyznaniowych w Koronie w II połowie XVIII wieku
creator: Szady, B.
date: 2010
type: Document
type: NamedIndividual
label: Szady, Geografia struktur religijnych i wyznaniowych

Wielka encyklopedia powszechna PWN
date: 1962/1970
type: Document
type: NamedIndividual

Parish
creator: Boudinhon, A.
creator: Fanning, W.
date: 1911
type: Document
type: NamedIndividual
label: Boudinhon, Fanning, Parish @en
zobacz też tekst: The Catholic Encyclopedia. New York: Robert Appleton Company. Retrieved June 21, 2019 @en

Ènciklopedičeskij slovarʹ Brokgauza i Efrona
title: Энциклопедический словарь Брокгауза и Ефрона @ru
type: Document
type: NamedIndividual

Organizacja Kościoła wschodniego w Polsce
creator: Bieńkowski, L.
date: 1969/1970
Identifier: Kościół w Polsce, t. 2, red. J. Kłoczowski, Kraków 1969-1970, s. 779–1049
type: Document
type: NamedIndividual
label: Bieńkowski, Organizacja Kościoła wschodniego

Kościoły wschodnie w Rzeczypospolitej około 1772 roku: Struktury administracyjne
creator: Kołbuk, W.
date: 1998
description: Wspólnoty religijne i narodowe w Rzeczypospolitej w drugiej połowie XVIII wieku, 2
type: Document
type: NamedIndividual
label: Kołbuk, Kościoły wschodnie w Rzeczypospolitej

Kościoły wschodnie na ziemiach dawnej Rzeczypospolitej 1772-1914: Rozprawa habilitacyjna
creator: Kołbuk, W.
date: 1992
type: Document
type: NamedIndividual
label: Kołbuk, Kościoły wschodnie na ziemiach dawnej Rzeczypospolitej

Protopope
creator: Fortescue, A.
date: 1911
Identifier: The Catholic Encyclopedia. New York: Robert Appleton Company. Retrieved June 21, 2019 from New Advent: http://www.newadvent.org/cathen/12503c.htm
type: Document
type: NamedIndividual
label: Fortescue, Protopope @en

Schism and Russia’s Old Believers
creator: Druzhelyubov, V.
date: 2007
Identifier: "Contemporary Review", 289 (1687), 454 @en
type: Document
type: NamedIndividual
label: Druzhelyubov, Schism and Russia’s Old Believers @en

Kościół prawosławny na ziemiach polskich w XIX i XX wieku
creator: Mironowicz, A.
date: 2005
type: Document
type: NamedIndividual
label: Mironowicz, Kościół prawosławny na ziemiach polskich w XIX i XX wieku

Kościół prawosławny a Rzeczpospolita Polska: Zarys historyczny 1370-1632
creator: Chodynicki, K.
date: 1934
type: Document
type: NamedIndividual
label: Chodynicki, Kościół prawosławny a Rzeczpospolita Polska

Kościoły wschodnie w państwie polsko-litewskim w procesie przemian i adaptacji: Metropolia kijowska w latach 1458-1795
creator: Gil, A.
creator: Skoczylas, I.
date: 2014
type: Document
type: NamedIndividual
label: Gil, Skoczylas, Kościoły wschodnie w państwie polsko-litewskim

Irsigler, Die Stadt im Mittelalter
creator: Irsigler, Franz
date: 2001
Identifier: Goslar und die Stadtgeschichte. Forschungen und Perspektiven 1399–1999, hg. v. Carl-Hans Hauptmeyer/Jürgen Rund, Bielefeld 2001, s. 57–74 @de
title: Die Stadt im Mittelalter. Aktuelle Forschungstendenzen @de
type: Document
type: NamedIndividual
preferred label: Irsigler, Franz: Die Stadt im Mittelalter @de

Ewangelicy polscy i litewscy w epoce saskiej (1696-1763): Sytuacja prawna, organizacja i stosunki międzywyznaniowe
creator: Kriegseisen, W.
date: 1996
type: Document
type: NamedIndividual
label: Kriegseisen, Ewangelicy polscy i litewscy

Kancelarie i dokumenty Kościołów protestanckich w XVI-XVIII wieku
creator: Ptaszyński, M.
date: 2015
Identifier: Dyplomatyka staropolska, red. T. Jurek, Warszawa 2015, s. 389–406 (Nauki Pomocnicze Historii. Seria Nowa / Instytut Historii PAN)
type: Document
type: NamedIndividual
label: Ptaszyński, Kancelarie i dokumenty Kościołów protestanckich w XVI-XVIII wieku

Bracia czescy w Wielkopolsce w XVI i XVII wieku
creator: Dworzaczkowa, J.
date: 1997
type: Document
type: NamedIndividual
label: Dworzaczkowa, Bracia czescy w Wielkopolsce w XVI i XVII wieku

Ustroje kościołów ewangelicko‑reformowanych w Rzeczypospolitej Obojga Narodów na przełomie XVI i XVII wieku
creator: Bem, K.
date: 2013
Identifier: „Odrodzenie i Reformacja w Polsce“, 57, 2013, s. 123–153
type: Document
type: NamedIndividual
label: Bem, Ustroje kościołów ewangelicko‑reformowanych w Rzeczypospolitej Obojga Narodów

Bracia czescy a kalwini w Rzeczypospolitej, połowa XVI - połowa XVII wieku: Studium porównawcze
creator: Gmiterek, H.
date: 1987
type: Document
type: NamedIndividual
label: Gmiterek, Bracia czescy a kalwini w Rzeczypospolitej

Kościoły ewangelickie na Kresach Wschodnich II Rzeczypospolitej
creator: Alabrudzińska, E.
date: 1999
type: Document
type: NamedIndividual
label: Alabrudzińska, Kościoły ewangelickie na Kresach Wschodnich

Litewska jednota ewangelicko-reformowana od połowy XVII w. do 1939 r.
creator: Kosman, M.
date: 1986
description: Studia i Monografie / Wyższa Szkoła Pedagogiczna im. Powstańców Śląskich w Opolu, nr 121
type: Document
type: NamedIndividual
label: Kosman, Litewska jednota ewangelicko-reformowana

Kościoły luterańskie na ziemiach polskich (XVI - XX w.)
creator: Kłaczkow, J.
date: 2012
description: t. 1-3
type: Document
type: NamedIndividual

Kneifel, E.
date: 1964
title: Geschichte der Evangelisch-Augsburgischen Kirche in Polen @de
type: Document
type: NamedIndividual
label: Kneifel, Geschichte der Evangelisch-Augsburgischen Kirche in Polen @de

Die evangelisch-augsburgischen Gemeinden in Polen 1555-1939: Eine Parochialgeschichte in Einzeldarstellungen
creator: Kneifel, E.
date: 1971
type: Document
type: NamedIndividual
label: Kneifel, Die evangelisch-augsburgischen Gemeinden in Polen 1555-1939 @de

Średniowieczny dwór rycerski w Polsce
creator: Marciniak-Kajzer, Anna
date: 2011
type: Document
type: NamedIndividual
label: Marciniak-Kajzer, Średniowieczny dwór rycerski w Polsce

Historisch-comparative Geographie von Preussen
creator: Töppen, M.
date: 1858
type: Document
type: NamedIndividual
label: Töppen, Historisch-comparative Geographie von Preussen @de

Chronik und Statistik der evangelischen Kirchen in den Provinzen Ost- und Westpreussen
creator: Harnoch, A. @de
date: 1890 @de
type: Document
type: NamedIndividual
label: Harnoch, Chronik und Statistik der evangelischen Kirchen in den Provinzen Ost- und Westpreussen @de

Geschichte der evangelischen Kirche Ostpreussens
creator: Hubatsch, W.
date: 1968
description: vol. 1-3 @en
type: Document
type: NamedIndividual
label: Hubatsch, Geschichte der evangelischen Kirche Ostpreussens @de

Die kirchliche Organisation um 1785
creator: Mortensen, H.
date: 1968
Identifier: Historisch-geographischer Atlas des Preußenlandes, t. 2, red. H. Mortensen, Wiesbaden 1968
type: Document
type: NamedIndividual

Śląsk w końcu XVIII wieku
creator: Janczak, J.
creator: Ładogórski, T.
date: 1976/1984
description: Atlas historyczny Polski: Mapy XVIII wieku, 1-2
description: t. 1-2
type: Document
type: NamedIndividual

Historia protestantyzmu w Polsce: Od połowy XVIII wieku do pierwszej wojny światowej
creator: Gastpary, W.
date: 1977
type: Document
type: NamedIndividual
label: Gastpary, Historia protestantyzmu w Polsce

Im Blickpunkt der Geschichte der Reformation: Evangelisch-Reformierte in (Ost-)Preußen
creator: Gresch, E.
date: 2011
Identifier: „Rundbrief der Gemeinschaft evangelischer Ostpreußen e.V.“, 1, 2011, s. 1–32
type: Document
type: NamedIndividual
label: Gresch, Im Blickpunkt der Geschichte der Reformation @de

Praktyczny słownik współczesnej polszczyzny
creator: Zgółkowa, H.
date: 1994/2005
description: t. 1–50, Wydawnictwo Kurpisz, Poznań
type: Document
type: NamedIndividual

Nowa encyklopedia powszechna PWN
date: 1995/1996
type: Document
type: NamedIndividual

Słownik starożytności słowiańskich: encyklopedyczny zarys kultury Słowian od czasów najdawniejszych
date: 1961/1996
type: Document
type: NamedIndividual
label: Słownik starożytności słowiańskich

Dzieje Puszczy Białowieskiej w Polsce przedrozbiorowej (w okresie do 1798 roku)
creator: Hedemann, Otton
date: 1939
type: Document
type: NamedIndividual
label: Hedemann, Dzieje Puszczy Białowieskiej
zobacz też IRI: http://pbc.biaman.pl/dlibra/doccontent

Wielka ilustrowana encyklopedia powszechna (Wydawnictwa Gutenberga)
date: 1929/1938
type: Document
type: NamedIndividual

Niemcy w Polsce w XX wieku
creator: Matelski, D.
date: 1999
type: Document
type: NamedIndividual
label: Matelski, Niemcy w Polsce w XX wieku

Protestantyzm w Poznańskiem 1815-1918
creator: Kiec, O.
date: 2001
type: Document
type: NamedIndividual
label: Kiec, Protestantyzm w Poznańskiem

Polacy-ewangelicy w Królestwie Polskim 1815-1914: Kształtowanie sie środowisk ich działalność społeczna i narodowa
creator: Stegner, T.
date: 1992
description: Rozprawy i monografie / Uniwersytet Gdański, 174
type: Document
type: NamedIndividual
label: Stegner, Polacy-ewangelicy w Królestwie Polskim 1815-1914

Kościół Ewangelicko-Augsburski w Polsce w latach 1918-1939
creator: Kłaczkow, J.
date: 2017
type: Document
type: NamedIndividual
label: Kłaczkow, Kościół Ewangelicko-Augsburski w Polsce w latach 1918-1939

Organizacja kościoła ewangelicko-reformowanego w b. zaborze rosyjskim
creator: Witkowski, W.
date: 1936
Identifier: „Gazeta Administracji“, 18 (20), 1936, s. 624–633;
type: Document
type: NamedIndividual
label: Witkowski, Organizacja kościoła ewangelicko-reformowanego w b. zaborze rosyjskim

Geografia historyczna Wielkiego Księstwa Litewskiego: Stan i perspektywy badań
creator: Błaszczyk, G.
date: 2007
type: Document
type: NamedIndividual
label: Błaszczyk G., Geografia historyczna Wielkiego Księstwa Litewskiego

Studia z ustroju i dziejów Wielkiego Księstwa Litewskiego
creator: Bardach, J.
date: 1970
type: Document
type: NamedIndividual
label: Bardach J., Studia z ustroju i dziejów Wielkiego Księstwa Litewskiego

Oбластное деление и местное управление Литовско-русского государства ко времени издания первого Литовского статута
creator: Любавский, М.К.
date: 1892
type: Document
type: NamedIndividual
label: Oblastnoye deleniye i mestnoye upravleniye Litovsko-russkogo gosudarstva ko vremeni izdaniya pervogo Litovskogo statuta @en
zobacz też IRI: http://e-heritage.ru/ras/view/publication/general.html

Podlasie (Województwo)
date: 1908/1910
Identifier: Źródła Dziejowe, t. 17, cz. 1-3
type: Document
type: NamedIndividual
label: Jabłonowski A., Podlasie (Województwo)

S. Orgelbranda Encyklopedja powszechna z ilustracjami i mapami. T. 1 - T. 18
creator: Orgelbrand, Samuel
date: 1898/1912
type: Document
type: NamedIndividual
label: Orgelbrand, Encyklopedja powszechna
zobacz też IRI: http://cybra.lodz.pl/dlibra/publication/721

Mapa Wielkiego Księstwa Litewskiego w połowie XVI wieku. 1, Część północna, skala 1:1.600.000: objaśnienia do mapy
creator: Jakubowski, J.
date: 1928
type: Document
type: NamedIndividual
label: Mapa Wielkiego Księstwa Litewskiego w połowie XVI wieku.

Вялікі гістарычны атлас Беларусі, t. 1-3,
date: 2013/2016
type: Document
type: NamedIndividual
label: Vialiki histaryčny atlas Bielarusi @en
label: Вялікі гістарычны атлас Беларусі @be

Studja nad początkami społeczeństwa i państwa litewskiego.
creator: Łowmiański, H.
date: 1931/1932
Identifier: Rozprawy Wydziału III Towarzystwa Przyjaciół Nauk w Wilnie, t. 5-6
type: Document
type: NamedIndividual
label: Łowmiański H., Studja nad początkami społeczeństwa i państwa litewskiego

Organizacja opolna w Polsce średniowiecznej
creator: Buczek, K.
date: 1970
Identifier: "Studia Historyczne“, 13 (2), 1970, 205-250
type: Document
type: NamedIndividual
label: Buczek K., Organizacja opolna w Polsce średniowiecznej

Organizacja opolna w Polsce piastowskiej
creator: Modzelewski, K.
date: 1986
Identifier: „Przegląd Historyczny“, 77 (2), 1986, 177-222
type: Document
type: NamedIndividual
label: Modzelewski K., Organizacja opolna w Polsce piastowskiej

Vicinia id est: Poszukiwania alternatywnej koncepcji staropolskiego opola
creator: Matuszewski, J.
date: 1991
type: Document
type: NamedIndividual
label: Matuszewski J., Vicinia id est: Poszukiwania alternatywnej koncepcji staropolskiego opola
zobacz też IRI: http://polona.pl/item/5979812

Wczesnopiastowska organizacja administracyjna w X i XI wieku
creator: Teterycz-Puzio, A.
date: 2001
Identifier: „Słupskie Studia Historyczne“, 9, 2001, 245-257
type: Document
type: NamedIndividual
label: Teterycz-Puzio A., Wczesnopiastowska organizacja administracyjna w X i XI wieku

Powiat w Wielkopolsce XIV-XVI wieku: Z zagadnień zarządu terytorialnego i podziałów Polski późnośredniowiecznej
creator: Gąsiorowski, A.
date: 1965
type: Document
type: NamedIndividual
label: Gąsiorowski A., Powiat w Wielkopolsce XIV-XVI wieku

Historisch-comparative Geographie von Preussen
creator: Töppen, M.
date: 1858
type: Document
type: NamedIndividual

Prusy Książęce a Prusy Królewskie w latach 1525-1548. Studium z dziejów polskiej polityki księcia Albrechta Hohenzollerna
creator: Małłek, J.
date: 2016
type: Document
type: NamedIndividual

Geografia historyczna Polski
creator: Arnold, Stanisław
date: 1951
type: Document
type: NamedIndividual
label: Arnold, Geografia historyczna Polski

Ustawa o rządzie (Regimentsnottel) Prus Książęcych z 1542 roku. Studium z dziejów przemian społecznych i politycznych w lennie pruskim
creator: Małłek, J.
date: 1967
Identifier: Roczniki Towarzystwa Naukowego w Toruniu, R. 72, z. 2
type: Document
type: NamedIndividual

Organizacja władzy naczelnej Prus Książęcych
creator: Grygier, T.
date: 1964
Identifier: "Komunikaty Mazursko-Warmińskie" 1964, nr 4, s. 460-513
type: Document
type: NamedIndividual

Geneza i znaczenie hołdu pruskiego 1525 roku
creator: Biskup, M.
date: 1975
Identifier: "Komunikaty Mazursko-Warmińskie" 1975, nr 4, s. 407-424
type: Document
type: NamedIndividual

Starostwa dziedziczne Prus Książęcych w XVII i XVIII wieku
creator: Skibiński, J.
date: 1972
type: Document
type: NamedIndividual

Administracja gmin wiejskich w Królestwie Polskim w latach 1815–1864
creator: Dziki, T.
date: 2015
Identifier: "Klio. Czasopismo poświęcone dziejom Polski i powszechnym", 32 (1), 2015, s. 111–138.
type: Document
type: NamedIndividual

Ustrój polityczno-prawny Śląska Austriackiego w latach 1742-1848. (Próba syntezy)
creator: Grodziski, S.
date: 1967
Identifier: „Studia Historyczne”. 1967, z. 1–2, s. 5–21.
type: Document
type: NamedIndividual

Granice i zmiany przynależności Śląska Cieszyńskiego do 1918 roku
creator: Gawrecki, D.
date: 2008
Identifier: Śląsk Cieszyński. Granice – przynależność – tożsamość. Red. J. Spyra. Cieszyn 2008, s. 20–21;
type: Document
type: NamedIndividual

Historyczno-Geograficzne podstawy Śląska
creator: Semkowicz, W.
date: 1930
type: Document
type: NamedIndividual

Historia ustroju i prawa Księstwa Warszawskiego
creator: Sobociński, W.
date: 1964
type: Document
type: NamedIndividual

Encyklopedia historii gospodarczej Polski do 1945 roku
creator: Mączak, Antoni
date: 1981
type: Document
type: NamedIndividual

Organy administracji terenowej w Księstwie Warszawskim
creator: Kallas, M.
date: 1975
type: Document
type: NamedIndividual

Granice Śląska. Zmiany granic Śląska w czasie i przestrzeni. Śląsk na dawnej mapie. Obraz Sudetów w dawnej kartografii,
creator: Konopska, B.
creator: Pustelnik, A.
creator: Pyskiewicz-Jędrusik, R.
date: 1998
type: Document
type: NamedIndividual

Sytuacja polityczna i prawno-administracyjna miasta i okolicy w latach konstytucjonalizmu
creator: Spyra, J.
date: 2010
Identifier: Bielsko-Biała. Monografia miasta, red. I. Panic, t. 3: Bielsko od wojen śląskich do zakończenia I wojny światowej (1740-1918), Bielsko-Biała 2010, s. 122-136;
type: Document
type: NamedIndividual

Dzieje Śląska Cieszyńskiego od zarania do czasów współczesnych
creator: Panic, I. (red.)
date: 2013
Identifier: red. I. Panic, t. 5: Śląsk Cieszyński od Wiosny Ludów do I wojny światowej (1848-1918), red. K. Nowak, I. Panic, Cieszyn 2013.
type: Document
type: NamedIndividual

Dzieje ustroju i prawa księstwa siewierskiego
creator: Nowakowski, A.
date: 1991
type: Document
type: NamedIndividual

Siewierz
date: 2008
Identifier: Atlas historyczny Polski. Województwo krakowskie w drugiej połowie XVI w., cz. II, red. H. Rutkowski, Warszawa 2008, s. 236-239;
type: Document
type: NamedIndividual
label: M. Wilska, Siewierz...

Księstwo Siewierskie. Prawo i ustrój a zakres suwerenności względem Korony Królestwa Polskiego
creator: Żelazny, K., Z.
date: 2016
type: Document
type: NamedIndividual

Powiat w Polsce późnośredniowiecznej
creator: Bardach, J.
date: 1967
Identifier: CPH, t. 19, 1967, z. 2
type: Document
type: NamedIndividual

Typ i forma państwa polskiego w okresie demokracji szlacheckiej
creator: Kaczmarczyk, Z.
date: 1955
Identifier: "Odrodzenie i Reformacja w Polsce", 1955, t. 1
type: Document
type: NamedIndividual

Słownik języka polskiego
creator: Lehr-Spławiński, Tadeusz
date: 1938/1939
publisher: Księgarnia i Dom Wydawniczy Trzaska, Evert i Michalski
type: Document
type: NamedIndividual
label: Słownik języka polskiego (Trzaska)

Historia Polski 1572-1795
creator: Augustyniak, U.
date: 2008
type: Document
type: NamedIndividual

Królestwo Polskie 1295-1370
creator: Balzer, O.
date: 2005
type: Document
type: NamedIndividual

Die österreichische Monarchie, geographisch, statistisch, topographisch und historisch dargestellt
creator: Ungewitter, F.H.
date: 1856
title: Die österreichische Monarchie, geographisch, statistisch, topographisch und historisch dargestellt: Unter genauer Bezugnahme auf die neueste administrative und gerichtliche Organisation der Kronländer, und mit der sorgfältigsten und ausführlichsten Topographie @de
type: Document
type: NamedIndividual

Słownik języka polskiego PWN
creator: Szymczak, Mieczysław
date: 1995/1998
publisher: Wydawnictwo Naukowe PWN
type: Document
type: NamedIndividual
label: Słownik języka polskiego PWN (Szymczak)

Słownik polszczyzny XVI wieku
creator: Bąk, Stanisław
creator: Mayenowa, Maria Renata
creator: Pepłowski, Franciszek
date: 1956/
type: Document
type: NamedIndividual
zobacz też IRI: http://kpbc.umk.pl/dlibra/publication/17781

Słownik współczesnego języka polskiego
date: 2000
publisher: Wydawnictwo WILGA
type: Document
type: NamedIndividual
label: Słownik współczesnego języka polskiego (Wilga)

Wielka Encyklopedia PWN
creator: Wojnowski, Jan
date: 2001/2005
type: Document
type: NamedIndividual
label: Wielka Encyklopedia PWN (2001-2005)

Rozporządzenie Ministra Administracji i Cyfryzacji z dnia 9 stycznia 2012 r. w sprawie ewidencji miejscowości, ulic i adresów
creator: Minister Administracji i Cyfryzacji RP
date: 2012-02-02
type: Document
type: NamedIndividual
label: Rozporządzenie EMUiA (2012)
zobacz też IRI: http://prawo.sejm.gov.pl/isap.nsf/DocDetails.xsp

Zmiany podziałów administracyjnych w Cesarstwie Rosyjskim, w Związku Radzieckim oraz w Federacji Rosyjskiej
creator: Eberhardt, Piotr
date: 2010
Identifier: „Studia z Dziejów Rosji i Europy Środkowo-Wschodniej“, 45, 2010, s. 239–257
type: Document
type: NamedIndividual
label: Eberhardt P. Zmiany podziałów administracyjnych w Cesarstwie Rosyjskim...

Правительственный аппарат самодержавной России
creator: Зайончковский П.А.
date: 1978
type: Document
type: NamedIndividual
label: Zajončkovskij P.A., Pravitelʹstvennyj apparat samoderžavnoj Rossii @en
label: Зайончковский П.А., Правительственный аппарат самодержавной России @ru

Институт генерал-губернаторства в Российской империи
creator: Рассолов Г.А. @ru
date: 2005
type: Document
type: NamedIndividual
label: Rassolov G.A., Institut general-gubernatorstva v Rossijskoj imperii @en
label: Рассолов Г.А., Институт генерал-губернаторства в Российской империи @ru
zobacz też IRI: http://www.dissercat.com/content/institut-general-gubernatorstva-v-rossiiskoi-imperii-1775-g-konets-xix-v

Изменение административно-территориального деления России за последние 300 лет, „География“
creator: Тархов С.А.
date: 2001
type: Document
type: NamedIndividual
label: Tarhov S.A., Izmeneniye administrativno-territorial'nogo deleniya Rossii za posledniye 300 let, „Geografiya“ @en
label: Тархов С.А., Изменение административно-территориального деления России за последние 300 лет, „География“ @ru
zobacz też IRI: http://geo.1september.ru/article.php

Изменение административно-территориального деления России в XIII—XX вв
creator: Тархов С.А.
date: 2005
Identifier: „Логос“, 1 (46), 2005, s. 65–101
type: Document
type: NamedIndividual
label: Tarhov S.A., Izmenenie administrativno-territorialʹnogo deleniâ Rossii v XIII—XX vv @en
label: Тархов С.А., Изменение административно-территориального деления России в XIII—XX вв @ru

Ландратура Санкт-Петербургской губернии: штат, функции, место в системе управления (mатериалы к исследованию)
creator: Peдин, Д.
Identifier: Pедин, Дмитрий, Ландратура Санкт-Петербургской губернии, „Res Historica“, 44, 2017, s. 75–88. @ru
type: Document
type: NamedIndividual
label: Redin D., Landratura Sankt-Peterburgskoj gubernii @en
label: Редин Д., Ландратура Санкт-Петербургской губернии @ru

Moravskoslezské gubernium v letech 1783-1849
creator: Brodesser, S.
date: 1968
type: Document
type: NamedIndividual
label: Brodesser S., Moravskoslezske gubernium v letech 1783-1849 @en
label: Brodesser S., Moravskoslezské gubernium v letech 1783-1849 @cs

Słownik języka polskiego (PWN)
type: Document
type: NamedIndividual

Przemiany struktur aparatu biurokratycznego na przykładzie Moraw
creator: Svitak, Z.
date: 2016
Identifier: Dzieje biurokracji: t. 6, red. T. Bykowa, A. Górak, G. Smyk, Lublin, Radzyń Podlaski 2016, s. 15–24
type: Document
type: NamedIndividual
label: Svitak Z., Przemiany struktur aparatu biurokratycznego na przykładzie Moraw
zobacz też IRI: http://polona.pl/item/60135467

Historia państwa i prawa Polski. T. 3, Od rozbiorów do uwłaszczenia
creator: Bardach J.
creator: Bartel W.M.
type: Document
type: NamedIndividual
label: Bardach J., Bartel W.M., Historia państwa i prawa Polski. T. 3

Ustrój i prawo Wolnego Miasta Krakowa: (1815-1846)
creator: Bartel W.M.
date: 1976
type: Document
type: NamedIndividual
label: Bartel W.M., Ustrój i prawo Wolnego Miasta Krakowa...

Pierwsze podziały administracyjne Galicji
creator: Barwiński, E.
date: 1935
type: Document
type: NamedIndividual
label: Barwiński E., Pierwsze podziały administracyjne Galicji

Kancelaria organów władzy w Galicji: Wybór źródeł
creator: Górak, A.
creator: Latawiec, K.
date: 2012
type: Document
type: NamedIndividual
label: Górak A., Latawiec K., Kancelaria organów władzy w Galicji...

Historia ustroju społeczno-politycznego Galicji 1772-1848
creator: Grodziski, S.
date: 1971
type: Document
type: NamedIndividual
label: Grodziski S., Historia ustroju społeczno-politycznego Galicji 1772-1848

Galicja Zachodnia 1795-1809: Studium z dziejów ziem polskich zaboru austriackiego po III rozbiorze
creator: Mencel, T.
date: 1976
type: Document
type: NamedIndividual
label: Mencel T., Galicja Zachodnia 1795-1809...

Galizien unter österreichischer Herrschaft: Verwaltung - Kirche - Bevölkerung
date: 1994
type: Document
type: NamedIndividual
label: Mark R.A., Galizien unter österreichischer Herrschaft @de

Historia państwa i prawa Polski. T. 4, Od uwłaszczenia do odrodzenia państwa
creator: Grzybowski, K.
date: 1982
type: Document
type: NamedIndividual
label: Grzybowski K., Historia państwa i prawa Polski. T. 4

Galicja 1848-1914: Historia ustroju politycznego na tle historii ustroju Austrii
creator: Grzybowski, K.
date: 1959
type: Document
type: NamedIndividual
label: Grzybowski K., Galicja 1848-1914

Słownik języka polskiego
creator: Doroszewski, Witold
date: 1958/1969
type: Document
type: NamedIndividual
label: Słownik języka polskiego (Doroszewski)

Historia Węgier
creator: Felczak, W.
date: 1983
type: Document
type: NamedIndividual
label: Felczak W., Historia Węgier

Dzieje Węgier w zarysie, t. 2-3
creator: Gajsler, J.F
date: 1900/2002
type: Document
type: NamedIndividual
label: Gajsler J.F., Dzieje Węgier w zarysie

Osadnictwo polskie na Górnych Węgrzech do początku XVIII wieku
creator: Skawiński, M.
date: 2007
Identifier: Jánošik a fenomén zbojnictva na slovensko-polsko-českom pomedzi: Janosik a fenomen zbójnictwa słowacko-polskiego i czeskiego pogranicza zborník príspevkov z konferencie Terchová 2.- 4. 8. 2007, red. M. Mrva, Žilina 2007, s. 33–53;
type: Document
type: NamedIndividual
label: Skawiński M., Osadnictwo polskie na Górnych Węgrzech...

Górny Spisz za panowania Władysława II Jagiełły (1386-1434)
creator: Trajdos, T.
date: 2016
Identifier: „Nowe Studia Grunwaldzkie“, 2, 2016, s. 9–20.
type: Document
type: NamedIndividual
label: Trajdos T., Górny Spisz...

Historia ustroju Polski X-XX w.
creator: Kallas, M.
date: 2003
type: Document
type: NamedIndividual
label: Kallas M., Historia ustroju Polski X-XX w.

Polska na królu pruskim zdobyta. „Ustrój, administracja i sądownictwo doby Komisji Rządzącej w 1807 roku"
creator: Goclon, J. A.
date: 2002
type: Document
type: NamedIndividual
label: Goclon J. A., Polska na królu pruskim zdobyta...

Organy administracji terytorialnej w Księstwie Warszawskim
creator: Kallas, M.
date: 1975
type: Document
type: NamedIndividual
label: Kallas M., Organy administracji terytorialnej w Księstwie Warszawskim

Deutsche Verwaltungsgeschichte
creator: G. H. v. Unruh
creator: H. Pohl
creator: K. G. A. Jeserich
date: 1983
type: Document
type: NamedIndividual
label: Deutsche Verwaltungsgeschichte...

Prusy w okresie monarchii absolutnej (1701-1806)
creator: Wachowiak, B.
date: 2010
type: Document
type: NamedIndividual

Ziemie polskie pod zaborem pruskim. Prusy Południowe 1793-1806. Studium historycznoprawne
creator: Wąsicki, J.
date: 1957
type: Document
type: NamedIndividual
label: J. Wąsicki, Ziemie polskie pod zaborem pruskim

Słownik języka polskiego
creator: Karłowicz, Jan
creator: Kryński, Adam
creator: Niedźwiedzki, Władysław
date: 1900/1927
type: Document
type: NamedIndividual
label: Słownik warszawski
zobacz też IRI: http://ebuw.uw.edu.pl/publication/254

M. Bär, Die Behördenverfassung in Westpreußen seit der Ordenszeit
creator: Bär, M.
date: 1912
title: Die Behördenverfassung in Westpreußen seit der Ordenszeit @de
type: Document
type: NamedIndividual

Heinrich G., Henning F.W., Jeserich K. G. A., Verwaltungsgeschichte Ostdeutschlands 1815-1945
creator: Heinrich G.
creator: Henning F.W.
creator: Jeserich K. G. A.
date: 1993
title: Verwaltungsgeschichte Ostdeutschlands 1815-1945. Organisation-Aufgaben-Leistungen der Verwaltung @de
type: Document
type: NamedIndividual

Handbuch der Preußischen Geschichte...
date: 1992
title: Handbuch der Preußischen Geschichte, hrsg. v. O. Buesch, Bd. II, Das 19. Jh. und Große Themen der Geschichte Preußens @de
type: Document
type: NamedIndividual

Deutsche Verfassungsgeschichte
creator: Huber
type: Document
type: NamedIndividual

Roger W., Frotscher W., „Überblick über die Verwaltungsorganisation in den Bundesstaaten
creator: Frotscher, W.
creator: Roger, W.
date: 1984
Identifier: Deutsche Verwaltungsgeschichte, Bd. 3 hrsg. von K.G.A. Jeserich, H. Pohl und G. Ch. v. Unruh, Stuttgart 1984 @de
title: Überblick über die Verwaltungsorganisation in den Bundesstaaten @de
type: Document
type: NamedIndividual

Historia Pomorza, t. I do roku 1466...
creator: Labuda, G.
date: 1969
title: Historia Pomorza, t. I do roku 1466, cz. II. Pomorze Zachodnie w dobie rozwijającego się feudalizmu (1124-14640)
type: Document
type: NamedIndividual

Dzieje Brandenburgii-Prus. Na progu czasów nowożytnych (1500-1701)
creator: Kamieński, A.
creator: Wachowiak, B.
date: 2001
type: Document
type: NamedIndividual
label: B. Wachowiak, A. Kamieński, Dzieje Brandenburgii-Prus.

Władztwo Polski w Prusiech Zakonnych i Książęcych
creator: Vetulani, A.
date: 1953
title: Władztwo Polski w Prusiech Zakonnych i Książęcych (1454-1657)
title: Władztwo Polski w Prusiech Zakonnych i Książęcych (1454-1657). Wybór źródeł.
type: Document
type: NamedIndividual

Struktura administracyjna i własnościowa Pomorza Gdańskiego pod rządami zakonu krzyżackiego w latach 1309-1454
creator: Grzegorz, M.
date: 1987
type: Document
type: NamedIndividual
label: M. Grzegorz, Struktura administracyjna i własnościowa Pomorza Gdańskiego...

Gerard Labuda, Dzieje zakonu krzyżackiego w Prusach. Gospodarka-Społeczeństwo-Pańswo-Ideologia
creator: Biskup, M.
creator: Labuda, G.
date: 1986
type: Document
type: NamedIndividual
label: M. Biskup, G. Labuda, Dzieje zakonu krzyżackiego w Prusach...

Słownik staropolski
creator: Urbańczyk, Stanisław
date: 1953/2002
type: Document
type: NamedIndividual
zobacz też IRI: sstp.html

Państwo zakonu krzyżackiego w Prusach. Władza i społeczeństwo
creator: Biskup, M.
date: 2008
type: Document
type: NamedIndividual
label: M. Biskup, i in., Państwo zakonu krzyżackiego w Prusach...

Zakon Krzyżacki w Prusach i Inflantach. Podziały admiinistracyjne i kościelne w XIII-XVI wieku
creator: Czaja, R.
creator: Radzimiński, A.
date: 2013
type: Document
type: NamedIndividual
label: Zakon Krzyżacki w Prusach i Inflantach...

A. Radzimiński, Die Kirche im Deutschordensstaat in Preussen...
creator: Radzimiński, A.
date: 2014
description: Prussia sacra, t. 4
title: Die Kirche im Deutschordensstaat in Preussen (1243-1525). Organisation, Ausstattung, Rechtsprechung, Geistlichkeit, Gläubige @de
type: Document
type: NamedIndividual

A. Radzimiński, Biskupstwa państwa krzyżackiego...
creator: Radzimiński, A.
date: 1999
title: Biskupstwa państwa krzyżackiego w Prusach XIII-XV wieku
type: Document
type: NamedIndividual

Ustawy okołokonstytucyjne Sejmu Wielkiego z 1791 i 1792 r.
creator: Uruszczak, W.
date: 2013
Identifier: "Krakowskie Studia z Historii Państwa i Prawa", t. 6 (z. 3), 2013
type: Document
type: NamedIndividual
label: W. Uruszczak, Ustawy okołokonstytucyjne Sejmu Wielkiego...

Historia Polski 1572-1795
creator: Augustyniak, U.
date: 2008
type: Document
type: NamedIndividual
label: U. Augustyniak, Historia Polski 1572-1795

Historia państwa i prawa Polski do roku 1795, t. 1-2
creator: Bardach, J.
date: 1957
type: Document
type: NamedIndividual

Historia administracji nowożytnej
creator: Malec, D.
creator: Malec, J.
date: 1998
type: Document
type: NamedIndividual
label: D. Malec, J. Malec, Historia administracji nowożytnej

Historia ustroju i prawa polskiego
creator: Bardach, J.
creator: Leśniodorski, B.
creator: Pietrzak, M.
date: 2011
type: Document
type: NamedIndividual
label: J. Bardach, B. Leśniodorski, M. Pietrzak, Historia ustroju i prawa polskiego

Encyklopedia Katolicka
date: 1973/2014
type: Document
type: NamedIndividual
zobacz też IRI: encyklopedia-katolicka,art 9929.html

Podziały terytorialno-administracyjne II Rzeczypospolitej w zakresie administracji zespolonej
creator: Mielcarek, A. J.
date: 2008
type: Document
type: NamedIndividual
label: Mielcarek A.J., Podziały terytorialno-administracyjne II Rzeczypospolitej w zakresie administracji zespolonej

Państwowe, administracyjne, wojskowe i wyznaniowe podziały terytorialne na ziemiach polskich: (zarys dziejów)
creator: Wojtkowiak, S.
date: 2000
type: Document
type: NamedIndividual
label: Wojtkowiak S., Państwowe, administracyjne, wojskowe i wyznaniowe podziały terytorialne na ziemiach polskich

Ustrój administracji ogólnej na Wileńszczyźnie w okresie międzywojennym
creator: Gałędek, M.
date: 2012
type: Document
type: NamedIndividual
label: Gałędek M., Ustrój administracji ogólnej na Wileńszczyźnie w okresie międzywojennym

Proces ujednolicania ustroju samorządu terytorialnego w II Rzeczypospolitej
creator: Dziobek-Romański, J.
date: 2012
Identifier: „Roczniki Nauk Prawnych“, 22 (2), 2012, s. 149–177
type: Document
type: NamedIndividual
label: Dziobek-Romański J., Proces ujednolicania ustroju samorządu terytorialnego w II Rzeczypospolitej

Z dziejów unifikacji administracji II Rzeczypospolitej: Rola przepisów pruskich
creator: Tarnowska, A.
date: 2012
type: Document
type: NamedIndividual
label: Tarnowska A., Z dziejów unifikacji administracji II Rzeczypospolitej

Niedostatki unifikacji administracji ogólnej. Doktryna i praktycy o koniecznych uzupełnieniach rozporządzenia Prezydenta RP z dnia 19 stycznia 1928 r
creator: Tarnowska, A.
date: 2016
Identifier: „Studia Iuridica Toruniensia“, 17, 2016, s. 255
type: Document
type: NamedIndividual
label: Tarnowska A., Niedostatki unifikacji administracji ogólnej

Województwo w Drugiej Rzeczypospolitej: z dziejów podziałów terytorialnych w latach 1919-1939
creator: Kallas, M.
date: 1997
Identifier: „Acta Universitatis Nicolai Copernici. Nauki Humanistyczno-Społeczne. Historia“, 30, 1997, s. 145–161
type: Document
type: NamedIndividual
label: Kallas M., Województwo w Drugiej Rzeczypospolitej

Próba zreformowania podziału terytorialnego Drugiej Rzeczypospolitej w latach 1928-1933
creator: Lewandowska-Malec, I.
date: 1997
Identifier: „Czasopismo Prawno-Historyczne“, 51 (1-2), 1999, s. 301–317
type: Document
type: NamedIndividual
label: Lewandowska-Malec I., Próba zreformowania podziału terytorialnego Drugiej Rzeczypospolitej w latach 1928-1933

Historia ustroju Śląska 1202-1740
creator: Orzechowski, K.
date: 2005
type: Document
type: NamedIndividual
label: K. Orzechowski, Historia ustroju Śląska 1202-1740

Slezsko - země Koruny české. Historie a kultura 1300-1740
creator: Dáňová, H.
creator: Klípa, J.
creator: Stolárová, L.
date: 2008
title: Slezsko - země Koruny české. Historie a kultura 1300-1740. Díl A a B @cs
type: Document
type: NamedIndividual

Organizacja przestrzenna wsi w Polsce
creator: Tkocz, Jan
date: 1998
type: Document
type: NamedIndividual
label: Tkocz, Organizacja przestrzenna wsi

The Long Formation of the Region (c. 1000-1526)
creator: Wiszewski, P.
date: 2013
Identifier: Cuius regio? Ideological and Territorial Cohesion of Silesia, eds. Lucyna Karc, Przemysław Wiszewski, Rościsław Żerelik, vol. 1), Wrocław 2013
type: Document
type: NamedIndividual

Terra - Ducatus - Marchionatus - Regio
creator: Bobková, L.
creator: Fantysová-Matějková, J.
creator: J. Hrachovec, P.
creator: Zdichynec, J.
date: 2013
title: Terra - Ducatus - Marchionatus - Regio. Die Bildung und Entwicklung der Regionen im Rahmen der Krone des Königreichs Böhmen @de
type: Document
type: NamedIndividual

Slezsko v dějinách českého státu, I: od pravěku do roku 1490
creator: Antonín, R.
creator: Janák, V.
creator: Jirásek, Z.
creator: Kouřil, P.
creator: Prix, D.
creator: Čapský, M.
date: 2012
type: Document
type: NamedIndividual

Slezsko v dějinách českého státu. II. 1490-1763
creator: Fukala, R.
creator: Jirásek, Z.
creator: Korbelářová, I.
creator: Olšovský, J.
creator: Uhlíř, D.
creator: Žáček, R.
date: 2012
type: Document
type: NamedIndividual

Polskie Górne Łużyce
creator: Bena, W.
date: 2005
type: Document
type: NamedIndividual
label: W. Bena, Polskie Górne Łużyce

Zachodnia granica Polski
creator: Skubiszewski, K.
date: 1969
type: Document
type: NamedIndividual
label: Skubiszewski K., Zachodnia granica Polski

Wolne Miasto Gdańsk a Liga Narodów 1920-1939
creator: Mikos, S.
date: 1979
type: Document
type: NamedIndividual
label: Mikos S., Wolne Miasto Gdańsk a Liga Narodów 1920-1939

Ustrój polityczny Wolnego Miasta Gdańska w latach 1920-1933
creator: Podlaszewski, M.
date: 1966
type: Document
type: NamedIndividual
label: Podlaszewski M., Ustrój polityczny Wolnego Miasta Gdańska w latach 1920-1933

Polska i Wolne Miasto Gdańsk (1920-1939). Stosunki polityczne
creator: Stępniak, H.
date: 2004
Identifier: Historia Pomorza, t. 5 (1918-1939)
type: Document
type: NamedIndividual
label: Stępniak H., Polska i Wolne Miasto Gdańsk (1920-1939)

Województwo pomorskie i Wolne Miasto Gdańsk
creator: Olstowski, P.
creator: Wierzchosławski, Sz.
date: 2015
type: Document
type: NamedIndividual

Rozporządzenie BDOT10k
creator: Minister Spraw Wewnętrznych i Administracji
date: 2011
title: Rozporządzenie Ministra Spraw Wewnętrznych i Administracji z dnia 17 listopada 2011 r. w sprawie bazy danych obiektów topograficznych oraz bazy danych obiektów ogólnogeograficznych, a także standardowych opracowań kartograficznych
type: Document
type: NamedIndividual
zobacz też IRI: http://prawo.sejm.gov.pl/isap.nsf/DocDetails.xsp

Podział administracyjny Królestwa Polskiego 1815-1918
creator: Borkiewicz, A.
creator: Trzebiński, W.
date: 1956
description: Dokumentacja Geograficzna, 4
type: Document
type: NamedIndividual
label: Trzebiński W., Borkiewicz A., Podział administracyjny Królestwa Polskiego 1815-1918

Skorowidz miejscowości Rzeczpospolitej Polskiej opracowany na podstawie wyników pierwszego powszechnego spisu ludności z dn. 30 września 1921 roku, tom XI: Województwo Pomorskie
date: 1921/1926
type: Document
type: NamedIndividual
label: Skorowidz miejscowości Rzeczpospolitej Polskiej 1921. Województwo Pomorskie

Ustrój terytorialny państwa a decentralizacja systemu władzy publicznej
creator: Lutrzykowski, Alfred
date: 2013
type: Document
type: NamedIndividual

Podział terytorialny Rzeczypospolitej - spojrzenie krytyczne
creator: Zaborowski, Łukasz
date: 2009
Identifier: „Prace Geograficzne / Instytut Geografii i Gospodarki Przestrzennej Uniwersytetu Jagiellońskiego“, 121, 2009, s. 263–275.
type: Document
type: NamedIndividual
label: Zaborowski, Podział terytorialny Rzeczypospolitej - spojrzenie krytyczne

Gminny podział administracyjny w świetle 25 lat funkcjonowania samorządu terytorialnego w Polsce
creator: Kaczmarek, Tomasz
date: 2017
Identifier: „Przegląd Politologiczny“, 1, 2017, s. 63-80.
type: Document
type: NamedIndividual
label: Kaczmarek, Gminny podział administracyjny

Nowa organizacja terytorialna Polski i układ regionalny
creator: Chojnicki, Zbyszko
creator: Czyż, Teresa
date: 2000
Identifier: „Czasopismo Geograficzne“, 71, 2000, s. 261-277
type: Document
type: NamedIndividual
label: Chojnicki, Czyż, Nowa organizacja terytorialna Polski

Podział kraju na województwa: Próba obiektywizacji
creator: Zaborowski, Łukasz
date: 2013
type: Document
type: NamedIndividual
label: Zaborowski, Podział kraju na województwa: Próba obiektywizacji

Zasady podziału terytorialnego państwa na szczeblu regionalnym. Próba uporządkowania i zastosowania na przykładzie Polski
creator: Zaborowski, Łukasz
date: 2010
Source: Praca doktorska napisana pod kierunkiem prof. dr. hab. Bolesława Domańskiego, Uniwersytet Jagielloński Instytut Geografii i Gospodarki Przestrzennej
type: Document
type: NamedIndividual
label: Zaborowski, Zasady podziału terytorialnego państwa

Decentralisation and regionalisation after communism: administrative and territorial reform in Poland and the Czech Republic
creator: Yoder, J. A.
date: 2003
Identifier: "Europe-Asia Studies", 55 (2), pp. 263-286. @en
type: Document
type: NamedIndividual
label: Yoder, Decentralisation and regionalisation after communism @en

Evolution of Administrative and Territorial Transformations in the XVIII Century Northeastern Asian Part of Russia
creator: Egorova, Tatiana P.
date: 2018
Identifier: "Astra Salvensis", Jan. 2018, pp. 593–602 @en
type: Document
type: NamedIndividual
label: Egorova et al., Evolution of Administrative and Territorial Transformations @en

kończy obowiązywać w
type: DatatypeProperty
type: FunctionalProperty
domain: system administracji
label: ends domination at @en
range: date

feature contains feature
type: ObjectProperty
domain: Cecha
range: Cecha
property chain axiom: ma charakterystykę przestrzenną
property chain axiom: ehContains
property chain axiom: jest charakterystyką przestrzenną

feature is contained in feature
type: ObjectProperty

funkcja rolnicza
type: BFO_0000034
type: NamedIndividual
label: agricultural @en
note: dotyczy obiektów służących uprawianiu ziemi i produkcji rolnej, np. osady rolne, gospodarstwa rolne, pola orne

funkcja obsługi kuracjuszy
type: BFO_0000034
type: NamedIndividual
label: bathers and visitors' service @en

funkcja zapewnienia odpoczynku i noclegu dla turystów
type: BFO_0000034
type: NamedIndividual
label: rest and accommodation of tourists @en

funkcja sakralna
type: BFO_0000034
type: NamedIndividual
label: sacral function @en
note: dotyczy obiektów związanych z kultem oraz obiektów z nim ściśle związanych, np. kościoły, cerkwie, plebanie, pastorówki

funkcja gastronomiczna
type: BFO_0000034
type: NamedIndividual
label: catering @en
note: dotyczy obiektów, które służą pomieszczeniu lokali, w których użytkownicy mogą na miejscu być obsłużeni i otrzymać posiłek, np. restauracje, traktiernie, gospody

funkcja hotelowa
type: BFO_0000034
type: NamedIndividual
label: accomodation @en
note: dotyczy obiektów służących czasowemu zamieszkaniu i zaspokojeniu innych potrzeb gości, np. zajazdy, traktiernie, pensjonaty, hotele

funkcja przemysłowa
type: BFO_0000034
type: NamedIndividual
label: industrial @en

funkcja mieszkalna
type: BFO_0000034
type: NamedIndividual
label: residential function @en
note: dotyczy obiektów służących stałemu zamieszkaniu, a jako funkcja dodatkowa dotyczy obiektów służących okresowemu zamieszkaniu, dłuższemu jednak niż w przypadku hoteli

funkcja gospodarcza - gospodarka leśna
type: BFO_0000034
type: NamedIndividual
label: forestry @en
note: dotyczy obiektów związanych z gospodarowaniem zasobami leśnymi, np. osady leśne, gajówki, leśniczówki; jako funkcja dodatkowa terenów leśnych wykorzystywanych przez człowieka

funkcja obronna
type: BFO_0000034
type: NamedIndividual
label: defensive function @en
note: dotyczy obiektów należących do infrastruktury obronnej miasta, a także obiektów, które służą wojsku, w tym garnizonowi miejskiemu, np. koszary, fortece, bastiony, prochownie

funkcja administracyjna
type: BFO_0000034
type: NamedIndividual
label: administrative function @en
note: dotyczy obiektów służacych zarządzaniu dużą organizacją z państwem na czele, w tym uznanych przez niego form autonomii lub samorządu, placówek zagranicznych, związków wyznaniowych, w tym też wyższych niż parafia jednostek organizacji kościelnej, a także instytucji, stowarzyszeń społecznych i gospodarczych, np. wszelkiego typu urzędy, towarzystwa ubezpieczeniowe, siedziby zarządu przedsiębiorstw

funkcja wypoczynkowa
type: BFO_0000034
type: NamedIndividual
label: leisure @en
note: dotyczy obiektów służących wypoczynkowi i spędzaniu wolnego czasu, które nie są obiektami kultury i służby zdrowia, obiektów będących częścią wilegiatury miejskiej, np. plaże, wiaty leśne, letniska, wille letniskowe

funkcja gospodarcza
type: BFO_0000034
type: NamedIndividual
label: industrial @en
note: dotyczy obiektów, które są istotne dla gospodarki państwowej i miejskiej oraz służące pozyskiwaniu dóbr materialnych z pieniądzem na czele, np. banki, mennice, giełdy

funkcja komunikacyjna
type: BFO_0000034
type: NamedIndividual
label: communication @en
note: dotyczy obiektów służących pośrednio lub bezpośrednio przemieszczaniu ludzi i towarów, np. ulice, tory kolejowe, kolejki linowe, funikulary, a także dworce, stacje, infrastruktura kolejowa

ma początek
type: DatatypeProperty
type: FunctionalProperty
label: has beginning @en
range: date

ma granicę
type: ObjectProperty
label: has boundary @en
range: BFO_0000140
sub property of: est composée de
inverse of: jest granicą

ma koniec
type: DatatypeProperty
type: FunctionalProperty
label: has end @en
range: date

ma funkcję
type: ObjectProperty
label: has function @en
inverse of: jest funkcją

ma funkcję niewłaściwą
type: ObjectProperty
label: has improper function @en
sub property of: ma funkcję
property disjoint with: ma funkcję właściwą
zobacz też IRI: http://dx.doi.org/10.1080/13869790410001694462

weryfikacja tłumaczenia deskrypcji przez
type: AnnotationProperty
type: ObjectProperty
label: translation was verified by @en
sub property of: Contributor

ma podstawę prawną w
type: DatatypeProperty
label: has legal basis @en

deskrypcja została ontologicznie zweryfikowana przez
type: AnnotationProperty
type: ObjectProperty
label: was ontologically verified by @en
sub property of: Contributor

ma komentarz od zespołu tworzącego ontologię
type: AnnotationProperty
label: has comment from ontology development team @en
sub property of: comment

ma funkcję właściwą
type: ObjectProperty
label: has proper function @en
sub property of: ma funkcję
inverse of: jest funkcją właściwą
zobacz też IRI: http://dx.doi.org/10.1080/13869790410001694462

ma zasięg
type: DatatypeProperty
type: FunctionalProperty
label: has scope @en
sub property of: topDataProperty

deskrypcja została przetłumaczona przez
type: AnnotationProperty
type: ObjectProperty
label: was translated by @en
sub property of: Contributor

jest (dodatkowo) opisana przez
type: ObjectProperty
domain: manifestacja jednostki osadniczej
label: is (additionaly) denoted by @en
range: nazwa jednostki osadniczej
sub property of: about in
property disjoint with: jest zdefiniowana przez

jest granicą
type: ObjectProperty
domain: BFO_0000140
label: is boundary of @en
sub property of: bildet Teil von

jest utworzony przez
type: ObjectProperty
label: is created by @en

jest zdefiniowana przez
type: FunctionalProperty
type: ObjectProperty
domain: manifestacja jednostki osadniczej
label: is defined by @en
range: nazwa jednostki osadniczej
sub property of: about in

jest zdefiniowany przez obiekt
type: AnnotationProperty
comment: This property is to be used when the defining resource is defined within this ontology. @en
label: is defined by entity @en
range: Thing
sub property of: isDefinedBy

jest zdefiniowany przez IRI
type: AnnotationProperty
label: is defined by IRI @en
range: anyURI
sub property of: isDefinedBy

jest zdefiniowany przez literał
type: AnnotationProperty
label: is defined by literal @en
range: Literal
sub property of: isDefinedBy

jest funkcją
type: ObjectProperty
domain: BFO_0000034
label: is function of @en

jest charakterystyką przestrzenną
type: ObjectProperty
label: is geographical characteristic of @en

jest wspomniany w źródle
type: AnnotationProperty
label: is mentioned in source @en
range: źródło

jest częścią podziału
type: AnnotationProperty
label: is a member of logical partition @en
range: ConceptScheme

jest funkcją właściwą
type: ObjectProperty
sub property of: jest funkcją

jest opublikowane po
type: DatatypeProperty
type: FunctionalProperty
domain: źródło
label: is published after @en
range: dateTime

jest opublikowane przed
type: DatatypeProperty
type: FunctionalProperty
domain: źródło
label: is published before @en
range: dateTime

jest przedstawiony za pomocą symbolu
type: AnnotationProperty
label: is symbolised by means of @en
range: Symbol na mapie

jest w użyciu po
type: AnnotationProperty
label: is in use after @en
sub property of: (źródło) jest w użyciu (w)

jest w użyciu około
type: AnnotationProperty
label: is in use around @en
sub property of: (źródło) jest w użyciu (w)

(źródło) jest w użyciu (w)
type: AnnotationProperty
comment: Relacja służy do określania czasu powstania i/lub wykorzystania źródła historycznego.
label: (source) is in use at @en
range: dateTime

jest w użyciu przed
type: AnnotationProperty
label: is in use before @en
sub property of: (źródło) jest w użyciu (w)

jest w użyciu (na)
type: AnnotationProperty
comment: Relacja służy do ustalenia granic czasowych i przestrzennych poprawnego użycia kategorii.
label: is is use throughout @en
range: manifestacja obszaru administracyjnego

gmina, obszar dworski, dominium
type: NamedIndividual
type: Symbol na mapie

państwo złożone,cesarstwo,monarchia złożona,państwo związkowe
type: NamedIndividual
type: Symbol na mapie

wójtostwo, okręg, prokuratorstwo
type: NamedIndividual
type: Symbol na mapie

diecezja
type: NamedIndividual
type: Symbol na mapie

parafia, gmina
type: NamedIndividual
type: Symbol na mapie

metropolia
type: NamedIndividual
type: Symbol na mapie

dekanat-archiprezbiterat-wikariat okręgowy
type: NamedIndividual
type: Symbol na mapie

archidiakonat-dziekania-prepozytura-terytorium
type: NamedIndividual
type: Symbol na mapie

państwo złożone,cesarstwo,papiestwo, monarchia złożona,państwo związkowe
type: NamedIndividual
type: Symbol na mapie

filia, przykahałek
type: NamedIndividual
type: Symbol na mapie

seniorat
type: NamedIndividual
type: Symbol na mapie

patriarchat
type: NamedIndividual
type: Symbol na mapie

konfederacja
type: NamedIndividual
type: Symbol na mapie

powiat, komturstwo, okręg
type: NamedIndividual
type: Symbol na mapie

ziemia, cyrkuł, obwód, departament
type: NamedIndividual
type: Symbol na mapie

województwo, gubernia, komitat, obwód, rejencja, landwójtostwo
type: NamedIndividual
type: Symbol na mapie

prowincja, starostwo generalne, generalne gubernatorstwo
type: NamedIndividual
type: Symbol na mapie

gubernium, wolne państwo stanowe, księstwo zależne, dzielnica, marchia, hrabstwo, margrabstwo
type: NamedIndividual
type: Symbol na mapie

państwo, królestwo, samodzielne księstwo, marchia, kraj koronny, elektorat, wolne miasto
type: NamedIndividual
type: Symbol na mapie

część (człon) państwa złożonego
type: NamedIndividual
type: Symbol na mapie

budowla
type: Class
label: construction @en
subclass of: artefakt

artefakt
type: Class
label: artefact @en
subclass of: Artefakt
subclass of: Cecha
subclass of: Restriction
  on property: ma charakterystykę przestrzenną
  some values from: Thing
subclass of: Restriction
  on property: ma funkcję właściwą
  some values from: Thing
alternative label: artifact @en

była miejscowość
type: Class
label: former dwelling @en
subclass of: manifestacja jednostki osadniczej
subclass of: Restriction
  has value: P.PPLQ
  on property: featureCode
equivalent class: Class
  intersection of: manifestacja jednostki osadniczej
  intersection of: Class
    complement of: miejscowość
  intersection of: Restriction
    on property: hasPredecessorEntityManifestation
    some values from: miejscowość
zobacz też IRI: HistoricalSettlement

ogólnie dostępna miejscowość
type: Class
comment: Miejscowość jest ogólnie dostępna jeżeli nie jest przeznaczona do zamieszkiwania przez określoną grupę osób.
label: universal dwelling @en
subclass of: miejscowość
jest częścią podziału: podział manifestacji jednostek osadniczych ze względu na przeznaczenie

dedykowana miejscowość
type: Class
comment: Miejscowość jest dedykowana jeżeli jest przeznaczona do zamieszkiwania przez określoną grupę osób.
label: special dwelling @en
subclass of: miejscowość
jest częścią podziału: podział manifestacji jednostek osadniczych ze względu na przeznaczenie

ewangelicko-augsburski
bildet Teil von: wyznanie protestanckie
type: NamedIndividual
type: ryt
label: Evangelical Augsburg @en
alternative label: Lutheran @en
alternative label: luterański

ewangelicki
bildet Teil von: wyznanie protestanckie
type: NamedIndividual
type: ryt
label: Evangelical @en

ewangelicko-reformowany
bildet Teil von: wyznanie protestanckie
type: NamedIndividual
type: ryt
label: Evangelical Reformed @en
alternative label: Calvinist @en
alternative label: kalwiński

czesko-braterski
bildet Teil von: wyznanie protestanckie
type: NamedIndividual
type: ryt
label: Czech Brethren @en

obrządek łaciński
bildet Teil von: wyznanie katolickie
type: NamedIndividual
type: ryt
label: Latin (Roman Catholic) @en
alternative label: Latin Rite Catholicism @en
alternative label: Latin Rite Roman Catholicism @en

grecki
bildet Teil von: wyznanie katolickie
type: NamedIndividual
type: ryt
label: Uniate (Greek-Catholic) @en
alternative label: Greek Rite Catholicism @en

obrządek ormiański
bildet Teil von: wyznanie katolickie
type: NamedIndividual
type: ryt

niewłaściwa miejscowość
type: Class
comment: Miejscowość właściwa jest taką miejscowością, której funkcja podstawowa nie polega na byciu miejscem zamieszkania.
label: improper dwelling @en
subclass of: miejscowość
equivalent class: Class
  intersection of: miejscowość
  intersection of: Restriction
    has value: funkcja mieszkalna
    on property: ma funkcję niewłaściwą
jest częścią podziału: podział manifestacji jednostek osadniczych ze względu na funkcje

jednostka podziału administracyjnego
type: Class
comment: Typ jednostki administracyjnej pozostaje niezmienny w trakcie całego "życia" tej jednostki.
label: administrative unit @en
subclass of: VariableEntity
subclass of: Wytwór
subclass of: Obiekt prawny
subclass of: Restriction
  on property: ma charakterystykę przestrzenną
  some values from: Thing
disjoint with: jednostka osadnicza

manifestacja jednostki podziału administracyjnego
type: Class
label: administrative unit manifestation @en
subclass of: VariableEntityManifestation
subclass of: Obiekt prawny
subclass of: Restriction
  on property: ma granicę
  some values from: granica podziału administracyjnego
subclass of: Restriction
  on property: ma początek
  some values from: date
subclass of: Restriction
  cardinality: 1
  on property: ma charakterystykę przestrzenną
subclass of: Restriction
  all values from: granica podziału administracyjnego
  on property: ma granicę
disjoint with: manifestacja jednostki osadniczej
equivalent class: Restriction
  on property: isManifestationOf
  some values from: jednostka podziału administracyjnego

manifestacja organu administracji religijnej
type: Class
subclass of: manifestacja organu administracji
subclass of: Restriction
  on property: ma właściwość w obszarze
  some values from: manifestacja obszaru administracji religijnej

manifestacja organu administracji świeckiej
type: Class
subclass of: manifestacja organu administracji
subclass of: Restriction
  on property: ma właściwość w obszarze
  some values from: manifestacja obszaru administracji świeckiej

manifestacja organu administracji
type: Class
subclass of: manifestacja jednostki podziału administracyjnego
subclass of: Restriction
  on property: ma właściwość w obszarze
  some values from: Thing
disjoint with: manifestacja obszaru administracyjnego
equivalent class: Class
  union of: manifestacja organu administracji religijnej
  union of: manifestacja organu administracji świeckiej

manifestacja obszaru administracyjnego
type: Class
subclass of: manifestacja jednostki podziału administracyjnego
equivalent class: Class
  union of: manifestacja obszaru administracji religijnej
  union of: manifestacja obszaru administracji świeckiej

manifestacja obszaru administracji religijnej
type: Class
subclass of: manifestacja obszaru administracyjnego

manifestacja obszaru administracji świeckiej
type: Class
subclass of: manifestacja obszaru administracyjnego

system administracji
type: Class
label: administrative system @en
subclass of: VariableEntity
subclass of: Wytwór
subclass of: Obiekt prawny

budynek
type: Class
label: building @en
subclass of: budowla
equivalent class: Class
  intersection of: budowla
  intersection of: Restriction
    has value: funkcja odgraniczenia przestrzeni wewnętrznej od przestrzeni zewnętrznej
    on property: ma funkcję właściwą
jest zdefiniowany przez literał: Budynek jest to przedmiot trwający w czasie, który został wytworzony lub wykorzystany w celu odgraniczenia pewnej przestrzeni (“wewnątrz") od innej przestrzeni (“zewnątrz”).
zobacz też IRI: budynek.html
zobacz też IRI: http://gov.genealogy.net/types.owl#17

jednostka osadnicza
type: Class
label: human settlement @en
subclass of: VariableEntity
subclass of: Artefakt
subclass of: Restriction
  has value: funkcja bycia miejscem zamieszkania
  on property: ma funkcję
subclass of: Restriction
  on property: hasManifestation
  some values from: miejscowość
jest zdefiniowany przez literał: Human settlement is area such that: 1. it has a proper name and 2. it is or it was in the past a locality @en
jest zdefiniowany przez literał: Jednostka osadnicza: 1. obszar posiadający nazwę własną i 2. obszar, który jest lub był w przeszłości miejscowością
zobacz też IRI: http://encyklopedia.pwn.pl/haslo/jednostka-osadnicza

obszar administracji religijnej
type: Class
label: religious administrative region @en
subclass of: jednostka podziału administracyjnego

obszar administracji świeckiej
type: Class
label: secular administrative region @en
subclass of: jednostka podziału administracyjnego
subclass of: Restriction
  has value: funkcja zarządzania terytorium państwa i jego obywatelami
  on property: ma funkcję

granica gminy
type: Class
subclass of: granica podziału administracyjnego

granica województwa
type: Class
subclass of: granica podziału administracyjnego

granica państwa
type: Class
subclass of: granica podziału administracyjnego

nazwa jednostki osadniczej
type: Class
subclass of: Nazwa miejsca

miejscowość
type: Class
comment: Zakładamy, że każda podklasa miejscowości zawiera tylko zamieszkane jednostki osadnicze, np. klasa settlement_type_10 (rdfs:label='browar'@pl) obejmuje tylko zamieszkane browary.
label: dwelling @en
subclass of: manifestacja jednostki osadniczej
subclass of: Restriction
  max qualified cardinality: 1
  on class: miejscowość
  on property: jednostka osadnicza jest częścią
subclass of: Restriction
  all values from: granica miejscowości
  on property: ma granicę
disjoint union of: niewłaściwa miejscowość
disjoint union of: właściwa miejscowość
disjoint union of: ogólnie dostępna miejscowość
disjoint union of: dedykowana miejscowość
equivalent class: Class
  intersection of: artefakt
  intersection of: manifestacja jednostki osadniczej
  intersection of: Restriction
    on property: est composée de
    some values from: budynek
  intersection of: Restriction
    on property: ma granicę
    some values from: granica miejscowości
  intersection of: Restriction
    on property: jest zdefiniowana przez
    some values from: nazwa jednostki osadniczej
jest zdefiniowany przez literał: A dwelling is an area such that: 1. it is filled with buildings 2. it is used for accommodation 3. it has a proper name 4. it is separated from other areas by a. having a distingushed function b. having a distingushed shape c. having a distingushed juridical status. @en
jest zdefiniowany przez literał: Miejscowość jest to 1. obszar zabudowany i 2. obszar zamieszkany i 3. obszar posiadający nazwę własną i 4. obszar wyodrębniony: a. funkcjonalnie (ma funkcje, której żadna część nie ma, ani nie jest częścią czegoś co ma) lub b. morfologicznie (ma wyraźne granice) lub c. prawnie.
zobacz też IRI: Settlement

manifestacja jednostki osadniczej
type: Class
comment: We assume that each settlement manifests itself as of a certain type, e.g., as a village. @en
label: human settlement manifestation @en
subclass of: VariableEntityManifestation
subclass of: Obiekt prawny
subclass of: Restriction
  max cardinality: 1
  on property: ma charakterystykę przestrzenną
subclass of: Restriction
  on property: ma początek
  some values from: date
subclass of: Restriction
  has value: funkcja mieszkalna
  on property: ma funkcję
subclass of: Restriction
  on property: jest zdefiniowana przez
  some values from: nazwa jednostki osadniczej
disjoint union of: była miejscowość
disjoint union of: miejscowość
equivalent class: Restriction
  on class: jednostka osadnicza
  on property: isManifestationOf
  qualified cardinality: 1

funkcja bycia miejscem zamieszkania
type: BFO_0000034
type: NamedIndividual
label: playing the role of dwelling @en

funkcja odgraniczenia przestrzeni wewnętrznej od przestrzeni zewnętrznej
type: BFO_0000034
type: NamedIndividual
label: separation of inner space from outer space @en

funkcja bycia miejscem wymiany handlowej
type: BFO_0000034
type: NamedIndividual
label: playing the role of commerce @en
note: dotyczy obiektów służących handlowi

funkcja bycia siedzibą urzędu
type: BFO_0000034
type: NamedIndividual
label: playing role of administrative body location @en

funkcja produkcyjna
type: BFO_0000034
type: NamedIndividual
label: production @en
note: dotyczy obiektów, związanych z wytwarzaniem lub pozyskiwaniem nowych dóbr nierolniczych oraz ich przekształcaniem, w sposób rzemieślniczy, manufakturowy lub przemysłowy, a także z obsługą tego typu obiektów, m.in. przez zapewnienie energii, np. młyny, torfiarnie, fabryki, młyny parowe, elektrownie fabryczne

funkcja transportowa
type: BFO_0000034
type: NamedIndividual
label: transport @en

funkcja zarządzania terytorium państwa i jego obywatelami
type: BFO_0000034
type: NamedIndividual
label: managing country's territory and dwellers @en

budynek mieszkalny
type: Class
label: housing building @en
subclass of: budynek
equivalent class: Class
  intersection of: budynek
  intersection of: Restriction
    has value: funkcja mieszkalna
    on property: ma funkcję właściwą
jest zdefiniowany przez literał: Budynek mieszkalny jest to budynek, w którym odgraniczona przestrzeń (“wewnątrz") jest przeznaczona do przebywania ludzi.
zobacz też IRI: BuildingResidential

miejsce produkcji
type: Class
label: production dwelling @en
subclass of: niewłaściwa miejscowość
equivalent class: Class
  intersection of: niewłaściwa miejscowość
  intersection of: Restriction
    has value: funkcja produkcyjna
    on property: ma funkcję właściwą

miejsce wymiany handlowej
type: Class
label: commercial dwelling @en
subclass of: niewłaściwa miejscowość
equivalent class: Class
  intersection of: niewłaściwa miejscowość
  intersection of: Restriction
    has value: funkcja bycia miejscem wymiany handlowej
    on property: ma funkcję właściwą

miejsce transportu
type: Class
label: transportation dwelling @en
subclass of: niewłaściwa miejscowość
equivalent class: Class
  intersection of: niewłaściwa miejscowość
  intersection of: Restriction
    has value: funkcja transportowa
    on property: ma funkcję właściwą

Symbol na mapie
type: Class
label: map symbol @en
subclass of: Opis miejsca

podział manifestacji jednostek osadniczych ze względu na mereologiczną samodzielność
type: NamedIndividual
type: podział jednostek osadniczych
label: classification of settlement units with respect to mereological independence @en

podział manifestacji jednostek osadniczych ze względu na mereologiczną złożoność
type: NamedIndividual
type: podział jednostek osadniczych
label: classification of settlement units with respect to mereological complexity @en

podział manifestacji jednostek osadniczych ze względu na funkcje
type: NamedIndividual
type: podział jednostek osadniczych
label: classification of settlement units with respect to function @en

podział manifestacji jednostek osadniczych ze względu na przeznaczenie
type: NamedIndividual
type: podział jednostek osadniczych
label: classification of settlement units with respect to usage @en

podział jednostek osadniczych
type: Class
label: classification of settlement units @en
subclass of: ConceptScheme

religia
type: Class
label: religion @en
subclass of: Grupa

wyznanie
type: Class
label: confession @en
subclass of: Grupa
subclass of: Restriction
  on class: religia
  on property: bildet Teil von
  qualified cardinality: 1

ryt
type: Class
label: rite @en
subclass of: Grupa
subclass of: Restriction
  on class: wyznanie
  on property: bildet Teil von
  qualified cardinality: 1

religia chrześcijańska
type: NamedIndividual
type: religia
label: Christian @en
alternative label: Christianity @en
alternative label: chrześcijaństwo
zobacz też IRI: Christianity
zobacz też IRI: http://vocab.getty.edu/aat/300073711
zobacz też IRI: Q5043

religia mojżeszowa
type: NamedIndividual
type: religia
label: Jewish @en
alternative label: Judaism @en
alternative label: Judaizm
zobacz też IRI: Judaism
zobacz też IRI: http://vocab.getty.edu/aat/300073723
zobacz też IRI: Q9268

wyznanie protestanckie
bildet Teil von: religia chrześcijańska
type: NamedIndividual
type: wyznanie
label: Protenstatism @en
zobacz też IRI: Protestantism
zobacz też IRI: http://vocab.getty.edu/aat/300073735
zobacz też IRI: Q23540

wyznanie katolickie
bildet Teil von: religia chrześcijańska
type: NamedIndividual
type: wyznanie
label: Catholicism @en
alternative label: Roman Catholicism @en
zobacz też IRI: Catholic Church
zobacz też IRI: Catholicism
zobacz też IRI: http://vocab.getty.edu/aat/300073730
zobacz też IRI: Q1841
zobacz też IRI: Q9592

wyznanie prawosławne
bildet Teil von: religia chrześcijańska
type: NamedIndividual
type: wyznanie
label: Orthodox @en
zobacz też IRI: Orthodox Christianity
zobacz też IRI: http://vocab.getty.edu/aat/300022034
zobacz też IRI: Q3333484

Paulina Wacławik
type: Osoba
type: NamedIndividual

Piotr Kulicki
type: Osoba
type: NamedIndividual

Witold Matwiejczyk
type: Osoba
type: NamedIndividual

Marek Słoń
type: Osoba
type: NamedIndividual

Doroszewski, Witold
type: Osoba
type: NamedIndividual
zobacz też IRI: Witold Doroszewski

Linde, Samuel Bogumił
type: Osoba
type: NamedIndividual
zobacz też IRI: Samuel Linde

Tomasz Związek
type: Osoba
type: NamedIndividual

Anna Orłowska
type: Osoba
type: NamedIndividual

Tomasz Panecki
type: Osoba
type: NamedIndividual

Bogumił Szady
type: Osoba
type: NamedIndividual

Wiesław Ostrowski
type: Osoba
type: NamedIndividual

Izabela Karsznia
type: Osoba
type: NamedIndividual

Wiesława Duży
type: Osoba
type: NamedIndividual

zobacz też obiekt
type: AnnotationProperty
comment: This property is to be used when the referenced resource is defined within this ontology. @en
label: see also entity @en
range: Thing
sub property of: seeAlso

zobacz też IRI
type: AnnotationProperty
label: see also an IRI @en
range: anyURI
sub property of: seeAlso

zobacz też tekst
type: AnnotationProperty
label: see also a literal @en
range: langString
sub property of: seeAlso

ma część (jednostkę osadniczą)
type: ObjectProperty
domain: manifestacja jednostki osadniczej
label: has settlement part @en
range: manifestacja jednostki osadniczej
sub property of: est composée de
sub property of: feature contains feature
inverse of: jednostka osadnicza jest częścią
property disjoint with: jednostka osadnicza jest częścią

settlement unit is administered by administrative unit
type: FunctionalProperty
type: ObjectProperty
sub property of: feature is contained in feature

jednostka osadnicza jest częścią
type: FunctionalProperty
type: ObjectProperty
label: is settlement part of @en
sub property of: bildet Teil von
sub property of: feature is contained in feature

zamek
creator: Marek Słoń
type: Class
type: NamedIndividual
comment: A castle could be an independent settlement unit or an object within some other unit. @en
comment: Zamek mógł być jednostką osadniczą lub obiektem w obrębie innej jednostki.
label: castle @en
subclass of: właściwa miejscowość
subclass of: Restriction
  has value: S.CSTL
  on property: featureCode
subclass of: Restriction
  on property: est composée de
  some values from: zamek - obiekt
subclass of: Restriction
  has value: funkcja obronna
  on property: ma funkcję właściwą
alternative label: Burg @de
alternative label: Schloß @de
alternative label: castellum @la
alternative label: castrum @la
hidden label: arx @la
hidden label: forteca
hidden label: gród
hidden label: pałac
hidden label: twierdza
weryfikacja tłumaczenia deskrypcji przez: Paulina Wacławik
deskrypcja została ontologicznie zweryfikowana przez: Piotr Kulicki
deskrypcja została przetłumaczona przez: Wiesława Duży
jest zdefiniowany przez literał: A castle (a locality) is a locality comprising a castle (building) unless it is a part of another locality. @en
jest zdefiniowany przez literał: Zamek (miejscowość) jest to miejscowość obejmująca zamek (obiekt), gdy nie jest on częścią innej miejscowości.
zobacz też IRI: http://gov.genealogy.net/types.owl#111
zobacz też IRI: Castle

browar
creator: Anna Orłowska
type: Class
type: NamedIndividual
comment: A brewery might be a separate locality (rarely, before the WW II), both individual and a part of a cluster of localities sharing the same name, however most often it has been an integral part of a city or a town and has not been distinguished. @en
comment: Browar może być odrębną miejscowością (rzadko, przed II wojną światową), zarówno samodzielną jak i częścią grupy miejscowości o tej samej nazwie, ale najczęściej znajduje się w obrębie miast i nie jest wyróżniony.
label: brewery @en
subclass of: miejsce produkcji
subclass of: (mereologicznie) prosta miejscowość
subclass of: Restriction
  has value: S.MFGB
  on property: featureCode
subclass of: Restriction
  on property: est composée de
  some values from: browar - obiekt
subclass of: Restriction
  has value: funkcja gospodarcza
  on property: ma funkcję właściwą
hidden label: Bierbrauerei @de
hidden label: Brauerei @de
hidden label: Brauhaus @de
hidden label: braxatorium @la
hidden label: mielcuch
hidden label: piwowarnia
hidden label: warzelnia
hidden label: пивоварня @ru
weryfikacja tłumaczenia deskrypcji przez: Paulina Wacławik
deskrypcja została ontologicznie zweryfikowana przez: Piotr Kulicki
deskrypcja została przetłumaczona przez: Wiesława Duży
jest zdefiniowany przez literał: Brewery (locality) is a settlement, where a brewery (a factory) plays the most important role. @en
jest zdefiniowany przez literał: Browar (miejscowość) jest to osada, w której główna rolę pełni browar (obiekt).

kaplica
creator: Bogumił Szady
type: Class
type: NamedIndividual
comment: As a separate building, chapel could be a separate settlement unit in the past (rarely in the early modern era), but most often it is part of the village as a building. @en
comment: Kaplica jako odrębny budynek mogła być w przeszłości odrębną jednostką osadniczą (rzadko, spotyka się w okresie staropolskim), najczęściej jednak wchodzi w skład miejscowości jako budowla.
label: chapel @en
subclass of: niewłaściwa miejscowość
subclass of: Restriction
  on property: est composée de
  some values from: kaplica - obiekt
subclass of: Restriction
  has value: S.CH
  on property: featureCode
subclass of: Restriction
  has value: funkcja sakralna
  on property: ma funkcję właściwą
alternative label: capella @la
alternative label: die Kapelle @de
hidden label: aedes @la
hidden label: aedicula sacrarium @la
hidden label: augurale @la
hidden label: auguratorium @la
hidden label: delubrum @la
hidden label: fanulum @la
hidden label: fanum @la
hidden label: kościół
hidden label: lararium @la
hidden label: oratorium @la
hidden label: sacellum @la
hidden label: świątynia
weryfikacja tłumaczenia deskrypcji przez: Paulina Wacławik
deskrypcja została ontologicznie zweryfikowana przez: Piotr Kulicki
deskrypcja została przetłumaczona przez: Tomasz Panecki
jest zdefiniowany przez literał: Chapel is a locality, where the main role is played by a chapel (sacral building). @en
jest zdefiniowany przez literał: Kaplica jest to miejscowość, w której główną rolę pełni kaplica jako obiekt sakralny.
zobacz też IRI: http://gov.genealogy.net/types.owl#245

właściwa miejscowość
type: Class
comment: Miejscowość właściwa jest taką miejscowością, której funkcja podstawowa polega na byciu miejscem zamieszkania.
label: proper dwelling @en
subclass of: miejscowość
equivalent class: Class
  intersection of: miejscowość
  intersection of: Restriction
    has value: funkcja mieszkalna
    on property: ma funkcję właściwą
jest częścią podziału: podział manifestacji jednostek osadniczych ze względu na funkcje

grupa zabudowań
type: Class
label: group of buildings @en
subclass of: ogólnie dostępna miejscowość
subclass of: Restriction
  on property: est composée de
  some values from: budowla
zobacz też IRI: http://gov.genealogy.net/types.owl#229

kościół
creator: Bogumił Szady
type: Class
type: NamedIndividual
comment: A church could be a separate settlement in the past (rarely, one can note its existence during and early modern era), however usually it, understood as a building, constituted a part of a locality. @en
comment: Kościół mógł być w przeszłości odrębną jednostką osadniczą (rzadko, spotyka się w okresie staropolskim), najczęściej jednak wchodzi w skład miejscowości jako budowla.
label: church @en
subclass of: niewłaściwa miejscowość
subclass of: Restriction
  has value: S.CH
  on property: featureCode
subclass of: Restriction
  on property: est composée de
  some values from: kościół - obiekt
subclass of: Restriction
  has value: funkcja sakralna
  on property: ma funkcję właściwą
alternative label: ecclesia @la
hidden label: aedes @la
hidden label: cerkiew
hidden label: die Kirche @de
hidden label: domus Dei @la
hidden label: fanum @la
hidden label: kaplica
hidden label: templum @la
hidden label: świątynia
weryfikacja tłumaczenia deskrypcji przez: Paulina Wacławik
deskrypcja została ontologicznie zweryfikowana przez: Piotr Kulicki
deskrypcja została przetłumaczona przez: Tomasz Panecki
deskrypcja została przetłumaczona przez: Wiesława Duży
jest zdefiniowany przez literał: Church is a locality, where the main role is played by the church (sacral building). @en
jest zdefiniowany przez literał: Kościół jest to miejscowość, w której główną rolę pełni kościół jako obiekt sakralny.

fabryka
type: Class
label: factory @en
subclass of: miejsce produkcji
subclass of: Restriction
  has value: S.MFG
  on property: featureCode
zobacz też IRI: Factory

rumunek
creator: Tomasz Związek
type: Class
type: NamedIndividual
comment: Although the category exists on maps - e.g. the Topographical Map of the Kingdom of Poland from 1843 - it is very rare. On the Map, one can notice the peculiar spelling of this category: "romunek". @en
comment: Kategoria występuje na mapach – np. Kwatermistrzostwie, to jednak jest to kategoria bardzo rzadka.
label: "rumunek" @en
subclass of: właściwa miejscowość
subclass of: (mereologicznie) samodzielna miejscowość
subclass of: osada
subclass of: Restriction
  has value: funkcja rolnicza
  on property: ma funkcję właściwą
alternative label: pustkowie (pl)
hidden label: kolonia
hidden label: przysiółek
weryfikacja tłumaczenia deskrypcji przez: Paulina Wacławik
deskrypcja została ontologicznie zweryfikowana przez: Piotr Kulicki
deskrypcja została przetłumaczona przez: Wiesława Duży
jest zdefiniowany przez literał: "Rumunek" is an outlying settlement, situated in a cleared forest area (usually) or near the forest. @en
jest zdefiniowany przez literał: Rumunek to odosobniona osada, położona w miejscu po wykarczowanym lesie (najczęściej) lub pod lasem.

cegielnia
creator: Anna Orłowska
type: Class
type: NamedIndividual
comment: A brickyard might be a separate locality, both individual and a part of a cluster of localities sharing the same name. It may also be an integral part of a bigger locality. @en
comment: Cegielnia może być odrębną miejscowością, zarówno samodzielną jak i częścią grupy miejscowości o tej samej nazwie, może też znajdować się w obrębie większej miejscowości.
label: brickyard @en
subclass of: miejsce produkcji
subclass of: (mereologicznie) prosta miejscowość
subclass of: Restriction
  has value: funkcja gospodarcza
  on property: ma funkcję właściwą
subclass of: Restriction
  on property: est composée de
  some values from: cegielnia - obiekt
hidden label: Ziegelei @de
hidden label: Ziegelscheune @de
hidden label: cegielnica
hidden label: кирпичный завод @ru
weryfikacja tłumaczenia deskrypcji przez: Paulina Wacławik
deskrypcja została ontologicznie zweryfikowana przez: Piotr Kulicki
deskrypcja została przetłumaczona przez: Wiesława Duży
jest zdefiniowany przez literał: Brickyard (locality) is a settlement, where a brickyard (a building and a factory) plays the most important role. @en
jest zdefiniowany przez literał: Cegielnia (miejscowość) jest to osada, w której główną rolę odrywa cegielnia (obiekt).

wójtostwo
creator: Tomasz Związek
type: Class
type: NamedIndividual
comment: O odrębności wójtostwa decyduje kryterium nazewnicze, które jest efektem jego statusu prawnego.
comment: Vogt-owned-settlement is distinguished on the basis of its name, which results from its legal status. @en
label: vogt-owned-settlement @en
subclass of: dedykowana miejscowość
subclass of: (mereologicznie) prosta miejscowość
subclass of: Restriction
  has value: funkcja rolnicza
  on property: ma funkcję właściwą
alternative label: die Vogtei @de
hidden label: grunt
hidden label: majątek
hidden label: posiadłość
hidden label: sołectwo
hidden label: zagroda
weryfikacja tłumaczenia deskrypcji przez: Paulina Wacławik
deskrypcja została ontologicznie zweryfikowana przez: Piotr Kulicki
deskrypcja została przetłumaczona przez: Tomasz Panecki
deskrypcja została przetłumaczona przez: Wiesława Duży
jest zdefiniowany przez literał: Vogt-owned-settlement is the area of land owned by the vogt (ger Schultheiß) which is either a separate locality or a separate part of another locality. @en
jest zdefiniowany przez literał: Wójtostwo to obszar zajmowany przez ziemię należącą do sołtysa (wójta), będący osobną miejscowością lub wydzieloną częścią miejscowości.

część przysiółka
creator: Izabela Karsznia
type: Class
type: NamedIndividual
comment: Część przysiółka jest odrębną jednostką osadniczą, rodzajem miejscowości, zawsze ma swoją nazwę własną. Części przysiółków to 6 obiektów: 3 w woj. małopolskim, po 1 w woj. mazowieckim, kujawsko-pomorskim i wielkopolskim.
comment: Part of a hamlet is a separate settlement unit, a kind of locality, it always has a particular name. There are 6 parts of the hamlets according to National Register of Geographic Names (pl "Państwowy Rejestr Nazwy Geograficznych"): 3 in Małopolskie voivodship, 1 in Mazowieckie , Kuyawsko-Pomorskie, and Wielkopolskie voivodships. @en
label: part of a hamlet @en
subclass of: ogólnie dostępna miejscowość
subclass of: właściwa miejscowość
subclass of: (mereologicznie) niesamodzielna miejscowość
equivalent class: Class
  intersection of: (mereologicznie) niesamodzielna miejscowość
  intersection of: Restriction
    on property: jednostka osadnicza jest częścią
    some values from: przysiółek
weryfikacja tłumaczenia deskrypcji przez: Paulina Wacławik
deskrypcja została ontologicznie zweryfikowana przez: Piotr Kulicki
deskrypcja została przetłumaczona przez: Tomasz Panecki
jest zdefiniowany przez literał: Część przysiółka jest to miejscowość stanowiąca integralną część miejscowości podstawowej przysiółka, jest wydzielona administracyjnie, ale należy do jednostki nadrzędnej.
jest zdefiniowany przez literał: Part of a hamlet is an integral part of the main locality a hamlet; it is administratively separated, but belongs to the superior locality. @en

gród
creator: Marek Słoń
type: Class
type: NamedIndividual
comment: At least untill the 13th century, a gord was a central and usually the only element of a city or town indicated in written historical sources, which is why these may be considered as identical for this period; after location, the gord became one of many facilities in a city or a town, usually situated on peripheries, sometimes converted into a castle. @en
comment: Gords are characteristic mostly for the High Middle Ages, when documents were written in Latin, despite the fact that Latin does not know a proper notion for this kind of settlement unit. Expressions with a different, relatively similar, meaning had been used to describe the gord, i.e. a city (lat civitas), or a castle (lat arx, castrum). In younger historical German sources “gród” was called Burg, the expression meaning both a gord and a castle. Researchers consider “gord” as an endemic and specifically Slavic phenomenon. @en
comment: Grody są charakterystyczne przede wszystkim dla pełnego średniowiecza, gdy językiem źródeł była łacina - a w niej nie wykształcił się w ogóle termin odpowiadający tej jednostce osadniczej. Określano ją więc za pomocą pojęć o odmiennym, względnie podobnym znaczeniu, jak miasto (civitas), zamek (arx, castrum). Z kolei w późniejszych źródłach niemieckich odpowiadał mu termin Burg, oznaczający zarówno gród, jak również zamek. W literaturze przedmiotu gród jest traktowany jako zjawisko specyficznie słowiańskie.
comment: Przynamniej do XIII w. gród stanowił centralną i zwykle jedyną uchwytną źródłowo część miasta, więc dla tego okresu może być z nim utożsamiany; po lokacji stawał się jednym z obiektów w mieście, zwykle peryferyjnym, niejednokrotnie zamienianym w zamek.
label: gord @en
subclass of: właściwa miejscowość
subclass of: Restriction
  has value: funkcja mieszkalna
  on property: ma funkcję właściwą
hidden label: Burg @de
hidden label: arx @la
hidden label: castrum @la
hidden label: civitas @la
hidden label: gorod @ru
hidden label: grodzisko
hidden label: grodzisko (pol, zamek (pl), Burg (de), gorod (ru), civitas (lat), arx (lat), castrum (lat)
hidden label: zamek
weryfikacja tłumaczenia deskrypcji przez: Paulina Wacławik
deskrypcja została ontologicznie zweryfikowana przez: Piotr Kulicki
deskrypcja została przetłumaczona przez: Wiesława Duży
jest zdefiniowany przez literał: Gord is a medieval or – in eastern territories – early modern settlement with revetments and stockades. @en
jest zdefiniowany przez literał: Średniowieczna lub, na terenach wschodnich, wczesnonowożytna osada z obwarowaniami drewniano-ziemnymi.
zobacz też IRI: Gord (archaeology)
zobacz też IRI: Q88598
zobacz też tekst: t. 2, s. 168 (hasło "Grodzisko"): "Grody to obiekty sztucznie ogrodzone w celach obronnych. Pojęcie to obejmuje wszelkiego rodzaju miejsca obronne, jak wsie, miasta, ośrodki administracyjne, wojskowe i inne schronienia przygotowane do obrony. W średniowieczu grodami nazywano też miasta".
zobacz też tekst: t. 2, s. 637: "pierwotnie osada obronna, ogrodzona palisadą lub obwałowana"
zobacz też tekst: t. 6, s. 22: "miejsce obronne w znaczeniu późniejszym tyle co "zamek", "miasto""

zamek - obiekt
creator: Marek Słoń
type: Class
type: NamedIndividual
comment: Chronologically, a castle with its functions was preceded by a gord (non-brick, without buildings having both defensive and residential functions), while its successor was a palace (with defensive functions reduced), and a fortress (is was not necessarily a densely built-up structure, and there was no buildings with both defensive and residential functions). During the Early Modern era, military functions of castles were diminishing, but they continued to be residences. Newly established ones in their form imitated defensive buildings and due to this feature were called castles. @en
comment: Chronologicznie funkcjonalnym poprzednikiem zamku był gród (niemurowany i bez budynków łączących funkcje obronne i rezydencjonalne), a następcą pałac (bez funkcji obronnych) i twierdza (nie musiała być założeniem zwartym i bez budynków łączących funkcje obronne i rezydencjonalne). W epoce nowożytnej i później zamki w coraz mniejszym stopniu pełniły funkcje militarne, ale zachowywały ciągłość funkcji rezydencjonalnych lub, nowopowstałe, w architekturze naśladowały budowle obronne i z tego względu były nazywane zamkami.
label: castle - object @en
subclass of: budynek mieszkalny
alternative label: Burg @de
alternative label: Schloss @de
alternative label: castellum @la
alternative label: castrum @la
hidden label: arx @la
hidden label: forteca
hidden label: gród
hidden label: pałac
hidden label: twierdza
preferred label: castle @en
preferred label: zamek
weryfikacja tłumaczenia deskrypcji przez: Paulina Wacławik
deskrypcja została ontologicznie zweryfikowana przez: Piotr Kulicki
deskrypcja została przetłumaczona przez: Wiesława Duży
jest zdefiniowany przez literał: Castle is a brick, densely built-up, closed, usually complex structure, within which at least some buildings have both defensive and residential functions; built in the Middle Ages or later but then in a form referring to that period. @en
jest zdefiniowany przez literał: Murowane, zwarte, zamknięte, zwykle wieloczłonowe założenie, w którym przynajmniej część budynków pełni funkcje zarazem obronne i rezydencjonalne; powstałe w średniowieczu lub nawiązujące formą do tej epoki.
zobacz też IRI: Castle
zobacz też IRI: http://vocab.getty.edu/aat/300006891
zobacz też IRI: Q23413
zobacz też tekst: miejsce obronne, twierdza
zobacz też tekst: od średniowiecza do w. XVII obronna siedziba pana feudalnego, ośrodek władzy; w XVII w. i później królewska, książęca lub magnacka rezydencja miejska lub pozamiejska

port morski - obiekt
creator: Tomasz Panecki
type: Class
type: NamedIndividual
comment: Port morski określa funkcję, jako pełni miejscowość, np. Gdynia jest miastem portowym (określenie z Bystrzyckiego), ale „port” (niekoniecznie morski) również może być miejscowością (patrz: Koeniglicher Hafen k. Torunia). Niektóre portowe miasta niemieckie zawierają „port” (niem. „-hafen”) w nazwie własnej (np. Osternothafen dziś: Chorzelin, id prng: 178058).
comment: Sea harbour defines the function of the locality, e.g. Gdynia is a "harbour city" (in Bystrzycki's register), but the "harbour" (not necessarily at sea) may also be a locality (see: Koeniglicher Hafen near Toruń). Some harbours in Germany contain a "harbour" (German "-hafen") suffix in their own name (e.g. Osternothafen today: Chorzelin, id :: prng 178058). @en
label: sea harbour - object @en
subclass of: budynek
preferred label: port morski
preferred label: sea harbour @en
weryfikacja tłumaczenia deskrypcji przez: Paulina Wacławik
deskrypcja została ontologicznie zweryfikowana przez: Piotr Kulicki
deskrypcja została przetłumaczona przez: Tomasz Panecki
deskrypcja została przetłumaczona przez: Wiesława Duży
jest zdefiniowany przez literał: Port morski to przybrzeżny obszar wodny wraz z infrastrukturą przeznaczony dla obsługi statków.
jest zdefiniowany przez literał: Sea harbour is an area consisting of coastal waters together with artificial structures designed for the ship service. @en
zobacz też IRI: Port
zobacz też IRI: Q15310171
zobacz też tekst: przybrzeżny obszar wodny, odpowiednio pogłębiony, osłonięty przed wiatrem i falą, przeznaczony dla postoju statków, wyposażony w specjalne urządzenia służące do ich załadowywania, wyładowywania, zaopatrzenia i naprawy; miasto nabrzeżne, w którym jest także miejsce postoju statków.
zobacz też tekst: t. 2, cz. 2. s. 929: część można między ziemią zamknięta, do którey okręty wchodzą o od burzy morskiey bezpieczeństwo znayduią

schronisko turystyczne - obiekt
creator: Tomasz Panecki
type: Class
type: NamedIndividual
comment: Although tourist shelter is nowadays classified as a kind of village (PRNG, DBTO10k), it seems that the tourist shelters were not considered localites in the period of our interest. This is due to the lack of this category in Bystrzycki's register, as well as the way of presentation on the maps: without the particular name, only symbol and explanatory abbreviation. Conceptually, this category is similar to shepherd's huts and inns (see: example). @en
comment: Mimo że dziś figuruje jako rodzaj miejscowości (PRNG, BDOT10k), wydaje się, że schronisko turystyczne nie było w interesującym nas okresie uznawane za miejscowość. Świadczy o tym brak wyróżnienia tej kategorii w spisie Bystrzyckiego, jak również sposób prezentacji na mapach: bez nazwy własnej, jedynie sygnatura i skrótem objaśniającym. Pojęciowo kategoria zbliżona do szałasów pasterskich i karczem (patrz przykład).
label: tourist shelter - object @en
subclass of: budynek mieszkalny
hidden label: karczma
hidden label: schronisko
hidden label: schronisko górskie
hidden label: stacja turystyczna
hidden label: szałas
preferred label: schronisko turystyczne
preferred label: tourist shelter @en
weryfikacja tłumaczenia deskrypcji przez: Paulina Wacławik
deskrypcja została ontologicznie zweryfikowana przez: Piotr Kulicki
deskrypcja została przetłumaczona przez: Tomasz Panecki
jest zdefiniowany przez literał: Schronisko turystyczne to budynek na szlaku turystycznym służący jako miejsce odpoczynku i noclegu dla turystów.
jest zdefiniowany przez literał: Tourist shelter is a building on the tourist trail that serves as a place of rest and accommodation for tourists. @en
zobacz też IRI: Mountain hut
zobacz też IRI: schroniskoTurystyczne
zobacz też IRI: Q182676
zobacz też tekst: 1] miejsce, gdzie można się schronić, czuć bezpiecznie, schronienie; [2] budynek położony na szlaku turystycznym z dala od osiedli ludzkich, służący jako miejsce odpoczynku i noclegu dla turystów (podróżnych); [3] przytułek, zakład dla bezdomnych, starców
zobacz też tekst: budynek na szlaku turystycznym służący jako miejsce odpoczynku i noclegu dla turystów (kategorie: budynki, budowle i urządzenia; kompleksu użytkowania terenu, miejscowości)
zobacz też tekst: t. 5, s. 201 – mieysce do schronienia

stacja kolejowa - obiekt
creator: Tomasz Panecki
type: Class
type: NamedIndividual
comment: Functional distinctivness - clearly defined (passenger services).Morphological distinctiveness - on the maps, mostly as a non-scale symbols and an explanatory annotation.Spatial distinctivness - depending on the location of the railway line with the respect of locality, stations are either at a distance (often they have a given name, such as a town and the number of houses) or in the area of the locality (without a proper name, only a symbol and an explanatory annotation).Railway station can be part of a locality (Czekanów) or a separate locality (Chrośnica), then spatially distinct. If the station is located far away from the locality, then on the MGI maps it can be supplemeted by information about number of houses, not just the explanatory annotation (pol "st."). The name of the station is never a proper name name but only the name of the main locality. @en
comment: Odrębność funkcjonalna – jasno określona (obsługa podróżnych).Odrębność morfologiczna – najczęściej na mapach jako znak nieskalowy i podpis objaśniający.Odrębność przestrzenna – w zależności od położenia linii kolejowej względem miejscowości stacje znajdują się albo w oddaleniu (wtedy często mają podaną nazwę, taką jak miejscowość oraz liczbę domów) lub na obszarze miejscowości (bez nazwy; tylko sygnatura i skrót objaśniający).Stacja kolejowa może być częścią miejscowości (Czekanów) albo osobną miejscowością (Chrośnica) wyodrębnioną przestrzennie. Jeżeli stacja leży w oddaleniu od głównej miejscowości (wówczas na mapie WIG ma podaną liczbę domów, a nie tylko skrót objaśniający „st.”). Nazwa stacji nigdy nie jest nazwą własną, a jedynie nazwą głównej miejscowości.
label: railway station - object @en
subclass of: budynek
alternative label: Haltestation (de)
hidden label: przystanek kolejowy (pl), dworzec kolejowy (pl)
preferred label: railway station @en
preferred label: stacja kolejowa
weryfikacja tłumaczenia deskrypcji przez: Paulina Wacławik
deskrypcja została ontologicznie zweryfikowana przez: Piotr Kulicki
deskrypcja została przetłumaczona przez: Tomasz Panecki
jest zdefiniowany przez literał: Stacja kolejowa to obszar, gdzie rozmieszczone są budowle związane z obsługą pasażerów kolei naziemnych.
jest zdefiniowany przez literał: The railway station is an area where facilities related to the service of ground railway passengers are located. @en
zobacz też tekst: #BDOT10k, s. 154 – Obszar, na którym rozmieszczone są budowle (budynek stacyjny, magazyny, przechowalnia bagażu, perony, parkingi itp.), związane z obsługą pasażerów kolei naziemnych i przeładunkiem towarów (klasa obiektów: kompleks komunikacyjny)
zobacz też tekst: miejsce, gdzie zatrzymują się pociągi

przystanek kolejowy - obiekt
creator: Tomasz Panecki
type: Class
type: NamedIndividual
comment: Functional distinctivness - clearly defined (passenger services).Morphological distinctiveness - most often on topographic maps as a non-scale symbol or an explanatory annotation, usually without a proper name (only an abbreviation).Spatial distinctivness - depending on the location of the railway line with respect to the locality, the stops are either located at a distance (then they often have a proper name, the same as a locality) or within the area of the locality (no particular name, only symbol or an explanatory annotation). A railway station should rather not be treated as a locality, unless in exceptional cases, when all the constitutive conditions of localities are met. @en
comment: Odrębność funkcjonalna – jasno określona (obsługa podróżnych).Odrębność morfologiczna – najczęściej na mapach jako znak nieskalowy obszaru przystanku i podpis objaśniający, przeważnie bez nazwy własnej (jedynie skrót).Odrębność przestrzenna – w zależności od położenia linii kolejowej względem miejscowości przystanki znajdują się albo w oddaleniu (wtedy często mają podaną nazwę, taką jak miejscowość) lub na obszarze miejscowości (bez nazwy; tylko sygnatura i skrót objaśniający). Przystanek kolejowy raczej nie powinien być traktowany jako miejscowość, chyba że w wyjątkowych przypadkach, gdy spełnione są wszystkie warunki konstytutywne miejscowości.
label: train stop - object @en
subclass of: budynek
alternative label: Haltepunkt (de)
hidden label: Stacja kolejowa (pl), dworzec kolejowy (pl)
preferred label: przystanek kolejowy
preferred label: train stop @en
weryfikacja tłumaczenia deskrypcji przez: Paulina Wacławik
deskrypcja została ontologicznie zweryfikowana przez: Piotr Kulicki
deskrypcja została przetłumaczona przez: Tomasz Panecki
jest zdefiniowany przez literał: A train stop is a stopping place for trains enabling travelers to enter or leave the train. @en
jest zdefiniowany przez literał: Przystanek kolejowy to miejsce zatrzymywania się pociągów umożliwiające podróżnym wejście lub opuszczenie pociągu.
zobacz też tekst: #BDOT10k, s. 166 – miejsce zatrzymywania się pociągów, umożliwiające podróżnym wejście lub opuszczenie pociągu (klasa obiektów: obiekt związany z komunikacją)
zobacz też tekst: mała stacja kolejowa przeznaczona tylko dla ruchu pasażerskiego

cukrownia
creator: Anna Orłowska
type: Class
type: NamedIndividual
comment: It is very unusual to classify a sugar factory or refinery as a separate locality, most often it is a part of a locality. @en
comment: W niezwykle rzadkich przypadkach cukrownia może być odrębną miejscowością, zazwyczaj jest częścią miejscowości.
label: sugar factory @en
subclass of: miejsce produkcji
subclass of: (mereologicznie) prosta miejscowość
subclass of: osada
subclass of: Restriction
  on property: est composée de
  some values from: cukrownia - obiekt
subclass of: Restriction
  has value: funkcja gospodarcza
  on property: ma funkcję właściwą
subclass of: Restriction
  has value: S.MFGSG
  on property: featureCode
hidden label: die Zuckerfabrik @de
hidden label: die Zuckersiederei @de
hidden label: Сахарный завод @ru
weryfikacja tłumaczenia deskrypcji przez: Paulina Wacławik
deskrypcja została ontologicznie zweryfikowana przez: Piotr Kulicki
deskrypcja została przetłumaczona przez: Wiesława Duży
jest zdefiniowany przez literał: Cukrownia (miejscowość) jest to osada, w której główną rolę odgrywa cukrownia (obiekt).
jest zdefiniowany przez literał: Sugar rafinery (a locality) is a settlement with a sugar factory or refinery (a factory) as the most important element. @en

kościół - obiekt
creator: Bogumił Szady
type: Class
type: NamedIndividual
comment: A church could be a separate unit (from adjacent settlements) distinguished by a particular name and morphology. @en
comment: W analizowanych przypadkach kościół mógł stanowić odrębną (od sąsiadujących) nazewniczo i morfologicznie jednostkę osadniczą.
label: church - object @en
subclass of: budynek
hidden label: ecclesia (lat), templum (lat), fanum (lat), aedes (lat), domus Dei (lat), kaplica (pl), cerkiew (pl), świątynia (pl), die Kirche (de)
preferred label: church @en
preferred label: kościół
weryfikacja tłumaczenia deskrypcji przez: Paulina Wacławik
deskrypcja została ontologicznie zweryfikowana przez: Piotr Kulicki
deskrypcja została przetłumaczona przez: Wiesława Duży
jest zdefiniowany przez literał: A church (in architecture) is a building used by a religious community to meet and listen to the Word of God, for preaching, private prayers or to celebrate rituals. @en
jest zdefiniowany przez literał: Kościół (w kontekście architektonicznym) jest to budynek, gdzie wspólnota religijna gromadzi się na słuchanie słowa Bożego, wspólną lub prywatną modlitwę oraz celebrację sakramentów.
zobacz też IRI: BuildingChurch
zobacz też IRI: Church
zobacz też IRI: Q16970
zobacz też tekst: 2. «budynek, miejsce modlitwy chrześcijan»
zobacz też tekst: t. 11, s. 57-68: II. Budowla sakralna; 1. Świątynia chrześcijańska, zwłaszcza katolicka; templum--; aedes, fanum--; ecclesia--; aedes sacra--; sacrum--; domus, sedes sacra--; delubrum, dominicum, domus Dei, martyrium, sacrarium ritus Christiani--. 3. Świątynia mahometańska; meczet--. 4. Świątynia pogańska, delubrum--; aedes, oraculum, templum--; templum idolorum--; idolium--; domus--; aedes sacra, fanum, penetralia, sessimonium deorum--. 6. n-loc [nazwa miejsca] : -- »Czerwony Kościoł«
zobacz też tekst: t. 3, s. 360-362: 1. Świątynia (nie tylko chrześcijańska), dom boży, templum, aedes sacra--. 2. swoista jednostka prawna związana z określonym kościołem (parafia, diecezja itd.), corpus paroeciae vel dioecesis (ad certam quandam ecclesiam pertinens).
zobacz też tekst: t. 9, kol. 1025: budynek poświęcony (dedykacja lub benedykcja) w obrzędzie liturg. przez biskupa, gdzie wspólnota ochrzczonych (—> Kościół) gromadzi się na słuchanie słowa Bożego, wspólną i prywatną modlitwę oraz celebrację sakramentów, zwł. Eucharystii; miejsce przechowywania Najśw. Sakramentu, a także pochówku(—> krypta, —> konfesja); k. był określany także jako domus ecclesiae, domus orationis, Kyriakon, domus Dei, Dominicum; w kat. obrządkach wsch. nazywany jest —> cerkwią.

plebania - obiekt
creator: Bogumił Szady
type: Class
type: NamedIndividual
comment: In each analysed case, a rectory being a separate settlement, lays in a vicinity of a village, or a town/city with the same name. In cartographical sources, one can find it presented separately, with its proper name, an abbreviation of a category (i.e. pol “pleb.”, which is “rect.”), and distinguished by its morphology. A rectory differs slightly from the house of a provost, but we leave this difference aside. @en
comment: We wszystkich analizowanych przypadkach jeżeli plebania jest odrębną miejscowością, to znajduje się w pobliżu wsi, miasta lub osady o tej samej nazwie. W ujęciu kartograficznym wyodrębniona przez nazwę własną, skrót kategorii (np. pleb.) oraz morfologicznie. Plebania różni się nieco od probostwa, gdyż pleban nie jest tożsamy z proboszczem, ale różnicę tę pomijamy.
label: rectory - object @en
subclass of: budynek mieszkalny
alternative label: Pfarrwohnung @de
alternative label: curionis domus @la
alternative label: dom plebański
alternative label: pastorówka
alternative label: plebanatus @la
alternative label: popówka
alternative label: probostwo
hidden label: Pfarre @de
hidden label: curionatus @la
hidden label: curionium @la
hidden label: parafia
hidden label: parochia @la
hidden label: wikariatka
preferred label: plebania
preferred label: rectory @en
weryfikacja tłumaczenia deskrypcji przez: Paulina Wacławik
deskrypcja została ontologicznie zweryfikowana przez: Piotr Kulicki
deskrypcja została przetłumaczona przez: Wiesława Duży
jest zdefiniowany przez literał: A rectory is a house or a group of buildings organised for a home for a provost supervising other priests living with him together with other people responsible for its maintenance. @en
jest zdefiniowany przez literał: Plebania jest to dom lub zespół zabudowań przeznaczony do mieszkania dla plebana, podległych mu księży i innych osób zajmujących się jego obsługą.
zobacz też IRI: Clergy house
zobacz też IRI: http://vocab.getty.edu/aat/300005639
zobacz też IRI: Q607241
zobacz też tekst: dom należący do parafii, przeznaczony na mieszkanie dla proboszcza
zobacz też tekst: t. 2, cz. 2, s. 732: Pleban -- Plebania, -ii, ż., urząd plebański abo beneficjum --; Dochód plebański, ut dobra --; plebaniia, dom plebański, die Pfarrwohnung, die Pfarre. J ksiądz widzimy, plebaniią rzadki Buduie, że kto inszy weźmie po nim spadki. Pot. Pocz. 475 (Slo. fara; Hg. plebania; Cro. plebania; Vd. faroush; Ross. приходъ (cf. przychód).
zobacz też tekst: t. 24, s. 326: 1. Domostwo plebana -- ; flaminia -- ; parochia, plebanatus -- ; curionis domus, curionium --; 2. Terytorium będące pod opieką plebana; także urząd i dochody z niego; parochia --; plebanatus --; curionatus, curionium -- ; 2a. Wierni należący do parafii --. Synonimy: probostwo, parafija.

kaplica - obiekt
creator: Bogumił Szady
type: Class
type: NamedIndividual
comment: Kryterium wyróżniającym kościół od kaplicy jest wielkość oraz znaczenie instytucjonalne. Kościół ma charakter świątyni głównej dla wspólnoty wiernych, natomiast kaplica ma znaczenie pomocnicze. Niewielkie wspólnoty wiernych mogły funkcjonować przy kaplicy, kiedy z różnych powodów (brak środków, ograniczenia prawne) nie mogły wybudować lub utrzymać kościoła.
comment: The criterion that distinguishes the church from the chapel is its size and institutional significance. The church serves as a main temple for the community, while the chapel's role is rather auxiliary. Small communities could use a chapel, when for various reasons (lack of resources, legal restrictions) they could not build or afford a church. @en
label: chapel - object @en
subclass of: budynek
alternative label: capella (lat)
hidden label: kościół (pl), oratorium (pl), świątynia (pl), sacellum (łac), oratorium (lat), aedicula (lat), sacrarium (lat), aedes (lat), fanum (lat), augurale (lat), augurale (lat), auguratorium (lat), fanulum (lat), lararium (lat), delubrum (lat), die Kapelle (de)
preferred label: chapel @en
preferred label: kaplica
weryfikacja tłumaczenia deskrypcji przez: Paulina Wacławik
deskrypcja została ontologicznie zweryfikowana przez: Piotr Kulicki
deskrypcja została przetłumaczona przez: Tomasz Panecki
jest zdefiniowany przez literał: Chapel is a separate building (small church) or a separate room with an altar in a church or another building, devoted to religious worship (prayer, worship). @en
jest zdefiniowany przez literał: Kaplica jest to odrębny budynek (mały kościół) lub oddzielne pomieszczenie z ołtarzem w kościele lub innym budynku, przeznaczone do sprawowania kultu religijnego (modlitwy, nabożeństwa).
zobacz też IRI: BuildingChapel
zobacz też IRI: Q108325
zobacz też tekst: 1. «niewielka budowla sakralna», 2. «oddzielne pomieszczenie z ołtarzem do odprawiania nabożeństw»
zobacz też tekst: t. 1, cz 2, s. 955: miejsce bogu poświęcone, w którym obowiązki kościelne za zezwoleniem zwierzchności odprawować się mogą.
zobacz też tekst: t. 10, s. 81: Mały kościół lub nieduże pomieszczenie z ołtarzem, przeznaczone do uprawiania kultu religijnego; też wydzielona część kościoła (wyraz przeniesiony również na świątynie i pomieszczenia służące innym kultom); sacellum --; aedicula --; sacrarium--; oratorium--; aedes, fanum--; aedis sacrae appendix, augurale, auguratorium, fanulum (s. hanulum), lararium, parvum delubrum
zobacz też tekst: t. 8, kol. 676: niewielka budowla kultowa (najczęściej z ołtarzem), wolno stojąca lub związana z większym kompleksem archit., także pomieszczenie, czyli oratorium, miejsce modlitwy liturg. i prywatnej, przeznaczone przez ordynariusza do sprawowanie wszystkich lub niektórych funkcji liturg. dla niewielkiej grupy wiernych, do którego za zgodą kompetentnego przełożonego mogą przychodzić także in. wierni.

smolarnia - obiekt
creator: Bogumił Szady
type: Class
type: NamedIndividual
comment: In most analysed cases, if the tar pitch was morphologically distinct, it had the same name as the neighbouring village or another locality. Occasionally it had its proper name. @en
comment: W większości analizowanych przypadków, jeżeli smolarnia była odrębna morfologicznie, to miała tę samą nazwę, co sąsiadująca wieś lub inna miejscowość. Sporadycznie cechowała ją odrębność nazewnicza.
label: tar pitch - object @en
subclass of: budynek
alternative label: der Teerofen (de), smolanoi zawod (ru)
hidden label: terpentyniarnia (pl), osada leśna (pl), dziegciarnia (pl), huta (pl)
preferred label: smolarnia
preferred label: tar pitch @en
weryfikacja tłumaczenia deskrypcji przez: Paulina Wacławik
deskrypcja została ontologicznie zweryfikowana przez: Piotr Kulicki
deskrypcja została przetłumaczona przez: Tomasz Panecki
jest zdefiniowany przez literał: Obiekt lub zespół obiektów gospodarczych zlokalizowanych w lesie lub jego pobliżu, gdzie w procesie prażenia drewna pozyskiwano smołę i inne produkty np. terpentynę, węgiel drzewny.
jest zdefiniowany przez literał: Tar pitch is a facility or a complex of industrial facilities located in or near the forest, where tar was sourced in the process of wood roasting, along with other products, e.g. turpentine, charcoal. @en
zobacz też tekst: huta smolana, t. 3, s. 519:
zobacz też tekst: prymitywny zakład przemysłowy, gdzie wypraża się z drewna (tzw. karpowin) smołę i otrzymuje terpentynę, spirytus drzewny i inne chemikalia
zobacz też tekst: «dawny zakład, w którym się wyprażało z drewna smołę»

karczma - obiekt
creator: Tomasz Związek
type: Class
type: NamedIndividual
comment: Inns (localities) are distinguished on the old maps, which is mainly the result of their function. In the historiography, inns are distinguished from "zajazd" and "gościniec".The former usually served local customers - residents of the village or city, whereas the latter was supposed to serve supra-regional traffic. On the maps, inns are also distinguished by their proper names - e.g. Wygoda or Ostatni Grosz. @en
comment: Karczmy wyróżniane są na dawnej kartografii, co wynika głównie z pełnionej przez nie funkcji. Warto jednak pamiętać o tym, że w historiografii rozróżnia się pojęcie karczmy oraz zajazdu lub gościńca. Pierwszy obiekt zazwyczaj miał na celu obsługę lokalnych klientów – mieszkańców wsi lub miasta, drugi zaś miał obsługiwać ruch ponadregionalny. Na mapach karczmy wyróżniają także specyficzne nazwy – np. Wygoda lub Ostatni Grosz.
label: inn - object @en
subclass of: budynek
alternative label: Gasthof @de
alternative label: Krug @de
alternative label: Wirthaus @de
alternative label: gospoda
alternative label: taberna @la
hidden label: budynek
hidden label: gościniec
hidden label: gościnny dom
hidden label: oberża
hidden label: restauracja
hidden label: szynkowny dom
hidden label: zajazd
preferred label: inn @en
preferred label: karczma
weryfikacja tłumaczenia deskrypcji przez: Paulina Wacławik
deskrypcja została ontologicznie zweryfikowana przez: Piotr Kulicki
deskrypcja została przetłumaczona przez: Tomasz Panecki
jest zdefiniowany przez literał: Budynek służący celom gastronomiczno-hotelarskim, zlokalizowany na przedmieściach miast, obrzeżach wsi lub ważnych szlakach komunikacyjnych.
jest zdefiniowany przez literał: Inn is a building serving catering and accomodation purposes, located in the suburbs, outskirts of villages, or on important communication routes. @en
zobacz też IRI: Inn
zobacz też IRI: Q32860419
zobacz też tekst: t. 1, s. 296–298: ‘budynek, w którym warzono, sprzedawano, później głównie szynkowano piwo, miód pitny, od XVI w. gorzałkę; niektóre karczmy, zwłaszcza przy ważniejszych drogach i w miastach, dawały posiłki i obrok dla koni oraz zapewniały nocleg podróżnym (zwano je gościńcami); sprzedawano w nich różne wyroby, głównie spożywcze, rzadziej odzieżowe. Dostarczały też karczmy różnego rodzaju rozrywek, często z muzyką, były miejscem tańców i zabaw. Niekiedy w karczmach odbywał sesje sąd (zwłaszcza wiejski), załatwiano tu sprawy urzędowe podczas popasu dostojników czy pobytu miejscowych oficjalistów [...]’.
zobacz też tekst: t. 10, s. 136: miejsce wyszynku alkoholu i spotkań okolicznej ludności, przede wszystkim chłopów, także gospoda, dom zajezdny; taberna
zobacz też tekst: t. 15, s. 403: ‘budynek służący jako dom zajezdny dla podróżnych, a także miejsce wyszynku oraz spotkań i zabaw miejscowej ludności, wznoszony na przedmieściach większych miast, na rynkach miasteczek, przy uczęszczanych traktach, we wsiach w pobliżu kościoła lub dworu’ @de
zobacz też tekst: t. 2, s. 264: 1. dom szynkowy (Star.), szynk, szynkownia, gospoda; do na wsi albo przy drodze dla popasu podróżnych, austerja, oberża, dom zajezdny, zajazd’, [por. t. 3, s. 453 hasło: oberża ‘dom gościnny, gospoda, zajazd, karczma, austerja’ i t. 8, s. 106 hasło zajazd, gdzie ‘dom zajezdny, gospoda, austerja, karczma, dom gościnny’]
zobacz też tekst: t. 2, s. 318: dom szynkowy
zobacz też tekst: t. 3, s. 564: szynk na wsi, gospoda; dawniej również dom zajezdny, austeria, oberża

osada kuźnicza
creator: Tomasz Związek
type: Class
type: NamedIndividual
label: ironworks @en
subclass of: miejsce produkcji
subclass of: osada
subclass of: Restriction
  has value: funkcja przemysłowa
  on property: ma funkcję właściwą
subclass of: Restriction
  on property: est composée de
  some values from: kuźnica - obiekt
alternative label: Hammer (de), minera (lat), ruda (pl), Hütte (de), Ofen (de), Schmelze (de)
hidden label: kuźnica
hidden label: ruda
weryfikacja tłumaczenia deskrypcji przez: Paulina Wacławik
deskrypcja została ontologicznie zweryfikowana przez: Piotr Kulicki
deskrypcja została przetłumaczona przez: Wiesława Duży
jest zdefiniowany przez literał: Ironworks (locality) is a settlement, where the main role is played by an ironworks, an industrial facility. @en
jest zdefiniowany przez literał: Osada kuźnicza jest to osada, w której główną rolę pełni kuźnica jako obiekt gospodarczy.

kuźnica - obiekt
creator: Tomasz Związek
type: Class
type: NamedIndividual
label: ironworks - object @en
subclass of: budynek
alternative label: Hütte (de), huta (pl), hamer (pl), Hammer (de), minera (lat), hamernia (pl), amernia (pl), oficina ferraria (lat), ferrifonda (lat), ruda (pl)
hidden label: kuźnia (pl), fryszerka (pl), huta żelaza (pl), zakład przemysłowy (pl), mennica (pl)
preferred label: ironworks @en
preferred label: kuźnica
weryfikacja tłumaczenia deskrypcji przez: Paulina Wacławik
deskrypcja została ontologicznie zweryfikowana przez: Piotr Kulicki
deskrypcja została przetłumaczona przez: Wiesława Duży
jest zdefiniowany przez literał: Ironworks is a cluster of manufacturing workshops, the main puprpose of which is to melt and manufacture iron. @en
jest zdefiniowany przez literał: Zespół warsztatów przemysłowych, których głównym zadaniem jest przetop i obróbka żelaza.
zobacz też tekst: #Zientara B., Dzieje małopolskiego hutnictwa żelaznego, Warszaw 1954, s. 64‘zespół połączonych warsztatów – dymarki, młotów, kowalichy (piec kowalski i urządzenia służące do produkcji różnych przedmiotów z żelaza)’#Praktyczny słownik współczesnej polszczyzny, red. H. Zgłówkowa, t. 18, s. 369‘dawny typ zakładu hutniczego, w którym żelazo z rud wytapiano za pomocą dymarki i młota napędzanego kołem wodnym’ – dodatkowo inf., że „kuźnice zostały wyparte przez zakłady stosujące procesy wielkopiecowe”#Encyklopedia historii gospodarczej Polski do 1945 r., t. 1, red. A. Mączak:‘w XIII–XVIII w. zespół warsztatów zakładu hutniczego, składający się w zasadzie z dymarki, młota mechanicznego i pieca kowalskiego (kowalichy), niekiedy także ze stęp do drobienia rudy; wszystkie te warsztaty (czasem podwójne) poruszane były energią wodną, uzyskiwaną dzięki budowie zapór na niewielkich rzeczkach. Hamrem (hamernią) zwano wchodzący w skład każdej kuźnicy warsztat obróbki metali, którego głównym urządzeniem był młot mechaniczny z kowadłem; niekiedy jednak przez hamer rozumiano całą kuźnicę. Upowszechnione w Polsce od przełomu XIII/XIV w., stanowiły kuźnice do XVIII w. dominujący typ zakładu hutniczego, tworzącego jednocześnie odrębne przedsiębiorstwo prowadzone przez kuźnika [...]”. Autor hasła B. Zientara
zobacz też tekst: t. 11, s. 598: ‘zakład przetapiający i obrabiający żelazo’, ‘warsztat kowalski; miejsce, gdzie się kuje’
zobacz też tekst: t. 2, s. 561: utożsamia pojęcia kuźnia i kuźnica, podaje też termin bliskoznaczny kowalnia
zobacz też tekst: t. 2, s. 653: ‘zabudowanie mieszczące w sobie jedno albo kilka ognisk, miechy i młoty poruszane przez wodę, gdzie z surowizny przetopionej i oczyszczonej wykuwa się żelazo gotowe; fabryka topienia żelaza i urabiana go w sztaby
zobacz też tekst: t. 3, s. 1328: zakład przemysłowy, fabryka wyrobów z żelaza itp. metali; dawniej kuźnia
zobacz też tekst: t. 3, s.473–474: ‘warsztat wytopu i obróbki żelaza’

osada hutnicza
creator: Tomasz Związek
type: Class
type: NamedIndividual
comment: Glasswork settlement (ger Hütte) was considered a separate locality, which emerged as consequence of a process in which common names (i.e. huta) gained new meaning, associated with a particular locality. Glasswork settlements were temporary settlements, very often, these were very unstable. When all local resources became exhausted (i.e. woods, sand, limestone), these settlements were moved into a new place. The result was frequent disappearing of glasswork settlements. @en
comment: Odrębność osadnicza osady hutniczej (od ger Hütte) wynika przede wszystkim z procesu onimizacji, czyli przekształcania nazwy pospolitej (huta) w nazwę własną. Osady hutnicze były często osadami czasowymi, tzn. cechowały się dużą mobilnością. Po wyczerpaniu się pobliskich surowców (drewno, piasek, wapień) przenoszone były w inne miejsca. W związku z tym były to osady zanikające z krajobrazu osadniczego.
label: glassworks @en
subclass of: miejsce produkcji
subclass of: osada
subclass of: Restriction
  has value: funkcja przemysłowa
  on property: ma funkcję właściwą
subclass of: Restriction
  on property: est composée de
  some values from: huta - obiekt
alternative label: Hütte (de), Ofen (de), Schmelze (de), Hammer (de)
hidden label: kuźnica
hidden label: ruda
weryfikacja tłumaczenia deskrypcji przez: Paulina Wacławik
deskrypcja została ontologicznie zweryfikowana przez: Piotr Kulicki
deskrypcja została przetłumaczona przez: Wiesława Duży
jest zdefiniowany przez literał: Glassworks is a settlement in which the most importan role is played by a glassworks (considered as an factory building). @en
jest zdefiniowany przez literał: Osada hutnicza jest to osada, w której główną rolę pełni huta jako obiekt gospodarczy.

huta - obiekt
creator: Tomasz Związek
type: Class
type: NamedIndividual
comment: Legal status - ownership diveded between a land lord and a hereditary tenant or an annual tenant. @en
comment: Status prawny - własność podzielona między pana gruntowego a dzierżawcę dziedzicznego lub dzierżawcę rocznego.
label: glassworks - object @en
subclass of: budynek
alternative label: Hütte (de), Ofen (de), Schmelze (de), Hammer (de)
hidden label: kuźnica (pl), ruda (pl)
preferred label: glassworks @en
preferred label: huta
weryfikacja tłumaczenia deskrypcji przez: Paulina Wacławik
deskrypcja została ontologicznie zweryfikowana przez: Piotr Kulicki
deskrypcja została przetłumaczona przez: Wiesława Duży
jest zdefiniowany przez literał: Glassworks is an industrial facility, where major production was glasswork, and later mainly casting and manufacturing metals, e.g. lead, zinc, iron. @en
jest zdefiniowany przez literał: Zakład przemysłowy, którego głównym celem była produkcja szkła, a w późniejszym okresie wytop i przetwórstwo rud metali np. ołowiu, cynku, żelaza.
zobacz też tekst: #J. Olczak, Późnośrednowieczne i nowożytne hutnictwo szkła w Polsce w perspektywie źródeł archeologicznych, „Archeologia Historia Polona”, t.1, 1995, s. 79-86#Wyrobisz A., Szkło w Polsce od XIV do XVII w., Warszawa 1968
zobacz też tekst: rozróżnia hutę i hutę szkła. Huta – ‘zakład metalurgiczny, w którym wytapia się metale z rud’, zaś Huta szkła – ‘zakład wytapiający szkło i wytwarzający produkty szklane’
zobacz też tekst: t. 2, s. 67: ‘zakład, gdzie robią szkło albo topią metale’
zobacz też tekst: zakład lub zespół zakładów przemysłowych produkujących metale z rud, szkło, siarkę i in.’, huty przerabiają nie tylko rudy na surówkę, lecz także surówkę na stal

leśniczówka - obiekt
creator: Tomasz Panecki
type: Class
type: NamedIndividual
comment: Morphological distinctiveness - usually clear (location in the forest), but there are lodges located in the immediate vicinity of some other localities. Naming distinctiveness - clear from the second half of the 19th c. (previously forester's lodges had no proper names, later not always). Functional distinctiveness - the forester's lodge plays a role in the economy and forest administration. @en
comment: Odrębność morfologiczna – przeważnie wyraźna (położenie w lesie), ale zdarzają się leśniczówki położone w bezpośrednim sąsiedztwie innych miejscowości. Odrębność nazewnicza – od drugiej połowy XIX wieku (wcześniej bez nazw; później nie zawsze). Odrębność funkcjonalna – leśniczówka pełni rolę związaną z gospodarką i administracją leśną.
label: forester's lodge - object @en
subclass of: budynek mieszkalny
alternative label: Jägerhaus @de
hidden label: Forestrey @de
hidden label: Forst Amt @de
hidden label: Hegerhaus @de
hidden label: gajówka
hidden label: nadleśnictwo
hidden label: osada leśna
preferred label: forester's lodge @en
preferred label: leśniczówka
weryfikacja tłumaczenia deskrypcji przez: Paulina Wacławik
deskrypcja została ontologicznie zweryfikowana przez: Piotr Kulicki
deskrypcja została przetłumaczona przez: Tomasz Panecki
jest zdefiniowany przez literał: Forester's lodge is an area where there is a complex of buildings including a house in which a forester lives, which is the seat of the Forest District's authorities, located in a forest area. Apart from forest management, forester's lodge performs residential functions. Forester's lodge is a locality as long as it has a proper name and is not in the vicinity of another locality. @en
jest zdefiniowany przez literał: Leśniczówka (obiekt) to obszar, na którym znajduje się zespół zabudowań obejmujący dom, w którym mieszka leśniczy, stanowiący siedzibę leśnictwa, znajdujący się na terenie leśnym, pełniący oprócz mieszkalnych funkcje związane z gospodarką leśną. Leśniczówka jest miejscowością o ile posiada nazwę własną i nie znajduje się w bezpośrednim sąsiedztwie innej miejscowości.
zobacz też IRI: http://gov.genealogy.net/types.owl#102
zobacz też IRI: http://vocab.getty.edu/aat/300250342
zobacz też IRI: Q1425352
zobacz też tekst: Dom, zagroda w lesie stanowiąca mieszkanie; mieszkanie leśniczego (zarządca obszaru leśnego stanowiącego leśnictwo) wraz z zabudowaniami gospodarskimi
zobacz też tekst: Pojedyncza zagroda służąca leśniczemu i będąca jednocześnie siedzibą leśnictwa
zobacz też tekst: t. 2, s. 721: domek w lesie, mieszkanie, zagroda leśniczego a. leśnika

gajówka - obiekt
creator: Tomasz Panecki
type: Class
type: NamedIndividual
comment: Morphological distinctiveness - usually clear (location in the forest), but there are lodges located in the immediate vicinity of some other localities.Naming distinctiveness - clear from the second half of the 19th century (previously forester's lodges had no proper names, later not always).Functional distinctiveness - the forester's lodge plays a role in the economy and forest administration. @en
comment: Odrębność morfologiczna – przeważnie wyraźna (położenie w lesie), ale zdarzają się gajówki położone w bezpośrednim sąsiedztwie innych miejscowości.Odrębność nazewnicza – od drugiej połowy XIX wieku (wcześniej bez nazw; później nie zawsze). Odrębność funkcjonalna – gajówka pełni rolę związaną z gospodarką leśną.
label: forest-guard's lodge - object @en
subclass of: budynek mieszkalny
alternative label: Hegerhaus @de
hidden label: Forestrey @de
hidden label: Forst Amt @de
hidden label: Jägerhaus @de
hidden label: leśnictwo
hidden label: leśniczówka
hidden label: nadleśnictwo
preferred label: forest-guard's lodge @en
preferred label: gajówka
weryfikacja tłumaczenia deskrypcji przez: Paulina Wacławik
deskrypcja została ontologicznie zweryfikowana przez: Piotr Kulicki
deskrypcja została przetłumaczona przez: Tomasz Panecki
jest zdefiniowany przez literał: Forest-guard's lodge is an area comprising a set of buildings including a house in which a forest-guard lives, located in a forest area, performing residential as well as forest management functions. Forest-guard's lodge is a locality as long as it has its own name and is not located in the immediate vicinity of another locality. @en
jest zdefiniowany przez literał: Gajówka to obszar na którym znajduje się zespół zabudowań obejmujący dom, w którym mieszka gajowy, znajdujący się na terenie leśnym, pełniący oprócz mieszkalnych funkcje związane z gospodarką leśną. Gajówka jest miejscowością o ile posiada nazwę własną i nie znajduje się w bezpośrednim sąsiedztwie innej miejscowości.
zobacz też IRI: http://vocab.getty.edu/aat/300250342
zobacz też IRI: Q17087359
zobacz też tekst: Budynek, w którym mieszka gajowy (pracownik nadleśnictwa chroniący przydzieloną mu część lasu przed szkodami)
zobacz też tekst: Pojedyncza zagroda, zazwyczaj położona w lesie, pełniąca funkcję mieszkania służbowego dla funkcjonariuszy pomocniczej służy leśnej podleśniczych lub gajowych
zobacz też tekst: t. 1, s. 793: chatka gajowego

latarnia morska - obiekt
creator: Tomasz Panecki
type: Class
type: NamedIndividual
comment: Functional distinctivness - distinguished as a kind of locality in Bystrzycki's register, and on topographic maps as distinct symbol, sometimes with the proper name. Morphological and spatial distinctivness - usually a lightouse is a building (structure) within the area of the locality or in its vicinity. If it has its a particular (proper) name, it can be treated as a separate locality (interpretation of maps is necessary, see: Rozewie). Otherwise it is either part of another locality or an object (building/structure) in it (see: Hel, Jastarnia). @en
comment: Odrębność funkcjonalna – wyróżniana jako rodzaj miejscowości u Bystrzyckiego, a na mapach topograficznych odrębnym znakiem, niekiedy z nazwą własną. Odrębność morfologiczna/przestrzenna – przeważnie jest obiektem na obszarze miejscowości lub w niewielkim od niej oddaleniu. Jeżeli posiada nazwę własną może być traktowana jako osobna miejscowość (konieczna interpretacja map; patrz: Rozewie). W przeciwnym razie jest albo częścią innej, większej miejscowości lub obiektem terenowym (budowlą) w niej (patrz: Hel, Jastarnia).
label: lighthouse - object @en
subclass of: budynek mieszkalny
alternative label: Leuchtturm @de
preferred label: latarnia morska
preferred label: lighthouse @en
weryfikacja tłumaczenia deskrypcji przez: Paulina Wacławik
deskrypcja została ontologicznie zweryfikowana przez: Piotr Kulicki
deskrypcja została przetłumaczona przez: Tomasz Panecki
deskrypcja została przetłumaczona przez: Wiesława Duży
jest zdefiniowany przez literał: A lighthouse (a facility) is a building, usually a high tower with a beacon light to guide ships. @en
jest zdefiniowany przez literał: Latarnia morska (obiekt) to budowla, najczęściej wysoka wieża służąca jako punkt orientacyjny dla statków.
zobacz też IRI: Lighthouse
zobacz też IRI: http://vocab.getty.edu/aat/300007741
zobacz też IRI: Q39715
zobacz też tekst: wysoka, widoczna z morza wieża, służąca jako punkt orientacyjny dla statków

klasztor - obiekt
creator: Bogumił Szady
type: Class
type: NamedIndividual
comment: In the analysed cases, the monastery could have been a locality which was separate in terms of name and mophology from the neighbouring ones. The monastery could have been a beginning (a stem) of a larger locality, which would develop around it and transform into a monastery settlement, village, city etc. @en
comment: W analizowanych przypadkach klasztor mógł stanowić całkowicie odrębną (od sąsiadujących) nazewniczo i morfologicznie miejscowość. Klasztor mógł stanowić zalążek większej miejscowości, która rozwinęła się wokół niego i przekształciła się w osadę klasztorną, wieś, miasto etc.
label: monastery - object @en
subclass of: budynek mieszkalny
alternative label: Kloster @de
alternative label: claustrum @la
alternative label: monaster
alternative label: monasterium @la
hidden label: opactwo
hidden label: ławra
preferred label: klasztor
preferred label: monastery @en
weryfikacja tłumaczenia deskrypcji przez: Paulina Wacławik
deskrypcja została ontologicznie zweryfikowana przez: Piotr Kulicki
deskrypcja została przetłumaczona przez: Tomasz Panecki
jest zdefiniowany przez literał: Klasztor jest to budynek lub zespół budynków przeznaczony do mieszkania dla zakonników lub zakonnic.
jest zdefiniowany przez literał: Monastery is a building or a group of buildings where monks and nuns live @en
zobacz też IRI: Monastery
zobacz też IRI: http://gov.genealogy.net/types.owl#30
zobacz też IRI: http://vocab.getty.edu/aat/300000641
zobacz też IRI: Q44613
zobacz też tekst: 1. budynek lub kompleks budynków stanowiących wspólne miejsce zamieszkiwania zakonnic lub zakonników; 2. wspólnota zakonna o określonej regule
zobacz też tekst: 1. zgromadzenie zakonne; zakon--; 2. budynek lub kompleks budynków zamieszkiwanych przez zakonników (zakonnice) danej reguły
zobacz też tekst: t. 1, cz. 2, s. 1010: pomieszkanie zakonnicze
zobacz też tekst: t. 10, s. 337: 1. Odosobnione i wyodrębnione spośród innych osiedli ludzkich miejsce zamieszkania zakonników i zakonnic (pojmowane jako budynek lub jego mieszkańcy); odosobnienie; tryb życia klasztornego; w wypadku niektórych zakonów także: szkoła, kolegium; coenobium, monasterium.
zobacz też tekst: t. 3, s. 282: zabudowanie dla zgromadzenia zakonnego zwykle połączone z kościołem, coenobium, religiosorum domus.
zobacz też tekst: t. 9, kol. 66-76: zespół budynków lub pomieszczeń mieszkalnych i gospodarczych o różnej strukturze, przeznaczonych do prowadzenia życia pustelniczego (zob. ławra) lub wspólnotowego życia ascetycznego (zob. asceza), występujący w religiach pozachrześcijańskich i chrześcijaństwie. -- Czasem rozbudowane założenia klasztorne tworzyły wręcz miasto, a nawet państwo mnichów (civitas monachorum)

tartak - obiekt
creator: Bogumił Szady
type: Class
type: NamedIndividual
comment: In most analysed cases, if the sawmill was morphologically distinct, it had the same name as the neighboring village or another locality, such as: forester's lodge. Occasionally it had its particular name. @en
comment: W większości analizowanych przypadków, jeżeli tartak był odrębny morfologicznie, to miał tę samą nazwę, co sąsiadująca wieś lub inna miejscowość, np. leśniczówka. Sporadycznie cechowała go odrębność nazewnicza.
label: sawmill - object @en
subclass of: budynek
alternative label: das Sägewerk @de
alternative label: лесопильный завод @ru
hidden label: die Säge @de
hidden label: młyn
hidden label: osada leśna
hidden label: osada młyńska
hidden label: piła
preferred label: sawmill @en
preferred label: tartak
weryfikacja tłumaczenia deskrypcji przez: Paulina Wacławik
deskrypcja została ontologicznie zweryfikowana przez: Piotr Kulicki
deskrypcja została przetłumaczona przez: Tomasz Panecki
jest zdefiniowany przez literał: Obiekt lub zespół obiektów gospodarczych często zlokalizowanych w lesie lub jego pobliżu, gdzie dokonuje się przerobu drewna okrągłego na tarcicę w procesie przecierania (tarcia).
jest zdefiniowany przez literał: Sawmill is an industrial facility often located within or near the forest, where wood is processed into sawn timber in the wiping process. @en
zobacz też tekst: #Orgelbrand, t. 14, s. 412: pilarnia, machina do piłowania drzewa, której główną częścią składową jest piła, poruszana siłą wody lub pary. Tartaki istnieją już od wieku XIV, a obecnie stanowią machiny niekiedy bardzo zawiłe, które robotę wykonywają szybko i dokładnie
zobacz też tekst: t. 3, s. 607: młyn do tarcia drzew na tarcice, dyle
zobacz też tekst: t. 7, s. 29: Pilarnia, młyn do tarcia drzewa na tarcice, dyle: Tartak wodny, parowy
zobacz też tekst: zakład przemysłowy zajmujący się przecieraniem drewna na tarcicę
zobacz też tekst: «zakład zajmujący się rozpiłowywaniem kłód na tarcicę oraz przerobem tarcicy na różne elementy»

torfiarnia - obiekt
creator: Bogumił Szady
type: Class
type: NamedIndividual
comment: In all the analysed cases, in Bystrzycki's register, peat mines had the same names as the locality nearby: village and peat mine, manor and peat mine. @en
comment: We wszystkich analizowanych przypadkach z tzw. skorowidza Bystrzyckiego z 1931 r. torfiarnie posiadały takie same nazwy jak osada lub osady leżąca obok niej (wieś i torfiarnia, folwark i torfiarnia).
label: peat mine - object @en
subclass of: budynek
hidden label: torfowisko (pl)
preferred label: peat mine @en
preferred label: torfiarnia
weryfikacja tłumaczenia deskrypcji przez: Paulina Wacławik
deskrypcja została ontologicznie zweryfikowana przez: Piotr Kulicki
deskrypcja została przetłumaczona przez: Tomasz Panecki
jest zdefiniowany przez literał: Peat mine is a mine where a peat is mined @en
jest zdefiniowany przez literał: Torfiarnia (obiekt) jest to kopalnia torfu.
zobacz też tekst: kopalnia torfu
zobacz też tekst: t. 7, s. 85: kopalnia torfu, torfowisko eksploatowane

browar - obiekt
creator: Anna Orłowska
type: Class
type: NamedIndividual
comment: At the very beginning, breweries had been situated only within bigger settlement unit and had not had an individual name. Some of these had only a name corresponding to the owner's name, which was frequently changed. Subsequently, particular names were assigned to breweries; often in the form of trademarks, however the process of integrating the breweries under one trademark originated relatively early/ quickly. One may not find a difference between brewery and distillery in historical sources. @en
comment: Browary początkowo mieściły się wyłącznie w obrębie większych jednostek osadniczych i nie miały własnej nazwy, ew. nazwę wywiedzioną od nazwiska właściciela, często zmienianą. Z czasem browary zaczęły mieć własne nazwy, często w postaci znaków handlowych, jednakże dość szybko zaczął się proces łączenia się browarów pod wspólną nazwą. Źródłowo zdarza się brak rozróżnienia gorzelni i browaru.
label: brewery - object @en
subclass of: budynek
alternative label: Bierbrauerei @de
alternative label: Brauerei @de
alternative label: Brauhaus @de
alternative label: braxatorium @la
alternative label: piwowarnia
alternative label: пивоварня @ru
hidden label: mielcuch
hidden label: warzelnia
preferred label: brewery @en
weryfikacja tłumaczenia deskrypcji przez: Paulina Wacławik
deskrypcja została ontologicznie zweryfikowana przez: Piotr Kulicki
deskrypcja została przetłumaczona przez: Wiesława Duży
jest zdefiniowany przez literał: Brewery is a factory producing beer, as well as a complex of buildings established for production and accomodation for factory workers. @en
jest zdefiniowany przez literał: Browar jest to zakład wytwarzający piwo jak również zespół budynków przeznaczonych na cele produkcyjne i mieszkalne dla obsługi zakladu.
zobacz też IRI: Brewery
zobacz też IRI: http://vocab.getty.edu/aat/300006341
zobacz też IRI: Q131734
zobacz też tekst: t. 1, cz.12, s. 272: Browar, budynek, gdzie się piwo warzy, piwowarnia, mielcuch
zobacz też tekst: t. 2, s. 455-456: budynek, w którym się warzy piwo, piwowarnia
zobacz też tekst: zakład produkujący piwo
zobacz też tekst: zakład przemysłowy, w którym wyrabia się piwo; wytwórnia piwa

cegielnia - obiekt
creator: Anna Orłowska
type: Class
type: NamedIndividual
comment: In each case analysed, a brickyard with a particular name has been located near a village, a city or a town, or a settlement with the same name. If it was an integral part of a superior locality, it had not been given a proper name. (One should remember that exporting produced goods outside the area of production was difficult). @en
comment: We wszystkich analizowanych przypadkach jeżeli cegielnia jest odrębną miejscowością, to znajduje się w pobliżu wsi, miasta lub osady o tej samej nazwie. Jeśli znajduje się w obrębie większej miejscowości to dość długo nie ma nazwy własnej. (Trudności w eksporcie towaru poza miejsce wyrobu.)
label: brickyard - object @en
subclass of: budynek
alternative label: Ziegelei @de
alternative label: cegielnica
alternative label: кирпичный завод @ru
hidden label: Ziegelscheune @de
preferred label: brickyard @en
preferred label: cegielnia
weryfikacja tłumaczenia deskrypcji przez: Paulina Wacławik
deskrypcja została ontologicznie zweryfikowana przez: Piotr Kulicki
deskrypcja została przetłumaczona przez: Wiesława Duży
jest zdefiniowany przez literał: Brickyard is a factory where bricks and other ceramic building materials and elements are being produced together with a complex of buildings established for production and houses for factory workers. @en
jest zdefiniowany przez literał: Cegielnia jest to zakład wytwarzający cegły oraz ew. inne ceramiczne elementy budowlane jak również zespół budynków przeznaczonych na cele produkcyjne i mieszkalne dla obsługi zakładu.
zobacz też IRI: http://vocab.getty.edu/aat/300006278
zobacz też IRI: Q198632
zobacz też tekst: t. 1, cz. 1, s. 221: Cegielnia, Cegielnica, budynek z piecem od palenia cegieł, die Ziegelscheune, der Ziegelofen
zobacz też tekst: t. 3, s. 142: cegielnia – miejsce wyrobu cegieł
zobacz też tekst: wytwórnia cegly oraz innych materiałów budowlanych z gliny: dachówek, sączków (drenów), kafli, klinkierów, płytek itp.
zobacz też tekst: wytwórnia cegły oraz innych materiałów budowlanych z gliny

kopalnia - obiekt
creator: Anna Orłowska
type: Class
type: NamedIndividual
comment: Mines presented on majority of analysed maps had their individual symbol. @en
comment: Na wszystkich badanych mapach kopalnie miały własny znak umowny.
label: mine @en
subclass of: budynek
alternative label: Bergwerk @de
alternative label: gruba
alternative label: рудник @ru
hidden label: Binge @de
hidden label: Bruch @de
hidden label: Miene @de
hidden label: Schacht @de
hidden label: шахта @ru
preferred label: kopalnia
weryfikacja tłumaczenia deskrypcji przez: Paulina Wacławik
deskrypcja została ontologicznie zweryfikowana przez: Piotr Kulicki
deskrypcja została przetłumaczona przez: Wiesława Duży
jest zdefiniowany przez literał: A mine is a factory extracting minerals from the earth. It may be connected with a settlement, it may be inhabited by the personnel. @en
jest zdefiniowany przez literał: Kopalnia jest to zakład wydobywający z ziemi kopaliny. Może być połączony z osadą, miewa stale zamieszkujący personel.
zobacz też IRI: Mine
zobacz też IRI: http://vocab.getty.edu/aat/300000390
zobacz też IRI: Q820477
zobacz też tekst: Teren zakładu górniczego, zajmującego się wydobywaniem z ziemi kopalin użytecznych. Ze względu na sposób wydobycia rozróżnia się kopalnie odkrywkowe (naziemne), głębinowe (podziemne) i otworowe.
zobacz też tekst: t. 1, cz. 2, s. 1077: Kopalnia, miejsce gdzie się iakowe rzeczy kopalne z ziemi dobywają
zobacz też tekst: zakład górniczy zajmujący się wydobywaniem z ziemi kopalin
zobacz też tekst: zakład górniczy zajmujący się wydobywaniem z ziemi kopalin użytecznych

cukrownia - obiekt
creator: Anna Orłowska
type: Class
type: NamedIndividual
comment: Cukrownia może mieć własną nazwę, najczęściej powiązaną z nazwą firmy lub znakiem firmowym, ale nie musi. Rzadko zaznaczana na mapach.
comment: Sugar factory or refinery may have its own name - usually related to the factory name or a trademark - however it is not nocessary. Very seldom, it has been indicated on maps. @en
label: sugar factory - object @en
subclass of: budynek
hidden label: die Zuckerfabrik (de), die Zuckersiederei (de) Сахарный завод (ru)
preferred label: cukrownia
preferred label: sugar factory @en
weryfikacja tłumaczenia deskrypcji przez: Paulina Wacławik
deskrypcja została ontologicznie zweryfikowana przez: Piotr Kulicki
deskrypcja została przetłumaczona przez: Wiesława Duży
jest zdefiniowany przez literał: A sugar factory or refinery is a factory producing sugar, as well as a complex of buildings established for production and accomodation for factory workers. @en
jest zdefiniowany przez literał: Cukrownia jest to zakład wytwarzający cukier jak również zespół budynków przeznaczonych na cele produkcyjne i mieszkalne dla obsługi zakładu.
zobacz też tekst: fabryka cukru
zobacz też tekst: t. 1, cz. 1, s. 327: [Brak hasła „cukrownia”.] Cukrowarz, fabrykant cukru, warzący sok na cukier, derZuckersieder, cf. Cukiernik.
zobacz też tekst: zakład przemysłowy produkujący cukier

gorzelnia - obiekt
creator: Bogumił Szady
type: Class
type: NamedIndividual
comment: Distillery may have its own name - usually related to the factory name or a trademark - however it is not nocessary. As a separate locality, it may - however it is not obligatory - be located near a village, a city or a town, or a settlement sharing the same name. One may not find a difference between brewery and distillery in historical sources. @en
comment: Gorzelnie znajdujące się w obrębie miast mogą, ale nie muszą mieć własnej nazwy, zazwyczaj nazwa ta powiązana jest z nazwą firmy, znakiem firmowym. Jeśli jest odrębną miejscowością to może ale nie musi znajdować się w pobliżu wsi, miasta lub osady o tej samej nazwie. Źródłowo zdarza się brak rozróżnienia gorzelni i browaru.
label: distillery - object @en
subclass of: budynek
alternative label: Brantweinbrennerei @de
alternative label: Brennerei @de
alternative label: Brennhaus @de
alternative label: Destillerie @de
alternative label: gorzalnia
alternative label: винокуренныйзавод @ru
alternative label: винокурня @ru
hidden label: browar
preferred label: distillery @en
preferred label: gorzelnia
weryfikacja tłumaczenia deskrypcji przez: Paulina Wacławik
deskrypcja została ontologicznie zweryfikowana przez: Piotr Kulicki
deskrypcja została przetłumaczona przez: Wiesława Duży
jest zdefiniowany przez literał: Distillery is a factory where alcohol and spirits requiring distillation whilst manufacturing are produced. @en
jest zdefiniowany przez literał: Gorzelnia jest to zakład wytwarzający spirytus oraz napoje alkoholowe o wysokiej zawartości alkoholu, wymagające w trakcie procesu produkcyjnego destylacji.
zobacz też IRI: http://vocab.getty.edu/aat/300006346
zobacz też IRI: Q1251750
zobacz też tekst: t. 1, cz. 2, s. 54: Gorzalnia, gorzelnia, budowanie do palenia gorzałki (pospolicie zowią: browarem, ale borwar na piwo iest.)
zobacz też tekst: zakład przemysłowy produkujący alkohol etylowy
zobacz też tekst: zakład przemysłowy produkujący spirytus i wódki głównie z kartofli lub zboża

gajówka
creator: Tomasz Panecki
type: Class
type: NamedIndividual
comment: Forest-guard's lodge is a kind of forester's lodge; criteria for distinguishing a forester's lodge, forestry and forest-guard's lodge are unknown (in the context of topographic maps); the term forest-guard's lodge is very rarely used in Bystrzycki's register 1931 (Forest-guard's lodges depicted on MGI maps are forester's lodges in Bystrzycki's register 1931 or are not included in Bystrzycki's register 1931 whereas depicted on MGI maps). @en
comment: Gajówka jest rodzajem leśniczówki; kryteria odróżniania leśniczówki, leśnictwa i gajówki są nieznane (w świetle kartografii); termin bardzo rzadko stosowany w skorowidzu Bystrzyckiego z 1931 r. (gajówki na mapach WIG to często leśniczówki w skorowidzu Bystrzyckiego z 1931 r.; gajówki nie ujęte w skorowidzu Bystrzyckiego z 1931 r. występują na mapach WIG)
label: forest-guard's lodge @en
subclass of: leśniczówka
subclass of: Restriction
  on property: est composée de
  some values from: gajówka - obiekt
subclass of: Restriction
  has value: funkcja gospodarcza - gospodarka leśna
  on property: ma funkcję właściwą
hidden label: Forestrey @de
hidden label: Forst Amt @de
hidden label: Hegerhaus @de
hidden label: Jägerhaus @de
hidden label: leśnictwo
hidden label: leśniczówka
hidden label: nadleśnictwo
weryfikacja tłumaczenia deskrypcji przez: Paulina Wacławik
deskrypcja została ontologicznie zweryfikowana przez: Piotr Kulicki
deskrypcja została przetłumaczona przez: Tomasz Panecki
jest zdefiniowany przez literał: Forest-guard's lodge (a locality) is a settlement in which the main role is played by a forest-guard's lodge (a facility). Forest-guard's lodge is a locality as long as it has its own name and is not located in the immediate vicinity of another locality. @en
jest zdefiniowany przez literał: Gajówka (miejscowość) to miejscowość, w której główną rolę pełni gajówka (obiekt). Gajówka jest miejscowością jeżeli posiada nazwę własną i jest przestrzennie wyodrębniona od innej miejscowości.

gorzelnia
creator: Anna Orłowska
type: Class
type: NamedIndividual
comment: A distillery may be a separate locality, both individual and a part of a cluster of localities sharing the same name, however most often it has been an integral part of a city or a town and has not been distinguished. @en
comment: Gorzelnia może być odrębną miejscowością, zarówno samodzielną jak i częścią grupy miejscowości o tej samej nazwie, ale najczęściej znajduje się w obrębie miasta i nie jest wyróżniona.
label: distillery @en
subclass of: miejsce produkcji
subclass of: (mereologicznie) prosta miejscowość
subclass of: Restriction
  on property: est composée de
  some values from: gorzelnia - obiekt
subclass of: Restriction
  has value: funkcja gospodarcza
  on property: ma funkcję właściwą
hidden label: Brantweinbrennerei @de
hidden label: Brennerei @de
hidden label: Brennhaus @de
hidden label: Destillerie @de
hidden label: browar
hidden label: винокуренныйзавод @ru
hidden label: винокурня @ru
weryfikacja tłumaczenia deskrypcji przez: Paulina Wacławik
deskrypcja została ontologicznie zweryfikowana przez: Piotr Kulicki
deskrypcja została przetłumaczona przez: Wiesława Duży
jest zdefiniowany przez literał: A distillery (locality) is a settlement, where a distillery (a factory) plays the most important role. @en
jest zdefiniowany przez literał: Gorzelnia (miejscowość) jest to osada, w której główną role odgrywa gorzelnia (obiekt).

osada klasztorna
creator: Bogumił Szady
type: Class
type: NamedIndividual
comment: Klasztor może być odrębną miejscowością (rzadko, przed II wojną światową) lub częścią miejscowości.
comment: Monastery can be a separate locality (rarely, before the Second World War) or a part of a locality. @en
label: monastery @en
subclass of: dedykowana miejscowość
subclass of: właściwa miejscowość
subclass of: (mereologicznie) prosta miejscowość
subclass of: osada
subclass of: Restriction
  on property: est composée de
  some values from: klasztor - obiekt
subclass of: Restriction
  has value: funkcja mieszkalna
  on property: ma funkcję właściwą
subclass of: Restriction
  has value: S.MSTY
  on property: featureCode
hidden label: Kloster @de
hidden label: claustrum @la
hidden label: monaster
hidden label: monasterium @la
hidden label: opactwo
hidden label: ławra
weryfikacja tłumaczenia deskrypcji przez: Paulina Wacławik
deskrypcja została ontologicznie zweryfikowana przez: Piotr Kulicki
deskrypcja została przetłumaczona przez: Tomasz Panecki
jest zdefiniowany przez literał: Monastery (locality) is a settlement in which the main role is played by a monastery (facility). @en
jest zdefiniowany przez literał: Osada klasztorna jest to osada, w której główą rolę odgrywa klasztor (obiekt).

wieś
creator: Tomasz Związek
type: Class
type: NamedIndividual
comment: A development in a village may be dense (i.e. villages established according to a German law introducing a linear development) or scattered (i.e. Hauländer colonies, Dutch settlement, from 18th century or early medieval single manor settlements). A village may preponderate (be a superior settlement) any other units, such as: a hamlet or a mill settlement; it is also dependent on a manor, which supervises a village in legal and administrative issues. Inhabitants from all units forming a village comprise a village community. Studies on this type of localities distinguish an abandoned village, a settlement that lost its functions due to environmental, political, or economic incidents. In historiography, one can find an expression a lost village, which stands for a village, where settlement was not re-established. In German language in the nineteenth century, two terms could coexist - Pfarrdorf and Kirchdorf. The first meant a larger village with a parish church, and a second smaller village with an auxiliary (filial) church, but these criteria of distinction were not strict and neither used consistently. For example on the Gilly map (1802-1803), only the following categories exist: Kirchdorf and Dorf ohne Kirche. @en
comment: Wieś może posiadać zwartą (np. wsie lokowane na prawie niemieckim np. ulicówki, łańcuchówki) lub rozproszoną zabudowę (często kolonie olęderskie w XVIII w. lub wczesnośredniowieczne osady jednodworcze). Wieś może dominować (być jednostką nadrzędną osadniczo) w stosunku do innych jednostek takich jak np. przysiółek, osada młyńska; jest także zależna od pana gruntowego, który sprawuje nad nią nadzór własnościowy. Mieszkańcy wszystkich jednostek składających się na wieś tworzą jedną wspólnotę wiejską. W badaniach nad wsią rozróżnia się także pojęcie wsi opustoszałej, czyli takiej, która fizycznie przestała pełnić swoje funkcje w wyniku zdarzeń o charakterze losowym, środowiskowym, politycznym lub gospodarczym. W literaturze przedmiotu funkcjonuje także określenie wieś zaginiona, które odnosi się do wsi, w których nie wznowiono osadnictwa. W języku niemieckim w XIX wieku mogły funkcjonować równolegle dwa terminy – Pfarrdorf i Kirchdorf. Pierwszy oznaczał raczej większą wieś z kościołem parafialnym, zaś drugi mniejszą wieś z kościołem pomocniczym. Terminy te nie były jednak ścisłe i używane konsekwentnie, np. na mapie Gilly’ego z lat 1802-1803 występują tylko kategorie: Kirchdorf oraz Dorf ohne Kirche.
label: village @en
subclass of: ogólnie dostępna miejscowość
subclass of: właściwa miejscowość
subclass of: Restriction
  has value: P.PPLF
  on property: featureCode
subclass of: Restriction
  has value: funkcja rolnicza
  on property: ma funkcję właściwą
alternative label: Dorf @de
alternative label: pagus @la
alternative label: sioło
alternative label: villa @la
alternative label: село @ru
hidden label: Kirchdorf @de
hidden label: Pfarrdorf @de
hidden label: ager @la
hidden label: osada
hidden label: osiedle wiejskie
hidden label: rus @la
hidden label: siedlisko wiejskie
hidden label: vicus @la
hidden label: wioseczka
hidden label: wioska
hidden label: włość i klucz
hidden label: źreb
hidden label: погост @ru
weryfikacja tłumaczenia deskrypcji przez: Paulina Wacławik
deskrypcja została ontologicznie zweryfikowana przez: Piotr Kulicki
deskrypcja została przetłumaczona przez: Wiesława Duży
jest zdefiniowany przez literał: Village is a locality composed of a group of buildings, mostly of residential and economic character, but sometimes, also industrial ones (i.e. ironworks, mill) as well as a belonging land, inhabited by people involved particularly in agricultural and construction activities or in farming industry (i.e. blacksmith or mill work), and not having city rights nor a status of a city or a town. Some villages in Early Middle Ages had a right to organise a fair and a market. @en
jest zdefiniowany przez literał: Wieś jest to miejscowość składająca się z zabudowań mieszkalno-gospodarczych, niekiedy przemysłowych (np. kuźnia, młyn) wraz z przynależnymi do nich gruntami (rozłogi), zamieszkała przez ludność zajmującą się w większości zajęciami rolniczo-hodowlanymi oraz przemysłem wiejskim (np. kowalstwo, młynarstwo), nieposiadająca praw miejskich ani statusu miasta. Niekiedy we wczesnym średniowieczu posiadająca prawo odbywania targu.
zobacz też IRI: Village
zobacz też IRI: http://gov.genealogy.net/types.owl#55
zobacz też IRI: http://vocab.getty.edu/aat/300008372
zobacz też IRI: wies
zobacz też IRI: Q532
zobacz też tekst: 1. miejscowość zamieszkała przez ludzi, którzy trudnią się pracą na roli, 2. mieszkańcy takiej miejscowości, 3. tereny pozamiejskie, rolnicze, letniskowe, 4. ludzie trudniący się pracą na roli
zobacz też tekst: Jednostka osadnicza o zwartej lub rozproszonej zabudowie i istniejących funkcjach rolniczych lub związanych z nimi usługowych lub turystycznych, nieposiadająca praw miejskich lub statusu miasta
zobacz też tekst: Kirchdorf: Dorf mit Kirche (I) und Pfarrer, rechtlicher und religiöser Mittelpunkt einer (eventuell aus mehreren Filialdörfern bestehenden) politischen oder Pfarr-Gemeinde [Wieś z kościołem i parafią, prawne i religijne centrum gminy politycznej albo parafialnej (ewentualnie składającej się z kilku wsi filialnych, wsi z kościołami filialnymi] @de
zobacz też tekst: Pfarrdorf: 1. Dorf, in dem die für die Pfarrgemeinde konstitutive Pfarrkirche (I) steht [wieś, w której stoi kościół parafialny właściwy dla całej parafii, gminy parafialnej]; 2. zu einer Pfarre (I) gehöriges Dorf [wieś należąca do parafii] @de
zobacz też tekst: s. 15: 1. osada, której ludność zajmuje się uprawą roślin i chowem zwierząt, wieś: osada (osiedle wiejskie; teren zabudowany), na którym mieszka ludność pracująca w gospodarstwach wiejskich, koncentrująca większość środków produkcji, i na którym są dokonywane różne procesy produkcyjne, istnieje życie społeczne oraz kulturalne mieszkańców wsi (def. na podstawie Nowosielski 1964, Kiełczewska-Zaleska 1976, Chowaniem 1989); 2. podstawą (atomem) dla wsi nie jest pojedynczy wiejski budynek lecz ich komplet (zagroda), tworzący samodzielne gospodarstwo rolne z należącą doń powierzchnią ziemi --. Wieś w sensie antropogeograficznym jest częścią gminy (lub gromady), która stanowi grupę gospodarstw rolnych zabudowaną według jednolitego planu i tworzącą typ kształtu i skupienia (def. na podstawie Zaborski 1926); 3. to zbiorowisko ludzi albo osiedle z należącymi doń gruntami. Wieś: rozłóg i osada. O istnieniu wsi ma decydować także zestaw więzi wewnątrz wsi: rozłóg, siedlisko i ludność rolnicza (def. na podstawie Szymański 1969, Olechowski 1948); 4. wieś to społeczność lokalna, której funkcję produkcyjną uzupełniała funkcja rodziny. Wieś stanowi pewną historyczną formę struktury społecznej, względnie trwałą i jednolitą całość, której członkowie są ze sobą powiązani siecią zależności i więzi sprawiających, że całość ta jest wewnętrznie zintegrowana. Cechą konstytutywną tak rozumianej grupy jest określone terytorium geograficzne, które wspólnie użytkują, a efektem tego jest pewien stopień psychologicznego zespolenia całości lub części społeczności ze strukturą społeczno-przestrzenną jako znaczącą wartością kulturową. Podstawową funkcją środowiska kulturowego wsi, a zwłaszcza jego wartości przestrzennych jest kształtowanie poczucia tożsamości z rodzinną tradycją i jej wartościami oraz wynikającej stąd świadomości przynależności do miejscowej społeczności oraz identyfikacja z jej przestrzenią życiową (def. na podstawie Turowski 1992); 5. twór terytorialny mający granice, rozłóg ziemi…
zobacz też tekst: s. 29: wsią nazywamy osiedle w zasadzie otwarte, której ludność zajmuje się produkcją śródków żywności oraz surowców technicznych (tj. rolnictwem, hodowlą bydła, rybołówstwem itd.)
zobacz też tekst: t. 4, s. 365: wioska, imienie, dobro, grunt leżący; wieś targowa, wsie łowcze, osoczne, wołoskie.
zobacz też tekst: t. 7, s. 594–595: osada rolnicza, z pewnej liczby chat złożona, sioło
zobacz też tekst: t. XX, s. 199–201: 1. osada, w której ludność zajmuje się głównie rolnictwem, 2. mieszkańcy wsi, ogół mieszkańców wsi.

kolonia
creator: Wiesław Ostrowski
creator: Izabela Karsznia
type: Class
type: NamedIndividual
comment: Colony is usually a part of another locality, more rarely, although these are not exceptional cases, it can have the status of a separate locality, usually a village. Both in the case where the colony is a separate locality or it is apart of another one, it is always located near the village (village or - sometimes - small town) from which its name is derived. On topographic maps, a colony is distinguished mainly by the explanatory abbreviation (pol.: kol.), by its own name, and morphologically. @en
comment: Kolonia jest przeważnie częścią miejscowości, rzadziej, choć nie są to wyjątkowe przypadki, ma obecnie status odrębnej miejscowości, z reguły wsi. Zarówno w przypadku, gdy kolonia jest odrębną miejscowością jak i częścią miejscowości, zawsze znajduje się w pobliżu miejscowości (wsi a wyjątkowo małego miasta) od której pochodzi jej nazwa. W ujęciu kartograficznym wyodrębniona przede wszystkim przez skrót kategorii (kol.), nazwę własną, oraz morfologicznie.
label: colony @en
subclass of: ogólnie dostępna miejscowość
subclass of: właściwa miejscowość
alternative label: Kolonie @de
alternative label: colonia @la
alternative label: колония @ru
hidden label: chutor
hidden label: część wsi
hidden label: housing estate @en
hidden label: osada
hidden label: osiedle
hidden label: przysiółek
hidden label: settlement @en
hidden label: sioło
hidden label: stanica
hidden label: wybudowanie
weryfikacja tłumaczenia deskrypcji przez: Paulina Wacławik
deskrypcja została ontologicznie zweryfikowana przez: Piotr Kulicki
deskrypcja została przetłumaczona przez: Tomasz Panecki
jest zdefiniowany przez literał: Colony (pol. kolonia) is a built-up area located away from previously existing buildings (locality) to which it is related. It is created on newly developed land allocated as a result of enfranchisement, parceling, consolidation, or internal migration. @en
jest zdefiniowany przez literał: Kolonia jest to obszar zabudowany oddalony od wcześniej istniejącej zabudowy, od której jest zależna, powstały na nowo zagospodarowanych gruntach przydzielonych w wyniku uwłaszczenia, parcelacji, komasacji lub migracji wewnętrznej.
zobacz też IRI: http://gov.genealogy.net/types.owl#121
zobacz też IRI: kolonia
zobacz też IRI: Q12015918
zobacz też tekst: Jednostka osadnicza powstała jako rezultat ekspansji miejscowości poza obszar wcześniej istniejącej zabudowy, w szczególności kolonia miasta, kolonia wsi.
zobacz też tekst: t. 1, s. 900: Osiedla mieszkaniowe położone z dala od centrum miasta, osady: niewielka posiadłość ziemska , nowa osada lub gospodarstwo rolne na gruntach przydzielonych w wyniku uwłaszczenia, parcelacji, komasacji, migracji wewnętrznej itp.
zobacz też tekst: t. 1-2, s. 1566: część miejscowości, zwykle z dale od jej centrum, składająca się z nowobudowanych domostw, will, itp.
zobacz też tekst: t. 2, s. 240: zabudowa, osiedle, domy znajdujące się z dala od miasta, wsi, osady; kolonia mieszkaniowa na przedmieściach, kolonia położona daleko za wsią, gospodarstwo rolne położone za wsią, posiadłość ziemska z dala od innych.
zobacz też tekst: t. 2, s. 404: mała posiadłość ziemska należąca do przybysza z obcego kraju; osada włościańska po uwłaszczeniu włościan; osada, miejsce, gdzie koloniści osadnicy mieszkają, budy, szopy, majdan.
zobacz też tekst: t. 5, s. 720: kolonia rolna -- gospodarstwo rolne powstałe w oddaleniu od wsi na gruntach przydzielonych w wyniku uwłaszczenia, parcelacji, komasacji, itp.; także kilka lub kilkanaście zagród w rozproszeniu -- osada na ziemiach nowo zagospodarowanych
zobacz też tekst: „W ten sposób termin 'osada' może tutaj oznaczać nie tylko małe osiedla, złożone z jednego lub kilku wyodrębnionych terytorialnie gospodarstw włościańskich, jak to miało miejsce na innych ziemiach polskich, lecz i większe, o charakterze kolonii, t. j. osiedli rozrzuconych na większej przestrzeni, a powstałych zazwyczaj na gruntach rozparcelowanych przez władze zaborcze”

granica podziału administracyjnego
type: Class
label: administrative unit boundary @en
subclass of: BFO_0000140
subclass of: Cecha
subclass of: Restriction
  on property: ma charakterystykę przestrzenną
  some values from: Thing
subclass of: Restriction
  on property: jest granicą
  some values from: jednostka podziału administracyjnego

granica miejscowości
type: Class
label: settlement unit boundary @en
subclass of: BFO_0000140
subclass of: Cecha
subclass of: Restriction
  on property: ma charakterystykę przestrzenną
  some values from: Thing
subclass of: Restriction
  on property: jest granicą
  some values from: miejscowość

osada górnicza
creator: Anna Orłowska
type: Class
type: NamedIndividual
comment: A mine may be a separate locality, an individual one or a part of a cluster of localities sharing the same name, however, even if a mine is an integral part of a bigger locality, it has its particular name. @en
comment: Kopalnia może być odrębną miejscowością, zarówno samodzielną jak i częścią grupy miejscowości o tej samej nazwie, ale najczęściej, nawet jeśli znajduje się w obrębie większej miejscowości, ma własną nazwę.
label: mining settlement @en
subclass of: miejsce produkcji
subclass of: (mereologicznie) prosta miejscowość
subclass of: osada
subclass of: Restriction
  on property: est composée de
  some values from: kopalnia - obiekt
subclass of: Restriction
  has value: funkcja gospodarcza
  on property: ma funkcję właściwą
subclass of: Restriction
  has value: S.MN
  on property: featureCode
alternative label: Bergwerksort @de
hidden label: Bergwerk @de
hidden label: Binge @de
hidden label: Bruch @de
hidden label: Miene @de
hidden label: Schacht @de
hidden label: gruba
hidden label: kopalnia
hidden label: mine @en
hidden label: mining camp @en
hidden label: mining community @en
hidden label: mining town @en
hidden label: рудник @ru
hidden label: шахта @ru
hidden label: шахтёрский город @ru
weryfikacja tłumaczenia deskrypcji przez: Paulina Wacławik
deskrypcja została ontologicznie zweryfikowana przez: Piotr Kulicki
deskrypcja została przetłumaczona przez: Wiesława Duży
jest zdefiniowany przez literał: A mine (a locality) is a settlement with a mine (a factory) as the most important element. @en
jest zdefiniowany przez literał: Kopalnia (miejscowość) jest to osada, w której główną rolę odgrywa kopalnia (obiekt).
zobacz też IRI: http://vocab.getty.edu/aat/300008464
zobacz też IRI: Q820254

koszary
type: Class
label: barracks @en
subclass of: dedykowana miejscowość
subclass of: właściwa miejscowość
subclass of: Restriction
  has value: S.BRKS
  on property: featureCode
zobacz też IRI: Barracks

latarnia morska
creator: Tomasz Panecki
type: Class
type: NamedIndividual
comment: Included as a kind of locality in Bystrzycki's register as abbreviation ("lat. mor."); dinstinct symbol on topographic maps; included in DBTO10k as a "communication buildings, stations and terminals" (BUBD feature class). Functional distinctivness - distinguished as a kind of locality in Bystrzycki's register, and on topographic maps as distinct symbol, sometimes with the proper name. Morphological and spatial distinctivness - usually a lightouse is a building (structure) within the area of the locality or in its vicinity. If it has its a particular (proper) name, it can be treated as a separate locality (interpretation of maps is necessary, see: Rozewie). Otherwise it is either part of another locality or an object (building/structure) in it (see: Hel, Jastarnia). @en
comment: Występuje jako rodzaj miejscowości u Bystrzyckiego w spisie ("lat. mor."); na mapach osobna sygnatura. W BDOT10k jako budynek łączności, dworców i terminali. Odrębność funkcjonalna – wyróżniana jako rodzaj miejscowości u Bystrzyckiego, a na mapach topograficznych odrębnym znakiem, niekiedy z nazwą własną. Odrębność morfologiczna/przestrzenna – przeważnie jest obiektem na obszarze miejscowości lub w niewielkim od niej oddaleniu. Jeżeli posiada nazwę własną może być traktowana jako osobna miejscowość (konieczna interpretacja map; patrz: Rozewie). W przeciwnym razie jest albo częścią innej, większej miejscowości lub obiektem terenowym (budowlą) w niej (patrz: Hel, Jastarnia).
label: lighthouse @en
subclass of: dedykowana miejscowość
subclass of: (mereologicznie) prosta miejscowość
subclass of: Restriction
  has value: funkcja komunikacyjna
  on property: ma funkcję właściwą
subclass of: Restriction
  has value: S.LTHSE
  on property: featureCode
alternative label: Leuchtturm @de
weryfikacja tłumaczenia deskrypcji przez: Paulina Wacławik
deskrypcja została ontologicznie zweryfikowana przez: Piotr Kulicki
deskrypcja została przetłumaczona przez: Tomasz Panecki
deskrypcja została przetłumaczona przez: Wiesława Duży
jest zdefiniowany przez literał: A lighthouse (a locality) is a settlement in which a main role is played by a lighthouse (building). @en
jest zdefiniowany przez literał: Latarnia morska (miejscowość) to osada obejmująca latarnię morską (obiekt).

letnisko
creator: Tomasz Panecki
type: Class
type: NamedIndividual
comment: It can be either a separate locality (e.g. Celestynów) or a part of another locality, morphologically it is most often a complex of (summer) houses (Chylice, Skolimów), but also a typical (based on the interpretation of the topographic map drawing) non-urban built-up area (Choszczówka). Included as a kind of locality in Bystrzycki's register as explanatory abbreviation ("letn."). All summer resorts in Bystrzycki's register are located near Warsaw. Exception: Wisła, Zełmianka (Stryj district). Included on topographic maps as a part of a place name annotation ("letn."), but not in symbology keys (legends). On the MGI maps, summer resort is one of the types of localities. In DBTO10k as "summer house" (pol "dom letniskowy") in the feature class of single-family residential buildings (BUBD01). @en
comment: Może być albo osobną miejscowością (Celestynów) albo częścią miejscowości. Morfologicznie jest to najczęściej zabudowa złożona z domków letniskowych (Chylice, Skolimów), ale również typowa (na podstawie interpretacji rysunku mapy) zabudowa zwarta niemiejska (Choszczówka). Występuje jako rodzaj miejscowości u Bystrzyckiego w spisie ("letn."). Wszystkie letniska u Bystrzyckiego znajdują się w okolicach Warszawy. Wyjątek: Wisła, Zełmianka (pow. Stryj). Występuje na mapach w nazwach miejscowości (letn.), ale nie w kluczach znaków. W legendach map WIG jest to jeden z rodzajów osiedli. W BDOT10k („dom letniskowy”) w klasie budynki mieszkalne jednorodzinne (BUBD01).
label: summer resort @en
subclass of: właściwa miejscowość
subclass of: Restriction
  has value: funkcja wypoczynkowa
  on property: ma funkcję właściwą
alternative label: osada letniskowa
alternative label: resort destination @en
hidden label: Erholungsort @de
hidden label: dom letniskowy
hidden label: resort town @en
hidden label: sanatorium
hidden label: uzdrowisko
hidden label: willa
hidden label: курортный город @ru
weryfikacja tłumaczenia deskrypcji przez: Paulina Wacławik
deskrypcja została ontologicznie zweryfikowana przez: Piotr Kulicki
deskrypcja została przetłumaczona przez: Tomasz Panecki
deskrypcja została przetłumaczona przez: Wiesława Duży
jest zdefiniowany przez literał: Letnisko to miejscowość o charakterze wypoczynkowym, złożona z domków letniskowych lub posiadająca zwartą zabudowę
jest zdefiniowany przez literał: Summer resort is a holiday locality consisting of holiday houses or densely built-up @en
zobacz też IRI: http://vocab.getty.edu/aat/300000547
zobacz też IRI: http://vocab.getty.edu/aat/300000558
zobacz też IRI: Q317548
zobacz też IRI: Q875157
zobacz też tekst: miejscowość wypoczynkowa; letni pobyt poza miastem w celach wypoczynkowych

leśniczówka
creator: Tomasz Panecki
type: Class
type: NamedIndividual
comment: Dziś leśniczówka jest miejscowością lub budynkiem (BDOT10k), ale nie wszystkie leśniczówki-budynki (BUBD01) to leśniczówki-miejscowości (ADMS11). Przed wojną leśniczówka prawie zawsze była wyróżniana jako odrębna miejscowość.
comment: Today, the forester's lodge is a locality or a building (DBTO10k), but not all forester's lodges (feature class: BUBD01) which are buildings are forester's lodges (feature class: ADMS11) understood as localities. Before the second world war, forester's lodge was almost always distinguished as a separate locality. @en
label: forester's lodge @en
subclass of: dedykowana miejscowość
subclass of: właściwa miejscowość
subclass of: (mereologicznie) prosta miejscowość
subclass of: Restriction
  has value: S.STNF
  on property: featureCode
subclass of: Restriction
  has value: funkcja gospodarcza - gospodarka leśna
  on property: ma funkcję właściwą
subclass of: Restriction
  on property: est composée de
  some values from: leśniczówka - obiekt
hidden label: Forestrey @de
hidden label: Forst Amt @de
hidden label: Hegerhaus @de
hidden label: Jägerhaus @de
hidden label: gajówka
hidden label: nadleśnictwo
hidden label: osada leśna
weryfikacja tłumaczenia deskrypcji przez: Paulina Wacławik
deskrypcja została ontologicznie zweryfikowana przez: Piotr Kulicki
deskrypcja została przetłumaczona przez: Tomasz Panecki
jest zdefiniowany przez literał: Forester's lodge (a locality) is a locality in which the main role is played by a forester's lodge (an area). Forester's lodge is a locality as long as it has a particular (proper) name and is not located in the immediate vicinity of another locality. @en
jest zdefiniowany przez literał: Leśniczówka (miejscowość) to miejscowość, w której główną rolę pełni leśniczówka (obiekt). Leśniczówka jest miejscowością jeżeli posiada nazwę własną i jest przestrzennie wyodrębniona od innej miejscowości.
zobacz też IRI: http://gov.genealogy.net/types.owl#115
zobacz też IRI: lesniczowka

miasteczko
creator: Marek Słoń
type: Class
type: NamedIndividual
comment: Miasteczko z zasady jest odrębną miejscowością. Na ziemiach polskich nie istniało rozróżnienie formalne między miastem i miasteczkiem, funkcjonowało ono natomiast na niektórych obszarach Rzeszy Niemieckiej (Flecken, Marktsiedlung - Stadt).
comment: Town is always (ex definitione) a separate locality. On the Polish lands, there was no formal distinction between the city and the town, but such distinction was present in some areas of the German Reich (Flecken, Marktsiedlung - Stadt). @en
label: town @en
subclass of: miasto
subclass of: Restriction
  has value: P.PPL
  on property: featureCode
alternative label: Städtchen @de
alternative label: oppidulum @la
hidden label: Flecken @de
hidden label: miasto
hidden label: oppidum @la
hidden label: osada targowa
weryfikacja tłumaczenia deskrypcji przez: Paulina Wacławik
deskrypcja została ontologicznie zweryfikowana przez: Piotr Kulicki
deskrypcja została przetłumaczona przez: Tomasz Panecki
jest zdefiniowany przez literał: Miasteczko to małe miasto, odróżniające się od dużych miast wielkością (liczoną według miary właściwej dla danej epoki i regionu) i stopniem złożoności.
jest zdefiniowany przez literał: Town (pol. miasteczko) is a small city, distniguished from larger cities by it size (estimated by standards appropriate for given period and region) and complexity. @en
zobacz też IRI: Town
zobacz też IRI: http://gov.genealogy.net/types.owl#51
zobacz też IRI: http://vocab.getty.edu/aat/300008375
zobacz też IRI: Q3957
zobacz też tekst: małe miasto, -- przen. ludność małego miasta
zobacz też tekst: małe miasto; pot. mieszkańcy małego miasta
zobacz też tekst: t. 13, s. 369-372: 1. Od znacz. 'miejsce' --; 2. Od znacz. 'wytyczony i najczęściej otoczony murem teren pokryty gęstą i planową zabudową

miasto
creator: Marek Słoń
type: Class
type: NamedIndividual
comment: During those periods, when legal status of localities was established and defined, cities/towns were granted specific municipal rights (location bill), which should be considered as an auxiliary indicator for distinguishing cities/towns. A city/town may consists of other settlement units, like: a core city/town (a founded one), a district, a suburb, a castle, a gord. At least from the 13th to the 18th century, two parallel notions existed: general (meaning the whole settlement unit with its own society, economy, and urban structure, perceived mostly by intuition), and a city in its political and legal meaning, as a community with an extensive autonomy. As a consequence, cities within other city or units lying partly in and partly outside the city existed. For these complex structures, in this project, first explanations of the city should be applied. @en
comment: W okresach, w których status prawny miejscowości był ukształtowany miasta posiadały szczególne prawa miejskie (lokacyjne), które stanowią postawowe kryterium pomocnicze odróżniania miast. W skład miasta mogą wchodzić inne jednostki osadnicze, jak miasto właściwe (lokacyjne), dzielnica, przedmieście, zamek, gród. Przynamniej w okresie od XIII do XVIII w. funkcjonowały równolegle dwa pojęcia miasta: ogólne, obejmujące cały zespół osadniczy o odrębności społecznej, gospodarczej i urbanistycznej, postrzegane przede wszystkim intuicyjnie oraz miasto w sensie polityczno-prawnym, obdarzona względnie szeroką autonomią gmina. W konsekwencji mogły istnieć miasta w mieście i obiekty leżące jednocześnie w mieście i poza nim. Dla takich złożonych struktur w niniejszym projekcie należy się posługiwać pierwszym znaczeniem miasta.
label: city / town @en
subclass of: ogólnie dostępna miejscowość
subclass of: właściwa miejscowość
subclass of: (mereologicznie) złożona miejscowość
subclass of: (mereologicznie) samodzielna miejscowość
subclass of: Restriction
  has value: funkcja mieszkalna
  on property: ma funkcję właściwą
subclass of: Restriction
  has value: P.PPL
  on property: featureCode
alternative label: Stadt @de
alternative label: civitas @la
alternative label: oppidum @la
alternative label: urbs @la
alternative label: город @ru
hidden label: aglomeracja
hidden label: miasteczko
hidden label: osada miejska
hidden label: месте́чко @ru
weryfikacja tłumaczenia deskrypcji przez: Paulina Wacławik
deskrypcja została ontologicznie zweryfikowana przez: Piotr Kulicki
deskrypcja została przetłumaczona przez: Wiesława Duży
jest zdefiniowany przez literał: A city/town is a superior locality, distinguished from others, surrounding basic units by size (measured differently in different periods of time and regions), a level of complexity, and central functions provided for those units. @en
jest zdefiniowany przez literał: Miasto jest to miejscowość wyższego rzędu, odróżniająca się od otaczających je podstawowych wielkością (liczoną według miary właściwej dla danej epoki i regionu), stopniem złożoności i funkcjami centralnymi względem nich.
zobacz też IRI: City
zobacz też IRI: http://gov.genealogy.net/types.owl#51
zobacz też IRI: http://vocab.getty.edu/aat/300008389
zobacz też IRI: miasto
zobacz też IRI: Q515
zobacz też tekst: Jednostka osadnicza (wyodrębniony przestrzennie obszar zabudowy mieszkaniowej wraz z obiektami infrastruktury technicznej zamieszkany przez ludzi) o przewadze zwartej zabudowy i funkcjach nierolniczych posiadająca prawa miejskie bądź status miasta nadany w trybie określonym odrębnymi przepisami.
zobacz też tekst: Skupisko ludności, odróżniające się od innych swymi głównie nierolniczymi funkcjami, znaczną wielkością oraz intensywnością zabudowy. Definicja ta musi być jednak interpretowana elastycznie i zawsze na tle aktualnej sieci osadniczej.
zobacz też tekst: s. 63: Miasto jest osadą różniącą się od wsi i nierolniczych osad monofunkcyjnych względną wielkością z zagęszczoną i rozczłonkowaną zabudową, z ludnością wyspecjalizowaną zawodowo i rozwarstwioną społecznie oraz funkcjami centralnymi pełnionymi wobec określonego regionu lub lokalnej ludności w sferze polityki, panowania, obronności, gospodarki, kultu i kultury [Stadt ist eine vom Dorf und nichtagrarischen Einzwecksiedlungen unterschiedene Siedlung relativer Größe mit verdichteter, gegliederter Bebauung, beruflich spezialisierter und sozial geschichteter Bevölkerung und zentralen Funktionen politisch-herrschaftlich-militärischer, wirtschaftlicher und kultisch-kultureller Art für eine bestimmte Region oder regionale Bevölkerung] @de
zobacz też tekst: t. 13, s. 37: Wytyczony i najczęściej otoczony murem teren, pokryty gęstą i planową zabudową tworzącą place i ulice, stanowiący mniej lub więcej samodzielną jednostkę administracyjną, samorządową, a czasem polityczną.

(mereologicznie) prosta miejscowość
type: Class
comment: Miejscowość jest (mereologicznie) prosta, gdy żadna jej część nie jest miejscowością.
label: (mereologically) simple human settlement @en
subclass of: miejscowość
subclass of: Restriction
  has value: S.HSP
  on property: featureCode
equivalent class: Class
  intersection of: miejscowość
  intersection of: Restriction
    max qualified cardinality: 0
    on class: miejscowość
    on property: ma część (jednostkę osadniczą)
jest zdefiniowany przez literał: (Mereologically) simple human settlement has no part that is a human settlement. @en
jest częścią podziału: podział manifestacji jednostek osadniczych ze względu na mereologiczną złożoność

(mereologicznie) złożona miejscowość
type: Class
comment: Miejscowość jest (mereologicznie) złożona, gdy niektóre jej części są miejscowościami.
label: (mereologically) complex human settlement @en
subclass of: miejscowość
equivalent class: Class
  intersection of: miejscowość
  intersection of: Restriction
    min qualified cardinality: 1
    on class: miejscowość
    on property: ma część (jednostkę osadniczą)
jest zdefiniowany przez literał: (Mereologically) complex human settlement has parts that are human settlements. @en
jest częścią podziału: podział manifestacji jednostek osadniczych ze względu na mereologiczną złożoność

(mereologicznie) samodzielna miejscowość
type: Class
comment: Miejscowość jest (mereologicznie) samodzielna, gdy nie jest częścią żadnej miejscowości.
label: (mereologically) complete human settlement @en
subclass of: miejscowość
equivalent class: Class
  intersection of: miejscowość
  intersection of: Restriction
    max qualified cardinality: 0
    on class: miejscowość
    on property: jednostka osadnicza jest częścią
jest zdefiniowany przez literał: (Mereologically) complete human settlement is not part of any settlement. @en
jest częścią podziału: podział manifestacji jednostek osadniczych ze względu na mereologiczną samodzielność

(mereologicznie) niesamodzielna miejscowość
type: Class
comment: Miejscowość jest (mereologicznie) niesamodzielna, gdy jest częścią pewnej miejscowości.
label: (mereologically) incomplete human settlement @en
subclass of: miejscowość
equivalent class: Class
  intersection of: miejscowość
  intersection of: Restriction
    on property: jednostka osadnicza jest częścią
    some values from: miejscowość
jest zdefiniowany przez literał: (Mereologically) incomplete human settlement is part of some settlement. @en
jest częścią podziału: podział manifestacji jednostek osadniczych ze względu na mereologiczną samodzielność

osada
creator: Wiesław Ostrowski
creator: Izabela Karsznia
type: Class
type: NamedIndividual
comment: A small locality organised in relation to a workplace or a particular occupation of its inhabitants. Settlement had usually been established as a separate locality, later on – especially in case of industrial settlements – particular settlements could develop into a city, merge with other settlement to create a new locality, or it could be incorporated into another locality. Depending on the type of inhabitants’ occupations one can, or could in the past, indicate a fair (market), craft, industrial, fishing, forestry, and railway settlements. @en
comment: Niewielka miejscowość zorganizowana w związku z miejscem lub rodzajem pracy mieszkańców. Osada powstawała z reguły jako odrębna miejscowość, później, dość często, szczególnie w przypadku osad przemysłowych, rozwijała się do rangi miasta, łączyła się z inną osadą jako odrębna miejscowość, lub była włączana do innej miejscowości. W zależności od rodzaju wykonywanej pracy wyróżnia lub wyróżniało się osady targowe, rzemieślnicze, przemysłowe, rybackie, leśne, kolejowe.
comment: „W ten sposób termin 'osada' może tutaj oznaczać nie tylko małe osiedla, złożone z jednego lub kilku wyodrębnionych terytorialnie gospodarstw włościańskich, jak to miało miejsce na innych ziemiach polskich, lecz i większe, o charakterze kolonii, t. j. osiedli rozrzuconych na większej przestrzeni, a powstałych zazwyczaj na gruntach rozparcelowanych przez władze zaborcze”
label: settlement @en
subclass of: miejscowość
subclass of: Restriction
  has value: funkcja mieszkalna
  on property: ma funkcję
alternative label: посёлок @ru
hidden label: Ansiedlung @de
hidden label: Kolonie @de
hidden label: Siedlung @de
hidden label: kolonia
hidden label: miasteczko
hidden label: osiedle
hidden label: sadyba
hidden label: zagroda włościańska
weryfikacja tłumaczenia deskrypcji przez: Paulina Wacławik
deskrypcja została ontologicznie zweryfikowana przez: Piotr Kulicki
deskrypcja została przetłumaczona przez: Wiesława Duży
jest zdefiniowany przez literał: Niewielka miejscowość zamieszkała przez ludność związaną z określonym typem lokalizacji lub rodzajem pracy nierolniczej i usytuowana z reguły w bezpośrednim sąsiedztwie miejsca pracy.
jest zdefiniowany przez literał: Settlement is a small locality inhabited by people associated with a particular type of location or a type of a non-agricultural work and lying mostly in the vicinity of a workplace. @en
zobacz też IRI: Hamlet (place)
zobacz też IRI: http://gov.genealogy.net/types.owl#120
zobacz też IRI: http://vocab.getty.edu/aat/300008369
zobacz też IRI: osada
zobacz też IRI: Q5084
zobacz też tekst: Niewielka jednostka osadnicza na terenie wiejskim o odmiennym (wyróżniającym się) charakterze zabudowy albo zamieszkana przez ludność związaną z miejscem lub rodzajem pracy, innymi niż wyżej wymienione [osada młyńska, osada leśna, osada rybacka, osada kolejowa, osada po byłem PGR]; źródło: ustawa z dnia 29 sierpnia 2003 r. o urzędowych nazwach miejscowości i obiektów fizjograficznych.
zobacz też tekst: Niewielka jednostka osadnicza na terenie wiejskim o odmiennym(wyróżniającym się) charakterze zabudowy albo zamieszkana przez ludność zwiazaną z określonym miejscem lub rodzajem pracy, w szczególności: osada młyńska, osada leśna, osada rybacka, osada kolejowa, osada po byłym państwowym gospodarstwie rolnym; osada może być samodzielna lub może stanowić część innej jednostki osadniczej.
zobacz też tekst: niewielka miejscowość, niemająca praw osiedla czy miasta; też: mieszkańcy takiej miejscowości
zobacz też tekst: osiedle typu wiejskiego pośrednie między wsią a miasteczkiem; kolonia, mieszkańcy tego osiedla
zobacz też tekst: t. 22, s. 99: 1. Osiedle, miejsce zamieszkałe przez osadzoną ludność, terytorium zamieszkałe, -- a. Siedlisko, mieszkanie --; 2. Mieszkańcy osiedla; ludność żyjąca na jakimś terenie --; 3. Miejsce zdatne, dogodne do osiedlenia się --; 4. Zasiedlenie pustego miejsca, colonia.
zobacz też tekst: t. 3, s. 547: osada, koloniia, mieysce, gdzie się nowi mieszkańcy sadowią, eine Kolonie (cf. wola), Pflanzstadt, Pflanzort, Ansiedlung; -- Vd. selizhzhe, preselishe, selitva, naselitva; Rs. колонїя, селенїе (ob. sieło, sioło), поселенїе, селишьба.
zobacz też tekst: t. 3, s. 836-837: 1.a. miejsce, gdzie ś. nowi mieszkańcy usadowili, kolonja --; b. miejsce zajęte przez mieszkańców, większe od wsi a mniejsze do miasta --; c. [Osiedle] grunt, na którym osadzano chłopa; sadyba, zagroda włościańska

osiedle
creator: Wiesław Ostrowski
creator: Izabela Karsznia
type: Class
type: NamedIndividual
comment: In a general meaning, currently obsolete, an expression for every settlement unit (urban or rural one). Understood as such, it had been considered a separate locality. In urban studies, this notion is derived from a "neighbouring unit" idea, covering a group of residential buildings with a service facilities and green areas. As a part of a locality, "osiedle" may be recognised by its particular name, physiognomy (i. e. a group of blocks of flats, detached houses), topography (occupied area), and a period, when it was established. In cartography, it may be distinguished by its own name preceded by an abbreviation (i.e. Os. Zdobycz Robotnicza) as well as morphology. @en
comment: W znaczeniu ogólnym, rzadko obecnie stosowanym, określenie każdej jednostki osadniczej (osiedle miejskie, osiedle wiejskie). W tym znaczeniu jest to osobna miejscowość. W urbanistyce (planowaniu przestrzennym) pojęcie osiedla wywodzi się z koncepcji „jednostki sąsiedzkiej”, na którą składa się zespół budynków mieszkalnych wraz z zapleczem obiektów usługowych oraz terenów zielonych. Jako część miejscowości osiedle wyróżnia się poprzez nazwę, swoją fizjonomię (np. osiedle bloków mieszkalnych, domków jednorodzinnych), topografię (jest wyodrębnione przestrzennie), a także przez okres powstania. W ujęciu kartograficznym wyodrębnione przez nazwę własną, poprzedzoną skrótem kategorii (np. Os. Zdobycz Robotnicza) oraz morfologicznie.
label: housing developments @en
subclass of: ogólnie dostępna miejscowość
subclass of: właściwa miejscowość
subclass of: (mereologicznie) niesamodzielna miejscowość
subclass of: Restriction
  on property: bildet Teil von
  some values from: Class
    union of: wieś
    union of: miasto
subclass of: Restriction
  has value: funkcja mieszkalna
  on property: ma funkcję właściwą
alternative label: Wohnsiedlung @de
hidden label: Ansiedlung @de
hidden label: Siedlung @de
hidden label: część miasta
hidden label: dzielnica
hidden label: hamlet @en
hidden label: housing estate @en
hidden label: kolonia
hidden label: osada
hidden label: osiedle willowe
hidden label: osiedlisko
hidden label: residential quarter @en
hidden label: settlement @en
weryfikacja tłumaczenia deskrypcji przez: Paulina Wacławik
deskrypcja została ontologicznie zweryfikowana przez: Piotr Kulicki
deskrypcja została przetłumaczona przez: Tomasz Panecki
deskrypcja została przetłumaczona przez: Wiesława Duży
jest zdefiniowany przez literał: Housing estate is an area covering a group of residential buildings, being an integral part of a city ( a town), or - rarely - a village. @en
jest zdefiniowany przez literał: Obszar obejmujący zespół budynków mieszkalnych, stanowiący integralną część miasta, a niekiedy wsi.
zobacz też IRI: Housing development
zobacz też IRI: http://vocab.getty.edu/aat/300000498
zobacz też IRI: osiedle
zobacz też IRI: Q2282602
zobacz też tekst: 10. Rodzaj miejscowości (Klasa: AD_RodzajMiejscowosciKod): Zespół mieszkaniowy stanowiący integralną część miasta lub wsi; źródło: ustawa z dnia 29 sierpnia 2003 r. o urzędowych nazwach miejscowości i obiektów fizjograficznych.
zobacz też tekst: 12. Typ ciągu komunikacyjnego (Klasa: AD_TypUlicyKod): Część miasta, wsi lub osady, dla której utworzono odrębny spójny zbiór numerów porządkowych nieprzyporządkowanych do żadnej ulicy ani placu.
zobacz też tekst: Rodzaj jednostki pomocniczej (Klasa: AD_RodzajJednostkiPomocniczej): Część miasta lub wsi, której uchwałą rady gminy nadano status jednostki pomocniczej.
zobacz też tekst: t. 2, s. 526: nieduże skupisko budynków miejskich lub wiejskich, zespół bloków mieszkalnych, willowe, przyfabryczne, robotnicze, mieszkaniowe
zobacz też tekst: t. 20, s. 56: osiedle mieszkaniowe – zespół mieszkaniowy stanowiący strukturalną jednostkę mieszkaniową w mieście; pojęcie „osiedle mieszkaniowe” wywodzi się z koncepcji jednostki sąsiedzkiej; wielkość osiedla mieszkaniowego wynika z zasięgu pieszego dojścia (600–800 m) do ośrodka usługowego oraz gęstości zaludnienia (5–20 tys. mieszk.) obszaru obsługiwanego przez ten ośrodek. Stanowi zespół budynków mieszkalnych wraz z integralnym zapleczem obiektów usługowych oraz terenów zieleni; niekiedy są wydzielane części osiedli mieszkaniowych – kolonie, złożone z kilku bloków mieszkalnych; kilka osiedli mieszkaniowych tworzy dzielnicę.
zobacz też tekst: t. 22, s. 124: osiedla, osiedlisko – siedziba, gospodarstwo wraz z zabudowaniami
zobacz też tekst: t. 3, s. 590: osiedlić, na osadzie czyli siedlisku postanowić kogoś, osadzić go; osiedlisko – miejsce osiedlenia, osada, osiadłość
zobacz też tekst: t. 6, s. 1121: nieduże skupienie siedzib ludzkich (miejskich lub wiejskich); reg. na wsi: dom mieszkalny wraz z zabudowaniami gospodarczymi, zagroda, dostatnie osiedle bogatego chłopa, sołtysowe osiedle
zobacz też tekst: zespół mieszkaniowy stanowiący integralną część miasta lub wsi

osada fabryczna
creator: Wiesław Ostrowski
creator: Izabela Karsznia
type: Class
type: NamedIndividual
comment: Industrial settlement usually emerged as a separate locality, later, quite often, it developed to the rank of the city, merged with another locality creating a separate one, or was incorporated into another locality. @en
comment: Osada fabryczna powstawała z reguły jako odrębna miejscowość, później, dość często rozwijała się do rangi miasta, łączyła się z inną osadą jako odrębna miejscowość, lub była włączana do innej miejscowości.
label: industrial settlement @en
subclass of: osada
subclass of: Restriction
  has value: funkcja przemysłowa
  on property: ma funkcję właściwą
alternative label: osada przemysłowa (pl)
hidden label: conlocationen @la
hidden label: der Ortschaft @de
hidden label: der Siedlung @de
hidden label: die Ansiedlung @de
hidden label: die Kolonie @de
hidden label: kolonia
hidden label: miasteczko
hidden label: miejscowość
hidden label: osiedle
hidden label: sadyba
hidden label: settlement @en
hidden label: zagroda włościańska
weryfikacja tłumaczenia deskrypcji przez: Paulina Wacławik
deskrypcja została ontologicznie zweryfikowana przez: Piotr Kulicki
deskrypcja została przetłumaczona przez: Tomasz Panecki
jest zdefiniowany przez literał: Industrial settlement is a settlement in which a main role is played by a factory. @en
jest zdefiniowany przez literał: Osada fabryczna jest to osada, w której główną rolę pełni fabryka.

osada leśna
creator: Tomasz Panecki
creator: Wiesław Ostrowski
creator: Izabela Karsznia
type: Class
type: NamedIndividual
comment: Osada leśna powstawała z reguły jako odrębna, niewielka miejscowość, położona w obrębie lub na skraju obszaru leśnego.
comment: The forest settlements were usually formed as a separate, small locality, located within or near the forest. @en
label: forest settlement @en
subclass of: osada
subclass of: Restriction
  has value: funkcja gospodarcza - gospodarka leśna
  on property: ma funkcję właściwą
hidden label: Forestrey @de
hidden label: Forst Amt @de
hidden label: Jagerhaus @de
hidden label: gajówka
hidden label: leśnictwo
hidden label: leśniczówka
hidden label: nadleśnictwo
weryfikacja tłumaczenia deskrypcji przez: Paulina Wacławik
deskrypcja została ontologicznie zweryfikowana przez: Piotr Kulicki
deskrypcja została przetłumaczona przez: Tomasz Panecki
deskrypcja została przetłumaczona przez: Wiesława Duży
jest zdefiniowany przez literał: A forest settlement is a small settlement located within or at the boundaries of a forest area, inhabited by people involved in administration, exploitation, or availing the surrounding forest areas. @en
jest zdefiniowany przez literał: Osada leśna jest to niewielka osada położona w obrębie lub na skraju obszaru leśnego, zamieszkała przez ludność związaną z administrowaniem, eksploatacją lub wykorzystywaniem otaczających obszarów leśnych.

osada miejska
creator: Marek Słoń
type: Class
type: NamedIndividual
comment: Osada miejska to miejscowość.
comment: Termin był stosowany dla oznaczenia ośrodków, które utraciły prawa miejskie po powstaniu styczniowym. Osada miejska mogła być stosowana także sensie szerszym, obejmującym wszystkie jednostki osadnicze o charakterze miejskim, np. duże miasto, przedmieścia itp.
comment: This notion was used to mark localites that lost their city rights after the "January Uprising". The urban settlement could also be used in a broader sense, encompassing all settlement units of urban character, e.g. a big city, suburbs, etc. @en
comment: Urban settlement is a locality. @en
label: urban settlement @en
subclass of: osada
subclass of: Restriction
  has value: funkcja mieszkalna
  on property: ma funkcję właściwą
subclass of: Restriction
  on property: hasPredecessorEntityManifestation
  some values from: miasto
hidden label: miasteczko
weryfikacja tłumaczenia deskrypcji przez: Paulina Wacławik
deskrypcja została ontologicznie zweryfikowana przez: Piotr Kulicki
deskrypcja została przetłumaczona przez: Tomasz Panecki
jest zdefiniowany przez literał: Osada miejska to miejscowość posiadająca wcześniej prawa miejskie i aktualnie ich pozbawiona.
jest zdefiniowany przez literał: Urban settlement is a locality which used to have city rights, but currently without them. @en
zobacz też IRI: Urban-type settlement
zobacz też IRI: Q18432972
zobacz też IRI: Q2989457
zobacz też tekst: t. 20. s.47: od 1867 nazwa „osada miejska” jest używana dla niewielkich osiedli pozbawionych praw miejskich, które nie są wsiami.

osada młyńska
creator: Wiesław Ostrowski
type: Class
type: NamedIndividual
comment: Mill settlement often emereged as a separete locality, which might later be combined with another locality or become a part of it. @en
comment: Osada młyńska powstawała często jako odrębna miejscowość, później łączyła się niekiedy z inną osadą lub była włączana do innej miejscowości.
label: mill settlement @en
subclass of: osada
subclass of: Restriction
  has value: funkcja przemysłowa
  on property: ma funkcję właściwą
hidden label: conlocationen @la
hidden label: der Ortschaft @de
hidden label: der Siedlung @de
hidden label: die Ansiedlung @de
hidden label: die Kolonie @de
hidden label: kolonia
hidden label: miasteczko
hidden label: miejscowość
hidden label: osiedle
hidden label: sadyba
hidden label: settlement @en
hidden label: zagroda włościańska
weryfikacja tłumaczenia deskrypcji przez: Paulina Wacławik
deskrypcja została ontologicznie zweryfikowana przez: Piotr Kulicki
deskrypcja została przetłumaczona przez: Tomasz Panecki
jest zdefiniowany przez literał: Mill settlement is a settlement in which a main role is played by a mill, most often a watermill, but it also might be a windmill or wind turbine. @en
jest zdefiniowany przez literał: Osada młyńska jest to osada, w której główną rolę pełni młyn, najczęściej młyn wodny, ale może to być też również wiatrak lub turbina wiatrowa.

plebania
creator: Bogumił Szady
type: Class
type: NamedIndividual
comment: In each analysed case, a rectory being a separate settlement, lays in a vicinity of a village, or a town/city with the same name. In cartographical sources, one can find it presented separately, with its proper name, an abbreviation of a category (i.e. pol “pleb.”, which is “rect.”), and distinguished by its morphology. A rectory differs slightly from the house of a provost, but we leave this difference aside. @en
comment: We wszystkich analizowanych przypadkach jeżeli plebania jest odrębną miejscowością, to znajduje się w pobliżu wsi, miasta lub osady o tej samej nazwie. W ujęciu kartograficznym wyodrębniona przez nazwę własną, skrót kategorii (np. pleb.) oraz morfologicznie. Plebania różni się nieco od probostwa, gdyż pleban nie jest tożsamy z proboszczem, ale różnicę tę pomijamy.
label: rectory @en
subclass of: dedykowana miejscowość
subclass of: właściwa miejscowość
subclass of: (mereologicznie) prosta miejscowość
subclass of: Restriction
  on property: est composée de
  some values from: plebania - obiekt
subclass of: Restriction
  has value: funkcja mieszkalna
  on property: ma funkcję właściwą
hidden label: curionatus @la
hidden label: curionis domus @la
hidden label: curionium @la
hidden label: die Pfarre @de
hidden label: die Pfarrwohnung @de
hidden label: dom plebański
hidden label: parafia
hidden label: parochia @la
hidden label: pastorówka
hidden label: plebanatus @la
hidden label: popówka
hidden label: probostwo
hidden label: wikariatka
weryfikacja tłumaczenia deskrypcji przez: Paulina Wacławik
deskrypcja została ontologicznie zweryfikowana przez: Piotr Kulicki
deskrypcja została przetłumaczona przez: Wiesława Duży
jest zdefiniowany przez literał: Plebania jest to miejscowość, w której główną rolę pełni plebania jako obiekt sakralny.
jest zdefiniowany przez literał: Rectory is a locality, where the main role is played by a rectory, a home of a provost, as a sacral object. @en

przedmieście
creator: Marek Słoń
type: Class
type: NamedIndividual
comment: Przedmieście z zasady jest częścią miejscowości: miasta. W miastach obwarowanych obrębem miasta była linia fortyfikacji, szczególnie murów. Przedmieście mogło mieć różny stopień odrębności prawnej względem miasta. Jest fenomenem charakterystycznym raczej dla epoki przedprzemysłowej. Większość przedmieść, szczególnie od schyłku XVIII w., była wcielana prawnie i następnie funkcjonalnie i morfologicznie do miasta; nazwa zazwyczaj zanikała lub nabierała innego znaczenia. Należy odróżnić od przedmieścia osady przedmiejskie, które były w znacznym stopniu niezależne od miasta właściwego lub wręcz sprawowały funkcje centralne względem niego, np. ze względu na siedzibę władz. Taka sytuacja była częsta w okresie lokacyjnym w przypadku większych ośrodków (gród książęcy i katedra poza gminą lokacyjną).
comment: Suburb is always (ex definitione) a part of a locality (city, town). In the fortified cities, the area of the core city was limted by the fortifications, especially by the walls. The suburb could have a different degree of legal separation from the city. It is an entity typical rather for the pre-industrial era. Most of the suburbs, especially from the end of the 18th c., were incorporated legally and then functionally as well as morphologically into the city. The particular name of the suburb usually disappeared or obtained a different meaning. It is necessary to distinguish suburbs from the suburban settlements which were largely independent of the neighboring city or even held central functions to it, e.g. due to the location of the seats of the authorities. Such a situation was common during the first stages of cities establishment, especially for larger centers (prince's stronghold and the cathedral outside the main municipality). @en
label: Vorstadt @de
label: suburb @en
label: suburbium @la
subclass of: ogólnie dostępna miejscowość
subclass of: właściwa miejscowość
subclass of: (mereologicznie) niesamodzielna miejscowość
subclass of: Restriction
  on property: bildet Teil von
  some values from: miasto
hidden label: osada podmiejska
hidden label: osada przedmiejska
hidden label: wieś podmiejska
weryfikacja tłumaczenia deskrypcji przez: Paulina Wacławik
deskrypcja została ontologicznie zweryfikowana przez: Piotr Kulicki
deskrypcja została przetłumaczona przez: Tomasz Panecki
jest zdefiniowany przez literał: Przedmieście to peryferyjna część miasta, tj. położona poza obrębem miasta właściwego (lokacyjnego), wyodrębniona przestrzennie lub morfologicznie i z własną nazwą, wobec której miasto pełni funkcje centralne.
jest zdefiniowany przez literał: Suburb is a peripheral part of the city, towards which the city performs central functions. A suburb is located outside its initial location city; distinguished spatially or morphologically and with its own (proper) name. @en
zobacz też IRI: Suburb
zobacz też tekst: Obszar wokół miasta, w ówczesnej Polsce i Europie uzależniony od niego prawnie i gospodarczo
zobacz też tekst: osada, teren, posiadłość poza obrębem murów miejskich
zobacz też tekst: peryferyjna dzielnica miasta

przysiółek
creator: Tomasz Związek
type: Class
type: NamedIndividual
label: hamlet @en
subclass of: ogólnie dostępna miejscowość
subclass of: właściwa miejscowość
subclass of: (mereologicznie) niesamodzielna miejscowość
alternative label: mała wioska (pl), niesamodzielna osada (pl), skupisko gospodarstw (pl)
hidden label: Colonie @de
hidden label: Dorf @de
hidden label: Unsiedlung @de
hidden label: kolonia
hidden label: osada
hidden label: predium @la
hidden label: przeszolek
hidden label: siadło
hidden label: siedlisko
hidden label: siedziba
hidden label: wieś
hidden label: wioska
weryfikacja tłumaczenia deskrypcji przez: Paulina Wacławik
deskrypcja została ontologicznie zweryfikowana przez: Piotr Kulicki
deskrypcja została przetłumaczona przez: Tomasz Panecki
jest zdefiniowany przez literał: Hamlet (pol "przysiółek") is a small group of buildings belonging to another locality, located on its land, in a remote part, and legally associated with it. @en
jest zdefiniowany przez literał: Przysiółek to mała grupa zabudowań, należących do innej miejscowości, położona na jej gruntach, w oddaleniu od niej i prawnie z nią związana.
zobacz też IRI: Hamlet

przystanek kolejowy
creator: Tomasz Panecki
type: Class
type: NamedIndividual
comment: Included as locality type in Bystrzycki's register in the abbreviation list (pol "kol."; "prz. k.");included on topographic maps marked with the explanatory abbreviation (pol "p."; ger "hp.");included in DBTO10k in the "objects related to communication" feature class (OIKM). @en
comment: Występuje jako rodzaj miejscowości u Bystrzyckiego w spisie (prz. kol.; prz.. k.); na mapach jako „p.” – przystanek lub „hp.” (ger Haltepunkt). W BDOT10k w klasie obiekt związany z komunikacją.
comment: dworzec kolejowy
label: train stop @en
subclass of: ogólnie dostępna miejscowość
subclass of: miejsce transportu
subclass of: (mereologicznie) prosta miejscowość
subclass of: Restriction
  has value: S.RSTP
  on property: featureCode
subclass of: Restriction
  on property: est composée de
  some values from: przystanek kolejowy - obiekt
subclass of: Restriction
  has value: funkcja gospodarcza
  on property: ma funkcję właściwą
alternative label: Haltepunkt (de)
hidden label: Stacja kolejowa
weryfikacja tłumaczenia deskrypcji przez: Paulina Wacławik
deskrypcja została ontologicznie zweryfikowana przez: Piotr Kulicki
deskrypcja została przetłumaczona przez: Tomasz Panecki
jest zdefiniowany przez literał: Przystanek kolejowy (miejscowość) jest to osada, w której główną rolę odgrywa przystanek kolejowy (obiekt).
jest zdefiniowany przez literał: Train stop (locality) is a settlement where the main role is played by a train stop (object). @en

pustkowie
type: Class
subclass of: była miejscowość
jest zdefiniowany przez literał: abandoned place @en
zobacz też IRI: http://gov.genealogy.net/types.owl#90

smolarnia
creator: Bogumił Szady
type: Class
type: NamedIndividual
comment: If residential buildings were erected around the tar pitch, it could be a kind of a separate forest settlement. The boundary between a tar pitch as an economic facility and a kind of forest settlement was blurry. It dependended on the seasonality and permanence of habitation. @en
comment: Jeżeli wokół smolarni utrwaliła się zabudowa mieszkalna to smolarnia mogła stanowić rodzaj odrębnej osady leśnej. Granica między smolarnią jako obiektem gospodarczym a smolarnią jako rodzajem osady leśnej była płynna. Była uzależniona od sezonowości i stałości zamieszkiwania.
label: tar pitch @en
subclass of: miejsce produkcji
subclass of: (mereologicznie) prosta miejscowość
subclass of: osada
subclass of: Restriction
  on property: est composée de
  some values from: smolarnia - obiekt
subclass of: Restriction
  has value: funkcja gospodarcza - gospodarka leśna
  on property: ma funkcję właściwą
alternative label: der Teerofen (de), smolanoi zawod (ru)
hidden label: dziegciarnia
hidden label: huta
hidden label: osada leśna
hidden label: terpentyniarnia
weryfikacja tłumaczenia deskrypcji przez: Paulina Wacławik
deskrypcja została ontologicznie zweryfikowana przez: Piotr Kulicki
deskrypcja została przetłumaczona przez: Tomasz Panecki
jest zdefiniowany przez literał: Smolarnia (miejscowość) jest to osada, w której główną rolę pełni smolarnia jako obiekt gospodarczy.
jest zdefiniowany przez literał: Tar pitch (locality) is a settlement where the main role is played by a tar pitch (industrial facility). @en

stacja kolejowa
creator: Tomasz Panecki
type: Class
type: NamedIndividual
comment: Included as locality type in Bystrzycki's register in the abbreviation list (pl. "st. kol."; "st. k.");included on topographic maps marked with the explanatory abbreviation (pl. "St." or "St. tow." [freight station], ger "H.st." [Haltestation]);included in DBTO10k in the "communication complex" feature class (KUKO). @en
comment: Stacja kolejowa występuje jako rodzaj miejscowości u Bystrzyckiego w spisie (st. kol.; st. k.); na mapach oznaczana skrótem objaśniającym „St.” lub „St. tow.” (stacja towarowa), „H.st.” (ger Haltestation);w BDOT10k w klasie kompleks komunikacyjny.
label: railway station @en
subclass of: ogólnie dostępna miejscowość
subclass of: miejsce transportu
subclass of: Restriction
  on property: est composée de
  some values from: stacja kolejowa - obiekt
subclass of: Restriction
  has value: funkcja gospodarcza
  on property: ma funkcję właściwą
subclass of: Restriction
  has value: S.RSTN
  on property: featureCode
alternative label: Haltestation (de)
hidden label: dworzec kolejowy
hidden label: przystanek kolejowy
weryfikacja tłumaczenia deskrypcji przez: Paulina Wacławik
deskrypcja została ontologicznie zweryfikowana przez: Piotr Kulicki
deskrypcja została przetłumaczona przez: Tomasz Panecki
jest zdefiniowany przez literał: Railway station (locality) is a settlement where the main role is played by a railway station (object). @en
jest zdefiniowany przez literał: Stacja kolejowa (miejscowość) jest to osada, w której główną rolę odgrywa stacja kolejowa (obiekt).
zobacz też IRI: RailwayStation
zobacz też IRI: http://gov.genealogy.net/types.owl#119
zobacz też IRI: TrainStation

tartak
creator: Bogumił Szady
type: Class
type: NamedIndividual
comment: If residential buildings emerged around a sawmill, then it could be a kind of a separate forest settlement or a mill settlement. The distinction between the sawmill as an industrial facility and the sawmill as a kind of locality was blurry. It depended on the seasonality or permanence of habitation. @en
comment: Jeżeli wokół tartaku utrwaliła się zabudowa mieszkalna to tartak mógł stanowić rodzaj odrębnej osady leśnej lub osady młyńskiej. Granica między tartakiem jako obiektem gospodarczym a tartakiem jako rodzajem osady była płynna. Była uzależniona od sezonowości i stałości zamieszkiwania.
comment: piła
label: sawmill @en
subclass of: miejsce produkcji
subclass of: (mereologicznie) prosta miejscowość
subclass of: Restriction
  has value: funkcja gospodarcza
  on property: ma funkcję właściwą
subclass of: Restriction
  on property: est composée de
  some values from: tartak - obiekt
subclass of: Restriction
  has value: S.MLSW
  on property: featureCode
alternative label: das Sägewerk @de
alternative label: лесопильный завод @ru
hidden label: die Säge @de
hidden label: młyn
hidden label: osada leśna
hidden label: osada młyńska
weryfikacja tłumaczenia deskrypcji przez: Paulina Wacławik
deskrypcja została ontologicznie zweryfikowana przez: Piotr Kulicki
deskrypcja została przetłumaczona przez: Tomasz Panecki
jest zdefiniowany przez literał: Sawmill (locality) is a locality where the main role is played by a sawmill (facility). @en
jest zdefiniowany przez literał: Tartak (miejscowość) to miejscowość, w której główną rolę odgrywa tartak (obiekt).

torfiarnia
creator: Bogumił Szady
type: Class
type: NamedIndividual
comment: If residential buildings emerged around a peat mine, then it could be a kind of a separate mine settlement or an industrial settlement. The distinction between the peat mine as an industrial facility and the peat mine as a kind of locality was blurry. It depended on the seasonality or permanence of habitation. @en
comment: Jeżeli wokół torfiarni utrwaliła się zabudowa mieszkalna to torfiarnia mogła stanowić rodzaj odrębnej osady górniczej lub osady fabrycznej. Granica między torfiarnią jako obiektem gospodarczym a torfiarnią jako rodzajem osady była płynna. Była uzależniona od sezonowości i stałości zamieszkiwania.
label: peat mine @en
subclass of: miejsce produkcji
subclass of: (mereologicznie) prosta miejscowość
subclass of: Restriction
  has value: funkcja gospodarcza
  on property: ma funkcję właściwą
subclass of: Restriction
  on property: est composée de
  some values from: torfiarnia - obiekt
hidden label: torfowisko
weryfikacja tłumaczenia deskrypcji przez: Paulina Wacławik
deskrypcja została ontologicznie zweryfikowana przez: Piotr Kulicki
deskrypcja została przetłumaczona przez: Tomasz Panecki
jest zdefiniowany przez literał: Peat mine (locality) is a locality where the main role is played by a peat mine (facility). @en
jest zdefiniowany przez literał: Torfiarnia (miejscowość) jest to miejscowość, w której główną rolę odgrywa torfiarnia (obiekt).

twierdza
creator: Marek Słoń
type: Class
type: NamedIndividual
comment: A fortress might be a separate settlement unit or a building inside a superior unit. @en
comment: Twierdza mogła być samodzielną jednostką osadniczą lub obiektem w obrębie większej jednostki.
label: fortress @en
subclass of: właściwa miejscowość
subclass of: Restriction
  has value: funkcja obronna
  on property: ma funkcję właściwą
subclass of: Restriction
  has value: S.FT
  on property: featureCode
alternative label: forteca (pl)
hidden label: fortyfikacje
hidden label: gród
hidden label: umocnienia
hidden label: zamek
weryfikacja tłumaczenia deskrypcji przez: Paulina Wacławik
deskrypcja została ontologicznie zweryfikowana przez: Piotr Kulicki
deskrypcja została przetłumaczona przez: Wiesława Duży
jest zdefiniowany przez literał: Fortress is a locality for which a defensive function is dominant. @en
jest zdefiniowany przez literał: Miejscowość, dla której dominująca jest funkcja obronna.
zobacz też IRI: Fortress

uzdrowisko
creator: Tomasz Panecki
type: Class
type: NamedIndividual
comment: Functional distinctivness - clearly defined function, a locality connected with the service of bathers/visitors; it seems this is not the most important criterion of defining a type of locality (e.g. Ciechocinek in Bystrzycki's register is a city, not a spa). Morphological distinctiness - loose built-up area (spa-type), mostly in the woods (e.g. Czarniecka Góra, Miłowody); Nałęczów in Bystrzycki's register is also referred to as a health resort, and is characterized as densely built-up area (see: MGI maps). Spatial distinctiveness - clear, as far as Czarniecka Góra and Miłowody (spas located among the forest) are concerned. @en
comment: Included as a kind of locality in Bystrzycki's register in the abbreviations as "spa" (pol "uzdrow.").Included on MGI maps where spas are annotated in the same manner as localites (e.g. Czarniecka Góra, Nałęczów) or buildings/field objects (Miłowody); there is no distinct symbol/abbreviation explained in maps' key to symbols (legends). @en
comment: Odrębność funkcjonalna – jasno zdefiniowana funkcja, miejscowość związana z obsługa kuracjuszy; wydaje się, że nie jest to najistotniejsze kryterium (np. Ciechocinek u Bystrzyckiego jest miastem, a nie uzdrowiskiem). Odrębność morfologiczna – luźna zabudowa (uzdrowiskowa), najczęściej pośród lasu (Czarniecka Góra, Miłowody); Nałęczów u Bystrzyckiego również jest określany jako uzdrowisko, a cechuje się zabudową zwartą (patrz: mapy WIG). Odrębność przestrzenna – wyraźna w przy Czarnieckiej Górze i Miłowodach (uzdrowiska położone pośród lasu).
comment: Występuje jako rodzaj miejscowości u Bystrzyckiego w spisie (uzdrow.).Na mapach WIG oznaczane krojem pisma charakterystycznym dla miejscowości (Czarniecka Góra, Nałęczów) lub budynków/obiektów terenowych (Miłowody); brak odrębnej sygnatury/skrótu objaśniające w legendach.
label: spa @en
subclass of: właściwa miejscowość
subclass of: Restriction
  has value: S.SPA
  on property: featureCode
subclass of: Restriction
  has value: funkcja obsługi kuracjuszy
  on property: ma funkcję właściwą
alternative label: spa town @en
hidden label: lecznica
hidden label: letnisko
hidden label: sanatorium
weryfikacja tłumaczenia deskrypcji przez: Paulina Wacławik
deskrypcja została ontologicznie zweryfikowana przez: Piotr Kulicki
deskrypcja została przetłumaczona przez: Tomasz Panecki
deskrypcja została przetłumaczona przez: Wiesława Duży
jest zdefiniowany przez literał: A spa is a locality, where climate enhances treatment, and a main function of which is to serve bathers and visitors. @en
jest zdefiniowany przez literał: Uzdrowisko jest miejscowością, w której warunki klimatyczne sprzyjają leczeniu chorób i której główną funkcją jest obsługa kuracjuszy
zobacz też IRI: Spa town
zobacz też IRI: Q4946461
zobacz też IRI: Q6882870
zobacz też tekst: miejscowość, która ze względu na warunki klimatyczne, źródła lecznicze, pokłady borowiny, itp. sprzyja leczeniu chorób i służy jako ośrodek leczniczy i wypoczynkowy
zobacz też tekst: t. 7, s. 424 – zakład leczniczy, lecznisko, leczysko, sanatorium

uroczysko
creator: Bogumił Szady
type: Class
type: NamedIndividual
comment: Forest distrct as it had a separate name and was spatially distinct, it could have been a locality (inhabited forest district) or a settlement unit (uninhabited, deserted forest district). This second category was dominant. As an inhabited forest district (next to the village, town, farm, etc.), it is mentioned in the registers concerning the eastern provinces of the former Polish-Lithuanian Commonwealth. The number of residents usually did not exceed a dozen or so people. Currently, a forest district is a type of physiographic object in the "Other physiographic object" class of objects in the State Register of Geographical Names. The basic criterion of distinguishing forest district from other localities or settlement units from the perspective of its functionality is its relation to the organization of forestry or agricultural production. Individual parts of forest or agricultural areas for a better understanding of space received their own names. It also did not exclude the forest settlement form the process of settling and thus the transformation to the kind of locality. The morphological distinctiveness of forest districts due to the nature of natural boundaries (swamps, glades, etc.) is fuzzy. From the legal point of view, the status of the forest district is rather unclear because this term was also used in relation to various types of forest settlements or parts of forests such as "bór" or "ostęp". @en
comment: Uroczysko, ponieważ posiadało odrębną nazwę i było wydzielone przestrzennie, mogło być miejscowością (uroczysko zamieszkane) lub jednostką osadniczą (uroczysko niezamieszkane, uroczysko opuszczone). Ta druga kategoria była dominująca. Jako kategoria miejscowości (obok wsi, miasta, folwarku etc.) wymieniane jest w rejestrach dotyczących wschodnich województw dawnej Rzeczypospolitej. Liczba mieszkańców nie przekraczała zazwyczaj kilkunastu osób. Obecnie uroczysko jest rodzajem obiektu fizjograficznego w klasie obiektów "Inny obiekt fizjograficzny" w Państwowym Rejestrze Nazw Geograficznych. Podstawowym kryterium wyodrębniającym uroczysko od innych miejscowości lub jednostek osadniczych w aspekcie funkcjonalnym jest jego związek z organizacją produkcji leśnej lub rolniczej. Poszczególne części obszarów leśnych lub rolnych dla lepszej orientacji w przestrzeni otrzymywały swoje nazwy własne. Nie wykluczało to też procesu osiedlania się a tym samym przekształcania uroczyska w rodzaj miejscowości. Odrębność morfologiczna uroczysk ze względu na charakter granic naturalnych (bagna, polany etc.) jest rozmyta. Od strony prawnej status uroczyska jest dość niejasny, gdyż termin ten był używany także w odniesieniu do różnego typu osad leśnych lub części lasów takich jak bory czy ostępy.
label: forest district @en
subclass of: była miejscowość
subclass of: Restriction
  has value: funkcja gospodarcza
  on property: ma funkcję właściwą
alternative label: урочище @ru
hidden label: bór
hidden label: leśniczówka
hidden label: osada leśna
hidden label: ostęp
hidden label: strażnica leśna
hidden label: łąka
weryfikacja tłumaczenia deskrypcji przez: Paulina Wacławik
deskrypcja została ontologicznie zweryfikowana przez: Piotr Kulicki
deskrypcja została przetłumaczona przez: Tomasz Panecki
jest zdefiniowany przez literał: Forest distrct is a part of a forest, meadow or swampy area separated by natural borders and an own (proper) name for better organization of social and economic life. Built-up and inhabited forest district used to be a locality. @en
jest zdefiniowany przez literał: Uroczysko to obszar leśny, łąkowy lub bagnisty wyodrębniony naturalnymi granicami oraz nazwą własną w celu lepszej organizacji życia społecznego i gospodarczego. Uroczysko zabudowane i zamieszkane było miejscowością.
zobacz też IRI: http://vocab.getty.edu/aat/300379281
zobacz też IRI: uroczysko
zobacz też IRI: uroczysko-dawnaMiejsc
zobacz też IRI: Q1434274
zobacz też tekst: 1. teren trudno dostępny, najczęściej bagnisty, leśny; też: miejsce odludne, 2. część terenu otoczona naturalnymi granicami, wyodrębniona za pomocą nazwy topograficznej, 3. u dawnych Słowian: miejsce w głębi puszczy związane z kultem bóstwa, odbywaniem narad lub uważane za siedzibę złych duchów
zobacz też tekst: s. 57-80: uroczyska to cała gama pojęć, stale łąki i lokacje straży leśnej, czasem synonimy borów i ostępów, zjawiska terenowe zasadniczo rozległe o wielce zróżniczkowanej, a raczej nieuchwytnej i zatraconej już, treści. Można tylko utrzymywać, że uroczyska to teren eksploatacji par excellence.
zobacz też tekst: t. 15, s. 34: nazwa kopca lub miejsca granicznego nieosiedlonego. Według Chodakowskiego, uroczyska, na Rusi horodyszczami zwane, były to w Słowiańszczyźnie przedchrześcijańskiej place, czyli świątyń posady, do sprawowania uroczystych pogańskich ofiar przeznaczone i nie mające śladu opisania wałami, byleby oddzielna, właściwe imię mająca, przywiązana do nich była jakaś pamiątka.
zobacz też tekst: t. 6, s. 80: uroczysko, uroczyszcze -- (Rs. urocziszcze, = powiat, kraina); kopiec, mieysce graniczne. Tr. Gränzstein, Mohlhausen.
zobacz też tekst: t. 7, s. 348: 1. starożytny , z czasów pogańskich nasyp ziemny w postaci mogiły a. okopu, kopiec, kurhan; miejsce graniczne. Troc. 2. miejsce odludne, tajemnicze – 3. miejscowość nie zamieszkana, nosząca jakie oddzielne charakterystyczne miano – 4. pewna część gruntu a. gruntów kilku posiadaczy w jednym miejscu, nosząca pewną nazwę – 5. miejsce w polu, składające się z gruntu i łąk, dawniej zarosłe lasem. 6. bart. okręg bartniczy --, 7. leśn. część lasu, oddzielona od innych części naturalnymi granicami, jako oto: wzgórzami, strumykami, łąkami, drogami i.t.p. albo też różniąca się drzewostanem
zobacz też tekst: t. 9, s. 431: 1. miedza graniczna, granica, limes agrorum, finis -- 2. teren poza granicą posiadłości, ale do niej przynależny, z własnymi granicami naturalnymi, locus extra fines praedii situs, sed ad id praedium pertinens, proprios fines naturales habens.
zobacz też tekst: u dawnych Słowian: miejsce przed świątynią lub w głębi puszczy, związane z kultem jakiegoś bóstwa, z odbywaniem narad, sądów; ogólnie: miejsce odludne, tajemnicze; pustkowie -- 2. część terenu (zwykle lasu wyodrębniona za pomocą nazwy o charakterze topograficznym.

więzienie
type: Class
label: prison @en
subclass of: dedykowana miejscowość
subclass of: właściwa miejscowość
subclass of: Restriction
  has value: S.PRN
  on property: featureCode
zobacz też IRI: Prison

zaścianek
creator: Tomasz Związek
type: Class
type: NamedIndividual
comment: "Zaścianek" is typical mostly for Mazovia, Podlachia and areas of the former Grand Duchy of Lithuania. @en
comment: Zaścianki są najbardziej charakterystyczne dla Mazowsza, Podlasia i obszarów dawnego Wielkiego Księstwa Litewskiego.
label: "zaścianek" @en
subclass of: ogólnie dostępna miejscowość
subclass of: (mereologicznie) prosta miejscowość
subclass of: Restriction
  has value: funkcja rolnicza
  on property: ma funkcję właściwą
alternative label: okolica
alternative label: zagroda
hidden label: obszar
hidden label: osada
hidden label: przysiółek
hidden label: wieś
weryfikacja tłumaczenia deskrypcji przez: Paulina Wacławik
deskrypcja została ontologicznie zweryfikowana przez: Piotr Kulicki
deskrypcja została przetłumaczona przez: Tomasz Panecki
jest zdefiniowany przez literał: "Zaścianek" is an agricultural locality inhabited by the poor nobility who cultivate their land on their own. @en
jest zdefiniowany przez literał: Zaścianek to miejscowość o charakterze rolniczym zamieszkała przez drobną szlachtę samodzielnie uprawiającą posiadaną ziemię.

dzielnica
type: Class
label: district @en
subclass of: ogólnie dostępna miejscowość
subclass of: właściwa miejscowość
subclass of: (mereologicznie) niesamodzielna miejscowość
zobacz też IRI: CityDistrict
zobacz też IRI: Subdivision

część kolonii
creator: Wiesław Ostrowski
creator: Izabela Karsznia
type: Class
type: NamedIndividual
comment: Część kolonii jest odrębną jednostką osadniczą, rodzajem miejscowości, zawsze ma swoją nazwę własną. Części kolonii występują najczęściej w woj. lubelskim, łódzkim i pomorskim. W sumie jest ich w Polsce 281.
comment: Part of a colony is a separate settlement unit, a kind of locality, always has a particular name. Parts of colonies occur most often in Lubelskie, Łódzkie, and Pomorskie voivodships. In total, there are 281 parts of colonies in Poland. @en
label: part of a colony @en
subclass of: ogólnie dostępna miejscowość
subclass of: właściwa miejscowość
subclass of: (mereologicznie) niesamodzielna miejscowość
equivalent class: Class
  intersection of: (mereologicznie) niesamodzielna miejscowość
  intersection of: Restriction
    on property: jednostka osadnicza jest częścią
    some values from: kolonia
weryfikacja tłumaczenia deskrypcji przez: Paulina Wacławik
deskrypcja została ontologicznie zweryfikowana przez: Piotr Kulicki
deskrypcja została przetłumaczona przez: Tomasz Panecki
jest zdefiniowany przez literał: Część kolonii to miejscowość stanowiąca integralną część miejscowości podstawowej kolonii, jest wydzielona administracyjnie, ale należy do jednostki nadrzędnej.
jest zdefiniowany przez literał: Part of a colony is an integral part of the main locality a colony; it is administratively separated, but belongs to the superior unit. @en

część miasta
creator: Wiesław Ostrowski
creator: Izabela Karsznia
type: Class
type: NamedIndividual
comment: Część miasta jest odrębną jednostką osadniczą, rodzajem miejscowości, zawsze ma swoją nazwę własną. W sumie jest ich w Polsce 10425. Są to części miejscowości skupiające się często wokół większych miejscowości w całej Polsce, większe skupiska części miejscowości są m. in. w woj. śląskim, mazowieckim, małopolskim, wielkopolskim, pomorskim.
comment: Part of a city is a separate settlement unit, a kind of locality, it always has a particular name. There are 10425 of these units in Poland at the moment. These are mostly parts of localities converging upon bigger localities around Poland. Large clusters of these units are located i.e. in Śląskie, Mazowieckie, Małopolskie, Wielkopolskie, and Pomorskie voivodeships. @en
label: part of a city @en
subclass of: ogólnie dostępna miejscowość
subclass of: właściwa miejscowość
subclass of: (mereologicznie) niesamodzielna miejscowość
subclass of: Restriction
  has value: funkcja mieszkalna
  on property: ma funkcję właściwą
equivalent class: Class
  intersection of: (mereologicznie) niesamodzielna miejscowość
  intersection of: Restriction
    on property: jednostka osadnicza jest częścią
    some values from: miasto
hidden label: Stadt @de
hidden label: city @en
hidden label: gorod @ru
hidden label: gród
hidden label: metropolia
hidden label: miasteczko
hidden label: miejscowość
hidden label: mieścina
hidden label: town @en
hidden label: urbs @la
weryfikacja tłumaczenia deskrypcji przez: Paulina Wacławik
deskrypcja została ontologicznie zweryfikowana przez: Piotr Kulicki
deskrypcja została przetłumaczona przez: Wiesława Duży
jest zdefiniowany przez literał: Część miasta to miejscowość stanowiąca integralną część miejscowości podstawowej miasta, jest wydzielona administracyjnie, ale należy do jednostki nadrzędnej.
jest zdefiniowany przez literał: Part of a city is an integral part of the main locality a city (or a town); it is administratively separated, but belongs to the superior unit. @en

część osady
creator: Wiesław Ostrowski
creator: Izabela Karsznia
type: Class
type: NamedIndividual
comment: Część osady jest odrębną jednostką osadniczą, rodzajem miejscowości, zawsze ma swoją nazwę własną. Części osady występują w większości na Pomorzu. W sumie jest ich w Polsce 76.
comment: Part of a settlement is a separate settlement unit, a kind of locality, it always has a particular name. Parts of settlements occur mostly in Pomorze. In total, there are 76 parts of settlements in Poland. @en
label: part of a settlement @en
subclass of: ogólnie dostępna miejscowość
subclass of: właściwa miejscowość
subclass of: (mereologicznie) niesamodzielna miejscowość
subclass of: Restriction
  has value: funkcja mieszkalna
  on property: ma funkcję właściwą
equivalent class: Class
  intersection of: (mereologicznie) niesamodzielna miejscowość
  intersection of: Restriction
    on property: jednostka osadnicza jest częścią
    some values from: osada
hidden label: conlocationen @la
hidden label: der Ortschaft @de
hidden label: der Siedlung @de
hidden label: die Ansiedlung @de
hidden label: die Kolonie @de
hidden label: kolonia
hidden label: miasteczko
hidden label: miejscowość
hidden label: osiedle
hidden label: sadyba
hidden label: settlement @en
hidden label: zagroda włościańska
weryfikacja tłumaczenia deskrypcji przez: Paulina Wacławik
deskrypcja została ontologicznie zweryfikowana przez: Piotr Kulicki
deskrypcja została przetłumaczona przez: Tomasz Panecki
jest zdefiniowany przez literał: Część osady to miejscowość stanowiąca integralną część miejscowości podstawowej osady, jest wydzielona administracyjnie, ale należy do jednostki nadrzędnej.
jest zdefiniowany przez literał: Part of a settlement is an integral part of the main locality a settlement, it is administratively separated, but belongs to the superior unit. @en

część wsi
creator: Wiesław Ostrowski
creator: Izabela Karsznia
type: Class
type: NamedIndividual
comment: A part of a village is a separate settlement unit, a kind of locality, and always has its own (individual) name. There are 41942 parts of villages around the whole Poland at the moment. @en
comment: Część wsi jest odrębną jednostką osadniczą, rodzajem miejscowości, zawsze ma swoją nazwę własną. Części wsi występują w całej Polsce. W sumie jest ich w Polsce 41942.
label: part of a village @en
subclass of: ogólnie dostępna miejscowość
subclass of: właściwa miejscowość
subclass of: (mereologicznie) niesamodzielna miejscowość
subclass of: Restriction
  has value: funkcja rolnicza
  on property: ma funkcję właściwą
equivalent class: Class
  intersection of: (mereologicznie) niesamodzielna miejscowość
  intersection of: Restriction
    on property: jednostka osadnicza jest częścią
    some values from: wieś
hidden label: Dorf @de
hidden label: Land @de
hidden label: country @en
hidden label: derewnia @ru
hidden label: pagus @la
hidden label: seło @ru
hidden label: sioło
hidden label: village @en
hidden label: wioska
weryfikacja tłumaczenia deskrypcji przez: Paulina Wacławik
deskrypcja została ontologicznie zweryfikowana przez: Piotr Kulicki
deskrypcja została przetłumaczona przez: Wiesława Duży
jest zdefiniowany przez literał: A part of a village is a locality being an integral part of the main locality a village; it is administratively separated, but belongs to the superior unit. @en
jest zdefiniowany przez literał: Część wsi to miejscowość stanowiąca integralną część miejscowości podstawowej wsi, jest wydzielona administracyjnie, ale przynależy do jednostki nadrzędnej.
zobacz też IRI: czescWsi
zobacz też IRI: Q41970180

kolonia kolonii
creator: Wiesław Ostrowski
creator: Izabela Karsznia
type: Class
type: NamedIndividual
comment: Colony of a colony is a separate settlement unit, a kind of locality, and always has its particular name. They occur most often in the Lubelskie and Podlaskie voivodships. In total, there are 31 colonies of colony at the moment. @en
comment: Kolonia kolonii jest odrębną jednostką osadniczą, rodzajem miejscowości, zawsze ma swoją nazwę własną. Kolonia kolonii występują w większości w woj. lubelskim i woj. podlaskim. W sumie jest ich obecnie w Polsce 31.
label: colony of a colony @en
subclass of: kolonia
subclass of: (mereologicznie) niesamodzielna miejscowość
subclass of: część kolonii
equivalent class: Class
  intersection of: kolonia
  intersection of: Restriction
    on property: jednostka osadnicza jest częścią
    some values from: kolonia
hidden label: chutor
hidden label: coloniam @la
hidden label: część wsi
hidden label: die Kolonie @de
hidden label: housing estate @en
hidden label: koloniya @ru
hidden label: kolonizacja
hidden label: osiedle
hidden label: przysiółek
hidden label: settlement @en
hidden label: sioło
hidden label: stanica
hidden label: wybudowanie
weryfikacja tłumaczenia deskrypcji przez: Paulina Wacławik
deskrypcja została ontologicznie zweryfikowana przez: Piotr Kulicki
deskrypcja została przetłumaczona przez: Tomasz Panecki
jest zdefiniowany przez literał: Colony of a colony is a colony which is related to a colony. @en
jest zdefiniowany przez literał: Kolonia kolonii to kolonia zależna od kolonii.

kolonia osady
creator: Wiesław Ostrowski
creator: Izabela Karsznia
type: Class
type: NamedIndividual
comment: A built-up area located away from previously existing buildings (locality) to which it is related. Colony of a settlement is a separate settlement unit, a kind of locality, always with its particular name. Colonies of settlements occur mainly in Zachodniopomorskie, Warmińsko-mazurskie and Podlaskie voivodships. In total, there are 17 colonies of settlements in Poland. @en
comment: Obszar zabudowany oddalony od wczesniejszej zabudowy, od której jest zależny. Kolonia osady jest odrębną jednostką osadniczą, rodzajem miejscowości, zawsze ma swoją nazwę własną. Kolonie osady występują w większości w woj. zachodniopomorskim, warmińsko-mazurskim i woj. podlaskim. W sumie jest ich w Polsce 17.
label: colony of a settlement @en
subclass of: kolonia
subclass of: (mereologicznie) niesamodzielna miejscowość
subclass of: osada osady
subclass of: Restriction
  has value: funkcja mieszkalna
  on property: ma funkcję właściwą
equivalent class: Class
  intersection of: kolonia
  intersection of: Restriction
    on property: jednostka osadnicza jest częścią
    some values from: osada
weryfikacja tłumaczenia deskrypcji przez: Paulina Wacławik
deskrypcja została ontologicznie zweryfikowana przez: Piotr Kulicki
deskrypcja została przetłumaczona przez: Tomasz Panecki
jest zdefiniowany przez literał: Colony of a settlement is a colony related to a settlement. @en
jest zdefiniowany przez literał: Kolonia osady to kolonia zależna od osady.
zobacz też IRI: koloniaOsady
zobacz też IRI: Q41970180

kolonia wsi
creator: Wiesław Ostrowski
creator: Izabela Karsznia
type: Class
type: NamedIndividual
comment: Colony of a village is a separate settlement unit, a kind of locality, and always has its particular name. They are spread all over modern Poland and there are 4043 collonies of villages at the moment. @en
comment: Kolonia wsi jest odrębną jednostką osadniczą, rodzajem miejscowości, zawsze ma swoją nazwę własną. Kolonie wsi występują w całej Polsce. W sumie jest ich obecnie w Polsce 4043.
label: colony of a village @en
subclass of: kolonia
subclass of: (mereologicznie) niesamodzielna miejscowość
subclass of: część wsi
subclass of: Restriction
  has value: funkcja rolnicza
  on property: ma funkcję właściwą
equivalent class: Class
  intersection of: kolonia
  intersection of: Restriction
    on property: jednostka osadnicza jest częścią
    some values from: wieś
hidden label: chutor
hidden label: coloniam
hidden label: część wsi
hidden label: die Kolonie @de
hidden label: housing estate @en
hidden label: koloniya @ru
hidden label: kolonizacja
hidden label: osiedle
hidden label: przysiółek
hidden label: settlement @en
hidden label: sioło
hidden label: stanica
hidden label: wybudowanie
weryfikacja tłumaczenia deskrypcji przez: Paulina Wacławik
deskrypcja została ontologicznie zweryfikowana przez: Piotr Kulicki
deskrypcja została przetłumaczona przez: Tomasz Panecki
jest zdefiniowany przez literał: Colony of a village is a colony related to a village. @en
jest zdefiniowany przez literał: Kolonia wsi to kolonia zależna od wsi.

osada kolonii
creator: Wiesław Ostrowski
creator: Izabela Karsznia
type: Class
type: NamedIndividual
comment: Brak oficjalnej definicji w "Ustawie o nazwach urzędowych miejscowości i jednostek fizjograficznych".
comment: No official definition in the "Act on official names of localities and physiographic units". @en
comment: Są cztery takie obiekty w Polsce, wszystkie w woj. lubelskim.
comment: There are 4 such a settlements is contemporary Poland: all in Lubelskie voivodship. @en
label: settlement of a colony @en
subclass of: (mereologicznie) niesamodzielna miejscowość
subclass of: osada
subclass of: część kolonii
subclass of: Restriction
  has value: funkcja mieszkalna
  on property: ma funkcję właściwą
equivalent class: Class
  intersection of: osada
  intersection of: Restriction
    on property: jednostka osadnicza jest częścią
    some values from: kolonia
weryfikacja tłumaczenia deskrypcji przez: Paulina Wacławik
deskrypcja została ontologicznie zweryfikowana przez: Piotr Kulicki
deskrypcja została przetłumaczona przez: Tomasz Panecki
jest zdefiniowany przez literał: Osada kolonii jest to osada stanowiąca integralną część kolonii.
jest zdefiniowany przez literał: Settlement of a colony is a settlement which is an integral part of a colony. @en
zobacz też IRI: osadaKolonii
zobacz też IRI: Q41970180

osada leśna wsi
creator: Wiesław Ostrowski
creator: Izabela Karsznia
type: Class
type: NamedIndividual
comment: Brak oficjalnej definicji w "Ustawie o nazwach urzędowych miejscowości i jednostek fizjograficznych".
comment: No official definition in the "Act on official names of localities and physiographic units". @en
comment: Są 233 takie obiekty w Polsce, świętokrzyskie, północnym lubelskim, północnym lubuskim, Borach Tucholskich.
comment: There are 233 forest settlements of a village in Poland, mainly in Świętokrzyskie northern part of Lubelskie, northern part of Lubuskie voivodships as well as in "Bory Tuchulskie" (Pomorskie voivodship). @en
label: forest settlement of a village @en
subclass of: osada leśna
subclass of: dzielnica
subclass of: Restriction
  has value: funkcja gospodarcza - gospodarka leśna
  on property: ma funkcję właściwą
equivalent class: Class
  intersection of: osada leśna
  intersection of: Restriction
    on property: jednostka osadnicza jest częścią
    some values from: wieś
alternative label: osada przemysłowa (pl)
hidden label: Ansiedlung @de
hidden label: Kolonie @de
hidden label: Ortschaft @de
hidden label: Siedlung @de
hidden label: conlocationen @la
hidden label: kolonia
hidden label: miasteczko
hidden label: miejscowość
hidden label: osiedle
hidden label: sadyba
hidden label: settlement @en
hidden label: zagroda włościańska
weryfikacja tłumaczenia deskrypcji przez: Paulina Wacławik
deskrypcja została ontologicznie zweryfikowana przez: Piotr Kulicki
deskrypcja została przetłumaczona przez: Tomasz Panecki
jest zdefiniowany przez literał: Forest settlement of a village is a forest settlement which is an integral part of a village. @en
jest zdefiniowany przez literał: Osada leśna wsi to osada leśna stanowiąca integralną część wsi.
zobacz też IRI: osadaLesnaWsi
zobacz też IRI: Q41970180
zobacz też tekst: t. 20. s.47: Osady przemysłowe - osiedla dla robotników i rzemieślników zakładane XVIII – XIX w. w związku z dokonującym się procesem uprzemysłowienia, niekiedy zwane osadami fabrycznymi; zwykle osady przemysłowe obejmowały zarówno zakłady przemysłowe jak i związane z nimi kolonie domów mieszkalnych. Na ziemiach polskich powstawały od końca XVIII wieku jako osady prywatne bądź rządowe i stopniowo uzyskiwały prawa miejskie; w drugiej połowie XIX wieku termin „osady przemysłowe” zaczęto używać do wszelkich osiedli rozwijających się wokół zakładów przemysłowych; dzielnice mieszkaniowe, zwane koloniami lub domami fabrycznymi wznoszono w drugiej połowie XIX i w XX wieku przez wielkie zakłady przemysłowe w już istniejących miejscowościach dla robotników i urzędników niższego szczebla, zwykle o niskim standardzie i niewysokich czynszach.

dwór - obiekt
creator: Tomasz Związek
type: Class
type: NamedIndividual
comment: Usually, a manor house was located away from the main group of houses in a village, on the outskirts, or in a vicinity. A manor house is recognised in historiography as identical with a manor (folwark, demesne), however a manor house appears in texts on culture, customs, legal issues, whereas a manor (folwark, demesne) usually corresponds with economic matters. @en
comment: Zazwyczaj dwór położony był poza głównym zbudową wsi, na jej obrzeżach lub w nieznacznym oddaleniu. Pojęcie często tożsame w literaturze z folwarkiem. Z czasem dwór pojawia się w kontekście pisania o życiu, kulturze, obyczajowości, a folwark dotyczy kwestii gospodarczych.
label: manor house @en
subclass of: budynek mieszkalny
alternative label: Hof @de
alternative label: curia @la
alternative label: dworzecz (określenie staropolskie)
alternative label: двор @ru
hidden label: Gutshof @de
hidden label: Herrenhof @de
hidden label: aula @la
hidden label: curiaculum @la
hidden label: czwierdza (określenie staropolskie)
hidden label: mons seu fortalicium @la
hidden label: rezydencja
hidden label: господский двор @ru
hidden label: усадьба @ru
preferred label: dwór
weryfikacja tłumaczenia deskrypcji przez: Paulina Wacławik
deskrypcja została ontologicznie zweryfikowana przez: Piotr Kulicki
deskrypcja została przetłumaczona przez: Wiesława Duży
jest zdefiniowany przez literał: A manor (a notion with a multiple meaning) is a home or a temporary house of a land lord and the managment of different clusters of estates, including a house and a farmstead ( a manor). In High and Late Middle Ages it could be a defensive tower (conical gord or a manor built on a mound) or a castle. Most of these, however, were one-floor homes (i.e. nobleman manor), which later (in 16th-20th century) evolved into palaces. @en
jest zdefiniowany przez literał: Dwór (pojęcie wieloznaczne) jest to siedziba lub miejsce okresowego pobytu pana gruntowego oraz zarządu poszczególnych kluczy dóbr, składająca się z domu oraz zabudowań gospodarczych ( folwark). W pełnym i późnym średniowieczu mógł przyjmować charakter rezydencjonalno-obronnej wieży (tzw. grodzisko stożkowate, lub dworu na kopcu) ew. zamku. W większości były to jednak jednokondygnacyjne siedziby (tzw. dwór szlachecki) mogące później (XVI-XX w.) przybierać formę pałacową.
zobacz też IRI: http://gov.genealogy.net/types.owl#24
zobacz też IRI: Manor
zobacz też IRI: http://vocab.getty.edu/aat/300005579
zobacz też IRI: Q879050
zobacz też tekst: 1. dom mieszkalny, budynek; siedziba szlachcica, właściciela majątku ziemskiego; majętność, posiadłość ziemska; 2. miejsce czasowego pobytu; lokal wynajęty (może dom zajezdny); 3. pałac, zamek, rezydencja; ewentualnie miejsce czasowego pobytu panującego; siedziba zwierzchnika (magnata) świeckiego lub duchownego; 4. miejsce posiedzeń senatu lub sądu w starożytnym Rzymie; także sama rada senatu; 5. otoczenie, środowisko skupiające się dokoła monarchy lub magnata, duchownego; dworzanie, urzędnicy, świta dworska, orszak; ogólnie: rząd danego państwa z panującym na czele; 6. siły zbrojne nadworne, żołnierze straży przybocznej monarchy; 7. praw. sąd królewski, w którym orzekał sam król osobiście przy asyście dygnitarzy królewskich lub zlecał rozpatrzenie sprawy i wydanie wyroku wyznaczonym dygnitarzom znajdującym się w danym momencie na dworze, to jest w miejscu pobytu władcy; 8. miejsce na zewnątrz domu, otaczająca dom; podwórze, dziedziniec, przestrzeń pod gołym niebem
zobacz też tekst: 1. miejsce pod niebem zagrodzone przy pomieszkanu, podworze (por. dziedziniec); 2. sądy za dworem królewskim, przy boku króla odprawujące się; 3. w wiekach dawnych, zjazd króla na różne miejsca, gdzie święta uroczystsze odbywał, obywatelów zgromadzał, sprawy sądził, okoliczności powiatowe ułatwiał, igrzyska i uczty dawał; 4. dwór królewski, zgromadzenie u króla, pokoje
zobacz też tekst: 1. przestrzeń otaczając dom, otwarte powietrze, miejsce pod gołym niebem; 2. podwórze, dziedziniec; 3. dom właściciela majątku ziemskiego, mieszkanie dziedzica; 4. gospodarstwo dworskie, folwark; 5. (przenośnie) mieszkańcy dworu wiejskiego, szczególnie dziedzic z rodziną, państwo; 6. dom, mieszkanie; 7. oficjaliści panów, szczególnie wyżsi, dworzanie; 8. miejsce pobytu albo mieszkanie panującego albo magnata; 9. panujący i jego otoczenie; 10. służba dworska; 11. zebranie u króla, sąd dworski, żołnierze nadworni
zobacz też tekst: 1. siedziba panującego lub księcia; 2. ludzie otaczający panującego lub księcia; 3. obszerny dom mieszkalny, charakterystyczny dla dawnych posiadłości ziemskich; 4. majątek ziemski z domem i zabudowaniami; 5. właściciele posiadłości ziemskiej, jej mieszkańcy, administracja; 6. otwarta przestrzeń na zewnątrz domu
zobacz też tekst: s. 9: -- desygnatem dworu jest tzw. gródek stożkowaty, czyli stanowisko archeologiczne mające wyodrębnioną formę terenową, najczęściej w postaci kopca lub przestrzeni zamkniętej dookolnymi obronnymi wałami

osada osady
creator: Wiesław Ostrowski
creator: Izabela Karsznia
type: Class
type: NamedIndividual
comment: Jest 17 takich obiektów w Polsce, zachodniopomorskie, północne wielkopolskie.
comment: Therea are 17 such localities in Poland: in Zachodniopomorskie and in the northern part of Wielkopolskie voivodships. @en
label: settlement of a settlement @en
subclass of: osada
subclass of: część osady
subclass of: Restriction
  has value: funkcja mieszkalna
  on property: ma funkcję właściwą
equivalent class: Class
  intersection of: osada
  intersection of: Restriction
    on property: jednostka osadnicza jest częścią
    some values from: osada
hidden label: Ansiedlung @de
hidden label: Kolonie @de
hidden label: Ortschaft @de
hidden label: Siedlung @de
hidden label: conlocationen @la
hidden label: kolonia
hidden label: miejscowość
hidden label: osiedle
hidden label: sadyba
hidden label: settlement @en
hidden label: zagroda włościańska
weryfikacja tłumaczenia deskrypcji przez: Paulina Wacławik
deskrypcja została ontologicznie zweryfikowana przez: Piotr Kulicki
deskrypcja została przetłumaczona przez: Tomasz Panecki
jest zdefiniowany przez literał: Osada osady jest to osada stanowiąca integralną część innej osady.
jest zdefiniowany przez literał: Settlement of a settlement is a settlement which is an integral part of a settlement. @en
zobacz też IRI: osadaOsady
zobacz też IRI: Q41970180

osada wsi
creator: Wiesław Ostrowski
creator: Izabela Karsznia
type: Class
type: NamedIndividual
comment: Jest 778 takich obiektów w Polsce, są one równomiernie rozmieszczone w całej Polsce.
comment: There are 778 such localities in Poland and they are evenly spread across Poland. @en
label: settlement of a village @en
subclass of: (mereologicznie) niesamodzielna miejscowość
subclass of: osada
subclass of: część wsi
subclass of: Restriction
  has value: funkcja mieszkalna
  on property: ma funkcję właściwą
equivalent class: Class
  intersection of: osada
  intersection of: Restriction
    on property: jednostka osadnicza jest częścią
    some values from: wieś
hidden label: conlocationen @la
hidden label: der Ortschaft @de
hidden label: der Siedlung @de
hidden label: die Ansiedlung @de
hidden label: die Kolonie @de
hidden label: kolonia
hidden label: miasteczko
hidden label: miejscowość
hidden label: osiedle
hidden label: sadyba
hidden label: settlement @en
hidden label: zagroda włościańska
weryfikacja tłumaczenia deskrypcji przez: Paulina Wacławik
deskrypcja została ontologicznie zweryfikowana przez: Piotr Kulicki
deskrypcja została przetłumaczona przez: Tomasz Panecki
jest zdefiniowany przez literał: Osada wsi jest to osada przynależna administracyjnie do wsi.
jest zdefiniowany przez literał: Settlement of a village is a settlement which is related to a village. @en

osiedle wsi
creator: Wiesław Ostrowski
creator: Izabela Karsznia
type: Class
type: NamedIndividual
comment: In urban studies, this notion is derived from a "neighbouring unit" idea, which denotes a group of residential buildings with service facilities and green areas. @en
comment: Jest 11 takich obiektów w Polsce, są one rozmieszczone w północno-zachodniej Polsce.
comment: There are 11 housing estates of a village which are located in NW Poland. @en
comment: W urbanistyce (planowaniu przestrzennym) pojęcie osiedla wywodzi się z koncepcji „jednostki sąsiedzkiej”, na którą składa się zespół budynków mieszkalnych wraz z zapleczem obiektów usługowych oraz terenów zielonych.
label: housing estate of a village @en
subclass of: (mereologicznie) niesamodzielna miejscowość
subclass of: osiedle
subclass of: Restriction
  has value: funkcja mieszkalna
  on property: ma funkcję właściwą
equivalent class: Class
  intersection of: osiedle
  intersection of: Restriction
    on property: jednostka osadnicza jest częścią
    some values from: wieś
hidden label: Ansiedlung @de
hidden label: Siedlung @de
hidden label: Wohnsiedlung @de
hidden label: conlocationen @la
hidden label: część miasta
hidden label: dzielnica
hidden label: hamlet @en
hidden label: housing estate @en
hidden label: kolonia
hidden label: osada
hidden label: osiedle willowe
hidden label: osiedlisko
hidden label: residential quarter @en
hidden label: settlement @en
weryfikacja tłumaczenia deskrypcji przez: Paulina Wacławik
deskrypcja została ontologicznie zweryfikowana przez: Piotr Kulicki
deskrypcja została przetłumaczona przez: Tomasz Panecki
deskrypcja została przetłumaczona przez: Wiesława Duży
jest zdefiniowany przez literał: Housing estate of a village is a housing estate which is an integral part of a village. @en
jest zdefiniowany przez literał: Osiedle wsi jest to osiedle stanowiące integralną część wsi.
zobacz też IRI: osiedleWsi
zobacz też IRI: Q41970180

przysiółek kolonii
creator: Izabela Karsznia
type: Class
type: NamedIndividual
comment: Hamlet of a colony is a separate settlement unit, a kind of locality, it always has a particular name. Hamlets of colonies occur most often in Lubelskie voivodship. In total, there are 72 hamlets of colonies in Poland. @en
comment: Przysiółek kolonii jest odrębną jednostką osadniczą, rodzajem miejscowości, zawsze ma swoją nazwę własną. Przysiółki kolonii występują głównie w lubelskim. W sumie są to 72 obiekty.
label: hamlet of a colony @en
subclass of: przysiółek
subclass of: Restriction
  has value: funkcja rolnicza
  on property: ma funkcję właściwą
equivalent class: Class
  intersection of: przysiółek
  intersection of: Restriction
    on property: jednostka osadnicza jest częścią
    some values from: kolonia
weryfikacja tłumaczenia deskrypcji przez: Paulina Wacławik
deskrypcja została ontologicznie zweryfikowana przez: Piotr Kulicki
deskrypcja została przetłumaczona przez: Tomasz Panecki
jest zdefiniowany przez literał: Hamlet of a colony is a hamlet, for which a colony is a superior unit. @en
jest zdefiniowany przez literał: Przysiółek kolonii jest to przysiółek, dla którego jednostką nadrzędną jest kolonia.

przysiółek osady
creator: Izabela Karsznia
type: Class
type: NamedIndividual
comment: Przysiółek osady jest odrębną jednostką osadniczą, rodzajem miejscowości, zawsze ma swoją nazwę własną. Przysiółki osady występują główniezachodnio-pomorskim, pomorskim, warmińsko-mazurskim. W sumie jest 80 takich obiektów.
comment: The hamlet of a settlement is a separate settlement unit, a kind of locality, always has its particular name. Hamlets of settlements occur mainly in the Zachodniopomorskie, Pomorskie, and Warmińsko-Mazurskie voivodships. In total, there are 80 hamlets of settlements in Poland. @en
label: hamlet of a settlement @en
subclass of: przysiółek
equivalent class: Class
  intersection of: przysiółek
  intersection of: Restriction
    on property: jednostka osadnicza jest częścią
    some values from: osada
alternative label: osada przemysłowa (pl)
hidden label: conlocationen @la
hidden label: der Ortschaft @de
hidden label: der Siedlung @de
hidden label: die Ansiedlung @de
hidden label: die Kolonie @de
hidden label: kolonia
hidden label: miasteczko
hidden label: miejscowość
hidden label: osiedle
hidden label: sadyba
hidden label: settlement @en
hidden label: zagroda włościańska
weryfikacja tłumaczenia deskrypcji przez: Paulina Wacławik
deskrypcja została ontologicznie zweryfikowana przez: Piotr Kulicki
deskrypcja została przetłumaczona przez: Tomasz Panecki
jest zdefiniowany przez literał: Hamlet of a settlement is a hamlet, for which a superior unit is a settlement. @en
jest zdefiniowany przez literał: Przysiółek osady jest to przysiółek, dla którego jednostką nadrzędną jest osada.

przysiółek wsi
creator: Izabela Karsznia
type: Class
type: NamedIndividual
comment: Brak oficjalnej definicji w "Ustawie o nazwach urzędowych miejscowości i jednostek fizjograficznych".
comment: No official definition in the "Act on official names of localities and physiographic units". @en
comment: Przysiółek wsi jest odrębną jednostką osadniczą, rodzajem miejscowości, zawsze ma swoją nazwę własną. Przysiółki wsi występują głównie w woj. podkarpackim, małopolskim oraz w świętokrzyskim. W sumie jest ich 11580.
comment: The hamlet of a village is a separate settlement unit, a kind of locality, always has its particular name. Hamlets of villages occur mainly in Podkarpackie, Małopolskie, and Świętokrzyskie voivodships. In total, there are 11 580 hamlets of villages in Poland. @en
label: hamlet of a village @en
subclass of: przysiółek
subclass of: Restriction
  has value: funkcja rolnicza
  on property: ma funkcję właściwą
equivalent class: Class
  intersection of: przysiółek
  intersection of: Restriction
    on property: jednostka osadnicza jest częścią
    some values from: wieś
weryfikacja tłumaczenia deskrypcji przez: Paulina Wacławik
deskrypcja została ontologicznie zweryfikowana przez: Piotr Kulicki
deskrypcja została przetłumaczona przez: Tomasz Panecki
jest zdefiniowany przez literał: Hamlet of a village is a hamlet, for which a superior unit is a village. @en
jest zdefiniowany przez literał: Przysiółek wsi jest to przysiółek, dla którego jednostką nadrzędną jest wieś.
zobacz też IRI: przysiolekWsi
zobacz też IRI: Q41970180

schronisko turystyczne
creator: Tomasz Panecki
type: Class
type: NamedIndividual
comment: In BDTO10k a tourist shelter is distinguished as a [1] building, [2] hotel services' complex, and [3] locality; in PRNG as a "tourist shelter". On MGI maps - a shelter [developed or undeveloped were depicted using different symbols] ("schr."), on German maps - Jugenherberge (youth hostel, "Jg. Hb."), Winterhutte (winter shelter, "Wint. H."), Schutzhutte (hostel). Tourist shelters are not included in Bystrzycki's register. @en
comment: W BDOT10k schronisko turystyczne wyróżnione jest jako budynek, kompleks usług hotelarskich oraz miejscowość; w PRNG jako „schronisko turystyczne”.Na mapach WIG – schronisko [zagospodarowane lub niezagospodarowane odmiennym znakiem] („schr.”), niemieckich – Jugenherberge (schronisko młodzieżowe, „Jg. Hb.”), Winterhutte (schron zimowy, „Wint. H.”), Schutzhutte (schronisko). Brak u Bystrzyckiego.
label: tourist shelter @en
subclass of: właściwa miejscowość
subclass of: (mereologicznie) prosta miejscowość
subclass of: Restriction
  has value: S.RHSE
  on property: featureCode
subclass of: Restriction
  has value: funkcja zapewnienia odpoczynku i noclegu dla turystów
  on property: ma funkcję właściwą
hidden label: karczma
hidden label: schronisko
hidden label: schronisko górskie
hidden label: stacja turystyczna
hidden label: szałas
weryfikacja tłumaczenia deskrypcji przez: Paulina Wacławik
deskrypcja została ontologicznie zweryfikowana przez: Piotr Kulicki
deskrypcja została przetłumaczona przez: Tomasz Panecki
jest zdefiniowany przez literał: Schronisko turystyczne (miejscowość) to miejscowość, w której główną rolę pełni schronisko turystyczne (obiekt).
jest zdefiniowany przez literał: Tourist shelter (locality) is a settlement where the main role is played by a tourist shelter (object). @en
zobacz też IRI: Shelter

folwark
creator: Tomasz Związek
type: Class
type: NamedIndividual
comment: A demesne (manor) may be considered as an independent locality as long as it is distinguished by an individual name. Usually, a demesne was located away from the main group of houses in a village, on the outskirts, or in its vicinity. @en
comment: Folwark może być traktowany jako odrębna miejscowość, o ile posiadał własną nazwę. Zazwyczaj folwark położony był poza główną zabudową wsi, na jej obrzeżach lub w nieznacznym oddaleniu.
label: demesne @en
subclass of: właściwa miejscowość
subclass of: Restriction
  has value: funkcja rolnicza
  on property: ma funkcję właściwą
alternative label: Vorwerk @de
alternative label: praedium @la
alternative label: фолварок @ru
hidden label: allodium @la
hidden label: dobra
hidden label: domena
hidden label: dwór
hidden label: majątek
hidden label: manor @en
hidden label: имение @ru
hidden label: усадьба @ru
hidden label: хутор @ru
weryfikacja tłumaczenia deskrypcji przez: Paulina Wacławik
deskrypcja została ontologicznie zweryfikowana przez: Piotr Kulicki
deskrypcja została przetłumaczona przez: Wiesława Duży
jest zdefiniowany przez literał: A demesne (en: manor, pl: folwark, de: Volwerk) is a locality with an industrial function, often located near the manor (a building) or separate.
jest zdefiniowany przez literał: Folwark (niem: Volwerk) to miejscowość o charakterze gospodarczym, często funkcjonująca obok dworu lub osobno.
zobacz też IRI: Demesne
zobacz też IRI: Folwark
zobacz też IRI: Manor
zobacz też IRI: http://gov.genealogy.net/types.owl#64
zobacz też IRI: http://vocab.getty.edu/aat/300000238
zobacz też IRI: http://vocab.getty.edu/aat/300108235
zobacz też tekst: duże gospodarstwo rolne wraz z zabudowaniami.
zobacz też tekst: t. 1, s. 173: duże gospodarstwo rolne lub rolno-hodowlane, produkujące głównie na zbyt, posługujące się pracą chłopów pańszczyźnianych albo siłą najemną. Organizowane przez feudalnych właścicieli ziemskich już w XIV w., stanowiły kontynuację tzw. rezerwy pańskiej, czyli gruntów wyłączonych spod uprawy chłopskiej i przeznaczonych do zaspokajania bezpośrednich potrzeb dworu--’
zobacz też tekst: t. 1, s. 759: 1. mała wioska, leżąca obok dużej, oddzielona część wsi; przysiółek; 2. majętność, grunt z zabudowaniem, ferma; 3. dwór we wsi, mieszkanie dziedzica albo dzierżawcy razem z zabudowaniami dworskimi.
zobacz też tekst: t. 7, s. 90–91: 1. ziemskie gospodarstwo, w przeciwieństwie do gospodarstwa chłopskiego, grunt z zabudowaniami gospodarskimi i mieszkalnymi, często będący częścią większej majętności; zazwyczaj wydzielona część wsi; 2. zabudowania gospodarcze; 3. ziemia orna, rola należąca do folwarku; 4. posiadłość ziemska, dworek z zabudowaniami gospodarskimi położony pod miastem; 5. wieś

holendry
creator: Tomasz Związek
type: Class
type: NamedIndividual
comment: Characteristic for the Commonwealth of Poland and Lithuania from 16th to 18th century. @en
comment: Charakterystycznego dla Rzeczypospolitej XVII–XVIII wieku
label: "holendry" @en
subclass of: kolonia
subclass of: Restriction
  has value: funkcja rolnicza
  on property: ma funkcję właściwą
hidden label: Hauland @de
hidden label: Holander @de
hidden label: Olander @de
hidden label: Olender
hidden label: Olęder
hidden label: kolonia
hidden label: osada
weryfikacja tłumaczenia deskrypcji przez: Paulina Wacławik
deskrypcja została ontologicznie zweryfikowana przez: Piotr Kulicki
jest zdefiniowany przez literał: "Holendry" (a Dutch type locality) is a colony established on an empty territory, in areas not very useful for agriculture. It was a type of locality characteristic for a "Dutch colonisation", which was a specific form of a settlement movement - widespread in the Commonwealth of Poland and Lithuania from 16th to 18th century. Granting uncongenial land difficult to cultivate or for animal husbandry to local people or (more often) immigrants inflowing from Flanders, German countries and Silesia was the core element of this process. @en
jest zdefiniowany przez literał: Holendry to kolonia zakładana na obszarach nieobjętych osadnictwem z powodu nikłej przydatności rolniczej, właściwa dla tzw. kolonizacji olęderskiej, czyli specyficznej formy ruchu osadniczego – charakterystycznego dla Rzeczypospolitej XVII–XVIII wieku – polegającego na nadaniu ludności rodzimej – lub częściej – imigrantom pochodzącym z Flandrii, państw niemieckich lub Śląska, trudnej (w uprawie lub hodowli) ziemi.

port morski
creator: Tomasz Panecki
type: Class
type: NamedIndividual
comment: Port morski na austriackiej mapie 1:75 000 wyróżniony explicite i opisany krojem pisma takim jak miasta większe niż 100 000 mieszkańców i twierdze.W BDOT10k „port wodny lub przystań” w klasie kompleks komunikacyjny.Jest u Bystrzyckiego (nie w skrótach) – port, miasto portowe.
comment: Sea harbour on the Austrian map 1:75,000 (Spezialkarte...) is explicitly distinguished as a placename using the same annotation style as "cities larger than 100,000 inhabitants and fortresses".Sea harbour is included in DBTO10k as "sea harbour port or marina" in the communication complex feature class (KUKO).Sea harbour is included in Bystrzycki's register (however, not in abbreviations list) as "harbour" (pol "port"), "harbour city" (pol "miasto portowe"). @en
label: sea harbour @en
subclass of: miejsce transportu
subclass of: Restriction
  has value: L.PRT
  on property: featureCode
subclass of: Restriction
  has value: funkcja gospodarcza
  on property: ma funkcję właściwą
subclass of: Restriction
  on property: est composée de
  some values from: port morski - obiekt
weryfikacja tłumaczenia deskrypcji przez: Paulina Wacławik
deskrypcja została ontologicznie zweryfikowana przez: Piotr Kulicki
deskrypcja została przetłumaczona przez: Tomasz Panecki
jest zdefiniowany przez literał: Port morski (miejscowość) jest to miejscowość w której główną rolę pełni port morski jako obiekt
jest zdefiniowany przez literał: Sea harbour (locality) is a locality where the main role is played by a sea harbour (area). @en
zobacz też IRI: Port
zobacz też IRI: Q15310171

wieś kościelna
type: Class
label: church village @en
subclass of: wieś
equivalent class: Class
  intersection of: wieś
  intersection of: Restriction
    on property: est composée de
    some values from: kościół - obiekt
zobacz też IRI: http://gov.genealogy.net/types.owl#66

targ
type: Class
label: market place @en
subclass of: miejsce wymiany handlowej
subclass of: Restriction
  has value: S.MKT
  on property: featureCode
zobacz też IRI: Marketplace

osada karczemna
creator: Tomasz Związek
type: Class
type: NamedIndividual
label: inn @en
subclass of: niewłaściwa miejscowość
subclass of: osada
subclass of: Restriction
  has value: funkcja gastronomiczna
  on property: ma funkcję właściwą
subclass of: Restriction
  on property: est composée de
  some values from: karczma - obiekt
hidden label: Gasthof @de
hidden label: Krug @de
hidden label: Wirthaus @de
hidden label: budynek
hidden label: gospoda
hidden label: gościniec
hidden label: gościnny dom
hidden label: oberża
hidden label: restauracja
hidden label: szynkowny dom
hidden label: taberna @la
hidden label: zajazd
weryfikacja tłumaczenia deskrypcji przez: Paulina Wacławik
deskrypcja została ontologicznie zweryfikowana przez: Piotr Kulicki
deskrypcja została przetłumaczona przez: Tomasz Panecki
jest zdefiniowany przez literał: Inn (locality) is a settlement in which the main role is played by an inn (builing). @en
jest zdefiniowany przez literał: Osada karczemna to osada, w której główną rolę pełni karczma (obiekt).
zobacz też IRI: Hamlet (place)
zobacz też IRI: http://gov.genealogy.net/types.owl#120
zobacz też IRI: Q5084

źródło
type: Class
label: source @en
subclass of: Document
subclass of: Restriction
  on property: jest opublikowane przed
  some values from: dateTime
subclass of: Restriction
  on property: jest opublikowane po
  some values from: dateTime

zaczyna obowiązywać od
type: DatatypeProperty
type: FunctionalProperty
domain: system administracji
label: begins domination at @en
range: date

Axiom
annotated property: zobacz też tekst
annotated source: cegielnia - obiekt
annotated target: t. 1, cz. 1, s. 221: Cegielnia, Cegielnica, budynek z piecem od palenia cegieł, die Ziegelscheune, der Ziegelofen
jest zdefiniowany przez obiekt: Słownik języka polskiego

Axiom
annotated property: zobacz też tekst
annotated source: kolonia
annotated target: t. 1-2, s. 1566: część miejscowości, zwykle z dale od jej centrum, składająca się z nowobudowanych domostw, will, itp.
jest zdefiniowany przez obiekt: Słownik języka polskiego

Axiom
annotated property: zobacz też tekst
annotated source: wieś
annotated target: 1. miejscowość zamieszkała przez ludzi, którzy trudnią się pracą na roli, 2. mieszkańcy takiej miejscowości, 3. tereny pozamiejskie, rolnicze, letniskowe, 4. ludzie trudniący się pracą na roli
jest zdefiniowany przez obiekt: Słownik języka polskiego

Axiom
annotated property: zobacz też tekst
annotated source: wieś
annotated target: Jednostka osadnicza o zwartej lub rozproszonej zabudowie i istniejących funkcjach rolniczych lub związanych z nimi usługowych lub turystycznych, nieposiadająca praw miejskich lub statusu miasta
jest zdefiniowany przez obiekt: Rozporządzenie BDOT10k

Axiom
annotated property: zobacz też tekst
annotated source: kościół - obiekt
annotated target: t. 11, s. 57-68: II. Budowla sakralna; 1. Świątynia chrześcijańska, zwłaszcza katolicka; templum--; aedes, fanum--; ecclesia--; aedes sacra--; sacrum--; domus, sedes sacra--; delubrum, dominicum, domus Dei, martyrium, sacrarium ritus Christiani--. 3. Świątynia mahometańska; meczet--. 4. Świątynia pogańska, delubrum--; aedes, oraculum, templum--; templum idolorum--; idolium--; domus--; aedes sacra, fanum, penetralia, sessimonium deorum--. 6. n-loc [nazwa miejsca] : -- »Czerwony Kościoł«
jest zdefiniowany przez obiekt: Słownik polszczyzny XVI wieku

Axiom
annotated property: zobacz też tekst
annotated source: kuźnica - obiekt
annotated target: t. 2, s. 653: ‘zabudowanie mieszczące w sobie jedno albo kilka ognisk, miechy i młoty poruszane przez wodę, gdzie z surowizny przetopionej i oczyszczonej wykuwa się żelazo gotowe; fabryka topienia żelaza i urabiana go w sztaby
jest zdefiniowany przez obiekt: Słownik języka polskiego

Axiom
annotated property: zobacz też tekst
annotated source: gajówka - obiekt
annotated target: Budynek, w którym mieszka gajowy (pracownik nadleśnictwa chroniący przydzieloną mu część lasu przed szkodami)
jest zdefiniowany przez obiekt: Słownik języka polskiego

Axiom
annotated property: zobacz też tekst
annotated source: miasto
annotated target: t. 13, s. 37: Wytyczony i najczęściej otoczony murem teren, pokryty gęstą i planową zabudową tworzącą place i ulice, stanowiący mniej lub więcej samodzielną jednostkę administracyjną, samorządową, a czasem polityczną.
jest zdefiniowany przez obiekt: Słownik polszczyzny XVI wieku

Axiom
annotated property: zobacz też tekst
annotated source: kopalnia - obiekt
annotated target: Teren zakładu górniczego, zajmującego się wydobywaniem z ziemi kopalin użytecznych. Ze względu na sposób wydobycia rozróżnia się kopalnie odkrywkowe (naziemne), głębinowe (podziemne) i otworowe.
jest zdefiniowany przez obiekt: Rozporządzenie BDOT10k

Axiom
annotated property: zobacz też tekst
annotated source: uroczysko
annotated target: t. 7, s. 348: 1. starożytny , z czasów pogańskich nasyp ziemny w postaci mogiły a. okopu, kopiec, kurhan; miejsce graniczne. Troc. 2. miejsce odludne, tajemnicze – 3. miejscowość nie zamieszkana, nosząca jakie oddzielne charakterystyczne miano – 4. pewna część gruntu a. gruntów kilku posiadaczy w jednym miejscu, nosząca pewną nazwę – 5. miejsce w polu, składające się z gruntu i łąk, dawniej zarosłe lasem. 6. bart. okręg bartniczy --, 7. leśn. część lasu, oddzielona od innych części naturalnymi granicami, jako oto: wzgórzami, strumykami, łąkami, drogami i.t.p. albo też różniąca się drzewostanem
jest zdefiniowany przez obiekt: Słownik języka polskiego

Axiom
annotated property: zobacz też tekst
annotated source: osiedle
annotated target: 10. Rodzaj miejscowości (Klasa: AD_RodzajMiejscowosciKod): Zespół mieszkaniowy stanowiący integralną część miasta lub wsi; źródło: ustawa z dnia 29 sierpnia 2003 r. o urzędowych nazwach miejscowości i obiektów fizjograficznych.
jest zdefiniowany przez obiekt: Rozporządzenie Ministra Administracji i Cyfryzacji z dnia 9 stycznia 2012 r. w sprawie ewidencji miejscowości, ulic i adresów

Axiom
annotated property: zobacz też tekst
annotated source: schronisko turystyczne - obiekt
annotated target: t. 5, s. 201 – mieysce do schronienia
jest zdefiniowany przez obiekt: Słownik języka polskiego

Axiom
annotated property: zobacz też tekst
annotated source: smolarnia - obiekt
annotated target: prymitywny zakład przemysłowy, gdzie wypraża się z drewna (tzw. karpowin) smołę i otrzymuje terpentynę, spirytus drzewny i inne chemikalia
jest zdefiniowany przez obiekt: Słownik języka polskiego
jest zdefiniowany przez IRI: https://sjp.pwn.pl/doroszewski/smolarnia

Axiom
annotated property: zobacz też tekst
annotated source: miasto
annotated target: Jednostka osadnicza (wyodrębniony przestrzennie obszar zabudowy mieszkaniowej wraz z obiektami infrastruktury technicznej zamieszkany przez ludzi) o przewadze zwartej zabudowy i funkcjach nierolniczych posiadająca prawa miejskie bądź status miasta nadany w trybie określonym odrębnymi przepisami.
jest zdefiniowany przez obiekt: Rozporządzenie BDOT10k

Axiom
annotated property: zobacz też tekst
annotated source: uzdrowisko
annotated target: miejscowość, która ze względu na warunki klimatyczne, źródła lecznicze, pokłady borowiny, itp. sprzyja leczeniu chorób i służy jako ośrodek leczniczy i wypoczynkowy
jest zdefiniowany przez obiekt: Słownik języka polskiego

Axiom
annotated property: zobacz też tekst
annotated source: dwór - obiekt
annotated target: 1. dom mieszkalny, budynek; siedziba szlachcica, właściciela majątku ziemskiego; majętność, posiadłość ziemska; 2. miejsce czasowego pobytu; lokal wynajęty (może dom zajezdny); 3. pałac, zamek, rezydencja; ewentualnie miejsce czasowego pobytu panującego; siedziba zwierzchnika (magnata) świeckiego lub duchownego; 4. miejsce posiedzeń senatu lub sądu w starożytnym Rzymie; także sama rada senatu; 5. otoczenie, środowisko skupiające się dokoła monarchy lub magnata, duchownego; dworzanie, urzędnicy, świta dworska, orszak; ogólnie: rząd danego państwa z panującym na czele; 6. siły zbrojne nadworne, żołnierze straży przybocznej monarchy; 7. praw. sąd królewski, w którym orzekał sam król osobiście przy asyście dygnitarzy królewskich lub zlecał rozpatrzenie sprawy i wydanie wyroku wyznaczonym dygnitarzom znajdującym się w danym momencie na dworze, to jest w miejscu pobytu władcy; 8. miejsce na zewnątrz domu, otaczająca dom; podwórze, dziedziniec, przestrzeń pod gołym niebem
jest zdefiniowany przez obiekt: Słownik polszczyzny XVI wieku

Axiom
annotated property: zobacz też tekst
annotated source: kuźnica - obiekt
annotated target: t. 11, s. 598: ‘zakład przetapiający i obrabiający żelazo’, ‘warsztat kowalski; miejsce, gdzie się kuje’
jest zdefiniowany przez obiekt: Słownik polszczyzny XVI wieku

Axiom
annotated property: zobacz też tekst
annotated source: leśniczówka - obiekt
annotated target: Dom, zagroda w lesie stanowiąca mieszkanie; mieszkanie leśniczego (zarządca obszaru leśnego stanowiącego leśnictwo) wraz z zabudowaniami gospodarskimi
jest zdefiniowany przez obiekt: Słownik języka polskiego

Axiom
annotated property: zobacz też tekst
annotated source: miasteczko
annotated target: małe miasto; pot. mieszkańcy małego miasta
jest zdefiniowany przez obiekt: Słownik języka polskiego (PWN)
jest zdefiniowany przez IRI: https://sjp.pwn.pl/sjp/miasteczko

Axiom
annotated property: zobacz też tekst
annotated source: kopalnia - obiekt
annotated target: t. 1, cz. 2, s. 1077: Kopalnia, miejsce gdzie się iakowe rzeczy kopalne z ziemi dobywają
jest zdefiniowany przez obiekt: Słownik języka polskiego

Axiom
annotated property: zobacz też tekst
annotated source: zamek - obiekt
annotated target: miejsce obronne, twierdza
jest zdefiniowany przez obiekt: Słownik polszczyzny XVI wieku

Axiom
annotated property: zobacz też tekst
annotated source: osada
annotated target: niewielka miejscowość, niemająca praw osiedla czy miasta; też: mieszkańcy takiej miejscowości
jest zdefiniowany przez obiekt: Słownik języka polskiego (PWN)
jest zdefiniowany przez IRI: https://sjp.pwn.pl/sjp/osada

Axiom
annotated property: zobacz też tekst
annotated source: kolonia
annotated target: t. 2, s. 240: zabudowa, osiedle, domy znajdujące się z dala od miasta, wsi, osady; kolonia mieszkaniowa na przedmieściach, kolonia położona daleko za wsią, gospodarstwo rolne położone za wsią, posiadłość ziemska z dala od innych.
jest zdefiniowany przez obiekt: Słownik współczesnego języka polskiego

Axiom
annotated property: zobacz też tekst
annotated source: wieś
annotated target: s. 15: 1. osada, której ludność zajmuje się uprawą roślin i chowem zwierząt, wieś: osada (osiedle wiejskie; teren zabudowany), na którym mieszka ludność pracująca w gospodarstwach wiejskich, koncentrująca większość środków produkcji, i na którym są dokonywane różne procesy produkcyjne, istnieje życie społeczne oraz kulturalne mieszkańców wsi (def. na podstawie Nowosielski 1964, Kiełczewska-Zaleska 1976, Chowaniem 1989); 2. podstawą (atomem) dla wsi nie jest pojedynczy wiejski budynek lecz ich komplet (zagroda), tworzący samodzielne gospodarstwo rolne z należącą doń powierzchnią ziemi --. Wieś w sensie antropogeograficznym jest częścią gminy (lub gromady), która stanowi grupę gospodarstw rolnych zabudowaną według jednolitego planu i tworzącą typ kształtu i skupienia (def. na podstawie Zaborski 1926); 3. to zbiorowisko ludzi albo osiedle z należącymi doń gruntami. Wieś: rozłóg i osada. O istnieniu wsi ma decydować także zestaw więzi wewnątrz wsi: rozłóg, siedlisko i ludność rolnicza (def. na podstawie Szymański 1969, Olechowski 1948); 4. wieś to społeczność lokalna, której funkcję produkcyjną uzupełniała funkcja rodziny. Wieś stanowi pewną historyczną formę struktury społecznej, względnie trwałą i jednolitą całość, której członkowie są ze sobą powiązani siecią zależności i więzi sprawiających, że całość ta jest wewnętrznie zintegrowana. Cechą konstytutywną tak rozumianej grupy jest określone terytorium geograficzne, które wspólnie użytkują, a efektem tego jest pewien stopień psychologicznego zespolenia całości lub części społeczności ze strukturą społeczno-przestrzenną jako znaczącą wartością kulturową. Podstawową funkcją środowiska kulturowego wsi, a zwłaszcza jego wartości przestrzennych jest kształtowanie poczucia tożsamości z rodzinną tradycją i jej wartościami oraz wynikającej stąd świadomości przynależności do miejscowej społeczności oraz identyfikacja z jej przestrzenią życiową (def. na podstawie Turowski 1992); 5. twór terytorialny mający granice, rozłóg ziemi…
jest zdefiniowany przez obiekt: Organizacja przestrzenna wsi w Polsce

Axiom
annotated property: zobacz też tekst
annotated source: wieś
annotated target: t. 7, s. 594–595: osada rolnicza, z pewnej liczby chat złożona, sioło
jest zdefiniowany przez obiekt: Słownik języka polskiego

Axiom
annotated property: zobacz też tekst
annotated source: osada leśna wsi
annotated target: t. 20. s.47: Osady przemysłowe - osiedla dla robotników i rzemieślników zakładane XVIII – XIX w. w związku z dokonującym się procesem uprzemysłowienia, niekiedy zwane osadami fabrycznymi; zwykle osady przemysłowe obejmowały zarówno zakłady przemysłowe jak i związane z nimi kolonie domów mieszkalnych. Na ziemiach polskich powstawały od końca XVIII wieku jako osady prywatne bądź rządowe i stopniowo uzyskiwały prawa miejskie; w drugiej połowie XIX wieku termin „osady przemysłowe” zaczęto używać do wszelkich osiedli rozwijających się wokół zakładów przemysłowych; dzielnice mieszkaniowe, zwane koloniami lub domami fabrycznymi wznoszono w drugiej połowie XIX i w XX wieku przez wielkie zakłady przemysłowe w już istniejących miejscowościach dla robotników i urzędników niższego szczebla, zwykle o niskim standardzie i niewysokich czynszach.
jest zdefiniowany przez obiekt: Wielka Encyklopedia PWN

Axiom
annotated property: zobacz też tekst
annotated source: tartak - obiekt
annotated target: t. 7, s. 29: Pilarnia, młyn do tarcia drzewa na tarcice, dyle: Tartak wodny, parowy
jest zdefiniowany przez obiekt: Słownik języka polskiego

Axiom
annotated property: zobacz też tekst
annotated source: dwór - obiekt
annotated target: 1. miejsce pod niebem zagrodzone przy pomieszkanu, podworze (por. dziedziniec); 2. sądy za dworem królewskim, przy boku króla odprawujące się; 3. w wiekach dawnych, zjazd króla na różne miejsca, gdzie święta uroczystsze odbywał, obywatelów zgromadzał, sprawy sądził, okoliczności powiatowe ułatwiał, igrzyska i uczty dawał; 4. dwór królewski, zgromadzenie u króla, pokoje
jest zdefiniowany przez obiekt: Słownik języka polskiego

Axiom
annotated property: zobacz też tekst
annotated source: leśniczówka - obiekt
annotated target: Pojedyncza zagroda służąca leśniczemu i będąca jednocześnie siedzibą leśnictwa
jest zdefiniowany przez obiekt: Rozporządzenie BDOT10k

Axiom
annotated property: zobacz też tekst
annotated source: kolonia
annotated target: t. 2, s. 404: mała posiadłość ziemska należąca do przybysza z obcego kraju; osada włościańska po uwłaszczeniu włościan; osada, miejsce, gdzie koloniści osadnicy mieszkają, budy, szopy, majdan.
jest zdefiniowany przez obiekt: Słownik języka polskiego

Axiom
annotated property: zobacz też tekst
annotated source: gród
annotated target: t. 2, s. 168 (hasło "Grodzisko"): "Grody to obiekty sztucznie ogrodzone w celach obronnych. Pojęcie to obejmuje wszelkiego rodzaju miejsca obronne, jak wsie, miasta, ośrodki administracyjne, wojskowe i inne schronienia przygotowane do obrony. W średniowieczu grodami nazywano też miasta".
jest zdefiniowany przez obiekt: Słownik starożytności słowiańskich: encyklopedyczny zarys kultury Słowian od czasów najdawniejszych

Axiom
annotated property: zobacz też tekst
annotated source: wieś
annotated target: Pfarrdorf: 1. Dorf, in dem die für die Pfarrgemeinde konstitutive Pfarrkirche (I) steht [wieś, w której stoi kościół parafialny właściwy dla całej parafii, gminy parafialnej]; 2. zu einer Pfarre (I) gehöriges Dorf [wieś należąca do parafii] @de
jest zdefiniowany przez obiekt: Deutsche Rechtswörterbuch

Axiom
annotated property: zobacz też tekst
annotated source: miasteczko
annotated target: małe miasto, -- przen. ludność małego miasta
jest zdefiniowany przez obiekt: Słownik języka polskiego
jest zdefiniowany przez IRI: https://sjp.pwn.pl/doroszewski/miasteczko

Axiom
annotated property: zobacz też tekst
annotated source: uzdrowisko
annotated target: t. 7, s. 424 – zakład leczniczy, lecznisko, leczysko, sanatorium
jest zdefiniowany przez obiekt: Słownik języka polskiego

Axiom
annotated property: zobacz też tekst
annotated source: gorzelnia - obiekt
annotated target: zakład przemysłowy produkujący spirytus i wódki głównie z kartofli lub zboża
jest zdefiniowany przez obiekt: Słownik języka polskiego

Axiom
annotated property: zobacz też tekst
annotated source: przedmieście
annotated target: peryferyjna dzielnica miasta
jest zdefiniowany przez obiekt: Słownik języka polskiego (PWN)

Axiom
annotated property: zobacz też tekst
annotated source: uroczysko
annotated target: t. 9, s. 431: 1. miedza graniczna, granica, limes agrorum, finis -- 2. teren poza granicą posiadłości, ale do niej przynależny, z własnymi granicami naturalnymi, locus extra fines praedii situs, sed ad id praedium pertinens, proprios fines naturales habens.
jest zdefiniowany przez obiekt: Słownik staropolski

Axiom
annotated property: zobacz też tekst
annotated source: karczma - obiekt
annotated target: t. 2, s. 264: 1. dom szynkowy (Star.), szynk, szynkownia, gospoda; do na wsi albo przy drodze dla popasu podróżnych, austerja, oberża, dom zajezdny, zajazd’, [por. t. 3, s. 453 hasło: oberża ‘dom gościnny, gospoda, zajazd, karczma, austerja’ i t. 8, s. 106 hasło zajazd, gdzie ‘dom zajezdny, gospoda, austerja, karczma, dom gościnny’]
jest zdefiniowany przez obiekt: Słownik języka polskiego

Axiom
annotated property: zobacz też tekst
annotated source: wieś
annotated target: s. 29: wsią nazywamy osiedle w zasadzie otwarte, której ludność zajmuje się produkcją śródków żywności oraz surowców technicznych (tj. rolnictwem, hodowlą bydła, rybołówstwem itd.)
jest zdefiniowany przez obiekt: Geografia historyczna Polski

Axiom
annotated property: zobacz też tekst
annotated source: dwór - obiekt
annotated target: 1. siedziba panującego lub księcia; 2. ludzie otaczający panującego lub księcia; 3. obszerny dom mieszkalny, charakterystyczny dla dawnych posiadłości ziemskich; 4. majątek ziemski z domem i zabudowaniami; 5. właściciele posiadłości ziemskiej, jej mieszkańcy, administracja; 6. otwarta przestrzeń na zewnątrz domu
jest zdefiniowany przez obiekt: Słownik języka polskiego

Axiom
annotated property: zobacz też tekst
annotated source: uroczysko
annotated target: t. 6, s. 80: uroczysko, uroczyszcze -- (Rs. urocziszcze, = powiat, kraina); kopiec, mieysce graniczne. Tr. Gränzstein, Mohlhausen.
jest zdefiniowany przez obiekt: Linde, Samuel Bogumił

Axiom
annotated property: zobacz też tekst
annotated source: cegielnia - obiekt
annotated target: wytwórnia cegły oraz innych materiałów budowlanych z gliny
jest zdefiniowany przez obiekt: Słownik języka polskiego (PWN)
jest zdefiniowany przez IRI: cegielnia.html

Axiom
annotated property: zobacz też tekst
annotated source: karczma - obiekt
annotated target: t. 3, s. 564: szynk na wsi, gospoda; dawniej również dom zajezdny, austeria, oberża
jest zdefiniowany przez obiekt: Słownik języka polskiego

Axiom
comment: according to Eurostat LAU (Local Administrative Units) in GB are districts @en
annotated property: hiddenLabel
annotated source: gmina (Rzeczpospolita Polska (1999-2016))
annotated target: district @en

Axiom
annotated property: zobacz też tekst
annotated source: cegielnia - obiekt
annotated target: t. 3, s. 142: cegielnia – miejsce wyrobu cegieł
jest zdefiniowany przez obiekt: Słownik polszczyzny XVI wieku

Axiom
annotated property: zobacz też tekst
annotated source: tartak - obiekt
annotated target: «zakład zajmujący się rozpiłowywaniem kłód na tarcicę oraz przerobem tarcicy na różne elementy»
jest zdefiniowany przez obiekt: Słownik języka polskiego (PWN)
jest zdefiniowany przez IRI: https://sjp.pwn.pl/sjp/tartak

Axiom
annotated property: zobacz też tekst
annotated source: osada
annotated target: Niewielka jednostka osadnicza na terenie wiejskim o odmiennym (wyróżniającym się) charakterze zabudowy albo zamieszkana przez ludność związaną z miejscem lub rodzajem pracy, innymi niż wyżej wymienione [osada młyńska, osada leśna, osada rybacka, osada kolejowa, osada po byłem PGR]; źródło: ustawa z dnia 29 sierpnia 2003 r. o urzędowych nazwach miejscowości i obiektów fizjograficznych.
jest zdefiniowany przez obiekt: Rozporządzenie Ministra Administracji i Cyfryzacji z dnia 9 stycznia 2012 r. w sprawie ewidencji miejscowości, ulic i adresów

Axiom
annotated property: zobacz też tekst
annotated source: miasto
annotated target: s. 63: Miasto jest osadą różniącą się od wsi i nierolniczych osad monofunkcyjnych względną wielkością z zagęszczoną i rozczłonkowaną zabudową, z ludnością wyspecjalizowaną zawodowo i rozwarstwioną społecznie oraz funkcjami centralnymi pełnionymi wobec określonego regionu lub lokalnej ludności w sferze polityki, panowania, obronności, gospodarki, kultu i kultury [Stadt ist eine vom Dorf und nichtagrarischen Einzwecksiedlungen unterschiedene Siedlung relativer Größe mit verdichteter, gegliederter Bebauung, beruflich spezialisierter und sozial geschichteter Bevölkerung und zentralen Funktionen politisch-herrschaftlich-militärischer, wirtschaftlicher und kultisch-kultureller Art für eine bestimmte Region oder regionale Bevölkerung] @de
jest zdefiniowany przez obiekt: Irsigler, Die Stadt im Mittelalter

Axiom
annotated property: zobacz też tekst
annotated source: plebania - obiekt
annotated target: t. 24, s. 326: 1. Domostwo plebana -- ; flaminia -- ; parochia, plebanatus -- ; curionis domus, curionium --; 2. Terytorium będące pod opieką plebana; także urząd i dochody z niego; parochia --; plebanatus --; curionatus, curionium -- ; 2a. Wierni należący do parafii --. Synonimy: probostwo, parafija.
jest zdefiniowany przez obiekt: Słownik polszczyzny XVI wieku

Axiom
annotated property: zobacz też tekst
annotated source: kaplica - obiekt
annotated target: 1. «niewielka budowla sakralna», 2. «oddzielne pomieszczenie z ołtarzem do odprawiania nabożeństw»
jest zdefiniowany przez obiekt: Słownik języka polskiego (PWN)
jest zdefiniowany przez IRI: kaplica.html

Axiom
annotated property: zobacz też tekst
annotated source: kościół - obiekt
annotated target: t. 3, s. 360-362: 1. Świątynia (nie tylko chrześcijańska), dom boży, templum, aedes sacra--. 2. swoista jednostka prawna związana z określonym kościołem (parafia, diecezja itd.), corpus paroeciae vel dioecesis (ad certam quandam ecclesiam pertinens).
jest zdefiniowany przez obiekt: Słownik staropolski

Axiom
annotated property: zobacz też tekst
annotated source: cukrownia - obiekt
annotated target: fabryka cukru
jest zdefiniowany przez obiekt: Słownik języka polskiego

Axiom
annotated property: zobacz też tekst
annotated source: klasztor - obiekt
annotated target: t. 10, s. 337: 1. Odosobnione i wyodrębnione spośród innych osiedli ludzkich miejsce zamieszkania zakonników i zakonnic (pojmowane jako budynek lub jego mieszkańcy); odosobnienie; tryb życia klasztornego; w wypadku niektórych zakonów także: szkoła, kolegium; coenobium, monasterium.
jest zdefiniowany przez obiekt: Słownik polszczyzny XVI wieku

Axiom
annotated property: zobacz też tekst
annotated source: dwór - obiekt
annotated target: s. 9: -- desygnatem dworu jest tzw. gródek stożkowaty, czyli stanowisko archeologiczne mające wyodrębnioną formę terenową, najczęściej w postaci kopca lub przestrzeni zamkniętej dookolnymi obronnymi wałami
jest zdefiniowany przez obiekt: Średniowieczny dwór rycerski w Polsce

Axiom
annotated property: zobacz też tekst
annotated source: tartak - obiekt
annotated target: t. 3, s. 607: młyn do tarcia drzew na tarcice, dyle
jest zdefiniowany przez obiekt: Słownik języka polskiego

Axiom
annotated property: zobacz też tekst
annotated source: schronisko turystyczne - obiekt
annotated target: 1] miejsce, gdzie można się schronić, czuć bezpiecznie, schronienie; [2] budynek położony na szlaku turystycznym z dala od osiedli ludzkich, służący jako miejsce odpoczynku i noclegu dla turystów (podróżnych); [3] przytułek, zakład dla bezdomnych, starców
jest zdefiniowany przez obiekt: Słownik języka polskiego

Axiom
annotated property: zobacz też tekst
annotated source: miasteczko
annotated target: t. 13, s. 369-372: 1. Od znacz. 'miejsce' --; 2. Od znacz. 'wytyczony i najczęściej otoczony murem teren pokryty gęstą i planową zabudową
jest zdefiniowany przez obiekt: Słownik polszczyzny XVI wieku

Axiom
annotated property: zobacz też tekst
annotated source: osiedle
annotated target: Rodzaj jednostki pomocniczej (Klasa: AD_RodzajJednostkiPomocniczej): Część miasta lub wsi, której uchwałą rady gminy nadano status jednostki pomocniczej.
jest zdefiniowany przez obiekt: Rozporządzenie Ministra Administracji i Cyfryzacji z dnia 9 stycznia 2012 r. w sprawie ewidencji miejscowości, ulic i adresów

Axiom
annotated property: zobacz też tekst
annotated source: kościół - obiekt
annotated target: t. 9, kol. 1025: budynek poświęcony (dedykacja lub benedykcja) w obrzędzie liturg. przez biskupa, gdzie wspólnota ochrzczonych (—> Kościół) gromadzi się na słuchanie słowa Bożego, wspólną i prywatną modlitwę oraz celebrację sakramentów, zwł. Eucharystii; miejsce przechowywania Najśw. Sakramentu, a także pochówku(—> krypta, —> konfesja); k. był określany także jako domus ecclesiae, domus orationis, Kyriakon, domus Dei, Dominicum; w kat. obrządkach wsch. nazywany jest —> cerkwią.
jest zdefiniowany przez obiekt: Encyklopedia Katolicka

Axiom
annotated property: comment
annotated source: prowincja kościelna (Kościół ewangelicki w Prusach 1817-1939)
annotated target: s. 45-46: w latach 1776-1793 rozwiązano konsystorze i nadzór przejęły urzędy rejencyjne, powrót do konsystorzy nastąpił w 1815 r., zakres działań konsystorzy był bardzo ograniczony a rolę zarządzającą pełniły urzędy rejencyjne; s. 47: konsystorz był na poziomie prowincji a więc nad rejencją, np. urzędnicy konsystorza w Poznaniu ściśle współpracowali z rejencją poznańską ale już z bydgoską nie
jest zdefiniowany przez obiekt: Protestantyzm w Poznańskiem 1815-1918

Axiom
annotated property: zobacz też tekst
annotated source: latarnia morska - obiekt
annotated target: wysoka, widoczna z morza wieża, służąca jako punkt orientacyjny dla statków
jest zdefiniowany przez obiekt: Słownik języka polskiego

Axiom
annotated property: zobacz też tekst
annotated source: osiedle
annotated target: t. 2, s. 526: nieduże skupisko budynków miejskich lub wiejskich, zespół bloków mieszkalnych, willowe, przyfabryczne, robotnicze, mieszkaniowe
jest zdefiniowany przez obiekt: Słownik języka polskiego PWN

Axiom
annotated property: zobacz też tekst
annotated source: osiedle
annotated target: t. 22, s. 124: osiedla, osiedlisko – siedziba, gospodarstwo wraz z zabudowaniami
jest zdefiniowany przez obiekt: Słownik polszczyzny XVI wieku

Axiom
annotated property: zobacz też tekst
annotated source: osada
annotated target: t. 3, s. 836-837: 1.a. miejsce, gdzie ś. nowi mieszkańcy usadowili, kolonja --; b. miejsce zajęte przez mieszkańców, większe od wsi a mniejsze do miasta --; c. [Osiedle] grunt, na którym osadzano chłopa; sadyba, zagroda włościańska
jest zdefiniowany przez obiekt: Słownik języka polskiego

Axiom
annotated property: zobacz też tekst
annotated source: karczma - obiekt
annotated target: t. 2, s. 318: dom szynkowy
jest zdefiniowany przez obiekt: Słownik języka polskiego

Axiom
annotated property: zobacz też tekst
annotated source: kolonia
annotated target: t. 5, s. 720: kolonia rolna -- gospodarstwo rolne powstałe w oddaleniu od wsi na gruntach przydzielonych w wyniku uwłaszczenia, parcelacji, komasacji, itp.; także kilka lub kilkanaście zagród w rozproszeniu -- osada na ziemiach nowo zagospodarowanych
jest zdefiniowany przez obiekt: Wielka encyklopedia powszechna PWN

Axiom
annotated property: Identifier
annotated source: Irsigler, Die Stadt im Mittelalter
annotated target: Goslar und die Stadtgeschichte. Forschungen und Perspektiven 1399–1999, hg. v. Carl-Hans Hauptmeyer/Jürgen Rund, Bielefeld 2001, s. 57–74 @de
jest zdefiniowany przez IRI: Definitionen.html

Axiom
annotated property: zobacz też tekst
annotated source: osada
annotated target: osiedle typu wiejskiego pośrednie między wsią a miasteczkiem; kolonia, mieszkańcy tego osiedla
jest zdefiniowany przez obiekt: Słownik języka polskiego
jest zdefiniowany przez IRI: https://sjp.pwn.pl/doroszewski/osada

Axiom
annotated property: zobacz też tekst
annotated source: gajówka - obiekt
annotated target: Pojedyncza zagroda, zazwyczaj położona w lesie, pełniąca funkcję mieszkania służbowego dla funkcjonariuszy pomocniczej służy leśnej podleśniczych lub gajowych
jest zdefiniowany przez obiekt: Rozporządzenie BDOT10k

Axiom
annotated property: zobacz też tekst
annotated source: browar - obiekt
annotated target: t. 2, s. 455-456: budynek, w którym się warzy piwo, piwowarnia
jest zdefiniowany przez obiekt: Słownik polszczyzny XVI wieku

Axiom
annotated property: zobacz też tekst
annotated source: uroczysko
annotated target: t. 15, s. 34: nazwa kopca lub miejsca granicznego nieosiedlonego. Według Chodakowskiego, uroczyska, na Rusi horodyszczami zwane, były to w Słowiańszczyźnie przedchrześcijańskiej place, czyli świątyń posady, do sprawowania uroczystych pogańskich ofiar przeznaczone i nie mające śladu opisania wałami, byleby oddzielna, właściwe imię mająca, przywiązana do nich była jakaś pamiątka.
jest zdefiniowany przez obiekt: S. Orgelbranda Encyklopedja powszechna z ilustracjami i mapami. T. 1 - T. 18

Axiom
annotated property: zobacz też tekst
annotated source: przedmieście
annotated target: Obszar wokół miasta, w ówczesnej Polsce i Europie uzależniony od niego prawnie i gospodarczo
jest zdefiniowany przez obiekt: Słownik polszczyzny XVI wieku

Axiom
annotated property: zobacz też tekst
annotated source: osada
annotated target: t. 22, s. 99: 1. Osiedle, miejsce zamieszkałe przez osadzoną ludność, terytorium zamieszkałe, -- a. Siedlisko, mieszkanie --; 2. Mieszkańcy osiedla; ludność żyjąca na jakimś terenie --; 3. Miejsce zdatne, dogodne do osiedlenia się --; 4. Zasiedlenie pustego miejsca, colonia.
jest zdefiniowany przez obiekt: Słownik polszczyzny XVI wieku

Axiom
annotated property: zobacz też tekst
annotated source: gród
annotated target: t. 2, s. 637: "pierwotnie osada obronna, ogrodzona palisadą lub obwałowana"
jest zdefiniowany przez obiekt: Nowa encyklopedia powszechna PWN

Axiom
annotated property: zobacz też tekst
annotated source: browar - obiekt
annotated target: t. 1, cz.12, s. 272: Browar, budynek, gdzie się piwo warzy, piwowarnia, mielcuch
jest zdefiniowany przez obiekt: Słownik języka polskiego

Axiom
annotated property: zobacz też tekst
annotated source: karczma - obiekt
annotated target: t. 15, s. 403: ‘budynek służący jako dom zajezdny dla podróżnych, a także miejsce wyszynku oraz spotkań i zabaw miejscowej ludności, wznoszony na przedmieściach większych miast, na rynkach miasteczek, przy uczęszczanych traktach, we wsiach w pobliżu kościoła lub dworu’ @de
jest zdefiniowany przez obiekt: Praktyczny słownik współczesnej polszczyzny

Axiom
annotated property: zobacz też tekst
annotated source: osiedle
annotated target: t. 20, s. 56: osiedle mieszkaniowe – zespół mieszkaniowy stanowiący strukturalną jednostkę mieszkaniową w mieście; pojęcie „osiedle mieszkaniowe” wywodzi się z koncepcji jednostki sąsiedzkiej; wielkość osiedla mieszkaniowego wynika z zasięgu pieszego dojścia (600–800 m) do ośrodka usługowego oraz gęstości zaludnienia (5–20 tys. mieszk.) obszaru obsługiwanego przez ten ośrodek. Stanowi zespół budynków mieszkalnych wraz z integralnym zapleczem obiektów usługowych oraz terenów zieleni; niekiedy są wydzielane części osiedli mieszkaniowych – kolonie, złożone z kilku bloków mieszkalnych; kilka osiedli mieszkaniowych tworzy dzielnicę.
jest zdefiniowany przez obiekt: Wielka Encyklopedia PWN

Axiom
annotated property: zobacz też tekst
annotated source: osada miejska
annotated target: t. 20. s.47: od 1867 nazwa „osada miejska” jest używana dla niewielkich osiedli pozbawionych praw miejskich, które nie są wsiami.
jest zdefiniowany przez obiekt: Wielka Encyklopedia PWN

Axiom
annotated property: zobacz też tekst
annotated source: port morski - obiekt
annotated target: t. 2, cz. 2. s. 929: część można między ziemią zamknięta, do którey okręty wchodzą o od burzy morskiey bezpieczeństwo znayduią
jest zdefiniowany przez obiekt: Słownik języka polskiego

Axiom
annotated property: zobacz też tekst
annotated source: gajówka - obiekt
annotated target: t. 1, s. 793: chatka gajowego
jest zdefiniowany przez obiekt: Słownik języka polskiego

Axiom
annotated property: zobacz też tekst
annotated source: huta - obiekt
annotated target: zakład lub zespół zakładów przemysłowych produkujących metale z rud, szkło, siarkę i in.’, huty przerabiają nie tylko rudy na surówkę, lecz także surówkę na stal
jest zdefiniowany przez obiekt: Słownik języka polskiego

Axiom
annotated property: zobacz też tekst
annotated source: osiedle
annotated target: 12. Typ ciągu komunikacyjnego (Klasa: AD_TypUlicyKod): Część miasta, wsi lub osady, dla której utworzono odrębny spójny zbiór numerów porządkowych nieprzyporządkowanych do żadnej ulicy ani placu.
jest zdefiniowany przez obiekt: Rozporządzenie Ministra Administracji i Cyfryzacji z dnia 9 stycznia 2012 r. w sprawie ewidencji miejscowości, ulic i adresów

Axiom
annotated property: zobacz też tekst
annotated source: konsystorz generalny (Kościół ewangelicko-augsburski w Polsce 1849-1939)
annotated target: s. 15: Warszawski Okręg Konsystorski nie został włączony do konsystorza generalnego w Petersburgu po 1832 roku, nie wykonano też żadnych ruchów w tym kiierunku po 1849 r.
jest zdefiniowany przez obiekt: Die evangelisch-augsburgischen Gemeinden in Polen 1555-1939: Eine Parochialgeschichte in Einzeldarstellungen

Axiom
annotated property: comment
annotated source: okręg kościelny (Kościół ewangelicki w Prusach 1817-1939)
annotated target: s. XXVI: In Folge der Kreiseintheilung von 1816 wurde auch die Sprengel der Superintendenturen mehr nach den Kreisgrenzen festgesetz und zwar --. @de
jest zdefiniowany przez obiekt: Chronik und Statistik der evangelischen Kirchen in den Provinzen Ost- und Westpreussen

Axiom
annotated property: zobacz też tekst
annotated source: wieś
annotated target: t. XX, s. 199–201: 1. osada, w której ludność zajmuje się głównie rolnictwem, 2. mieszkańcy wsi, ogół mieszkańców wsi.
jest zdefiniowany przez obiekt: Słownik staropolski

Axiom
annotated property: zobacz też tekst
annotated source: gorzelnia - obiekt
annotated target: t. 1, cz. 2, s. 54: Gorzalnia, gorzelnia, budowanie do palenia gorzałki (pospolicie zowią: browarem, ale borwar na piwo iest.)
jest zdefiniowany przez obiekt: Słownik języka polskiego

Axiom
annotated property: comment
annotated source: prowincja kościelna (Kościół ewangelicki w Prusach 1817-1939)
annotated target: s. 114: urząd generalnego superintendenta równoważny z sakrą biskupią
jest zdefiniowany przez obiekt: Niemcy w Polsce w XX wieku

Axiom
annotated property: zobacz też tekst
annotated source: dwór - obiekt
annotated target: 1. przestrzeń otaczając dom, otwarte powietrze, miejsce pod gołym niebem; 2. podwórze, dziedziniec; 3. dom właściciela majątku ziemskiego, mieszkanie dziedzica; 4. gospodarstwo dworskie, folwark; 5. (przenośnie) mieszkańcy dworu wiejskiego, szczególnie dziedzic z rodziną, państwo; 6. dom, mieszkanie; 7. oficjaliści panów, szczególnie wyżsi, dworzanie; 8. miejsce pobytu albo mieszkanie panującego albo magnata; 9. panujący i jego otoczenie; 10. służba dworska; 11. zebranie u króla, sąd dworski, żołnierze nadworni
jest zdefiniowany przez obiekt: Słownik języka polskiego

Axiom
annotated property: zobacz też tekst
annotated source: kolonia
annotated target: Jednostka osadnicza powstała jako rezultat ekspansji miejscowości poza obszar wcześniej istniejącej zabudowy, w szczególności kolonia miasta, kolonia wsi.
jest zdefiniowany przez obiekt: Rozporządzenie BDOT10k

Axiom
annotated property: zobacz też tekst
annotated source: kaplica - obiekt
annotated target: t. 8, kol. 676: niewielka budowla kultowa (najczęściej z ołtarzem), wolno stojąca lub związana z większym kompleksem archit., także pomieszczenie, czyli oratorium, miejsce modlitwy liturg. i prywatnej, przeznaczone przez ordynariusza do sprawowanie wszystkich lub niektórych funkcji liturg. dla niewielkiej grupy wiernych, do którego za zgodą kompetentnego przełożonego mogą przychodzić także in. wierni.
jest zdefiniowany przez obiekt: Encyklopedia Katolicka

Axiom
annotated property: zobacz też tekst
annotated source: folwark
annotated target: t. 7, s. 90–91: 1. ziemskie gospodarstwo, w przeciwieństwie do gospodarstwa chłopskiego, grunt z zabudowaniami gospodarskimi i mieszkalnymi, często będący częścią większej majętności; zazwyczaj wydzielona część wsi; 2. zabudowania gospodarcze; 3. ziemia orna, rola należąca do folwarku; 4. posiadłość ziemska, dworek z zabudowaniami gospodarskimi położony pod miastem; 5. wieś
jest zdefiniowany przez obiekt: Słownik polszczyzny XVI wieku

Axiom
annotated property: zobacz też tekst
annotated source: klasztor - obiekt
annotated target: t. 9, kol. 66-76: zespół budynków lub pomieszczeń mieszkalnych i gospodarczych o różnej strukturze, przeznaczonych do prowadzenia życia pustelniczego (zob. ławra) lub wspólnotowego życia ascetycznego (zob. asceza), występujący w religiach pozachrześcijańskich i chrześcijaństwie. -- Czasem rozbudowane założenia klasztorne tworzyły wręcz miasto, a nawet państwo mnichów (civitas monachorum)
jest zdefiniowany przez obiekt: Encyklopedia Katolicka

Axiom
annotated property: zobacz też tekst
annotated source: zamek - obiekt
annotated target: od średniowiecza do w. XVII obronna siedziba pana feudalnego, ośrodek władzy; w XVII w. i później królewska, książęca lub magnacka rezydencja miejska lub pozamiejska
jest zdefiniowany przez obiekt: Słownik języka polskiego

Axiom
annotated property: zobacz też tekst
annotated source: karczma - obiekt
annotated target: t. 10, s. 136: miejsce wyszynku alkoholu i spotkań okolicznej ludności, przede wszystkim chłopów, także gospoda, dom zajezdny; taberna
jest zdefiniowany przez obiekt: Słownik polszczyzny XVI wieku

Axiom
annotated property: zobacz też tekst
annotated source: konsystorz generalny (Kościół ewangelicko-augsburski w Polsce 1849-1939)
annotated target: s. 11: początkowo ewangelicy litewscy z Wilna byli związani z konsystorzem w Królewcu; od 1652 r. sami nazywają się konsystorzem, co oznacza rozluźnienie więzów z Prusami; od 1794 r. podporządkowani Justizkolegium w Petersburgu; w 1832 r. został zlikwidowany konsystorz ewangelicko-augsburski w Wilnie i podporządkowanie Mitawie, a ten nadkonsystorzowi w Petersbugu, w 1922 r. wchłonięty do Konsystorza Warszawskiego.
jest zdefiniowany przez obiekt: Die evangelisch-augsburgischen Gemeinden in Polen 1555-1939: Eine Parochialgeschichte in Einzeldarstellungen

Axiom
annotated property: zobacz też tekst
annotated source: tartak - obiekt
annotated target: zakład przemysłowy zajmujący się przecieraniem drewna na tarcicę
jest zdefiniowany przez obiekt: Słownik języka polskiego
jest zdefiniowany przez IRI: https://sjp.pwn.pl/doroszewski/tartak

Axiom
annotated property: zobacz też tekst
annotated source: cegielnia - obiekt
annotated target: wytwórnia cegly oraz innych materiałów budowlanych z gliny: dachówek, sączków (drenów), kafli, klinkierów, płytek itp.
jest zdefiniowany przez obiekt: Słownik języka polskiego

Axiom
annotated property: zobacz też tekst
annotated source: kościół - obiekt
annotated target: 2. «budynek, miejsce modlitwy chrześcijan»
jest zdefiniowany przez obiekt: Słownik języka polskiego (PWN)
jest zdefiniowany przez IRI: https://sjp.pwn.pl/sjp/kosciol

Axiom
annotated property: zobacz też tekst
annotated source: klasztor - obiekt
annotated target: t. 1, cz. 2, s. 1010: pomieszkanie zakonnicze
jest zdefiniowany przez obiekt: Słownik języka polskiego

Axiom
annotated property: zobacz też tekst
annotated source: port morski - obiekt
annotated target: przybrzeżny obszar wodny, odpowiednio pogłębiony, osłonięty przed wiatrem i falą, przeznaczony dla postoju statków, wyposażony w specjalne urządzenia służące do ich załadowywania, wyładowywania, zaopatrzenia i naprawy; miasto nabrzeżne, w którym jest także miejsce postoju statków.
jest zdefiniowany przez obiekt: Słownik języka polskiego

Axiom
annotated property: zobacz też tekst
annotated source: kolonia
annotated target: „W ten sposób termin 'osada' może tutaj oznaczać nie tylko małe osiedla, złożone z jednego lub kilku wyodrębnionych terytorialnie gospodarstw włościańskich, jak to miało miejsce na innych ziemiach polskich, lecz i większe, o charakterze kolonii, t. j. osiedli rozrzuconych na większej przestrzeni, a powstałych zazwyczaj na gruntach rozparcelowanych przez władze zaborcze”
jest zdefiniowany przez obiekt: Skorowidz miejscowości Rzeczpospolitej Polskiej opracowany na podstawie wyników pierwszego powszechnego spisu ludności z dn. 30 września 1921 roku, tom XI: Województwo Pomorskie

Axiom
annotated property: zobacz też tekst
annotated source: leśniczówka - obiekt
annotated target: t. 2, s. 721: domek w lesie, mieszkanie, zagroda leśniczego a. leśnika
jest zdefiniowany przez obiekt: Słownik języka polskiego

Axiom
annotated property: zobacz też tekst
annotated source: plebania - obiekt
annotated target: t. 2, cz. 2, s. 732: Pleban -- Plebania, -ii, ż., urząd plebański abo beneficjum --; Dochód plebański, ut dobra --; plebaniia, dom plebański, die Pfarrwohnung, die Pfarre. J ksiądz widzimy, plebaniią rzadki Buduie, że kto inszy weźmie po nim spadki. Pot. Pocz. 475 (Slo. fara; Hg. plebania; Cro. plebania; Vd. faroush; Ross. приходъ (cf. przychód).
jest zdefiniowany przez obiekt: Słownik języka polskiego

Axiom
annotated property: zobacz też tekst
annotated source: huta - obiekt
annotated target: rozróżnia hutę i hutę szkła. Huta – ‘zakład metalurgiczny, w którym wytapia się metale z rud’, zaś Huta szkła – ‘zakład wytapiający szkło i wytwarzający produkty szklane’
jest zdefiniowany przez obiekt: Słownik języka polskiego (PWN)

Axiom
annotated property: comment
annotated source: konsystorz generalny (Kościół ewangelicki w Królestwie Polskim 1828-1849)
annotated target: s. 15: Warszawski Okręg Konsystorski nie został włączony do konsystorza generalnego w Petersburgu po 1832 roku, nie wykonano też żadnych ruchów w tym kiierunku po 1849 r. Wg. autora byłoby to korzystne i część duchownych to dostrzegała
jest zdefiniowany przez obiekt: Die evangelisch-augsburgischen Gemeinden in Polen 1555-1939: Eine Parochialgeschichte in Einzeldarstellungen

Axiom
annotated property: zobacz też tekst
annotated source: cukrownia - obiekt
annotated target: zakład przemysłowy produkujący cukier
jest zdefiniowany przez obiekt: Słownik języka polskiego (PWN)
jest zdefiniowany przez IRI: cukrownia.html

Axiom
annotated property: zobacz też tekst
annotated source: klasztor - obiekt
annotated target: 1. zgromadzenie zakonne; zakon--; 2. budynek lub kompleks budynków zamieszkiwanych przez zakonników (zakonnice) danej reguły
jest zdefiniowany przez obiekt: Słownik języka polskiego

Axiom
annotated property: zobacz też tekst
annotated source: schronisko turystyczne - obiekt
annotated target: budynek na szlaku turystycznym służący jako miejsce odpoczynku i noclegu dla turystów (kategorie: budynki, budowle i urządzenia; kompleksu użytkowania terenu, miejscowości)
jest zdefiniowany przez obiekt: Rozporządzenie BDOT10k

Axiom
annotated property: zobacz też tekst
annotated source: letnisko
annotated target: miejscowość wypoczynkowa; letni pobyt poza miastem w celach wypoczynkowych
jest zdefiniowany przez obiekt: Słownik języka polskiego

Axiom
annotated property: zobacz też tekst
annotated source: osada
annotated target: t. 3, s. 547: osada, koloniia, mieysce, gdzie się nowi mieszkańcy sadowią, eine Kolonie (cf. wola), Pflanzstadt, Pflanzort, Ansiedlung; -- Vd. selizhzhe, preselishe, selitva, naselitva; Rs. колонїя, селенїе (ob. sieło, sioło), поселенїе, селишьба.
jest zdefiniowany przez obiekt: Słownik języka polskiego

Axiom
annotated property: zobacz też tekst
annotated source: superintendentura (Kościół ewangelicko-augsburski w Polsce 1849-1939)
annotated target: s. 21: Funkcjonowały na poczatku 4 superintendentury, w 1901 r. utworzono piątą
jest zdefiniowany przez obiekt: Kościoły ewangelickie na Kresach Wschodnich II Rzeczypospolitej

Axiom
annotated property: zobacz też tekst
annotated source: browar - obiekt
annotated target: zakład przemysłowy, w którym wyrabia się piwo; wytwórnia piwa
jest zdefiniowany przez obiekt: Słownik języka polskiego

Axiom
annotated property: zobacz też tekst
annotated source: plebania - obiekt
annotated target: dom należący do parafii, przeznaczony na mieszkanie dla proboszcza
jest zdefiniowany przez obiekt: Słownik języka polskiego (PWN)

Axiom
annotated property: zobacz też tekst
annotated source: przedmieście
annotated target: osada, teren, posiadłość poza obrębem murów miejskich
jest zdefiniowany przez obiekt: Słownik staropolski

Axiom
annotated property: zobacz też tekst
annotated source: kaplica - obiekt
annotated target: t. 10, s. 81: Mały kościół lub nieduże pomieszczenie z ołtarzem, przeznaczone do uprawiania kultu religijnego; też wydzielona część kościoła (wyraz przeniesiony również na świątynie i pomieszczenia służące innym kultom); sacellum --; aedicula --; sacrarium--; oratorium--; aedes, fanum--; aedis sacrae appendix, augurale, auguratorium, fanulum (s. hanulum), lararium, parvum delubrum
jest zdefiniowany przez obiekt: Słownik polszczyzny XVI wieku

Axiom
annotated property: comment
annotated source: konsystorz generalny (Kościół ewangelicki w Królestwie Polskim 1828-1849)
annotated target: s. 29: Komisja Rządowa Wyznań Religijnych i Oświecenia publicznego zlikwidowała istniejące luterańskie konsystorze departamentowe utworzone po 1807 r.
jest zdefiniowany przez obiekt: Polacy-ewangelicy w Królestwie Polskim 1815-1914: Kształtowanie sie środowisk ich działalność społeczna i narodowa

Axiom
annotated property: zobacz też tekst
annotated source: osiedle
annotated target: t. 6, s. 1121: nieduże skupienie siedzib ludzkich (miejskich lub wiejskich); reg. na wsi: dom mieszkalny wraz z zabudowaniami gospodarczymi, zagroda, dostatnie osiedle bogatego chłopa, sołtysowe osiedle
jest zdefiniowany przez obiekt: Słownik języka polskiego

Axiom
annotated property: zobacz też tekst
annotated source: kuźnica - obiekt
annotated target: t. 2, s. 561: utożsamia pojęcia kuźnia i kuźnica, podaje też termin bliskoznaczny kowalnia
jest zdefiniowany przez obiekt: Słownik języka polskiego

Axiom
annotated property: zobacz też tekst
annotated source: wieś
annotated target: t. 4, s. 365: wioska, imienie, dobro, grunt leżący; wieś targowa, wsie łowcze, osoczne, wołoskie.
jest zdefiniowany przez obiekt: Słownik języka polskiego

Axiom
annotated property: zobacz też tekst
annotated source: klasztor - obiekt
annotated target: t. 3, s. 282: zabudowanie dla zgromadzenia zakonnego zwykle połączone z kościołem, coenobium, religiosorum domus.
jest zdefiniowany przez obiekt: Słownik staropolski

Axiom
annotated property: zobacz też tekst
annotated source: browar - obiekt
annotated target: zakład produkujący piwo
jest zdefiniowany przez obiekt: Słownik języka polskiego (PWN)
jest zdefiniowany przez IRI: browar.html

Axiom
annotated property: zobacz też tekst
annotated source: torfiarnia - obiekt
annotated target: t. 7, s. 85: kopalnia torfu, torfowisko eksploatowane
jest zdefiniowany przez obiekt: Słownik języka polskiego

Axiom
annotated property: zobacz też tekst
annotated source: gorzelnia - obiekt
annotated target: zakład przemysłowy produkujący alkohol etylowy
jest zdefiniowany przez obiekt: Słownik języka polskiego (PWN)
jest zdefiniowany przez IRI: gorzelnia.html

Axiom
annotated property: zobacz też tekst
annotated source: stacja kolejowa - obiekt
annotated target: miejsce, gdzie zatrzymują się pociągi
jest zdefiniowany przez obiekt: Słownik języka polskiego

Axiom
annotated property: zobacz też tekst
annotated source: kuźnica - obiekt
annotated target: t. 3, s. 1328: zakład przemysłowy, fabryka wyrobów z żelaza itp. metali; dawniej kuźnia
jest zdefiniowany przez obiekt: Słownik języka polskiego

Axiom
annotated property: zobacz też tekst
annotated source: miasto
annotated target: Skupisko ludności, odróżniające się od innych swymi głównie nierolniczymi funkcjami, znaczną wielkością oraz intensywnością zabudowy. Definicja ta musi być jednak interpretowana elastycznie i zawsze na tle aktualnej sieci osadniczej.
jest zdefiniowany przez obiekt: Wielka encyklopedia powszechna PWN

Axiom
annotated property: zobacz też tekst
annotated source: folwark
annotated target: duże gospodarstwo rolne wraz z zabudowaniami.
jest zdefiniowany przez obiekt: Słownik języka polskiego
jest zdefiniowany przez IRI: https://sjp.pwn.pl/doroszewski/folwark

Axiom
annotated property: zobacz też tekst
annotated source: karczma - obiekt
annotated target: t. 1, s. 296–298: ‘budynek, w którym warzono, sprzedawano, później głównie szynkowano piwo, miód pitny, od XVI w. gorzałkę; niektóre karczmy, zwłaszcza przy ważniejszych drogach i w miastach, dawały posiłki i obrok dla koni oraz zapewniały nocleg podróżnym (zwano je gościńcami); sprzedawano w nich różne wyroby, głównie spożywcze, rzadziej odzieżowe. Dostarczały też karczmy różnego rodzaju rozrywek, często z muzyką, były miejscem tańców i zabaw. Niekiedy w karczmach odbywał sesje sąd (zwłaszcza wiejski), załatwiano tu sprawy urzędowe podczas popasu dostojników czy pobytu miejscowych oficjalistów [...]’.
jest zdefiniowany przez obiekt: Encyklopedia historii gospodarczej Polski do 1945 roku

Axiom
annotated property: zobacz też tekst
annotated source: folwark
annotated target: t. 1, s. 759: 1. mała wioska, leżąca obok dużej, oddzielona część wsi; przysiółek; 2. majętność, grunt z zabudowaniem, ferma; 3. dwór we wsi, mieszkanie dziedzica albo dzierżawcy razem z zabudowaniami dworskimi.
jest zdefiniowany przez obiekt: Słownik języka polskiego

Axiom
annotated property: zobacz też tekst
annotated source: wieś
annotated target: Kirchdorf: Dorf mit Kirche (I) und Pfarrer, rechtlicher und religiöser Mittelpunkt einer (eventuell aus mehreren Filialdörfern bestehenden) politischen oder Pfarr-Gemeinde [Wieś z kościołem i parafią, prawne i religijne centrum gminy politycznej albo parafialnej (ewentualnie składającej się z kilku wsi filialnych, wsi z kościołami filialnymi] @de
jest zdefiniowany przez obiekt: Deutsche Rechtswörterbuch

Axiom
annotated property: zobacz też tekst
annotated source: folwark
annotated target: t. 1, s. 173: duże gospodarstwo rolne lub rolno-hodowlane, produkujące głównie na zbyt, posługujące się pracą chłopów pańszczyźnianych albo siłą najemną. Organizowane przez feudalnych właścicieli ziemskich już w XIV w., stanowiły kontynuację tzw. rezerwy pańskiej, czyli gruntów wyłączonych spod uprawy chłopskiej i przeznaczonych do zaspokajania bezpośrednich potrzeb dworu--’
jest zdefiniowany przez obiekt: Encyklopedia historii gospodarczej Polski do 1945 roku

Axiom
annotated property: zobacz też tekst
annotated source: uroczysko
annotated target: u dawnych Słowian: miejsce przed świątynią lub w głębi puszczy, związane z kultem jakiegoś bóstwa, z odbywaniem narad, sądów; ogólnie: miejsce odludne, tajemnicze; pustkowie -- 2. część terenu (zwykle lasu wyodrębniona za pomocą nazwy o charakterze topograficznym.
jest zdefiniowany przez obiekt: Słownik języka polskiego
jest zdefiniowany przez IRI: http://sjp.pwn.pl/doroszewski/uroczysko

Axiom
annotated property: comment
annotated source: osada
annotated target: „W ten sposób termin 'osada' może tutaj oznaczać nie tylko małe osiedla, złożone z jednego lub kilku wyodrębnionych terytorialnie gospodarstw włościańskich, jak to miało miejsce na innych ziemiach polskich, lecz i większe, o charakterze kolonii, t. j. osiedli rozrzuconych na większej przestrzeni, a powstałych zazwyczaj na gruntach rozparcelowanych przez władze zaborcze”
jest zdefiniowany przez obiekt: Skorowidz miejscowości Rzeczpospolitej Polskiej opracowany na podstawie wyników pierwszego powszechnego spisu ludności z dn. 30 września 1921 roku, tom XI: Województwo Pomorskie

Axiom
annotated property: zobacz też tekst
annotated source: kuźnica - obiekt
annotated target: t. 3, s.473–474: ‘warsztat wytopu i obróbki żelaza’
jest zdefiniowany przez obiekt: Słownik staropolski

Axiom
annotated property: zobacz też tekst
annotated source: osiedle
annotated target: zespół mieszkaniowy stanowiący integralną część miasta lub wsi
jest zdefiniowany przez obiekt: Rozporządzenie BDOT10k

Axiom
annotated property: zobacz też tekst
annotated source: osada
annotated target: Niewielka jednostka osadnicza na terenie wiejskim o odmiennym(wyróżniającym się) charakterze zabudowy albo zamieszkana przez ludność zwiazaną z określonym miejscem lub rodzajem pracy, w szczególności: osada młyńska, osada leśna, osada rybacka, osada kolejowa, osada po byłym państwowym gospodarstwie rolnym; osada może być samodzielna lub może stanowić część innej jednostki osadniczej.
jest zdefiniowany przez obiekt: Rozporządzenie BDOT10k

Axiom
annotated property: zobacz też tekst
annotated source: klasztor - obiekt
annotated target: 1. budynek lub kompleks budynków stanowiących wspólne miejsce zamieszkiwania zakonnic lub zakonników; 2. wspólnota zakonna o określonej regule
jest zdefiniowany przez obiekt: Słownik języka polskiego (PWN)
jest zdefiniowany przez IRI: klasztor.html

Axiom
annotated property: zobacz też tekst
annotated source: kopalnia - obiekt
annotated target: zakład górniczy zajmujący się wydobywaniem z ziemi kopalin użytecznych
jest zdefiniowany przez obiekt: Słownik języka polskiego

Axiom
annotated property: zobacz też tekst
annotated source: torfiarnia - obiekt
annotated target: kopalnia torfu
jest zdefiniowany przez obiekt: Słownik języka polskiego
jest zdefiniowany przez IRI: torfiarnia

Axiom
annotated property: zobacz też tekst
annotated source: gród
annotated target: t. 6, s. 22: "miejsce obronne w znaczeniu późniejszym tyle co "zamek", "miasto""
jest zdefiniowany przez obiekt: Wielka ilustrowana encyklopedia powszechna (Wydawnictwa Gutenberga)

Axiom
annotated property: zobacz też tekst
annotated source: cukrownia - obiekt
annotated target: t. 1, cz. 1, s. 327: [Brak hasła „cukrownia”.] Cukrowarz, fabrykant cukru, warzący sok na cukier, derZuckersieder, cf. Cukiernik.
jest zdefiniowany przez obiekt: Słownik języka polskiego

Axiom
annotated property: zobacz też tekst
annotated source: smolarnia - obiekt
annotated target: huta smolana, t. 3, s. 519:
jest zdefiniowany przez obiekt: Słownik języka polskiego

Axiom
annotated property: zobacz też tekst
annotated source: przystanek kolejowy - obiekt
annotated target: mała stacja kolejowa przeznaczona tylko dla ruchu pasażerskiego
jest zdefiniowany przez obiekt: Słownik języka polskiego

Axiom
annotated property: zobacz też tekst
annotated source: kopalnia - obiekt
annotated target: zakład górniczy zajmujący się wydobywaniem z ziemi kopalin
jest zdefiniowany przez obiekt: Słownik języka polskiego (PWN)
jest zdefiniowany przez IRI: https://sjp.pwn.pl/sjp/kopalnia

Axiom
annotated property: comment
annotated source: okręg kościelny (Kościół ewangelicki w Prusach 1817-1939)
annotated target: s. 369: Die ältere Theilung des Herzgothums, dann Königsreichs Preussen in geistlichen Inspectionen erlitt schon vor der neuen Kreiseintheilung -- eingerichtet werden @de
jest zdefiniowany przez obiekt: Historisch-comparative Geographie von Preussen

Axiom
annotated property: zobacz też tekst
annotated source: osiedle
annotated target: t. 3, s. 590: osiedlić, na osadzie czyli siedlisku postanowić kogoś, osadzić go; osiedlisko – miejsce osiedlenia, osada, osiadłość
jest zdefiniowany przez obiekt: Słownik języka polskiego

Axiom
annotated property: zobacz też tekst
annotated source: kolonia
annotated target: t. 1, s. 900: Osiedla mieszkaniowe położone z dala od centrum miasta, osady: niewielka posiadłość ziemska , nowa osada lub gospodarstwo rolne na gruntach przydzielonych w wyniku uwłaszczenia, parcelacji, komasacji, migracji wewnętrznej itp.
jest zdefiniowany przez obiekt: Słownik języka polskiego PWN

Axiom
annotated property: zobacz też tekst
annotated source: kaplica - obiekt
annotated target: t. 1, cz 2, s. 955: miejsce bogu poświęcone, w którym obowiązki kościelne za zezwoleniem zwierzchności odprawować się mogą.
jest zdefiniowany przez obiekt: Słownik języka polskiego

Axiom
annotated property: zobacz też tekst
annotated source: smolarnia - obiekt
annotated target: «dawny zakład, w którym się wyprażało z drewna smołę»
jest zdefiniowany przez obiekt: Słownik języka polskiego (PWN)
jest zdefiniowany przez IRI: https://sjp.pwn.pl/sjp/smolarnia

Axiom
annotated property: zobacz też tekst
annotated source: huta - obiekt
annotated target: t. 2, s. 67: ‘zakład, gdzie robią szkło albo topią metale’
jest zdefiniowany przez obiekt: Słownik języka polskiego

Axiom
annotated property: zobacz też tekst
annotated source: uroczysko
annotated target: s. 57-80: uroczyska to cała gama pojęć, stale łąki i lokacje straży leśnej, czasem synonimy borów i ostępów, zjawiska terenowe zasadniczo rozległe o wielce zróżniczkowanej, a raczej nieuchwytnej i zatraconej już, treści. Można tylko utrzymywać, że uroczyska to teren eksploatacji par excellence.
jest zdefiniowany przez obiekt: Dzieje Puszczy Białowieskiej w Polsce przedrozbiorowej (w okresie do 1798 roku)

Axiom
annotated property: zobacz też tekst
annotated source: uroczysko
annotated target: 1. teren trudno dostępny, najczęściej bagnisty, leśny; też: miejsce odludne, 2. część terenu otoczona naturalnymi granicami, wyodrębniona za pomocą nazwy topograficznej, 3. u dawnych Słowian: miejsce w głębi puszczy związane z kultem bóstwa, odbywaniem narad lub uważane za siedzibę złych duchów
jest zdefiniowany przez obiekt: Słownik języka polskiego (PWN)
jest zdefiniowany przez IRI: http://sjp.pwn.pl/sjp/uroczysko