Informatics Research Artifacts Ontology
type: Ontology
version IRI: InformaticsResearchArtifactsOntology
contributor: Vojtěch Svátek
creator: Nguyen Viet Bach
date: 2021-03-18
description: Abstract: Informatics Research Artifacts Ontology, described using W3C RDF Schema and the Web Ontology Language OWL.
publisher: Prague University of Economics and Business, Czech Republic. Faculty of Informatics and Statistics. Department of Knowledge and Information Engineering
rights: Copyright © 2021 Prague University of Economics and Business
subject: Informatics, Research Artifacts, Ontology, Semantic SEO, Linked Data, RDF, Semantic Web
created: 2021-03-18
license: https://creativecommons.org/licenses/by/3.0/
preferred namespace prefix: irao
preferred namespace uri: http://ontology.ethereal.cz/irao/
version info: Version 1.1.1, Release 2021 Mar 18

has accessibility
type: ObjectProperty
domain: Research Artifact
range: Accessibility
comment: This property specifies the accessibility of a research artifact

has affiliation
type: ObjectProperty
domain: Researcher
range: Affiliation
comment: This property specifies the affiliation of a researcher

has author
type: ObjectProperty
domain: Research Artifact
range: Person
comment: This property specifies the author of a research artifact

has design
type: ObjectProperty
domain: Research Artifact
range: Design quality
comment: This property specifies the design of a research artifact

has design quality
type: ObjectProperty
domain: Design
range: Design quality
comment: This property specifies the design quality of a design

has development status
type: ObjectProperty
domain: Research Artifact
range: Development status
comment: This property specifies the development status of a research artifact

has domain
type: ObjectProperty
domain: Research Artifact
range: Research Domain
comment: This property specifies the research domain of a research artifact

has field
type: ObjectProperty
domain: Research Artifact
range: Research Field
comment: This property specifies the research field of a research artifact

has followed protocol
type: ObjectProperty
domain: Benchmark
range: Protocol
comment: This property specifies the protocol that a benchmark follows

has framework
type: ObjectProperty
domain: Software
range: Framework
comment: This property specifies the framework used by a software

has license
type: ObjectProperty
domain: Research Artifact
range: License
comment: This property specifies the license of a research artifact

has license type
type: ObjectProperty
domain: License
range: License type
comment: This property specifies the type of a license

has measuring system
type: ObjectProperty
domain: Benchmark
range: System
comment: This property specifies a system that measures a benchmark

has methodology
type: ObjectProperty
domain: Class
  union of: Dataset
  union of: Framework
  union of: Protocol
range: Methodology
comment: This property specifies the methodology used by a research artifact

has open standard
type: ObjectProperty
domain: Research Artifact
range: Open Standard
comment: This property specifies the open standard used by a research artifact

has produced dataset
type: ObjectProperty
domain: Benchmark
range: Dataset
comment: This property specifies the dataset which us produced by a benchmark

has publication
type: ObjectProperty
domain: Research Artifact
range: Publication
comment: This property specifies the publication of a research artifact

has refered benchmark
type: ObjectProperty
domain: Benchmark
range: Benchmark
comment: This property specifies a benchmark refered by another benchmark

has repository type
type: ObjectProperty
domain: Repository
range: Repository Type
comment: This property specifies the repository type of a research artifact repository

has research area
type: ObjectProperty
domain: Research Artifact
range: Topic
comment: This property specifies the research area of a research artifact

has research output
type: ObjectProperty
domain: Research project
range: Research output
comment: This property specifies the research output of a research project

has used framework
type: ObjectProperty
domain: Class
  union of: Framework
  union of: Software
  union of: System
range: Framework
comment: This property specifies the framework used by a research artifact like software or system

has used methodology
type: ObjectProperty
domain: Class
  union of: Dataset
  union of: Framework
range: Methodology
comment: This property specifies the methodology used in a research artifact like framework or dataset

has used ontology design pattern
type: ObjectProperty
domain: Class
  union of: Ontology
  union of: Ontology design pattern
range: Ontology design pattern
comment: This property specifies the ontology design pattern of an ontology or another ontology design pattern

is described by
type: ObjectProperty
domain: Dataset
range: Data model
comment: This property specifies the data model of a dataset

is followed by
type: ObjectProperty
domain: Research project
range: Research project
comment: This property specifies that a research project is followed by another research project

is maintained by
type: ObjectProperty
domain: Research Artifact
range: Researcher
comment: This property specifies the maintainer of a research artifact

is part of system
type: ObjectProperty
domain: Software
range: System
comment: This property specifies the system which a software is part of

is published at
type: ObjectProperty
domain: Research Artifact
range: Repository
comment: This property specifies the repository that a research artifact is published at

is used by
type: ObjectProperty
domain: Research Artifact
range: Research Artifact
comment: This property specifies that a research artifact is used by another research artifact

has topic
type: DatatypeProperty
domain: Publication
range: string
comment: This property specifies the topic of a publication

has URL
type: DatatypeProperty
domain: Class
  union of: Publication
  union of: Repository
  union of: Research Artifact
range: anyURI
comment: This property specifies the resource URL of a publication, repository or research artifact

has version
type: DatatypeProperty
domain: Research Artifact
range: string
comment: This property specifies the version of a research artifact

API
type: Class
subclass of: Service
comment: An API is a type of service-based research artifact

Accessibility
type: Class
comment: A research artifact can be made accessible via download or some kind of API, etc.

Affiliation
type: Class
comment: An affiliation of the author, it maybe a company or an institution

Annotated Dataset
type: Class
subclass of: Dataset
comment: A dataset which was processed for AI or machine learning

Application Framework
type: Class
subclass of: Software Framework
comment: A framework that is used by applications

Benchmark
type: Class
subclass of: Informatics Research Artifact
comment: A benchmark is a type of comparison and measuring with metrics, producing datasets and algorithms for comprehensive and systematic evaluation of existing and future systems

Conference paper
type: Class
subclass of: Publication
comment: A paper or article published at a scientific conference

Data model
type: Class
subclass of: Model
comment: A data model such as schema and ontologies

Dataset
type: Class
subclass of: Informatics Research Artifact
comment: A dataset containing the gathered or generated data about some topic

Design
type: Class
subclass of: Informatics Research Artifact
comment: A plan or specification for the construction or production of a research artifact

Design quality
type: Class
comment: A design quality involves the usage of recommended standards, protocols, frameworks, methodologies

Development status
type: Class
comment: The development status of a research artifact, informing about its maturity

Framework
type: Class
subclass of: Informatics Research Artifact
comment: The framework is a type of an informatics research artifact

Informatics Research Artifact
type: Class
subclass of: Research Artifact
comment: An informatics research artifact is a research artifact in the informatics field

License
type: Class
comment: A license authorizes the use, performace, or release of a research artifact

License type
type: Class
comment: The type of a license

Methodology
type: Class
subclass of: Informatics Research Artifact
comment: Methodology is a type of research artifact

Middleware
type: Class
subclass of: Software
comment: A middleware is a type of software that is used to connect software components in to a system

Model
type: Class
subclass of: Informatics Research Artifact
comment: A model is a type of research artifact that can be used to describe other artifacts such as a dataset or a software

Ontology
type: Class
subclass of: Data model
comment: An ontology is a type of data model used to describe linked datasets

Ontology design pattern
type: Class
subclass of: Informatics Research Artifact
comment: An ontology design pattern is a pattern used in designing ontologies

Open Standard
type: Class
comment: A open standard is a standard used to provide guidelines for the development and operations of artifacts and systems

Protocol
type: Class
comment: A protocol is used to provide guidelines to execute certain tasks

Publication
type: Class
subclass of: Research output
comment: A publication makes content and research results available to the general public via publication venues such as journals, books, websites, etc.

Repository
type: Class
comment: A repository is an online storage for the deposit of research artifacts such as datasets and vocabularies

Repository Type
type: Class
comment: A repository type can be a knowledge base, knowledge graph, version control hosting, etc.

Research Artifact
type: Class
subclass of: Research output
comment: A research artifact is a direct output or result of a research project

Research Domain
type: Class
comment: A research domain is the domain of interest of a research project

Research Field
type: Class
comment: A research field is the field of interest of a research project

Research output
type: Class
comment: A research output is the result of a research project

Research project
type: Class
subclass of: Project
comment: A research project is a project within the research domain with the endeavor of achieving scientific results

Researcher
type: Class
subclass of: Person
comment: A researcher is a person doing research

Service
type: Class
subclass of: Software
comment: A service is a type of software that provides e.g. data or some type of functionalities

Software
type: Class
subclass of: Informatics Research Artifact
comment: A software is a type of informatics research artifact

Software Framework
type: Class
subclass of: Framework
comment: A software framework is a type of software that provides guidelines for the development of new softwares

Synthetic Dataset
type: Class
subclass of: Dataset
comment: Synthetic datasets are generated through computer programs, instead of being composed through the documentation of real-world events

System
type: Class
comment: A system is a group of interacting or interrelated informatics components that form a unified whole

Thesis
type: Class
subclass of: Publication
comment: A thesis as a type of scientific or academic publication or dissertation is a document submitted in support of candidature for an academic degree or professional qualification presenting the author's research and findings

Vocabulary
type: Class
subclass of: Informatics Research Artifact
comment: A vocabulary is used to provide a range of commonly used terms and their definitions

Web Framework
type: Class
subclass of: Software Framework
comment: A web framework is a type of software framework that is used to develop applications on the web

Workflow
type: Class
subclass of: Informatics Research Artifact
comment: A workflow is a sequence of interrelated, orchestrated and repeatable tasks

API
type: NamedIndividual
type: Accessibility

Download
type: NamedIndividual
type: Accessibility

Open Data
type: NamedIndividual
type: Accessibility

Opensource
type: NamedIndividual
type: Accessibility

FAIR
type: NamedIndividual
type: Design quality

Reuse
type: NamedIndividual
type: Design quality

Alpha
type: NamedIndividual
type: Development status

Beta
type: NamedIndividual
type: Development status

Release
type: NamedIndividual
type: Development status

RDF
type: NamedIndividual
type: Open Standard

RDFS
type: NamedIndividual
type: Open Standard

SKOS
type: NamedIndividual
type: Open Standard

SPARQL
type: NamedIndividual
type: Open Standard

XML
type: NamedIndividual
type: Open Standard

Knowledge base
type: NamedIndividual
type: Repository Type

Version control hosting
type: NamedIndividual
type: Repository Type