NXP vocabulary
contributor: colin.maudry
creator: john.walker
license: http://creativecommons.org/licenses/by/3.0/
subject: semiconductor products and related subjects
title: NXP's RDF Schema for semiconductor products
sparql endpoint: sparql
type: Ontology
version info: V 1.0, Release 2014-06-23

About PL reference (object)
member of: NXP DITA Specializations
subclass of: Topicref

ACT
type: Lifecycle State
type: Value List Item
preferred label: Active

Application diagram
member of: NXP Document Type Vocabulary
comment: Graphic containing schematic information for a product in it's environment
subclass of: CreativeWork
subclass of: Visual
subclass of: Document

Application note
member of: NXP Document Type Vocabulary
comment: An application note is a document which gives more specific details on using a component in a specific application, or relating to a particular process, e.g. the physical assembly of a product containing the component. Application notes are especially useful for giving guidance on more unusual uses of a particular component, which would be irrelevant to many readers of the more widely read data sheet
subclass of: TechArticle
subclass of: TextDocument
subclass of: Document

Article Group
description: The reporting product tree is extended whereby the article group consists of one or more 5TGs.
type: Class
comment: aggregation of product types as agreed between logistics and control departments, to be used in financial planning, goods movement reporting and other applications
subclass of: Financial Classification

Basic Type
description: For packaged products the basic type usually comprises one specific package outline, which is more specific than the pro electron rules, that define the basic type at the level of a package style.
type: Class
comment: functional specification describing and characterising the intended behaviour of a product intended for sale
subclass of: ProductModel
subclass of: Concept

Block diagram
member of: NXP Document Type Vocabulary
comment: Graphic containing functional block information of a product
subclass of: CreativeWork
subclass of: Visual
subclass of: Document

Board
type: Class
comment: a PCB used to demonstrate the specific functions and features of a chip (i.e. DSP IC), and how the chip specifically works in the overall PCB design

Brochure
member of: NXP Document Type Vocabulary
comment: A commercial document with three or more pages
subclass of: CreativeWork
subclass of: TextDocument
subclass of: Document

Business
type: Class
comment: aggregation level in the reporting NXP product tree further detailing the product division and consisting of one or more business units for which a business organization is responsible
subclass of: Financial Classification

Business Line
type: Class
comment: aggregation level in the reporting product tree further detailing the business unit (BU) and consisting of one or more main article groups (MAG) for which a business line organization is responsible
subclass of: Financial Classification

Business Segment
type: Class
comment: group of products which is an aggregation of a number of article groups and a subdivision of a main article group
subclass of: Financial Classification

Business Unit
type: Class
comment: aggregation level in the reporting NXP product tree further detailing the business and consisting of one or more main article groups for which a business unit organization is responsible
subclass of: Financial Classification

CQS
type: Lifecycle State
type: Value List Item
preferred label: Customer qualification samples

DTD
member of: NXP Document Type Vocabulary
subclass of: CreativeWork
subclass of: PlainTextDocument
subclass of: Document

Data sheet
member of: NXP Document Type Vocabulary
comment: A data sheet is a document summarizing the performance and other characteristics of a component (e.g. an electronic component) a sub-system (e.g. a power supply) or software in sufficient detail to be used by a design engineer to design the component into a system.
subclass of: TechArticle
subclass of: TextDocument
subclass of: Document

Data sheet addendum
member of: NXP Document Type Vocabulary
comment: Document containing additional information to a data sheet
subclass of: TechArticle
subclass of: TextDocument
subclass of: Document

Design examples
member of: NXP Document Type Vocabulary
subclass of: TechArticle
subclass of: Document

Design tools
member of: NXP Document Type Vocabulary
comment: Link to design tool web pages
subclass of: CreativeWork
subclass of: Document

DEV
type: Lifecycle State
type: Value List Item
preferred label: Development

Development
type: Lifecycle State
type: Value List Item

NXP DITA Specializations
title: NXP DITA Specializations

NXP Document Type Vocabulary
title: NXP Document Type Vocabulary

DOD
type: Lifecycle State
type: Value List Item
preferred label: Discontinuation of delivery

EDA Model
member of: NXP Document Type Vocabulary
comment: BSDL files, Orcad and Eagle schematic symbols fit in this category
subclass of: CreativeWork
subclass of: Document

End of life
type: Lifecycle State
type: Value List Item

Errata sheet
member of: NXP Document Type Vocabulary
comment: A document, additional to a data sheet, to describe known limitations of the original data sheet
subclass of: TechArticle
subclass of: TextDocument
subclass of: Document

External articles
member of: NXP Document Type Vocabulary
subclass of: Article
subclass of: Document

Family
description: Typically the products in a family have a small number of properties in common, for example, a common function or technology generation.
type: Class
comment: group of loosely related products
subclass of: Group

Features and benefits reference (object)
member of: NXP DITA Specializations
subclass of: Topicref

Financial Classification
type: Class
comment: aggregation of products in the reporting NXP product tree
subclass of: Organization

5TG
description: The 5TG code is structured in the sense that each 5TG is the sum of all underlying levels. The 5th position of the 5TG can be numeric or alphabetic, with exception of the letters 'I','O' and 'Z'. The format of a 5TG code is NNNNX. The first 4 positions are equal to the AG code.
type: Class
comment: aggregation level in the reporting product tree further detailing the article group (AG) and consisting of one or more 6TG-planning-groups (6TG)
subclass of: Financial Classification

Group
type: Class
comment: grouping or collection of products for marketing purposes
subclass of: Collection

Handling instructions
member of: NXP Document Type Vocabulary
comment: Document describing handling information for packaged devices
subclass of: TechArticle
subclass of: Document

Headline reference (object)
member of: NXP DITA Specializations
subclass of: Topicref

IBS model
member of: NXP Document Type Vocabulary
comment: A file containing electric modelling information in IBS format
subclass of: CreativeWork
subclass of: Document

Leaflet
member of: NXP Document Type Vocabulary
comment: A commercial one or two page document
subclass of: CreativeWork
subclass of: TextDocument
subclass of: Document

Lifecycle State
description: Examples include the states defined by CC-OPS
type: Class
comment: life cycle phase of an object
subclass of: Value List Item

Line card
member of: NXP Document Type Vocabulary
comment: A commercial document including one or more product tables
subclass of: CreativeWork
subclass of: TextDocument
subclass of: Document

Literature
member of: NXP Document Type Vocabulary
subclass of: CreativeWork
subclass of: TextDocument
subclass of: Document

Logo
member of: NXP Document Type Vocabulary
comment: Graphic representing a technology, product, marketing feature or company
subclass of: ImageObject
subclass of: Visual
subclass of: Document

Main Article Group
type: Class
comment: aggregation level in the reporting product tree further detailing a business unit and consisting of one or more article groups
subclass of: Financial Classification

MarCom
member of: NXP Document Type Vocabulary
comment: A commercial image to be displayed (not listed)
subclass of: ImageObject
subclass of: Document

Marcom graphics
member of: NXP Document Type Vocabulary
comment: A commercial image to be displayed (not listed)
subclass of: ImageObject
subclass of: Visual
subclass of: Document

Marketing Category
type: Class
comment: categorization of products for marketing purposes
subclass of: Concept

Marketing summary reference (object)
member of: NXP DITA Specializations
subclass of: Topicref

Marketing Taxonomy
type: Class
comment: aggregation of one or more marketing categories that form a system for organizing products
subclass of: ConceptScheme

Mounting and soldering
member of: NXP Document Type Vocabulary
comment: A document describing general mounting and or soldering information for packages
subclass of: TechArticle
subclass of: Document

NDA
member of: NXP Document Type Vocabulary
subclass of: CreativeWork
subclass of: TextDocument
subclass of: Document

Not for design in
type: Lifecycle State
type: Value List Item

OBS
type: Lifecycle State
type: Value List Item
preferred label: Obsolete

Other type
member of: NXP Document Type Vocabulary
comment: All other documents or files to which none of the other descriptions apply
subclass of: CreativeWork
subclass of: Document

Outline 3d
member of: NXP Document Type Vocabulary
comment: A 3-dimensional view of a package, used as package and product logo
subclass of: CreativeWork
subclass of: Visual
subclass of: Document

Outline drawing
member of: NXP Document Type Vocabulary
comment: The package outline drawing is a technical drawing with the mechanical outline and dimensions of the package. The outline drawing is used on the internet and in data sheets.
subclass of: CreativeWork
subclass of: Visual
subclass of: Document

P-topic
member of: NXP Document Type Vocabulary
subclass of: CreativeWork
subclass of: PlainTextDocument
subclass of: Document

DITA p-topic
member of: NXP DITA Specializations
subclass of: topic
subclass of: P-topic

Packing
member of: NXP Document Type Vocabulary
comment: Document describing the packing of a product.
subclass of: TechArticle
subclass of: Document

PIP type
description: The PIP type determines the business logic used to generate the product information page on nxp.com
type: Class
comment: product information page type
subclass of: Value List Item

1
type: PIP type
type: Value List Item
comment: This PIP type is generated using the DITA value proposition content plus 'legacy' parametric data from eptos. This PIP is regarded as public because the customer specific indicator <http://purl.org/nxp/schema/v1/customerSpecificIndicator> and product security indicator <http://purl.org/nxp/schema/v1/productSecurityIndicator> both have the value 'No', which in practice only affects the message shown on the PIP when there is no data sheet linked to the product.
preferred label: Public DITA PIP

2
type: PIP type
type: Value List Item
comment: This PIP type is generated using the DITA value proposition content plus 'legacy' parametric data from eptos. This PIP is regarded as public because the customer specific indicator <http://purl.org/nxp/schema/v1/customerSpecificIndicator> and/or product security indicator <http://purl.org/nxp/schema/v1/productSecurityIndicator> has the value 'Yes', which in practice only affects the message shown on the PIP when there is no data sheet linked to the product.
preferred label: Not public DITA PIP

5
type: PIP type
type: Value List Item
comment: This PIP type is generated using the DITA value proposition content plus parametric data from SPC. This PIP is regarded as public because the customer specific indicator <http://purl.org/nxp/schema/v1/customerSpecificIndicator> and product security indicator <http://purl.org/nxp/schema/v1/productSecurityIndicator> both have the value 'No', which in practice only affects the message shown on the PIP when there is no data sheet linked to the product.
preferred label: Public mixed mode PIP

6
type: PIP type
type: Value List Item
comment: This PIP type is generated using the DITA value proposition content plus parametric data from SPC. This PIP is regarded as public because the customer specific indicator <http://purl.org/nxp/schema/v1/customerSpecificIndicator> and/or product security indicator <http://purl.org/nxp/schema/v1/productSecurityIndicator> has the value 'Yes', which in practice only affects the message shown on the PIP when there is no data sheet linked to the product.
preferred label: Not public mixed mode PIP

Presentation
member of: NXP Document Type Vocabulary
subclass of: CreativeWork
subclass of: Presentation
subclass of: Document

Product Division
type: Class
comment: top-level aggregation level in the reporting NXP product tree consisting of one or more businesses for which a product division is responsible
subclass of: Financial Classification

Product Type
description: Practically this results in a group of sales items that only differ in their packing method (=9NC).
type: Class
comment: implementation of a product design, meeting the functional and geometrical specifications of a product intended for sale
subclass of: ProductModel

Production
type: Lifecycle State
type: Value List Item

Qualification
type: Lifecycle State
type: Value List Item

Quarterly highlight
member of: NXP Document Type Vocabulary
subclass of: CreativeWork
subclass of: Document

Reflow soldering
member of: NXP Document Type Vocabulary
comment: Footprint information for packages to be used in a reflow soldering process
subclass of: TechArticle
subclass of: Visual
subclass of: Document

Report
member of: NXP Document Type Vocabulary
comment: Technical document containing researched information
subclass of: CreativeWork
subclass of: TextDocument
subclass of: Document

RFS
type: Lifecycle State
type: Value List Item
preferred label: Released for supply

SPICE model
member of: NXP Document Type Vocabulary
comment: A file containing electric modelling information in SPICE format
subclass of: CreativeWork
subclass of: Document

S-parameter
member of: NXP Document Type Vocabulary
comment: A file containing electric modelling information in S parameter format
subclass of: CreativeWork
subclass of: Document

Sales Item
type: Class
comment: item of commerce offered for sale to external parties
subclass of: SomeProducts

Selection guide
member of: NXP Document Type Vocabulary
comment: A commercial document including one or more product tables with selection criteria
subclass of: CreativeWork
subclass of: TextDocument
subclass of: Document

Series
description: Typically the products in a series differ in a small number of properties, for example, the same functionaltiy offered in a number of package variants or pin configurations.
type: Class
comment: group of closely related products
subclass of: Group

Short data sheet
member of: NXP Document Type Vocabulary
comment: A short data sheet is an extract of a full data sheet with the same product type number(s), title and revision number. A short data sheet is intended for quick reference only and should not be relied upon to contain detailed and full information.
subclass of: TechArticle
subclass of: TextDocument
subclass of: Document

Simulation model
member of: NXP Document Type Vocabulary
comment: A file containing electric modelling information
subclass of: CreativeWork
subclass of: Document

6TG
description: The 6TG code enables an adequate aggregation of code numbers (12NCs) of similar technological nature or organisational structure. The 6th position can be numeric or alphabetic, with exception of the letters 'I','O' and 'Z'. The format of a 6TG code is NNNNXX. The first 5 positions are equal to the 5TG code. The letter 'Z' is only used by the NXP control organisation for administrative and management purposes.
type: Class
comment: aggregation level in the reporting product tree detailing the 5TG group and consisting of one or more sales items
subclass of: Financial Classification

Software
member of: NXP Document Type Vocabulary
comment: A file containing software programs or extensions, and may include documentation of the software.
subclass of: SoftwareApplication
subclass of: Software
subclass of: Document

Solution brief
member of: NXP Document Type Vocabulary
comment: The solution brief describes a design solution for a product in an application.
subclass of: TechArticle
subclass of: TextDocument
subclass of: Document

SUP
type: Lifecycle State
type: Value List Item
preferred label: Superseded

Target applications reference (object)
member of: NXP DITA Specializations
subclass of: Topicref

Technical note
member of: NXP Document Type Vocabulary
comment: Document containing information about the technology of a product
subclass of: TechArticle
subclass of: TextDocument
subclass of: Document

Technical summary reference (object)
member of: NXP DITA Specializations
subclass of: Topicref

Thermal design
member of: NXP Document Type Vocabulary
comment: A document or file containing thermal design information
subclass of: CreativeWork
subclass of: Document

Thermal model
member of: NXP Document Type Vocabulary
comment: A document or file containing thermal modelling information
subclass of: CreativeWork
subclass of: Document

Top marking
member of: NXP Document Type Vocabulary
comment: Document describing the marking on top of a product
subclass of: CreativeWork
subclass of: Document

Training modules
member of: NXP Document Type Vocabulary
subclass of: CreativeWork
subclass of: Document

User manual
member of: NXP Document Type Vocabulary
comment: A user manual is a document that instructs the reader how to perform a sequence of tasks and is characterized by instructions (steps, ordered lists) and examples. Concepts and reference information is only present if needed to accomplish a task.
subclass of: TechArticle
subclass of: TextDocument
subclass of: Document

Value List Item
description: Value sets are supported by creating subclasses of this class.
type: Class
comment: predefined value for a property
subclass of: Enumeration

Value proposition
member of: NXP Document Type Vocabulary
comment: Set of content that gives a quick overview of a product or a group of products
subclass of: CreativeWork
subclass of: InformationElement

DITA value proposition
member of: NXP DITA Specializations
subclass of: Map
subclass of: Value proposition

Value proposition XHTML
subclass of: Value proposition
subclass of: HtmlDocument
subclass of: Document

Value proposition ZIP
comment: A value proposition ZIP contains a DITA and an XHTML rendition of a value proposition.
subclass of: Value proposition
subclass of: Archive
subclass of: Document

Video
member of: NXP Document Type Vocabulary
comment: Video captured on a YouTube NXP channel
subclass of: VideoObject
subclass of: Video
subclass of: Document

Wave soldering
member of: NXP Document Type Vocabulary
comment: Footprint information for packages to be used in a wave soldering process
subclass of: TechArticle
subclass of: Visual
subclass of: Document

Webinar
member of: NXP Document Type Vocabulary
subclass of: VideoObject
subclass of: Video
subclass of: Document

White paper
member of: NXP Document Type Vocabulary
comment: A report or guide helping readers to understand an issue, solve a problem, or make a decision.
subclass of: TechArticle
subclass of: TextDocument
subclass of: Document

WIT
type: Lifecycle State
type: Value List Item
preferred label: Withdrawn

XMLSchema-instance
member of: NXP Document Type Vocabulary
subclass of: CreativeWork
subclass of: PlainTextDocument
subclass of: Document

XML document
member of: NXP Document Type Vocabulary
subclass of: CreativeWork
subclass of: PlainTextDocument
subclass of: Document

broader financial classification
type: ObjectProperty
comment: broader aggregation in the reporting NXP product tree
domain: Financial Classification
range: Financial Classification
sub property of: transitive broader financial classification
sub property of: broader
inverse of: narrower financial classification

transitive broader financial classification
type: ObjectProperty
type: TransitiveProperty
comment: transitive broader aggregation in the reporting NXP product tree
domain: Financial Classification
range: Financial Classification
sub property of: broader
inverse of: transitive narrower financial classification

category
type: ObjectProperty
comment: marketing category in which a group is displayed
domain: Group
range: Marketing Category
inverse of: has group

code
member of: NXP DITA Specializations
sub property of: othermeta

customer specific indicator
description: Yes, No or X for unknown
type: DatatypeProperty
comment: indicator for customer specific product types
range: Literal

financial classification
type: ObjectProperty
comment: financial classification to which a resource is related for reporting purposes
range: Financial Classification

group description
description: The intended use of this property is to capture the human-readable version of the query that matches the group of products.
type: DatatypeProperty
comment: description of a group of products not intended for publication purposes
domain: Group
range: Literal
sub property of: description
sub property of: comment

group name
type: DatatypeProperty
comment: name of a group of products used for publication purposes
domain: Group
range: Literal
sub property of: name
sub property of: label

12NC
type: DatatypeProperty
comment: identifying code of an item according to the 12NC coding system, for example, '9352 793 49557'
domain: Sales Item
range: Literal
sub property of: NXP key identifier
sub property of: productID

12NC no spaces
type: DatatypeProperty
comment: identifying code of an item according to the 12NC coding system without spaces, for example, '935279349557'
domain: Sales Item
range: Literal
sub property of: identifier

has group
type: ObjectProperty
comment: group belonging to a marketing category
domain: Marketing Category
range: Group
inverse of: category

has version
description: It is safe to infer that the version (nxp:ProductType) inherits all functional and geometrical property values that are defined for the referenced nxp:BasicType.
type: ObjectProperty
comment: links a product design to an implementation of that design
domain: Basic Type
range: Product Type
inverse of: is version of

is key component of
type: ObjectProperty
comment: links from a component to a board in which it is a key component
domain: Basic Type
range: Board
sub property of: isRelatedTo
inverse of: key component

is member of
type: ObjectProperty
comment: links from a concept to a collection of which it is a member
domain: Concept
range: Collection
inverse of: member

is version of
description: It is safe to infer that the version (nxp:ProductType) inherits all functional and geometrical property values that are defined for the referenced nxp:BasicType.
type: ObjectProperty
comment: is an implementation of a product design
domain: Product Type
range: Basic Type
sub property of: isVariantOf
inverse of: has version

key component
type: ObjectProperty
comment: links from a board to a key component
domain: Board
range: Basic Type
sub property of: isAccessoryOrSparePartFor
inverse of: is key component of

Latest released version
comment: Latest version among all the expressions of a work that was released.
sub property of: realization

Latest version
comment: Latest version among all the expressions of a work.
sub property of: realization

mag-code
member of: NXP DITA Specializations
sub property of: othermeta

mainvisual
member of: NXP DITA Specializations
sub property of: othermeta

marketing category
type: ObjectProperty
comment: marketing categories in which a product is promoted
domain: Basic Type
range: Marketing Category
sub property of: broader

narrower financial classification
type: ObjectProperty
comment: narrower aggregation in the reporting NXP product tree
domain: Financial Classification
range: Financial Classification
sub property of: transitive narrower financial classification
sub property of: subOrganization
sub property of: narrower
inverse of: broader financial classification

transitive narrower financial classification
type: ObjectProperty
type: TransitiveProperty
comment: transitive narrower aggregation in the reporting NXP product tree
domain: Financial Classification
range: Financial Classification
sub property of: narrower
inverse of: transitive broader financial classification

nxp-type
member of: NXP DITA Specializations
sub property of: othermeta

NXP key identifier
description: The nxp:nxpId is an unambiguous reference to the resource within a given context.
type: DatatypeProperty
comment: NXP identifier of a resource
range: Literal
sub property of: identifier

orderable part number
type: DatatypeProperty
comment: identifying code of an item for placing orders
domain: Sales Item
range: Literal
sub property of: identifier
sub property of: mpn
alternative label: CatsType
alternative label: book part

owner
member of: NXP DITA Specializations
sub property of: othermeta

package
type: DatatypeProperty
comment: identifier of a package used by an electronic component
range: Literal

PIP type
type: ObjectProperty
comment: product information page type of a product
range: PIP type

product security indicator
type: DatatypeProperty
comment: attribute to indicate whether or not (Yes/No) it is required to adhere to special instructions (Documentation, Transport, Handling, Storage, and Scrap ) in order to fulfill the security requirements
range: Literal

product status
type: ObjectProperty
comment: life cycle phase of a product
range: Lifecycle State

product status date
type: DatatypeProperty
comment: date on which the product state is effectuated
range: date

product type
type: ObjectProperty
comment: component that is included in the respective offer
domain: Sales Item
range: Product Type
sub property of: model
inverse of: sales item

Publication ID
comment: Unique identifier given to the published version of a document. The value is the Unix timestamp of the time when the document was published for the first time.
sub property of: identifier

publish to web
type: DatatypeProperty
comment: attribute to indicate whether or not (Yes/No) information about the resource is published on the NXP website
range: Literal

Release status
comment: Unique identifier given to the published version of a document. The value is the Unix timestamp of the time when the document was published for the first time.
sub property of: identifier

releasestate
member of: NXP DITA Specializations
sub property of: othermeta

Rendition
comment: File resulting from a transformation of the source file
sub property of: embodiment

sales item
type: ObjectProperty
comment: commercial offering in which the component is included
domain: Product Type
range: Sales Item
inverse of: product type

Source
comment: Source file where the content is edited
sub property of: embodiment

specificationstate
member of: NXP DITA Specializations
sub property of: othermeta

subtitle
member of: NXP DITA Specializations
sub property of: searchtitle

TriMM key identifier
description: The nxp:trimmId is an unambiguous reference to the resource within a given context.
type: DatatypeProperty
comment: TriMM identifier of a resource
range: Literal
sub property of: identifier

type number
description: Type numbers shall be coded according to the rules of the coding system of a registration organization. This registration organization may be NXP internal or a recognized national or international registration office. The use of the optional package letter(s) is mandatory in registering NXP Semiconductors IC's.
type: DatatypeProperty
comment: code number identifying a technical product specification
range: Literal
sub property of: NXP key identifier
sub property of: mpn