Jindřich Mynarz
type: Person

Josef Petrák
type: Person

Vojtěch Svátek
type: Person

date
usage note: Používejte pro datum a čas otevření nabídek. Definičním oborem je pc:TendersOpening. Kardinalita 0..1 @cs
usage note: Use for date and time, when tenders are opened. The domain is pc:TendersOpening. Cardinality 0..1

description
usage note: Use for attaching plain text description of public contracts (instances of pc:Contract). The domain is pc:Contract.

title
usage note: Use for labelling states of public contracts (instances of pc:Contract). The domain is pc:Contract.

Jakub Klímek
type: Person

Tomáš Knap
type: Person

Public Contracts Ontology
type: Ontology
creator: Josef Petrák
creator: Vojtěch Svátek
creator: jindrich
creator: Jakub Klímek
creator: Tomáš Knap
creator: Pavel Nohejl
creator: Martin Nečaský
description: Ontologie pro veřejné zakázky poskytuje vyjadřovací prostředky pro popis zakázek zadávaných institucemi veřejné správy. @cs
description: Public Contracts Ontology offers a means of expression for describing public contracts in the public sector.
modified: 2012-10-10
rights: cz
title: Ontologie pro veřejné zakázky @cs
preferred namespace prefix: pc
preferred namespace uri: http://purl.org/procurement/public-contracts#

Combination of contract award criteria
type: Class
comment: Class for description of criteria combination used for tender evaluation
comment: Třída pro popis kombinace kritérií pro posuzování nabídek zájemců o zakázku @cs
label: Kombinace kritérií pro hodnocení dodaných nabídek @cs
equivalent class: AwardCriteria

Public contract
type: Class
comment: An instance of this class is an abstract information entity about a public contract. It consists of all currently known information about a contract, e.g., a contracting authority, services or supplies which shall be purchased, and contract conditions (e.g., important dates, expected price, etc.). It also informs about tenders received from particular bidders and about an accepted tender. If the contract has already been realized it also informs about an actual price of realization, etc.
comment: Instance této třídy je abstraktní informační entitou o veřejné zakázce. Obsahuje všechny aktuálně známé informace o zakázce, tj. např. o zadavateli veřejné zakázky, službách či dodávkách, které ve veřejné zakázce nakupuje, a o podmínkách nákupu (termíny, očekávané ceny, atd.). Dále obsahuje informace o nabídkách od zájemců o zakázku a o vybrané nabídce. Pokud již byla zakázka realizována, obsahuje i informace o skutečné ceně za realizaci apod. @cs
label: Veřejná zakázka @cs
equivalent class: Tender

Contract award weighted criterion
type: Class
comment: Class for description of one criterion and its weight
comment: Třída pro popis jednoho kritéria a jeho váhy. @cs
label: Vážené kritérium pro udělení zakázky @cs
subclass of: Condition

Framework agreement
type: Class
comment: Class for decribing a framework agreement
comment: Třída pro popis rámcové smlouvy @cs
label: Rámcová smlouva @cs

Tender
type: Class
comment: Basic class for decribing a tender submitted by a bidder
comment: Základní třída pro popis nabídky zájemce o zakázku @cs
label: Nabídka @cs
subclass of: Offering

Tenders' opening
type: Class
comment: Opening of tenders submitted for a public contract
comment: Otevírání nabídek zaslaných pro veřejnou zakázku @cs
label: Otevírání nabídek @cs
subclass of: Event

Actual end date of contract realization
type: FunctionalProperty
type: DatatypeProperty
comment: Property for actual end date of public contract's realization. Cardinality 0..1
comment: Vlastnost pro skutečné datum konce realizace zakázky. Kardinalita 0..1 @cs
domain: Public contract
label: Skutečné datum konce realizace zakázky @cs
range: date
sub property of: date

Actual price after contract realization
type: FunctionalProperty
type: ObjectProperty
comment: Property for actual price of the public contract. Cardinality 0..1
comment: Vlastnost pro skutečnou cenu zaplacenou za zakázku. Kardinalita 0..1 @cs
label: Skutečná cena po realizaci zakázky @cs
range: PriceSpecification
sub property of: Price

Additional object of contract
type: ObjectProperty
comment: CPV (Common Procurement Vocabulary) code describing an additional object of a public contract. Cardinality 0..*
comment: CPV (Common Procurement Vocabulary) kód popisující doplňující předmět veřejné zakázky. Kardinalita 0..* @cs
domain: Public contract
label: Další předmět zakázky @cs
range: Concept
sub property of: subject

Agreed price
type: FunctionalProperty
type: ObjectProperty
comment: Property for a price stated on the contract with the supplier. Cardinality 0..1
comment: Vlastnost pro cenu napsanou na smlouvě s dodavatelem. Kardinalita 0..1 @cs
label: Smluvní cena @cs
range: PriceSpecification
sub property of: Price

Contract agreement
type: ObjectProperty
comment: Property for attachment of documents containing the agreement between supplier and contractor. Cardinality 0..*
comment: Vlastnost pro připojení dokumentů obsahujících smlouvy na veřejnou zakázku uzavřené mezi zadavatelem a dodavatelem. Kardinalita 0..* @cs
label: Smlouva na veřejnou zakázku @cs
sub property of: Contract attachment

Contract attachment
type: ObjectProperty
comment: Property for attachment of other documents. For attachment of contract specification use pc:specification. For attachment of contract agreement use pc:agreement. Cardinality 0..*
comment: Vlastnost pro připojení ostatních příloh. Zadávací dokumentaci připojte pomocí pc:specification, smlouvu pomocí pc:agreement. Kardinalita 0..* @cs
domain: Public contract
label: Příloha k zakázce @cs
range: Document

Kind of contracting authority
type: FunctionalProperty
type: CodedProperty
type: ObjectProperty
comment: Property for a kind of a contracting authority. Only a predefined SKOS concept can be used. Cardinality 0..1
comment: Vlastnost pro druh zadavatele. Lze použít pouze jeden z předdefinovaných SKOS konceptů. Kardinalita 0..1 @cs
domain: BusinessEntity
label: Druh zadavatele @cs
range: Concept
range: Restriction
  has value: public-contracts-authority-kinds#
  on property: inScheme

Criteria combination for tender evaluation.
type: FunctionalProperty
type: ObjectProperty
comment: Property for criteria combination for tender evaluation. Cardinality 0..1
comment: Vlastnost pro nastavení kombinace kritérií pro hodnocení nabídek zájemců o zakázku. Kardinalita 0..1 @cs
domain: Public contract
label: Kombinace kritérií pro hodnocení nabídek zájemců o zakázku. @cs
range: Combination of contract award criteria

Criterion for contract award.
type: ObjectProperty
comment: Property for setting a criterion for tender evaluation. Cardinality 0..*
comment: Vlastnost pro nastavení jednoho kritéria pro hodnocení nabídek zájemců o zakázku. Kardinalita 0..* @cs
domain: Combination of contract award criteria
label: Critères d'attribution @fr
label: Kritérium pro zadání zakázky. @cs
label: Vergabekriterien @de
range: Contract award weighted criterion
equivalent property: AC

Date of contract award
type: DatatypeProperty
type: FunctionalProperty
comment: Property for date of contract award to a bidder. Cardinality 0..1
comment: Vlastnost pro datum přidělení zakázky dodavateli. Kardinalita 0..1 @cs
domain: Public contract
label: Datum přidělení zakázky @cs
range: date
sub property of: date

Awarded tender
type: FunctionalProperty
type: ObjectProperty
comment: Property for awarded tender submitted by a bidder. Cardinality 0..1
comment: Vlastnost pro vítěznou nabídku zájemce o zakázku. Kardinalita 0..1 @cs
label: Vybraná nabídka @cs
sub property of: Tender

Tender bidder
type: ObjectProperty
comment: Property for bidder submitting the tender. Cardinality 0..1
comment: Vlastnost pro zájemce o zakázku podávajícího nabídku. Kardinalita 0..1 @cs
domain: Tender
label: Zájemce o zakázku @cs
range: BusinessEntity

Contact person
type: FunctionalProperty
type: ObjectProperty
comment: Property for contact information for a person or place responsible for a communication with the public and bidders. If there are more contact places or persons (e.g., for collecting documentation to the public contract), there is a separate contact for each person. Cardinality 0..*
comment: Vlastnost pro kontaktní údaje na místo nebo osobu určenou pro komunikaci s veřejností a zájemci o zakázku. Pokud je kontaktních míst či osob více (např. pro vyzvednutí dokumentace k veřejné zakázce), je pro každou uveden samostatný kontakt. Kardinalita 0..* @cs
domain: Public contract
label: Kontaktní osoba @cs
range: ContactPoint

Public contract
type: ObjectProperty
comment: Public contract, for which tenders are opened
comment: Veřejná zakázka, pro níž jsou otevírány nabídky @cs
domain: Tenders' opening
label: Veřejná zakázka @cs
range: Public contract

Price
type: ObjectProperty
comment: Abstract property for price of public contract
comment: Abstraktní vlastnost pro cenu přiřazené k veřejné zakázce @cs
domain: Public contract
label: Cena @cs
range: PriceSpecification

Contracting authority
type: FunctionalProperty
type: ObjectProperty
comment: Instituce, která vypisuje veřejnou zakázku, přijímá nabídky a vybírá vhodného dodavatele na základě pravidel stanovených zakázkou. Kardinalita 0..1 @cs
comment: Institution which issues a public contract, receives tenders to the contract and chooses a suitable supplier on the base of the conditions given by the contract. Cardinality 0..1
domain: Public contract
label: Zadavatel @cs
range: BusinessEntity

Contract award criterion weight
type: FunctionalProperty
type: DatatypeProperty
comment: Property for criterion weight for tender evaluation. Cardinality 0..1
comment: Vlastnost pro specifikaci váhy kritéria pro hodnocení nabídky. Kardinalita 0..1 @cs
domain: Contract award weighted criterion
label: Váha kritéria pro výběr dodavatele zakázky @cs
range: percentage

Price of documentation for public contract
type: FunctionalProperty
type: ObjectProperty
comment: Property for price of documentation for public contract. Cardinality 0..1
comment: Vlastnost pro cenu zadávací dokumentace k zakázce. Kardinalita 0..1 @cs
domain: Public contract
label: Cena zadávací dokumentace k zakázce @cs
range: PriceSpecification

Time-limit for receipt of requests for documentation
type: FunctionalProperty
type: DatatypeProperty
comment: Property for time limit for receipt of requests for documentation. Cardinality 0..1
comment: Vlastnost pro lhůtu pro vyžádání dokumentace k veřejné zakázce. Kardinalita 0..1 @cs
domain: Public contract
label: Lhůta pro vyžádání dokumentace k veřejné zakázce @cs
range: dateTime
sub property of: date

Duration of contract
type: FunctionalProperty
type: DatatypeProperty
comment: Property for duration of contract. The duration may be described in days, months, years, etc. Cardinality 0..1
comment: Vlastnost pro dobu trvání zakázky. Doba trvání může být uvedena ve dnech, měsících, letech apod. Kardinalita 0..1 @cs
domain: Public contract
label: Doba trvání zakázky @cs
range: duration

Estimated end date of contract
type: FunctionalProperty
type: DatatypeProperty
comment: Property for estimated end date of public contract realization. Cardinality 0..1
comment: Vlastnost pro očekávané datum konce realizace zakázky. Kardinalita 0..1 @cs
domain: Public contract
label: Očekávané datum konce realizace zakázky @cs
range: date
sub property of: date

Exact estimated price
type: FunctionalProperty
type: ObjectProperty
comment: Property for estimated price of public contract. It can be an exact estimation or an interval. Cardinality 0..1
comment: Vlastnost pro odhadovanou cenu veřejné zakázky. Může jít o přesně odhadovanou částku nebo interval. Kardinalita 0..1 @cs
label: Odhadovaná cena zakázky @cs
sub property of: Price

Expected number of operators of framework agreement
type: FunctionalProperty
type: ObjectProperty
comment: Expected number of operators of framework agreement. Cardinality 0..1
comment: Očekávaný počet účastníků rámcové smlouvy. Kardinalita 0..1 @cs
domain: Framework agreement
label: Očekávaný počet účastníků rámcové smlouvy @cs
range: QuantitativeValueInteger

On the base of a framework agreement
type: ObjectProperty
comment: Property for a framework agreement on which base a public contract was issued. Cardinality 0..1
comment: Vlastnost pro rámcovou smlouvu, na jejímž základě byla veřejná zakázka zadána. Kardinalita 0..1 @cs
domain: Public contract
label: Na základě rámcové smlouvy @cs
range: Framework agreement

item
type: ObjectProperty
comment: An item inquired by a public contract. It can be a combination of several products or services which can be expressed using properties of gr:Offering. Cardinality 0..*
comment: Položka poptávaná v rámci veřejné zakázky. Může být kombinací několika produktů či služeb, což lze vyjádřit pomocí vlastností gr:Offering. Kardinalita 0..* @cs
domain: Class
  union of: Public contract
  union of: Tender
range: Offering
sub property of: hasPart

Contract kind
type: FunctionalProperty
type: CodedProperty
type: ObjectProperty
comment: Kategorie veřejné zakázky specifikuje základní zaměření veřejné zakázky na stavební práce, dodávku zboží nebo služby. Lze použít pouze jeden z předdefinovaných SKOS konceptů. Kardinalita 0..1 @cs
comment: Kind of a public contract specifies a basic focus of the contract on works, supplies or services. Only a predefined SKOS concept can be used. Cardinality 0..1
domain: Public contract
label: Kategorie zakázky @cs
range: Concept
range: Restriction
  has value: public-contracts-kinds#
  on property: inScheme
sub property of: type

Place of contract's realization
type: ObjectProperty
comment: Místo, kde dojde k dodání produktu nebo plnění služby nasmlouvané ve veřejné zakázce. Kardinalita 0..* @cs
comment: Place of delivery of contracted product or performance of contracted service. Cardinality 0..*
domain: Public contract
label: Místo uskutečnění zakázky @cs
range: Place
sub property of: location

Contract lot
type: ObjectProperty
comment: Property for specifying contract lot. When contract is too big, it is split to lots by contracting authority. Bidders then tender each lot separately. For each lot the authority awards a separate tender. The contract itself has no tenders. Cardinality 0..*
comment: Vlastnost pro specifikaci části zakázky. Zakázku rozděluje na části zadavatel, pokud je zakázka přiliš velká. Zájemci o zakázku podávají nabídky na každou část odděleně a pro každou část zakázky je vybrán samostatný dodavatel. Pro samotnou zakázku nabídky nejsou podávány. Kardinalita 0..* @cs
domain: Public contract
label: Část zakázky @cs
range: Public contract

Main activity
type: FunctionalProperty
type: CodedProperty
type: ObjectProperty
comment: Property for main activity of contracting authority. Only a predefined SKOS concept can be used. Cardinality 0..1
comment: Vlastnost pro hlavní aktivitu zadavatele. Lze použít pouze jeden z předdefinovaných SKOS konceptů. Kardinalita 0..1 @cs
domain: BusinessEntity
label: Hlavní aktivita @cs
range: Concept
range: Restriction
  has value: public-contracts-activities#
  on property: inScheme

Main object of contract
type: FunctionalProperty
type: ObjectProperty
comment: CPV (Common Procurement Vocabulary) code describing the main object of a public contract. Cardinality 0..1
comment: CPV (Common Procurement Vocabulary) kód popisující hlavní předmět veřejné zakázky. Kardinalita 0..1 @cs
domain: Public contract
label: Hlavní předmět zakázky @cs
range: Concept
sub property of: subject

Number of tenders received
type: FunctionalProperty
type: DatatypeProperty
comment: Property for number of tenders received. Cardinality 0..1
comment: Vlastnost pro počet obdržených nabídek. Kardinalita 0..1 @cs
domain: Public contract
label: Počet obdržených nabídek @cs
range: nonNegativeInteger

Offered price in tender
type: FunctionalProperty
type: ObjectProperty
comment: Property for price offered by supplier. Cardinality 0..1
comment: Vlastnost pro cenu nabídnutou zájemcem o zakázku. Kardinalita 0..1 @cs
domain: Tender
label: Nabídnutá cena v nabídce @cs
range: PriceSpecification
sub property of: hasPriceSpecification

On behalf of
type: ObjectProperty
comment: Contract award on behalf of other contracting authorities. Cardinality 0..*
comment: Zadání zakázky jménem jiných zadavatelů. Kardinalita 0..* @cs
domain: Public contract
label: Jménem @cs
range: BusinessEntity

Procedure type
type: FunctionalProperty
type: CodedProperty
type: ObjectProperty
comment: Druh řízení veřejné zakázky specifikuje proceduru, podle které je zakázka uveřejňována a podle které je vybírán dodavatel. Lze použít pouze jednu z předdefinovaných hodnot. Kardinalita 0..1 @cs
comment: Type of procedure of a public contract specifies a procedure which is applied to publish information about the contract and choose a supplier. Only a predefined value can be used. Cardinality 0..1
domain: Public contract
label: Druh řízení @cs
range: Concept
range: Restriction
  has value: public-contracts-procedure-types#
  on property: inScheme

Profile web site of contracting authority
type: DatatypeProperty
comment: Property for the internet address of the profile of contracting authority (URL).
comment: Vlastnost pro internetovou adresu profilové stránky zadavatele veřejných zakázek (URL). @cs
domain: BusinessEntity
label: Profilová stránka zadavatele @cs
range: anyURI

Contract specification
type: ObjectProperty
comment: Property for attachment of documents containing the contract specification. Cardinality 0..*
comment: Vlastnost pro připojení dokumentů obsahujících zadávací dokumentaci veřejné zakázky. Kardinalita 0..* @cs
label: Zadávací dokumentace zakázky @cs
sub property of: Contract attachment

Start date of contract
type: FunctionalProperty
type: DatatypeProperty
comment: Property for start date of public contract realization coming from the contract's text. Cardinality 0..1
comment: Vlastnost pro datum začátku realizace zakázky, které je uvedené ve smlouvě. Kardinalita 0..1 @cs
domain: Public contract
label: Datum začátku realizace zakázky @cs
range: date
sub property of: date

Subsidy supplemented for contract
type: ObjectProperty
comment: Property for used tender subsidy. Cardinality 0..*
comment: Vlastnost pro dotaci použitou pro zakázku. Kardinalita 0..* @cs
domain: Public contract
label: Dotace použitá pro zakázku @cs
range: Payment

Tender
type: ObjectProperty
comment: Property for a tender submitted by a bidder. Cardinality 0..*
comment: Vlastnost pro nabídku zájemce o zakázku. Kardinalita 0..* @cs
domain: Public contract
label: Nabídka @cs
range: Tender

Time-limit for receipt of tenders or requests to participate
type: FunctionalProperty
type: DatatypeProperty
comment: Property for time limit for receipt of tenders or requests to participate. Cardinality 0..1
comment: Vlastnost pro lhůtu pro doručení nabídek nebo přijetí žádostí o účast. Kardinalita 0..1 @cs
domain: Public contract
label: Lhůta pro doručení nabídek nebo přijetí žádostí o účast @cs
range: dateTime
sub property of: date
equivalent property: DT

Duration of tender validity
type: FunctionalProperty
type: DatatypeProperty
comment: Property for expressing minimum time frame during which the tenderer must maintain the tender. The duration may be described in days, months, years, etc. Cardinality 0..1
comment: Vlastnost pro vyjádření minimální doby, po kterou je uchazeč svou nabídkou vázán. Doba trvání může být uvedena ve dnech, měsících, letech apod. Kardinalita 0..1 @cs
domain: Public contract
label: Doba trvání nabídky @cs
range: duration

Weighted criterion
type: FunctionalProperty
type: ObjectProperty
comment: Property for attaching criterion that is weighted. Cardinality 0..1
comment: Vlastnost pro připojení kritéria, které je váženo. Kardinalita 0..1 @cs
domain: Contract award weighted criterion
label: Vážené kritérium @cs
range: Concept
sub property of: subject

location
usage note: Místo, kde dojde k otevření obálek s nabídkami pro veřejnou zakázku. Definičním oborem je pc:TendersOpening. Kardinalita 0..1 @cs
usage note: Use for location, where tenders are opened. The domain is pc:TendersOpening. Cardinality 0..1

Pavel Nohejl
type: Person

Martin Nečaský
type: Person

identifier
usage note: Use for attaching identifiers (instances of adms:Identifier) to contracting authorities and bidders (instances of gr:BusinessEntity). The property should be used for official numbers assigned to public contracts in national public procurement systems, reference numbers of public contracts assigned by their contracting authorities, notice number in EU TED, etc. The domain is a union of gr:BusinessEntity and pc:Contract.