RDA:n toimijan ominaisuudet
type: Ontology
title: Agent properties @en
description: Properties that represent the attribute and relationship elements of the RDA Agent, Collective Agent, Person, Family, and Corporate Body entities. @en
preferred namespace prefix: rdaa
rights: Copyright © 2020 American Library Association, Canadian Federation of Library Associations, and CILIP: Chartered Institute of Library and Information Professionals @en
licence: deed.en US
creator: RDA Steering Committee
contributor: RSC Technical Working Group
publisher: ALA Digital Reference
type: http://rdaregistry.info/termList/RDALinkedDataWork/1003
issued: 2014-01-18
description: RDA-elementeistä johdetut ominaisuudet RDA:n toimijan ja sen alaluokkien (yhteistoimija, henkilö, suku ja yhteisö) määrittelyjoukossa.
version info: v5.4.2
modified: 2025-05-16

lyhentäjä (toimija) ekspressiossa
status: Published
label: is abridger agent of @en
definition: Relates an agent to an expression that includes a contribution by an agent of shortening an expression of another work without changing the general meaning or manner of presentation. @en
type: Property
domain: C10002
sub property of: tarkastaja (toimija) ekspressiossa
lexical alias: abridgerAgentOf.en
label: est un agent abréviateur de @fr
definition: Met un agent en relation avec une expression qui intègre une contribution de la part d’un agent consistant à raccourcir une expression d’une autre œuvre sans en changer le sens général ou le mode de présentation. @fr
toolkit label: agent abréviateur de @fr
toolkit definition: Expression qui intègre une contribution de la part d’un agent consistant à raccourcir une expression d’une autre œuvre sans en changer le sens général ou le mode de présentation. @fr
toolkit label: abridger agent of @en
toolkit definition: An expression that includes a contribution by an agent of shortening an expression of another work without changing the general meaning or manner of presentation. @en
see also: kirjoittaja (toimija) teoksessa
instruction number: 18.5
label: είναι συντμητής φορέας του @el
definition: Συνδέει έναν φορέα, ο οποίος συνεισφέρει σε μια έκφραση ενός έργου μέσω της σύντμησης ή συρρίκνωσης του πρωτότυπου έργου, αφήνοντας ωστόσο ουσιαστικά αμετάβλητα τη φύση και το περιεχόμενό του, με μια έκφραση. @el
toolkit label: είναι συντμητής φορέας του @el
toolkit definition: Μια έκφραση ενός έργου που ενσωματώνει τη συνεισφορά της σύντμησης ή της συρρίκνωσης του πρωτότυπου έργου, αφήνοντας ωστόσο αμετάβλητα τη φύση και το περιεχόμενό του. @el
definition: Setzt einen Akteur in Beziehung zu einer Expression, zu der ein Akteur beiträgt, indem er eine Expression eines anderen Werks kürzt, ohne die allgemeine Bedeutung oder Art der Darstellung zu verändern. @de
toolkit label: Akteur als Kürzende/Kürzender von @de
toolkit definition: Eine Expression, zu der ein Akteur beiträgt, indem er eine Expression eines anderen Werks kürzt, ohne die allgemeine Bedeutung oder Art der Darstellung zu verändern. @de
label: er agent, som er forkorter af @da
definition: Relaterer en agent til et udtryk, som omfatter en agents bidrag ved at forkorte udtrykket af et andet værk, uden at ændre den overordnede betydning eller præsentationsmåde. @da
toolkit label: agent, som er forkorter af @da
toolkit definition: Udtryk, som omfatter en agents bidrag ved at forkorte udtrykket af et andet værk, uden at ændre den overordnede betydning eller præsentationsmåde. @da
label: és agent abreujador de @ca
definition: Relaciona un agent amb una expressió que inclou una contribució d’un agent escurçant una expressió d’una altra obra sense canviar-ne el significat general o la forma de presentació. @ca
toolkit label: agent abreujador de @ca
toolkit definition: Expressió que inclou una contribució d’un agent escurçant una expressió d’una altra obra sense canviar-ne el significat general o la forma de presentació. @ca
definition: Liittää toimijan ekspressioon, jonka tekemiseen toimija osallistuu lyhentämällä toisen teoksen ekspressiota muuttamatta esityksen yleistä sisältöä tai tyyliä.
toolkit label: lyhentäjä (toimija) ekspressiossa
toolkit definition: Ekspressio, jonka tekemiseen toimija osallistuu lyhentämällä toisen teoksen ekspressiota muuttamatta esityksen yleistä sisältöä tai tyyliä.
toolkit label: forkorter av (agent) @no
toolkit definition: Et uttrykk som inkluderer et bidrag fra en agent i form av forkortelse av et uttrykk av et annet verk og lar særpreg og innhold forbli hovedsakelig uendret. @no
label: ist Akteur als Kürzende/Kürzender von @de
has element type: 2
label: rövidítő ágense a következőnek: @hu
definition: Hozzákapcsol egy ágenst egy kifejezési formához, amely magában foglalja egy ágens közreműködését egy másik mű kifejezési formájának lerövidítésével úgy, hogy a prezentáció általános jelentése vagy módja nem változik. @hu
toolkit label: rövidítő ágense: @hu
toolkit definition: Egy kifejezési forma, amely magában foglalja egy ágens közreműködését egy másik mű kifejezési formájának lerövidítésével úgy, hogy a prezentáció általános jelentése vagy módja nem változik. @hu
alternative label: abridger of @en
alternative label: lyhentäjänä aineistossa (ekspressio)
label: er forkorter av (agent) @no
definition: Relaterer en agent til et uttrykk som inkluderer et bidrag fra en agent i form av forkortelse av et uttrykk av et annet verk og lar særpreg og innhold forbli hovedsakelig uendret. @no
alternative label: forkorter av @no
label: is inkorter-actor van @nl
definition: Relateert een actor aan een expressie die omvat een bijdrage door een actor door inkorten van een expressie of ander werk zonder de algemene betekenis of manier van uiteenzetting te wijzigen. @nl
toolkit label: inkorter-actor van @nl
toolkit definition: Een expressie die omvat een bijdrage door een actor door inkorten van een expressie of ander werk zonder de algemene betekenis of manier van uiteenzetting te wijzigen. @nl
label: هو وكيل مُلَخِّص لـ @ar
definition: يربط وكيلا بتعبيرة تتضمن إسهام وكيل في تلخيص تعبيرة لعمل آخر دون تغيير المعنى العام أو طريقة العرض. @ar
alternative label: مُلَخِص @ar
toolkit label: وكيل مُلَخِص @ar
toolkit definition: تعبيرة تتضمن إسهام وكيل في تلخيص تعبيرة لعمل آخر دون تغيير المعنى العام أو طريقة العرض. @ar
alternative label: abreujador de @ca
alternative label: forkorter af @da
label: lühendaja (tegija) väljenduses @et
definition: Seostab tegija väljendusega, millesse tegija on andnud panuse, lühendades teise teose väljendust, muutmata üldist tähendust ja esitusviisi. @et
alternative label: lühendaja väljenduses @et
toolkit label: lühendaja (tegija) väljenduses @et
toolkit definition: Väljendus, millesse tegija on andnud panuse, lühendades teise teose väljendust, muutmata üldist tähendust ja esitusviisi. @et
alternative label: rövidítője: @hu
label: è abbreviatore agente di @it
definition: Correla un agente a un'espressione che include un contributo da parte di un agente che riassume un'espressione o un'altra opera senza modificare il significato generale o la modalità di presentazione. @it
alternative label: abbreviatore di @it
toolkit label: abbreviatore agente di @it
toolkit definition: Espressione che include un contributo da parte di un agente che riassume un'espressione o un'altra opera senza modificare il significato generale o la modalità di presentazione. @it
alternative label: συντμητής του @el
alternative label: abréviateur de @fr
label: ir saīsinātājs (aģents) @lv
definition: Sasaista aģentu ar izteiksmi, kas ietver aģenta ieguldījumu, saīsinot cita darba izteiksmi, nemainot darba nozīmi vai pasniegšanas veidu. @lv
toolkit label: ir saīsinātājs (aģents) @lv
toolkit definition: Izteiksme, kas ietver aģenta ieguldījumu, saīsinot cita darba izteiksmi, nemainot darba nozīmi vai pasniegšanas veidu. @lv
alternative label: Kürzende/Kürzender von @de
alternative label: ……的缩编者 @zh-hans
toolkit label: ……的缩编者行为者 @zh-hans
toolkit definition: 包括缩短另一种作品的一种内容表达而不改变其总体意义或呈现方式的一个行为者的贡献的一种内容表达 @zh-hans
toolkit label: özetleyen temsilci @tr
toolkit definition: Diğer bir çalışmanın anlatımını, genel anlamı veya sunum biçimini değiştirmeden kısaltmakla görevli bir temsilcinin katkısını içeren bir anlatım. @tr

lyhentäjä (yhteistoimija) ekspressiossa
status: Published
label: is abridger collective agent of @en
lexical alias: abridgerCollectiveAgentOf.en
definition: Relates a collective agent to an expression that includes a contribution by a collective agent of shortening an expression of another work without changing the general meaning or manner of presentation. @en
toolkit label: abridger collective agent of @en
toolkit definition: An expression that includes a contribution by a collective agent of shortening an expression of another work without changing the general meaning or manner of presentation. @en
type: Property
domain: C10011
has element type: 2
sub property of: tarkastaja (yhteistoimija) ekspressiossa
sub property of: lyhentäjä (toimija) ekspressiossa
definition: Liittää yhteistoimijan ekspressioon, jonka tekemisesä yhteistoimija on osallisena lyhentämällä toisen teoksen ekspressiota muuttamatta esityksen yleistä sisältöä tai tyyliä.
toolkit label: lyhentäjä (yhteistoimija) ekspressiossa
toolkit definition: Ekspressio, jonka tekemisesä yhteistoimija on osallisena lyhentämällä toisen teoksen ekspressiota muuttamatta esityksen yleistä sisältöä tai tyyliä.
label: er forkorter for (kollektiv agent) @no
definition: Relaterer en kollektiv agent til et uttrykk som inkluderer et bidrag fra en kollektiv agent i form av å forkorte et uttrykk av et relatert verk uten å endre meningen eller presentasjonsformen. @no
toolkit label: forkorter for (kollektiv agent) @no
toolkit definition: Et uttrykk som inkluderer et bidrag fra en kollektiv agent i form av å forkorte et uttrykk av et relatert verk uten å endre meningen eller presentasjonsformen. @no
label: is inkorter-collectieve actor van @nl
definition: Relateert een collectieve actor aan een expressie die omvat een bijdrage door een collectieve actor door inkorten van een expressie of ander werk zonder de algemene betekenis of manier van uiteenzetting te wijzigen. @nl
toolkit label: inkorter-collectieve actor van @nl
toolkit definition: Een expressie die omvat een bijdrage door een collectieve actor door inkorten van een expressie of ander werk zonder de algemene betekenis of manier van uiteenzetting te wijzigen. @nl
label: هو وكيل جماعي مُلخّص لـ @ar
definition: يربط وكيلا جماعيا بتعبيرة تتضمن إسهام وكيل جماعي في تلخيص تعبيرة لعمل آخر دون تغيير المعنى العام أو طريقة العرض. @ar
toolkit label: وكيل جماعي مُلخّص @ar
toolkit definition: تعبيرة تتضمن إسهام وكيل جماعي في تلخيص تعبيرة لعمل آخر دون تغيير المعنى العام أو طريقة العرض. @ar
label: és agent col·lectiu abreujador de @ca
definition: Relaciona un agent col·lectiu amb una expressió que inclou una contribució d’un agent col·lectiu escurçant una expressió d’una altra obra sense canviar-ne el significat general o la forma de presentació. @ca
toolkit label: agent col·lectiu abreujador de @ca
toolkit definition: Expressió que inclou una contribució d’un agent col·lectiu escurçant una expressió d’una altra obra sense canviar-ne el significat general o la forma de presentació. @ca
label: er kollektiv agent, som er forkorter af @da
definition: Relaterer en kollektiv agent til et udtryk, som omfatter en kollektiv agents bidrag ved at forkorte udtrykket af et andet værk, uden at ændre den overordnede betydning eller præsentationsmåde. @da
toolkit label: kollektiv agent, som er forkorter af @da
toolkit definition: Udtryk, som omfatter en kollektiv agents bidrag ved at forkorte udtrykket af et andet værk, uden at ændre den overordnede betydning eller præsentationsmåde. @da
label: lühendaja (kollektiiv) väljenduses @et
definition: Seostab kollektiivi väljendusega, millesse kollektiiv on andnud panuse, lühendades teise teose väljendust, muutmata üldist tähendust ja esitusviisi. @et
toolkit label: lühendaja (kollektiiv) väljenduses @et
toolkit definition: Väljendus, millesse kollektiiv on andnud panuse, lühendades teise teose väljendust, muutmata üldist tähendust ja esitusviisi. @et
label: ist gemeinschaftlicher Akteur als Kürzende/Kürzender von @de
definition: Setzt einen gemeinschaftlichen Akteur in Beziehung zu einer Expression, zu der ein gemeinschaftlicher Akteur beiträgt, indem er eine Expression eines anderen Werks kürzt, ohne die allgemeine Bedeutung oder Art der Darstellung zu verändern. @de
toolkit label: Gemeinschaftlicher Akteur als Kürzende/Kürzender von @de
toolkit definition: Eine Expression, zu der ein gemeinschaftlicher Akteur beiträgt, indem er eine Expression eines anderen Werks kürzt, ohne die allgemeine Bedeutung oder Art der Darstellung zu verändern. @de
label: rövidítő kollektív ágense a következőnek: @hu
definition: Hozzákapcsol egy kollektív ágenst egy kifejezési formához, amely magában foglalja egy kollektív ágens közreműködését egy másik mű kifejezési formájának lerövidítésével úgy, hogy a prezentáció általános jelentése vagy módja nem változik. @hu
toolkit label: rövidítő kollektív ágense: @hu
toolkit definition: Egy kifejezési forma, amely magában foglalja egy kollektív ágens közreműködését egy másik mű kifejezési formájának lerövidítésével úgy, hogy a prezentáció általános jelentése vagy módja nem változik. @hu
label: è compendiatore agente collettivo di @it
definition: Correla un agente collettivo a un'espressione che comprende un contributo da parte di un agente collettivo nell'abbreviazione di un'espressione di un'altra opera senza modificare il significato generale o la modalità di presentazione. @it
toolkit label: compendiatore agente collettivo di @it
toolkit definition: Espressione che comprende un contributo da parte di un agente collettivo nell'abbreviazione di un'espressione di un'altra opera senza modificare il significato generale o il modo di presentazione. @it
label: είναι συντμητής συλλογικός φορέας του @el
toolkit label: συντμητής συλλογικός φορέας του @el
label: est un agent collectif abréviateur de @fr
definition: Met un agent collectif en relation avec une expression qui intègre une contribution de la part d’un agent collectif consistant à raccourcir une expression d’une autre œuvre sans en changer le sens général ou le mode de présentation. @fr
toolkit label: agent collectif abréviateur de @fr
toolkit definition: Expression qui intègre une contribution de la part d’un agent collectif consistant à raccourcir une expression d’une autre œuvre sans en changer le sens général ou le mode de présentation. @fr
label: ir saīsinātājs (grupa) @lv
definition: Sasaista grupu ar izteiksmi, kas ietver grupas ieguldījumu, saīsinot cita darba izteiksmi, nemainot darba nozīmi vai pasniegšanas veidu. @lv
toolkit label: ir saīsinātājs (grupa) @lv
toolkit definition: Izteiksme, kas ietver grupas ieguldījumu, saīsinot cita darba izteiksmi, nemainot darba nozīmi vai pasniegšanas veidu. @lv
label: 是……的缩编者集体行为者 @zh-hans
definition: 将一个集体行为者与包括缩短另一种作品的一种内容表达而不改变其总体意义或呈现方式的一个集体行为者的贡献的一种内容表达关联起来。 @zh-hans
toolkit label: ……的缩编者集体行为者 @zh-hans
toolkit definition: 包括缩短另一种作品的一种内容表达而不改变其总体意义或呈现方式的一个集体行为者的贡献的一种内容表达 @zh-hans
label: özetleyen kolektif temsilcisidir @tr
definition: Kolektif bir temsilciyi; diğer bir çalışmanın anlatımını, genel anlamı veya sunum biçimini değiştirmeden kısaltmakla görevli bir kolektif temsilcinin katkısını içeren bir anlatım ile ilişkilendirir. @tr
toolkit label: özetleyen kolektif temsilci @tr
toolkit definition: Diğer bir çalışmanın anlatımını, genel anlamı veya sunum biçimini değiştirmeden kısaltmakla görevli kolektif bir temsilcinin katkısını içeren bir anlatım. @tr
has subproperty: lyhentäjä (yhteisö) ekspressiossa
has subproperty: lyhentäjä (suku) ekspressiossa
has subproperty: P50766

lyhentäjä (yhteisö) ekspressiossa
status: Published
label: is abridger corporate body of @en
lexical alias: abridgerCorporateBodyOf.en
definition: Relates a corporate body to an expression that includes a contribution by a corporate body of shortening an expression of another work without changing the general meaning or manner of presentation. @en
toolkit label: abridger corporate body of @en
toolkit definition: An expression that includes a contribution by a corporate body of shortening an expression of another work without changing the general meaning or manner of presentation. @en
type: Property
domain: C10005
has element type: 2
sub property of: tarkastaja (yhteisö) ekspressiossa
sub property of: lyhentäjä (yhteistoimija) ekspressiossa
definition: Liittää yhteisön ekspressioon, jonka tekemisessä yhteisö on osallisena lyhentämällä toisen teoksen ekspressiota muuttamatta esityksen yleistä sisältöä tai tyyliä.
toolkit label: lyhentäjä (yhteisö) ekspressiossa
toolkit definition: Ekspressio, jonka tekemisessä yhteisö on osallisena lyhentämällä toisen teoksen ekspressiota muuttamatta esityksen yleistä sisältöä tai tyyliä.
label: er forkorter for (korporasjon) @no
definition: Relaterer en korporasjon til et uttrykk som inkluderer et bidrag fra en korporasjon i form av å forkorte et uttrykk av et relatert verk uten å endre meningen eller presentasjonsformen. @no
toolkit label: forkorter for (korporasjon) @no
toolkit definition: Et uttrykk som inkluderer et bidrag fra en korporasjon i form av å forkorte et uttrykk av et relatert verk uten å endre meningen eller presentasjonsformen. @no
label: is inkorter-corporatie van @nl
definition: Relateert een corporatie aan een expressie die omvat een bijdrage door een corporatie door inkorten van een expressie of ander werk zonder de algemene betekenis of manier van uiteenzetting te wijzigen. @nl
toolkit label: inkorter-corporatie van @nl
toolkit definition: Een expressie die omvat een bijdrage door een corporatie door inkorten van een expressie of ander werk zonder de algemene betekenis of manier van uiteenzetting te wijzigen. @nl
label: هي هيئة مسئولة عن التلخيص لـ @ar
definition: يربط هيئة بتعبيرة تتضمن إسهام هيئة في تلخيص تعبيرة لعمل آخر دون تغيير المعنى العام أو طريقة العرض. @ar
toolkit label: هيئة مسئولة عن التلخيص @ar
toolkit definition: تعبيرة تتضمن إسهام هيئة في تلخيص تعبيرة لعمل آخر دون تغيير المعنى العام أو طريقة العرض. @ar
label: és entitat corporativa abreujadora de @ca
definition: Relaciona una entitat corporativa amb una expressió que inclou una contribució d’una entitat corporativa escurçant una expressió d’una altra obra sense canviar-ne el significat general o la forma de presentació. @ca
toolkit label: entitat corporativa abreujadora de @ca
toolkit definition: Expressió que inclou una contribució d’una entitat corporativa escurçant una expressió d’una altra obra sense canviar-ne el significat general o la forma de presentació. @ca
label: er korporation, som er forkorter af @da
definition: Relaterer en korporation til et udtryk, som omfatter en korporations bidrag ved at forkorte udtrykket af et andet værk, uden at ændre den overordnede betydning eller præsentationsmåde. @da
toolkit label: korporation, som er forkorter af @da
toolkit definition: Udtryk, som omfatter en korporations bidrag ved at forkorte udtrykket af et andet værk, uden at ændre den overordnede betydning eller præsentationsmåde. @da
label: lühendaja (asutus) väljenduses @et
definition: Seostab asutuse väljendusega, millesse asutus on andnud panuse, lühendades teise teose väljendust, muutmata üldist tähendust ja esitusviisi. @et
toolkit label: lühendaja (asutus) väljenduses @et
toolkit definition: Väljendus, millesse asutus on andnud panuse, lühendades teise teose väljendust, muutmata üldist tähendust ja esitusviisi. @et
label: ist Körperschaft als Kürzende/Kürzender von @de
definition: Setzt eine Körperschaft in Beziehung zu einer Expression, zu der eine Körperschaft beiträgt, indem sie eine Expression eines anderen Werks kürzt, ohne die allgemeine Bedeutung oder Art der Darstellung zu verändern. @de
toolkit label: Körperschaft als Kürzende/Kürzender von @de
toolkit definition: Eine Expression, zu der eine Körperschaft beiträgt, indem sie eine Expression eines anderen Werks kürzt, ohne die allgemeine Bedeutung oder Art der Darstellung zu verändern. @de
label: rövidítő testülete a következőnek: @hu
definition: Hozzákapcsol egy testületet egy kifejezési formához, amely magában foglalja egy testület közreműködését egy másik mű kifejezési formájának lerövidítésével úgy, hogy a prezentáció általános jelentése vagy módja nem változik. @hu
toolkit label: rövidítő testülete: @hu
toolkit definition: Egy kifejezési forma, amely magában foglalja egy testület közreműködését egy másik mű kifejezési formájának lerövidítésével úgy, hogy a prezentáció általános jelentése vagy módja nem változik. @hu
label: è compendiatore ente di @it
definition: Correla un ente a un'espressione che comprende un contributo di un ente nell'abbreviazione di un'espressione di un'altra opera senza modificare il significato generale o la modalità di presentazione. @it
toolkit label: compendiatore ente di @it
toolkit definition: Espressione che comprende un contributo di un ente nell'abbreviazione di un'espressione di un'altra opera senza modificare il significato generale o la modalità di presentazione. @it
label: είναι συντμητής συλλογικό όργανο του @el
toolkit label: συντμητής συλλογικό όργανο του @el
label: est une collectivité abréviatrice de @fr
definition: Met une collectivité en relation avec une expression qui intègre une contribution de la part d’une collectivité consistant à raccourcir une expression d’une autre œuvre sans en changer le sens général ou le mode de présentation. @fr
toolkit label: collectivité abréviatrice de @fr
toolkit definition: Expression qui intègre une contribution de la part d’une collectivité consistant à raccourcir une expression d’une autre œuvre sans en changer le sens général ou le mode de présentation. @fr
label: ir saīsinātājs (institūcija) @lv
definition: Sasaista institūciju ar izteiksmi, kas ietver institūcijas ieguldījumu, saīsinot cita darba izteiksmi, nemainot darba nozīmi vai pasniegšanas veidu. @lv
toolkit label: ir saīsinātājs (institūcija) @lv
toolkit definition: Izteiksme, kas ietver institūcijas ieguldījumu, saīsinot cita darba izteiksmi, nemainot darba nozīmi vai pasniegšanas veidu. @lv
label: 是……的缩编者团体 @zh-hans
definition: 将一个团体与包括缩短另一种作品的一种内容表达而不改变其总体意义或呈现方式的一个团体的贡献的一种内容表达关联起来。 @zh-hans
toolkit label: ……的缩编者团体 @zh-hans
toolkit definition: 包括缩短另一种作品的一种内容表达而不改变其总体意义或呈现方式的一个团体的贡献的一种内容表达 @zh-hans
label: özetleyen tüzel kişisidir @tr
definition: Bir tüzel kişiyi, genel anlamı veya sunum biçimini değiştirmeden başka bir çalışmanın ifadesinin kısaltılmasına bir tüzel kişinin katkısını içeren bir anlatımla ilişkilendirir. @tr
toolkit label: özetleyen tüzel kişi @tr
toolkit definition: Genel anlamı veya sunum biçimini değiştirmeden başka bir çalışmanın anlatımının kısaltılması için tüzel bir kişinin katkısını içeren bir anlatım. @tr
has subproperty: P50917

lyhentäjä (suku) ekspressiossa
status: Published
label: is abridger family of @en
lexical alias: abridgerFamilyOf.en
definition: Relates a family to an expression that includes a contribution by a family of shortening an expression of another work without changing the general meaning or manner of presentation. @en
toolkit label: abridger family of @en
toolkit definition: An expression that includes a contribution by a family of shortening an expression of another work without changing the general meaning or manner of presentation. @en
type: Property
domain: C10008
has element type: 2
sub property of: tarkastaja (suku) ekspressiossa
sub property of: lyhentäjä (yhteistoimija) ekspressiossa
definition: Liittää suvun ekspressioon, jonka tekemisesä suku on osallisena lyhentämällä toisen teoksen ekspressiota muuttamatta esityksen yleistä sisältöä tai tyyliä.
toolkit label: lyhentäjä (suku) ekspressiossa
toolkit definition: Ekspressio, jonka tekemisesä suku on osallisena lyhentämällä toisen teoksen ekspressiota muuttamatta esityksen yleistä sisältöä tai tyyliä.
label: er forkorter for (familie) @no
definition: Relaterer en familie til et uttrykk som inkluderer et bidrag fra en familie i form av å forkorte et uttrykk av et relatert verk uten å endre meningen eller presentasjonsformen. @no
toolkit label: forkorter for (familie) @no
toolkit definition: Et uttrykk som inkluderer et bidrag fra en familie i form av å forkorte et uttrykk av et relatert verk uten å endre meningen eller presentasjonsformen. @no
label: is inkorter-familie van @nl
definition: Relateert een familie aan een expressie die omvat een bijdrage door een familie door inkorten van een expressie of ander werk zonder de algemene betekenis of manier van uiteenzetting te wijzigen. @nl
toolkit label: inkorter-familie van @nl
toolkit definition: Een expressie die omvat een bijdrage door een familie door inkorten van een expressie of ander werk zonder de algemene betekenis of manier van uiteenzetting te wijzigen. @nl
label: és família abreujadora de @ca
definition: Relaciona una família amb una expressió que inclou una contribució d’una família escurçant una expressió d’una altra obra sense canviar-ne el significat general o la forma de presentació. @ca
toolkit label: família abreujadora de @ca
toolkit definition: Expressió que inclou una contribució d’una família escurçant una expressió d’una altra obra sense canviar-ne el significat general o la forma de presentació. @ca
label: er familie, som er forkorter af @da
definition: Relaterer en familie til et udtryk, som omfatter en families bidrag ved at forkorte udtrykket af et andet værk, uden at ændre den overordnede betydning eller præsentationsmåde. @da
toolkit label: familie, som er forkorter af @da
toolkit definition: Udtryk, som omfatter en families bidrag ved at forkorte udtrykket af et andet værk, uden at ændre den overordnede betydning eller præsentationsmåde. @da
label: lühendaja (perekond) väljenduses @et
definition: Seostab perekonna väljendusega, millesse perekond on andnud panuse, lühendades teise teose väljendust, muutmata üldist tähendust ja esitusviisi. @et
toolkit label: lühendaja (perekond) väljenduses @et
toolkit definition: Väljendus, millesse perekond on andnud panuse, lühendades teise teose väljendust, muutmata üldist tähendust ja esitusviisi. @et
label: ist Familie als Kürzende/Kürzender von @de
definition: Setzt eine Familie in Beziehung zu einer Expression, zu der eine Familie beiträgt, indem sie eine Expression eines anderen Werks kürzt, ohne dabei die allgemeine Bedeutung oder Art der Darstellung zu verändern. @de
toolkit label: Familie als Kürzende/Kürzender von @de
toolkit definition: Eine Expression, zu der eine Familie beiträgt, indem sie eine Expression eines anderen Werks kürzt, ohne dabei die allgemeine Bedeutung oder Art der Darstellung zu verändern. @de
label: rövidítő családja a következőnek: @hu
definition: Hozzákapcsol egy családot egy kifejezési formához, amely magában foglalja egy család közreműködését egy másik mű kifejezési formájának lerövidítésével úgy, hogy a prezentáció általános jelentése vagy módja nem változik. @hu
toolkit label: rövidítő családja: @hu
toolkit definition: Egy kifejezési forma, amely magában foglalja egy család közreműködését egy másik mű kifejezési formájának lerövidítésével úgy, hogy a prezentáció általános jelentése vagy módja nem változik. @hu
label: è compendiatore famiglia di @it
definition: Correla una famiglia a un'espressione che comprende un contributo di una famiglia nell'abbreviazione di un'espressione di un'altra opera senza modificare il significato generale o la modalità di presentazione. @it
toolkit label: compendiatore famiglia di @it
toolkit definition: Espressione che comprende un contributo di una famiglia nell'abbreviazione di un'espressione di un'altra opera senza modificare il significato generale o la modalità di presentazione. @it
label: είναι συντμητής οικογένεια του @el
toolkit label: συντμητής οικογένεια του @el
label: est une famille abréviatrice de @fr
definition: Met une famille en relation avec une expression qui intègre une contribution de la part d’une famille consistant à raccourcir une expression d’une autre œuvre sans en changer le sens général ou le mode de présentation. @fr
toolkit label: famille abréviatrice de @fr
toolkit definition: Expression qui intègre une contribution de la part d’une famille consistant à raccourcir une expression d’une autre œuvre sans en changer le sens général ou le mode de présentation. @fr
label: ir saīsinātājs (dzimta/ģimene) @lv
definition: Sasaista dzimtu/ģimeni ar izteiksmi, kas ietver dzimtas/ģimenes ieguldījumu, saīsinot cita darba izteiksmi, nemainot darba nozīmi vai pasniegšanas veidu. @lv
toolkit label: ir saīsinātājs (dzimta/ģimene) @lv
toolkit definition: Izteiksme, kas ietver dzimtas/ģimenes ieguldījumu, saīsinot cita darba izteiksmi, nemainot darba nozīmi vai pasniegšanas veidu. @lv
label: هي عائلة ملخِّصة لـ @ar
definition: يربط عائلة بتعبيرة تتضمن إسهام عائلة في تلخيص تعبيرة لعمل آخر دون تغيير المعنى العام أو طريقة العرض. @ar
toolkit label: عائلة ملخِّصة لـ @ar
toolkit definition: تعبيرة تتضمن إسهام عائلة في تلخيص تعبيرة لعمل آخر دون تغيير المعنى العام أو طريقة العرض. @ar
label: 是……的缩编者家族 @zh-hans
definition: 将一个家族与包括缩短另一种作品的一种内容表达而不改变其总体意义或呈现方式的一个家族的贡献的一种内容表达关联起来。 @zh-hans
toolkit label: ……的缩编者家族 @zh-hans
toolkit definition: 包括缩短另一种作品的一种内容表达而不改变其总体意义或呈现方式的一个家族的贡献的一种内容表达 @zh-hans
label: özetleyen ailesidir @tr
definition: Bir aileyi, genel anlamı veya sunum biçimini değiştirmeden başka bir eserin ifadesini kısaltmak için bir ailenin katkısını içeren bir anlatımla ilişkilendirir. @tr
toolkit label: özetleyen aile @tr
toolkit definition: Diğer bir çalışmanın anlatımını, genel anlamı veya sunum biçimini değiştirmeden kısaltmakla görevli bir ailenin katkısını içeren bir anlatım. @tr
has subproperty: P51068

lyhentäjä (henkilö) ekspressiossa
status: Published
label: is abridger person of @en
lexical alias: abridgerPersonOf.en
definition: Relates a person to an expression that includes a contribution by a person of shortening an expression of another work without changing the general meaning or manner of presentation. @en
toolkit label: abridger person of @en
toolkit definition: An expression that includes a contribution by a person of shortening an expression of another work without changing the general meaning or manner of presentation. @en
type: Property
domain: C10004
has element type: 2
sub property of: tarkastaja (henkilö) ekspressiossa
sub property of: lyhentäjä (toimija) ekspressiossa
definition: Liittää henkilön ekspressioon, jonka tekemisessä henkilö on osallisena lyhentämällä toisen teoksen ekspressiota muuttamatta esityksen yleistä sisältöä tai tyyliä.
toolkit label: lyhentäjä (henkilö) ekspressiossa
toolkit definition: Ekspressio, jonka tekemisessä henkilö on osallisena lyhentämällä toisen teoksen ekspressiota muuttamatta esityksen yleistä sisältöä tai tyyliä.
label: er forkorter for (person) @no
definition: Relaterer en person til et uttrykk som inkluderer et bidrag fra en person i form av å forkorte et uttrykk av et relatert verk uten å endre meningen eller presentasjonsformen. @no
toolkit label: forkorter for (person) @no
toolkit definition: Et uttrykk som inkluderer et bidrag fra en person i form av å forkorte et uttrykk av et relatert verk uten å endre meningen eller presentasjonsformen. @no
label: is inkorter-persoon van @nl
definition: Relateert een persoon aan een expressie die omvat een bijdrage door een persoon door inkorten van een expressie of ander werk zonder de algemene betekenis of manier van uiteenzetting te wijzigen. @nl
toolkit label: inkorter-persoon van @nl
toolkit definition: Een expressie die omvat een bijdrage door een persoon door inkorten van een expressie of ander werk zonder de algemene betekenis of manier van uiteenzetting te wijzigen. @nl
label: هو شخص مُلخّص لـ @ar
definition: يربط شخصا بتعبيرة تتضمن إسهام شخص في تلخيص تعبيرة لعمل آخر دون تغيير المعنى العام أو طريقة العرض. @ar
toolkit label: شخص مُلخص @ar
toolkit definition: تعبيرة تتضمن إسهام شخص في تلخيص تعبيرة لعمل آخر دون تغيير المعنى العام أو طريقة العرض. @ar
label: és persona abreujadora de @ca
definition: Relaciona una persona amb una expressió que inclou una contribució d’una persona escurçant una expressió d’una altra obra sense canviar-ne el significat general o la forma de presentació. @ca
toolkit label: persona abreujadora de @ca
toolkit definition: Expressió que inclou una contribució d’una persona escurçant una expressió d’una altra obra sense canviar-ne el significat general o la forma de presentació. @ca
label: er person, som er forkorter af @da
definition: Relaterer en person til et udtryk, som omfatter en persons bidrag ved at forkorte udtrykket af et andet værk, uden at ændre den overordnede betydning eller præsentationsmåde. @da
toolkit label: person, som er forkorter af @da
toolkit definition: Udtryk, som omfatter en persons bidrag ved at forkorte udtrykket af et andet værk, uden at ændre den overordnede betydning eller præsentationsmåde. @da
label: lühendaja (isik) väljenduses @et
definition: Seostab isiku väljendusega, millesse isik on andnud panuse, lühendades teise teose väljendust, muutmata üldist tähendust ja esitusviisi. @et
toolkit label: lühendaja (isik) väljenduses @et
toolkit definition: Väljendus, millesse isik on andnud panuse, lühendades teise teose väljendust, muutmata üldist tähendust ja esitusviisi. @et
label: ist Person als Kürzende/Kürzender von @de
definition: Setzt eine Person in Beziehung zu einer Expression, zu der eine Person beiträgt, indem sie eine Expression eines anderen Werks kürzt, ohne dabei die allgemeine Bedeutung oder Art der Darstellung zu verändern. @de
toolkit label: Person als Kürzende/Kürzender von @de
toolkit definition: Eine Expression, zu der eine Person beiträgt, indem sie eine Expression eines anderen Werks kürzt, ohne dabei die allgemeine Bedeutung oder Art der Darstellung zu verändern. @de
label: rövidítő személye a következőnek: @hu
definition: Hozzákapcsol egy személyt egy kifejezési formához, amely magában foglalja egy személy közreműködését egy másik mű kifejezési formájának lerövidítésével úgy, hogy a prezentáció általános jelentése vagy módja nem változik. @hu
toolkit label: rövidítő személye: @hu
toolkit definition: Egy kifejezési forma, amely magában foglalja egy személy közreműködését egy másik mű kifejezési formájának lerövidítésével úgy, hogy a prezentáció általános jelentése vagy módja nem változik. @hu
label: è compendiatore persona di @it
definition: Correla una persona a un'espressione che comprende un contributo di una persona nell'abbreviazione di un'espressione di un'altra opera senza modificare il significato generale o la modalità di presentazione. @it
toolkit label: compendiatore persona di @it
toolkit definition: Espressione che comprende un contributo di una persona nell'abbreviazione di un'espressione di un'altra opera senza modificare il significato generale o la modalità di presentazione. @it
label: είναι συντμητής φυσικό πρόσωπο του @el
toolkit label: συντμητής φυσικό πρόσωπο του @el
label: est une personne abréviatrice de @fr
definition: Met une personne en relation avec une expression qui intègre une contribution de la part d’une personne consistant à raccourcir une expression d’une autre œuvre sans en changer le sens général ou le mode de présentation. @fr
toolkit label: personne abréviatrice de @fr
toolkit definition: Expression qui intègre une contribution de la part d’une personne consistant à raccourcir une expression d’une autre œuvre sans en changer le sens général ou le mode de présentation. @fr
label: ir saīsinātājs (persona) @lv
definition: Sasaista personu ar izteiksmi, kas ietver personas ieguldījumu, saīsinot cita darba izteiksmi, nemainot darba nozīmi vai pasniegšanas veidu. @lv
toolkit label: ir saīsinātājs (persona) @lv
toolkit definition: Izteiksme, kas ietver personas ieguldījumu, saīsinot cita darba izteiksmi, nemainot darba nozīmi vai pasniegšanas veidu. @lv
label: 是……的缩编者个人 @zh-hans
definition: 将一个个人与包括缩短另一种作品的一种内容表达而不改变其总体意义或呈现方式的一个个人的贡献的一种内容表达关联起来。 @zh-hans
toolkit label: ……是缩编者个人 @zh-hans
toolkit definition: 包括缩短另一种作品的一种内容表达而不改变其总体意义或呈现方式的一个个人的贡献的一种内容表达 @zh-hans
label: özetleyen kişisidir @tr
definition: Bir kişiyi, bir eserin genel anlamını veya anlatım biçimini değiştirmeksizin başka bir eserin anlatımının kısaltılmasına kişinin katkısını içeren anlatımla ilişkilendirir. @tr
toolkit label: özetleyen kişi @tr
toolkit definition: Diğer bir çalışmanın anlatımını, genel anlamı veya sunum biçimini değiştirmeden kısaltmakla görevli bir kişinin katkısını içeren bir anlatım. @tr
has subproperty: P50615

akateeminen ohjaaja teoksessa
status: Published
label: is academic supervisor of @en
lexical alias: academicSupervisorOf.en
definition: Relates a person to a work that involves a responsibility for overseeing academic activity of any kind that results in a work, including theses, research, and projects. @en
toolkit label: academic supervisor of @en
toolkit definition: A work that involves a responsibility for overseeing academic activity of any kind that results in a work, including theses, research, and projects. @en
type: Property
domain: C10004
sub property of: henkilöön liittyvä teos
has element type: 2
definition: Liittää henkilön teokseen, jossa henkilö on vastuussa kaikenlaisen akateemisen toiminnan valvonnasta, joka johtaa teokseen, mukaan lukien tutkielmat, tutkimukset ja projektit.
toolkit label: akateeminen ohjaaja teoksessa
toolkit definition: Teos, jossa henkilö on vastuussa kaikenlaisen akateemisen toiminnan valvonnasta, joka johtaa teokseen, mukaan lukien tutkielmat, tutkimukset ja projektit.
label: er akademisk veileder for @no
definition: Relaterer en person til et verk som involverer et ansvar for å føre tilsyn med all akademisk aktivitet som resulterer i et verk, inklusive avhandlinger, forskning og prosjekter. @no
toolkit label: akademisk veileder for @no
toolkit definition: Et verk som involverer et ansvar for å føre tilsyn med all akademisk aktivitet som resulterer i et verk, inklusive avhandlinger, forskning og prosjekter. @no
label: is academisch begeleider van @nl
definition: Relateert een persoon aan een werk dat met zich meebrengt een verantwoordelijkheid voor het toezicht houden op academische activiteiten van elke soort die resulteert in een werk, inclusief dissertaties, onderzoek en projecten. @nl
toolkit label: academisch begeleider van @nl
toolkit definition: Een werk dat met zich meebrengt een verantwoordelijkheid voor het toezicht houden op academische activiteiten van elke soort die resulteert in een werk, inclusief dissertaties, onderzoek en projecten. @nl
label: هو مشرف أكاديمي لـ @ar
definition: يربط شخصا بعمل يترتب عليه مسئولية الإشراف على نشاط أكاديمي من أي نوع يسفر عن عمل، ويشمل ذلك الأطروحات والبحوث والمشاريع. @ar
toolkit label: مشرف أكاديمي @ar
toolkit definition: عمل يترتب عليه مسئولية الإشراف على نشاط أكاديمي من أي نوع يسفر عن عمل، ويشمل ذلك الأطروحات والبحوث والمشاريع. @ar
label: és supervisor acadèmic de @ca
definition: Relaciona una persona amb una obra que implica una responsabilitat en la supervisió d’una activitat acadèmica de qualsevol classe que dona com a resultat una obra, incloses tesis, recerques i projectes. @ca
toolkit label: supervisor acadèmic de @ca
toolkit definition: Obra que implica una responsabilitat en la supervisió d’una activitat acadèmica de qualsevol classe que dona com a resultat una obra, incloses tesis, recerques i projectes. @ca
label: er akademisk vejleder af @da
definition: Relaterer en person til et værk, som involverer et ansvar for at føre tilsyn med akademisk aktivitet af enhver art, som resulterer i et værk, herunder afhandlinger, forskning og projekter. @da
toolkit label: akademisk vejleder af @da
toolkit definition: Værk, som involverer et ansvar for at føre tilsyn med akademisk aktivitet af enhver art, som resulterer i et værk, herunder afhandlinger, forskning og projekter. @da
label: akadeemiline juhendaja teoses @et
definition: Seostab isiku teosega, mis sisaldab vastutust teoses (sh väitekirjad, uurimused ja projektid) väljenduva ükskõik millist laadi akadeemilise tegevuse ülevaatamise eest. @et
toolkit label: akadeemiline juhendaja teoses @et
toolkit definition: Teos, mis sisaldab vastutust teoses (sh väitekirjad, uurimused ja projektid) väljenduva ükskõik millist laadi akadeemilise tegevuse ülevaatamise eest. @et
label: ist akademische Betreuerin/akademischer Betreuer von @de
definition: Setzt eine Person in Beziehung zu einem Werk, das mit einer Verantwortung verbunden ist, die akademische Tätigkeit jeglicher Art zu betreuen, die zu einem Werk führen. Darunter fallen Hochschulschriften, Forschungen und Projekte. @de
toolkit label: Akademische Betreuerin/Akademischer Betreuer von @de
toolkit definition: Ein Werk, das mit einer Verantwortung verbunden ist, die akademische Tätigkeit jeglicher Art zu betreuen, die zu einem Werk führen. Darunter fallen Hochschulschriften, Forschungen und Projekte. @de
label: tudományos témavezetője a következőnek: @hu
definition: Hozzákapcsol egy személyt egy műhöz, amely magában foglalja bármilyen tudományos tevékenység felügyeletének felelősségét, amelynek eredménye egy mű, beleértve szakdolgozatokat, kutatást és projekteket. @hu
toolkit label: tudományos témavezetője: @hu
toolkit definition: Egy mű, amely magában foglalja bármilyen tudományos tevékenység felügyeletének felelősségét, amelynek eredménye egy mű, beleértve szakdolgozatokat, kutatást és projekteket. @hu
label: è supervisore accademico di @it
definition: Correla una persona a un'opera che implica una responsabilità nella supervisione di attività accademica di qualsiasi genere che risulta in un'opera, incluse tesi, ricerca e progetti. @it
toolkit label: supervisore accademico di @it
toolkit definition: Opera che implica una responsabilità nella supervisione di attività accademica di qualsiasi genere che risulta in un'opera, incluse tesi, ricerca e progetti. @it
label: είναι ακαδημαϊκός επόπτης του @el
toolkit label: ακαδημαϊκός επόπτης του @el
label: est un superviseur académique de @fr
definition: Met une personne en relation avec une œuvre qui comporte une responsabilité consistant à superviser les activités universitaires de toute nature entraînant la création d’une œuvre, y compris les thèses, les travaux de recherche et les projets. @fr
toolkit label: superviseur académique de @fr
toolkit definition: Œuvre qui comporte une responsabilité consistant à superviser les activités universitaires de toute nature entraînant la création d’une œuvre, y compris les thèses, les travaux de recherche et les projets. @fr
label: ir akadēmiskā darba vadītājs @lv
definition: Sasaista personu ar darbu, kas ietver personas atbildību, esot par zinātniska vai promocijas darba konsultantu vai vadītāju, pārraugot akadēmisku vai zinātnisku darbu. @lv
toolkit label: ir akadēmiskā darba vadītājs @lv
toolkit definition: Darbs, kas ietver personas atbildību, esot par zinātniska vai promocijas darba konsultantu vai vadītāju, pārraugot akadēmisku vai zinātnisku darbu. @lv
label: 是……的学术主管 @zh-hans
definition: 将一个个人与涉及导致一种作品的各种学术活动（包括论文、研究和项目）之监督责任的一种作品关联起来。 @zh-hans
toolkit label: ……的学术主管 @zh-hans
toolkit definition: 涉及导致一种作品的各种学术活动（包括论文、研究和项目）之监督责任的一种作品 @zh-hans
label: akademik danışmanıdır @tr
definition: Bir kişiyi, tezler, araştırmalar ve projeler de dahil olmak üzere bir çalışmayla sonuçlanan her türlü akademik faaliyeti denetleme sorumluluğunu içeren bir eserle ilişkilendirir. @tr
toolkit label: Akademik danışman @tr
toolkit definition: Tezler, araştırmalar ve projeler de dahil olmak üzere, bir çalışmayla sonuçlanan her türlü akademik faaliyeti denetleme sorumluluğunu içeren bir çalışma. @tr
has subproperty: projektin ohjaaja teoksessa
has subproperty: tutkimuksen ohjaaja teoksessa
has subproperty: opinnäytteen ohjaaja teoksessa
has subproperty: P50458

toimijan hakutieto
status: Published
type: Property
label: has access point for agent @en
lexical alias: accessPointForAgent.en
definition: Relates an agent to a nomen that is an appellation of agent in natural language that is taken from a vocabulary encoding scheme or is constructed using a string encoding scheme. @en
domain: C10002
toolkit label: access point for agent @en
toolkit definition: A nomen that is an appellation of agent in natural language that is taken from a vocabulary encoding scheme or is constructed using a string encoding scheme. @en
sub property of: toimijan nimitys
has element type: 3
sub property of: P00016
definition: Liittää toimijan nomeniin, joka on luonnollisella kielellä oleva toimijan nimitys, joka on otettu sanaston merkintäjärjestelmästä tai muodostettu käyttämällä merkkijonon merkintäjärjestelmää.
toolkit label: toimijan hakutieto
toolkit definition: Nomen, joka on toimijan luonnollisella kielellä oleva nimitys, joka on otettu sanaston merkintäjärjestelmästä tai muodostettu käyttämällä merkkijonon merkintäjärjestelmää.
label: har søkeinngang for agent @no
definition: Relaterer en agent til en betegnelse for agent på et naturlig språk som er hentet fra et kodeskjema for vokabular eller er laget ved hjelp av et kodeskjema for syntaks. @no
toolkit label: søkeinngang for agent @no
toolkit definition: En betegnelse for agent på et naturlig språk som er hentet fra et kodeskjema for vokabular eller er laget ved hjelp av et kodeskjema for syntaks. @no
label: heeft ingang voor actor @nl
definition: Relateert een actor aan een nomen dat is een benaming van actor in natuurlijke taal die ontleend is aan een vocabulair coderingsschema of gevormd is volgens een string coderingsschema. @nl
toolkit label: ingang voor actor @nl
toolkit definition: Een nomen dat is een benaming van actor in natuurlijke taal die ontleend is aan een vocabulair coderingsschema of gevormd is volgens een string coderingsschema. @nl
label: له نقطة وصول لوكيل @ar
definition: يربط وكيلا بتسمية عبارة عن اسم لوكيل بلغة طبيعية مأخوذ من مخطط ترميز مفردات، أو أنشئ باستخدام خطة ترميز سلسلة تمثيلات. @ar
toolkit label: نقطة وصول لوكيل @ar
toolkit definition: تسمية عبارة عن اسم لوكيل في لغة طبيعية مأخوذ من مخطط ترميز مفردات، أو أنشئ باستخدام خطة ترميز سلسلة تمثيلات. @ar
label: té com a punt d’accés d’agent @ca
definition: Relaciona un agent amb un nomen que és una apel·lació d’agent en llenguatge natural que s’obté d’un esquema de codificació de vocabulari o s’elabora usant un esquema de codificació de cadenes. @ca
toolkit label: punt d’accés d’agent @ca
toolkit definition: Nomen que és una apel·lació d’agent en llenguatge natural que s’obté d’un esquema de codificació de vocabulari o s’elabora usant un esquema de codificació de cadenes. @ca
label: har søgeindgang for agent @da
definition: Relaterer en agent til et nomen, som er en benævnelse på agent på normalsprog, som er taget fra et vokabularkodningsskema eller er konstrueret ved hjælp af et strengkodningsskema. @da
toolkit label: søgeindgang for agent @da
toolkit definition: Nomen, som er en benævnelse på agent på normalsprog, som er taget fra et vokabularkodningsskema eller er konstrueret ved hjælp af et strengkodningsskema. @da
label: tegija otsielement @et
definition: Seostab tegija tegija nimetusega loomulikus keeles, mis on võetud leksikaalsest märkimissüsteemist või moodustatud stringilise märkimissüsteemi alusel. @et
toolkit label: tegija otsielement @et
toolkit definition: Tegija nimetus loomulikus keeles, mis on võetud leksikaalsest märkimissüsteemist või moodustatud stringilise märkimissüsteemi alusel. @et
label: hat Sucheinstieg für einen Akteur @de
definition: Setzt einen Akteur in Beziehung zu einer Bezeichnung für einen Akteur in natürlicher Sprache, die einem Vocabulary Encoding Scheme entnommen oder mit einem String Encoding Scheme konstruiert wird. @de
toolkit label: Sucheinstieg für einen Akteur @de
toolkit definition: Eine Bezeichnung für einen Akteur in natürlicher Sprache, die einem Vocabulary Encoding Scheme entnommen oder mit einem String Encoding Scheme konstruiert wird. @de
label: hozzáférési pontja ágenshez a következő: @hu
definition: Hozzákapcsol egy ágenst egy nomenhez, egy ágens természetes nyelvű megnevezéséhez, amely egy szótárkódolási sémából származik, vagy egy karakterlánc-kódolási séma használatával szerkesztett. @hu
toolkit label: hozzáférési pont ágenshez: @hu
toolkit definition: Egy nomen, egy ágens természetes nyelvű megnevezése, amely egy szótárkódolási sémából származik, vagy egy karakterlánc-kódolási séma használatával szerkesztett. @hu
label: ha come punto d'accesso per agente @it
definition: Correla un agente con la denominazione di un agente in linguaggio naturale che è presa dallo schema di codifica di un vocabolario controllato o è costruita usando uno schema di codifica di una stringa. @it
toolkit label: punto d'accesso per agente @it
toolkit definition: Denominazione di un agente in linguaggio naturale che è presa dallo schema di codifica di un vocabolario controllato o è costruita usando uno schema di codifica di una stringa. @it
label: έχει σημείο πρόσβασης για φορέα @el
toolkit label: σημείο πρόσβασης για φορέα @el
label: a pour point d’accès d’un agent @fr
definition: Met un agent en relation avec un nomen qui est une appellation d’agent en langage naturel provenant d’un schéma d’encodage de vocabulaire ou construite à l’aide d’un schéma d’encodage de chaînes. @fr
toolkit label: point d’accès d’un agent @fr
toolkit definition: Nomen qui est une appellation d’agent en langage naturel provenant d’un schéma d’encodage de vocabulaire ou construite à l’aide d’un schéma d’encodage de chaînes. @fr
label: aģenta pamatforma @lv
definition: Sasaista aģentu ar nomenu, kas ir aģenta vārds/nosaukums dabiskā valodā, kas ņemts no shēmas kontrolētu vārdnīcu kodēšanai vai tiek konstruēts, izmantojot virknes kodēšanas shēmu. @lv
toolkit label: aģenta pamatforma @lv
toolkit definition: Aģenta vārds/nosaukums dabiskā valodā, kas ņemts no shēmas kontrolētu vārdnīcu kodēšanai vai tiek konstruēts, izmantojot virknes kodēšanas shēmu @lv
label: 有行为者的检索点 @zh-hans
definition: 将一个行为者与作为一个行为者的称谓、取自一个词表编码体系或者用一个串编码体系构建、用自然语言的一个命名关联起来。 @zh-hans
toolkit label: 行为者的检索点 @zh-hans
toolkit definition: 作为一个行为者的称谓、取自一个词表编码体系或者用一个串编码体系构建、用自然语言的一个命名 @zh-hans
label: temsilci için erişim noktası ile ilişkilidir @tr
definition: Bir temsilciyi, bir kelime kodlama şemasından alınan veya bir dizi kodlama şeması kullanılarak oluşturulan, doğal dilde bir temsilcinin unvanı olan bir isime ilişkilendirir. @tr
toolkit label: Temsilci için erişim noktası @tr
toolkit definition: Bir kelime kodlama şemasından alınan veya bir dizi kodlama şeması kullanılarak oluşturulan, doğal dilde bir temsilcinin unvanı olan bir isim. @tr
has subproperty: yhteistoimijan hakutieto
has subproperty: henkilön hakutieto
has subproperty: toimijan auktorisoitu hakutieto
has subproperty: toimijan varianttihakutieto
has subproperty: P50373

yhteistoimijan hakutieto
status: Published
type: Property
label: has access point for collective agent @en
lexical alias: accessPointForCollectiveAgent.en
definition: Relates a collective agent to a nomen that is an appellation of collective agent in natural language that is taken from a vocabulary encoding scheme or is constructed using a string encoding scheme. @en
domain: C10011
toolkit label: access point for collective agent @en
toolkit definition: A nomen that is an appellation of collective agent in natural language that is taken from a vocabulary encoding scheme or is constructed using a string encoding scheme. @en
sub property of: yhteistoimijan nimitys
sub property of: toimijan hakutieto
has element type: 3
definition: Liittää yhteistoimijan nomeniin, joka on luonnollisella kielellä oleva yhteistoimijan nimitys, joka on otettu sanaston merkintäjärjestelmästä tai muodostettu käyttämällä merkkijonon merkintäjärjestelmää.
toolkit label: yhteistoimijan hakutieto
toolkit definition: Nomen, joka on yhteistoimijan luonnollisella kielellä oleva nimitys, joka on otettu sanaston merkintäjärjestelmästä tai muodostettu käyttämällä merkkijonon merkintäjärjestelmää.
label: har søkeinngang for kollektiv agent @no
definition: Relaterer en kollektiv agent til en betegnelse for kollektiv agent på et naturlig språk som er hentet fra et kodeskjema for vokabular eller er laget ved hjelp av et kodeskjema for syntaks. @no
toolkit label: søkeinngang for kollektiv agent @no
toolkit definition: En betegnelse for kollektiv agent på et naturlig språk som er hentet fra et kodeskjema for vokabular eller er laget ved hjelp av et kodeskjema for syntaks. @no
label: heeft ingang voor collectieve actor @nl
definition: Relateert een collectieve actor aan een nomen dat is een benaming van collectieve actor in natuurlijke taal die ontleend is aan een vocabulair coderingsschema of gevormd is volgens een string coderingsschema. @nl
toolkit label: ingang voor collectieve actor @nl
toolkit definition: Een nomen dat is een benaming van collectieve actor in natuurlijke taal die ontleend is aan een vocabulair coderingsschema of gevormd is volgens een string coderingsschema. @nl
label: له نقطة وصول لوكيل جماعي @ar
definition: يربط وكيلا جماعيا بتسمية عبارة عن اسم لوكيل جماعي في اللغة الطبيعية مأخوذ من خطة ترميز مفردات، أو أنشئ باستخدام خطة ترميز سلسلة تمثيلات. @ar
toolkit label: نقطة وصول لوكيل جماعي @ar
toolkit definition: تسمية عبارة عن اسم لوكيل جماعي بلغة طبيعية مأخوذ من مخطط ترميز مفردات، أو أنشئ باستخدام خطة ترميز سلسلة تمثيلات. @ar
label: té com a punt d’accés d’agent col·lectiu @ca
definition: Relaciona un agent col·lectiu amb un nomen que és una apel·lació d’agent col·lectiu en llenguatge natural que s’obté d’un esquema de codificació de vocabulari o s’elabora usant un esquema de codificació de cadenes. @ca
toolkit label: punt d’accés d’agent col·lectiu @ca
toolkit definition: Nomen que és una apel·lació d’agent col·lectiu en llenguatge natural que s’obté d’un esquema de codificació de vocabulari o s’elabora usant un esquema de codificació de cadenes. @ca
label: har søgeindgang for kollektiv agent @da
definition: Relaterer en kollektiv agent til et nomen, som er en benævnelse på kollektiv agent på normalsprog, som er taget fra et vokabularkodningsskema eller er konstrueret ved hjælp af et strengkodningsskema. @da
toolkit label: søgeindgang for kollektiv agent @da
toolkit definition: Nomen, som er en benævnelse på kollektiv agent på normalsprog, som er taget fra et vokabularkodningsskema eller er konstrueret ved hjælp af et strengkodningsskema. @da
label: kollektiivi otsielement @et
definition: Seostab kollektiivi kollektiivi nimetusega loomulikus keeles, mis on võetud leksikaalsest märkimissüsteemist või moodustatud stringilise märkimissüsteemi alusel. @et
toolkit label: kollektiivi otsielement @et
toolkit definition: Kollektiivi nimetus loomulikus keeles, mis on võetud leksikaalsest märkimissüsteemist või moodustatud stringilise märkimissüsteemi alusel. @et
label: hat Sucheinstieg für einen gemeinschaftlichen Akteur @de
definition: Setzt einen gemeinschaftlichen Akteur in Beziehung zu einer Bezeichnung für einen gemeinschaftlichen Akteur in natürlicher Sprache, die einem Vocabulary Encoding Scheme entnommen oder mit einem String Encoding Scheme konstruiert wird. @de
toolkit label: Sucheinstieg für einen gemeinschaftlichen Akteur @de
toolkit definition: Eine Bezeichnung für einen gemeinschaftlichen Akteur in natürlicher Sprache, die einem Vocabulary Encoding Scheme entnommen oder mit einem String Encoding Scheme konstruiert wird. @de
label: hozzáférési pontja kollektív ágenshez a következő: @hu
definition: Hozzákapcsol egy kollektív ágenst egy nomenhez, egy kollektív ágens természetes nyelvű megnevezéséhez, amely egy szótárkódolási sémából származik, vagy egy karakterlánc-kódolási séma használatával szerkesztett. @hu
toolkit label: hozzáférési pont kollektív ágenshez: @hu
toolkit definition: Egy nomen, egy kollektív ágens természetes nyelvű megnevezése, amely egy szótárkódolási sémából származik, vagy egy karakterlánc-kódolási séma használatával szerkesztett. @hu
label: ha come punto d'accesso per agente collettivo @it
definition: Correla un agente collettivo alla denominazione di un agente collettivo in linguaggio naturale che è presa dallo schema di codifica di un vocabolario controllato o è costruita usando uno schema di codifica di una stringa. @it
toolkit label: punto d'accesso per agente collettivo @it
toolkit definition: Denominazione di un agente collettivo in linguaggio naturale che è presa dallo schema di codifica di un vocabolario controllato o è costruita usando uno schema di codifica di una stringa. @it
label: έχει σημείο πρόσβασης για συλλογικό φορέα @el
toolkit label: σημείο πρόσβασης για συλλογικό φορέα @el
label: a pour point d’accès d’un agent collectif @fr
definition: Met un agent collectif en relation avec un nomen qui est une appellation d’agent collectif en langage naturel provenant d’un schéma d’encodage de vocabulaire ou construite à l’aide d’un schéma d’encodage de chaînes. @fr
toolkit label: point d’accès d’un agent collectif @fr
toolkit definition: Nomen qui est une appellation d’agent collectif en langage naturel provenant d’un schéma d’encodage de vocabulaire ou construite à l’aide d’un schéma d’encodage de chaînes. @fr
label: grupas pamatforma @lv
definition: Sasaista grupu ar nomenu, kas ir grupas vārds/nosaukums dabiskā valodā, kas ņemts no shēmas kontrolētu vārdnīcu kodēšanai vai tiek konstruēts, izmantojot virknes kodēšanas shēmu. @lv
toolkit label: grupas pamatforma @lv
toolkit definition: Grupas vārds/nosaukums dabiskā valodā, kas ņemts no shēmas kontrolētu vārdnīcu kodēšanai vai tiek konstruēts, izmantojot virknes kodēšanas shēmu. @lv
label: 有集体行为者的检索点 @zh-hans
definition: 将一个集体行为者与作为一个集体行为者的称谓、取自一个词表编码体系或者用一个串编码体系构建、用自然语言的一个命名关联起来。 @zh-hans
toolkit label: 集体行为者的检索点 @zh-hans
toolkit definition: 作为一个集体行为者的称谓、取自一个词表编码体系或者用一个串编码体系构建、用自然语言的一个命名 @zh-hans
label: kolektif temsilci için erişim noktası ile ilişkilidir @tr
definition: Kolektif bir temsilciyi, bir kelime dağarcığı kodlama şemasından alınan veya bir dize kodlama şeması kullanılarak oluşturulan doğal dilde kolektif temsilcinin adı olan bir isimlendirmeyle ilişkilendirirlir. @tr
toolkit label: Kolektif temsilci için erişim noktası @tr
toolkit definition: Bir kelime kodlama şemasından alınan veya bir dizi kodlama şeması kullanılarak oluşturulan, doğal dilde bir kolektif temsilcinin unvanı olan bir isim. @tr
has subproperty: yhteisön hakutieto
has subproperty: suvun hakutieto
has subproperty: yhteistoimijan auktorisoitu hakutieto
has subproperty: yhteistoimijan varianttihakutieto
has subproperty: P50374

yhteisön hakutieto
status: Published
type: Property
label: has access point for corporate body @en
lexical alias: accessPointForCorporateBody.en
definition: Relates a corporate body to a nomen that is an appellation of corporate body in natural language that is taken from a vocabulary encoding scheme or is constructed using a string encoding scheme. @en
domain: C10005
toolkit label: access point for corporate body @en
toolkit definition: A nomen that is an appellation of corporate body in natural language that is taken from a vocabulary encoding scheme or is constructed using a string encoding scheme. @en
sub property of: yhteisön nimitys
sub property of: yhteistoimijan hakutieto
has element type: 3
definition: Liittää yhteisön nomeniin, joka on luonnollisella kielellä oleva yhteisön nimitys, joka on otettu sanaston merkintäjärjestelmästä tai muodostettu käyttämällä merkkijonon merkintäjärjestelmää.
toolkit label: yhteisön hakutieto
toolkit definition: Nomen, joka on yhteisön luonnollisella kielellä oleva nimitys, joka on otettu sanaston merkintäjärjestelmästä tai muodostettu käyttämällä merkkijonon merkintäjärjestelmää.
label: har søkeinngang for korporasjon @no
definition: Relaterer en korporasjon til en betegnelse for korporasjon på et naturlig språk som er hentet fra et kodeskjema for vokabular eller er laget ved hjelp av et kodeskjema for syntaks. @no
toolkit label: søkeinngang for korporasjon @no
toolkit definition: En betegnelse for korporasjon på et naturlig språk som er hentet fra et kodeskjema for vokabular eller er laget ved hjelp av et kodeskjema for syntaks. @no
label: heeft ingang voor corporatie @nl
definition: Relateert een corporatie aan een nomen dat is een benaming van corporatie in natuurlijke taal die ontleend is aan een vocabulair coderingsschema of gevormd is volgens een string coderingsschema. @nl
toolkit label: ingang voor corporatie @nl
toolkit definition: Een nomen dat is een benaming van corporatie in natuurlijke taal die ontleend is aan een vocabulair coderingsschema of gevormd is volgens een string coderingsschema. @nl
label: له نقطة وصول لهيئة @ar
definition: يربط هيئة بتسمية عبارة عن اسم هيئة بلغة طبيعية مأخوذ من مخطط ترميز مفردات، أو أنشئ باستخدام خطة ترميز سلسلة تمثيلات. @ar
toolkit label: نقطة وصول لهيئة @ar
toolkit definition: تسمية لهيئة عبارة عن اسم بلغة طبيعية مأخوذ من مخطط ترميز مفردات، أو أنشئ باستخدام خطة ترميز سلسلة تمثيلات. @ar
label: té com a punt d’accés d’entitat corporativa @ca
definition: Relaciona una entitat corporativa amb un nomen que és una apel·lació d’entitat corporativa en llenguatge natural que s’obté d’un esquema de codificació de vocabulari o s’elabora usant un esquema de codificació de cadenes. @ca
toolkit label: punt d’accés d’entitat corporativa @ca
toolkit definition: Nomen que és una apel·lació d’entitat corporativa en llenguatge natural que s’obté d’un esquema de codificació de vocabulari o s’elabora usant un esquema de codificació de cadenes. @ca
label: har søgeindgang for korporation @da
definition: Relaterer en korporation til et nomen, som er en benævnelse på korporation på normalsprog, som er taget fra et vokabularkodningsskema eller er konstrueret ved hjælp af et strengkodningsskema. @da
toolkit label: søgeindgang for korporation @da
toolkit definition: Nomen, som er en benævnelse på korporation på normalsprog, som er taget fra et vokabularkodningsskema eller er konstrueret ved hjælp af et strengkodningsskema. @da
label: asutuse otsielement @et
definition: Seostab asutuse asutuse nimetusega loomulikus keeles, mis on võetud leksikaalsest märkimissüsteemist või moodustatud stringilise märkimissüsteemi alusel. @et
toolkit label: asutuse otsielement @et
toolkit definition: Asutuse nimetus loomulikus keeles, mis on võetud leksikaalsest märkimissüsteemist või moodustatud stringilise märkimissüsteemi alusel. @et
label: hat Sucheinstieg für eine Körperschaft @de
definition: Setzt eine Körperschaft in Beziehung zu einer Bezeichnung für eine Körperschaft in natürlicher Sprache, die einem Vocabulary Encoding Scheme entnommen oder mit einem String Encoding Scheme konstruiert wird. @de
toolkit label: Sucheinstieg für eine Körperschaft @de
toolkit definition: Eine Bezeichnung für eine Körperschaft in natürlicher Sprache, die einem Vocabulary Encoding Scheme entnommen oder mit einem String Encoding Scheme konstruiert wird. @de
label: hozzáférési pontja testülethez a következő: @hu
definition: Hozzákapcsol egy testületet egy nomenhez, egy testület természetes nyelvű megnevezéséhez, amely egy szótárkódolási sémából származik, vagy egy karakterlánc-kódolási séma használatával szerkesztett. @hu
toolkit label: hozzáférési pont testülethez: @hu
toolkit definition: Egy nomen, egy testület természetes nyelvű megnevezése, amely egy szótárkódolási sémából származik, vagy egy karakterlánc-kódolási séma használatával szerkesztett. @hu
label: ha come punto d'accesso per ente @it
definition: Correla un ente alla denominazione di un ente collettivo in linguaggio naturale che è presa dallo schema di codifica di un vocabolario (vocabolario controllato) o è costruita usando uno schema di codifica di una stringa. @it
toolkit label: punto d'accesso per ente @it
toolkit definition: Denominazione di un ente collettivo in linguaggio naturale che è presa dallo schema di codifica di un vocabolario controllato o è costruita usando uno schema di codifica di una stringa. @it
label: έχει σημείο πρόσβασης για συλλογικό όργανο @el
toolkit label: σημείο πρόσβασης για συλλογικό όργανο @el
label: a pour point d’accès d’une collectivité @fr
definition: Met une collectivité en relation avec un nomen qui est une appellation de collectivité en langage naturel provenant d’un schéma d’encodage de vocabulaire ou construite à l’aide d’un schéma d’encodage de chaînes. @fr
toolkit label: point d’accès d’une collectivité @fr
toolkit definition: Nomen qui est une appellation de collectivité en langage naturel provenant d’un schéma d’encodage de vocabulaire ou construite à l’aide d’un schéma d’encodage de chaînes. @fr
label: institūcijas pamatforma @lv
definition: Sasaista institūciju ar nomenu, kas ir institūcijas vārds/nosaukums dabiskā valodā, kas ņemts no shēmas kontrolētu vārdnīcu kodēšanai vai tiek konstruēts, izmantojot virknes kodēšanas shēmu. @lv
toolkit label: institūcijas pamatforma @lv
toolkit definition: Institūcijas vārds/nosaukums dabiskā valodā, kas ņemts no shēmas kontrolētu vārdnīcu kodēšanai vai tiek konstruēts, izmantojot virknes kodēšanas shēmu. @lv
label: 有团体的检索点 @zh-hans
definition: 将一个团体与作为一个团体的称谓、取自一个词表编码体系或者用一个串编码体系构建、用自然语言的一个命名关联起来。 @zh-hans
toolkit label: 团体的检索点 @zh-hans
toolkit definition: 作为一个团体的称谓、取自一个词表编码体系或者用一个串编码体系构建、用自然语言的一个命名 @zh-hans
label: tüzel kişi için erişim noktası ile ilişkilidir @tr
definition: Bir tüzel kişiyi, bir kelime kodlama şemasından alınan veya bir dizi kodlama şeması kullanılarak oluşturulan, doğal dilde bir tüzel kişinin tanımlayıcı adı olan bir isim ile ilişkilendirir. @tr
toolkit label: Tüzel kişi için erişim noktası @tr
toolkit definition: Bir kelime kodlama şemasından alınan veya bir dizi kodlama şeması kullanılarak oluşturulan, doğal dilde bir tüzel kişinin unvanı olan bir isim. @tr
has subproperty: yhteisön auktorisoitu hakutieto
has subproperty: yhteisön varianttihakutieto
has subproperty: P50375

suvun hakutieto
status: Published
type: Property
label: has access point for family @en
lexical alias: accessPointForFamily.en
definition: Relates a family to a nomen that is an appellation of family in natural language that is taken from a vocabulary encoding scheme or is constructed using a string encoding scheme. @en
domain: C10008
toolkit label: access point for family @en
toolkit definition: A nomen that is an appellation of family in natural language that is taken from a vocabulary encoding scheme or is constructed using a string encoding scheme. @en
sub property of: suvun nimitys
sub property of: yhteistoimijan hakutieto
has element type: 3
definition: Liittää suvun nomeniin, joka on luonnollisella kielellä oleva suvun nimitys, joka on otettu sanaston merkintäjärjestelmästä tai muodostettu käyttämällä merkkijonon merkintäjärjestelmää.
toolkit label: suvun hakutieto
toolkit definition: Nomen, joka on suvun luonnollisella kielellä oleva nimitys, joka on otettu sanaston merkintäjärjestelmästä tai muodostettu käyttämällä merkkijonon merkintäjärjestelmää.
label: har søkeinngang for familie @no
definition: Relaterer en familie til en betegnelse for familie på et naturlig språk som er hentet fra et kodeskjema for vokabular eller er laget ved hjelp av et kodeskjema for syntaks. @no
toolkit label: søkeinngang for familie @no
toolkit definition: En betegnelse for familie på et naturlig språk som er hentet fra et kodeskjema for vokabular eller er laget ved hjelp av et kodeskjema for syntaks. @no
label: heeft ingang voor familie @nl
definition: Relateert een familie aan een nomen dat is een benaming van familie in natuurlijke taal die ontleend is aan een vocabulair coderingsschema of gevormd is volgens een string coderingsschema. @nl
toolkit label: ingang voor familie @nl
toolkit definition: Een nomen dat is een benaming van familie in natuurlijke taal die ontleend is aan een vocabulair coderingsschema of gevormd is volgens een string coderingsschema. @nl
label: له نقطة وصول لعائلة @ar
definition: يربط عائلة بتسمية عبارة عن اسم عائلة بلغة طبيعية مأخوذ من مخطط ترميز مفردات، أو أنشئ باستخدام خطة ترميز سلسلة تمثيلات. @ar
toolkit label: نقطة وصول لعائلة @ar
toolkit definition: تسمية عبارة عن اسم عائلة بلغة طبيعية مأخوذ من مخطط ترميز مفردات، أو أنشئ باستخدام خطة ترميز سلسلة تمثيلات. @ar
label: té com a punt d’accés de família @ca
definition: Relaciona una família amb un nomen que és una apel·lació de família en llenguatge natural que s’obté d’un esquema de codificació de vocabulari o s’elabora usant un esquema de codificació de cadenes. @ca
toolkit label: punt d’accés de família @ca
toolkit definition: Nomen que és una apel·lació de família en llenguatge natural que s’obté d’un esquema de codificació de vocabulari o s’elabora usant un esquema de codificació de cadenes. @ca
label: har søgeindgang for familie @da
definition: Relaterer en familie til et nomen, som er en benævnelse på familie på normalsprog, som er taget fra et vokabularkodningsskema eller er konstrueret ved hjælp af et strengkodningsskema. @da
toolkit label: søgeindgang for familie @da
toolkit definition: Nomen, som er en benævnelse på familie på normalsprog, som er taget fra et vokabularkodningsskema eller er konstrueret ved hjælp af et strengkodningsskema. @da
label: perekonna otsielement @et
definition: Seostab perekonna perekonna nimetusega loomulikus keeles, mis on võetud leksikaalsest märkimissüsteemist või moodustatud stringilise märkimissüsteemi alusel. @et
toolkit label: perekonna otsielement @et
toolkit definition: Perekonna nimetus loomulikus keeles, mis on võetud leksikaalsest märkimissüsteemist või moodustatud stringilise märkimissüsteemi alusel. @et
label: hat Sucheinstieg für eine Familie @de
definition: Setzt eine Familie in Beziehung zu einer Bezeichnung für eine Familie in natürlicher Sprache, die einem Vocabulary Encoding Scheme entnommen oder mit einem String Encoding Scheme konstruiert wird. @de
toolkit label: Sucheinstieg für eine Familie @de
toolkit definition: Eine Bezeichnung für eine Familie in natürlicher Sprache, die einem Vocabulary Encoding Scheme entnommen oder mit einem String Encoding Scheme konstruiert wird. @de
label: hozzáférési pontja családhoz a következő: @hu
definition: Hozzákapcsol egy családot egy nomenhez, egy család természetes nyelvű megnevezéséhez, amely egy szótárkódolási sémából származik, vagy egy karakterlánc-kódolási séma használatával szerkesztett. @hu
toolkit label: hozzáférési pont családhoz: @hu
toolkit definition: Egy nomen, egy család természetes nyelvű megnevezése, amely egy szótárkódolási sémából származik, vagy egy karakterlánc-kódolási séma használatával szerkesztett. @hu
label: ha come punto d'accesso per famiglia @it
definition: correla una famiglia alla denominazione di una famiglia in linguaggio naturale che è presa dallo schema di codifica di un vocabolario (vocabolario controllato) o è costruita usando uno schema di codifica di una stringa. @it
toolkit label: punto d'accesso per famiglia @it
toolkit definition: Denominazione di una famiglia in linguaggio naturale che è presa dallo schema di codifica di un vocabolario controllato o è costruita usando uno schema di codifica di una stringa. @it
label: έχει σημείο πρόσβασης για οικογένεια @el
toolkit label: σημείο πρόσβασης για οικογένεια @el
label: a pour point d’accès d’une famille @fr
definition: Met une famille en relation avec un nomen qui est une appellation de famille en langage naturel provenant d’un schéma d’encodage de vocabulaire ou construite à l’aide d’un schéma d’encodage de chaînes. @fr
toolkit label: point d’accès d’une famille @fr
toolkit definition: Nomen qui est une appellation de famille en langage naturel provenant d’un schéma d’encodage de vocabulaire ou construite à l’aide d’un schéma d’encodage de chaînes. @fr
label: dzimtas/ģimenes pamatforma @lv
definition: Sasaista dzimtu/ģimeni ar nomenu, kas ir dzimtas/ģimenes vārds/nosaukums dabiskā valodā, kas ņemts no shēmas kontrolētu vārdnīcu kodēšanai vai tiek konstruēts, izmantojot virknes kodēšanas shēmu. @lv
toolkit label: dzimtas/ģimenes pamatforma @lv
toolkit definition: Dzimtas/ģimenes vārds/nosaukums dabiskā valodā, kas ņemts no shēmas kontrolētu vārdnīcu kodēšanai vai tiek konstruēts, izmantojot virknes kodēšanas shēmu. @lv
label: 有家族的检索点 @zh-hans
definition: 将一个家族与作为一个家族的称谓、取自一个词表编码体系或者用一个串编码体系构建、用自然语言的一个命名关联起来。 @zh-hans
toolkit label: 家族的检索点 @zh-hans
toolkit definition: 作为一个家族的称谓、取自一个词表编码体系或者用一个串编码体系构建、用自然语言的一个命名 @zh-hans
label: aile için erişim noktası ile ilişkilidir @tr
definition: Bir aileyi, bir kelime kodlama şemasından alınan veya bir dizi kodlama şeması kullanılarak oluşturulan, doğal dilde bir ailenin tanımlayıcı adı olan bir isimle ilişkilendirir. @tr
toolkit label: Aile için erişim noktası @tr
toolkit definition: Bir kelime kodlama şemasından alınan veya bir dizi kodlama şeması kullanılarak oluşturulan, doğal dilde bir ailenin unvanı olan bir isim. @tr
has subproperty: suvun auktorisoitu hakutieto
has subproperty: suvun varianttihakutieto
has subproperty: P50376

henkilön hakutieto
status: Published
type: Property
label: has access point for person @en
lexical alias: accessPointForPerson.en
definition: Relates a person to a nomen that is an appellation of person in natural language that is taken from a vocabulary encoding scheme or is constructed using a string encoding scheme. @en
domain: C10004
toolkit label: access point for person @en
toolkit definition: A nomen that is an appellation of person in natural language that is taken from a vocabulary encoding scheme or is constructed using a string encoding scheme. @en
sub property of: henkilön nimitys
sub property of: toimijan hakutieto
has element type: 3
definition: Liittää henkilön nomeniin, joka on luonnollisella kielellä oleva henkilön nimitys, joka on otettu sanaston merkintäjärjestelmästä tai muodostettu käyttämällä merkkijonon merkintäjärjestelmää.
toolkit label: henkilön hakutieto
toolkit definition: Nomen, joka on henkilön luonnollisella kielellä oleva nimitys, joka on otettu sanaston merkintäjärjestelmästä tai muodostettu käyttämällä merkkijonon merkintäjärjestelmää.
label: har søkeinngang for person @no
definition: Relaterer en person til en betegnelse for person på et naturlig språk som er hentet fra et kodeskjema for vokabular eller er laget ved hjelp av et kodeskjema for syntaks. @no
toolkit label: søkeinngang for person @no
toolkit definition: En betegnelse for person på et naturlig språk som er hentet fra et kodeskjema for vokabular eller er laget ved hjelp av et kodeskjema for syntaks. @no
label: heeft ingang voor persoon @nl
definition: Relateert een persoon aan een nomen dat is een benaming van persoon in natuurlijke taal die ontleend is aan een vocabulair coderingsschema of gevormd is volgens een string coderingsschema. @nl
toolkit label: ingang voor persoon @nl
toolkit definition: Een nomen dat is een benaming van persoon in natuurlijke taal die ontleend is aan een vocabulair coderingsschema of gevormd is volgens een string coderingsschema. @nl
label: له نقطة وصول لشخص @ar
definition: يربط شخصا بتسمية عبارة عن اسم شخص بلغة طبيعية مأخوذ من مخطط ترميز مفردات، أو أنشئ باستخدام خطة ترميز سلسلة تمثيلات. @ar
toolkit label: نقطة وصول لشخص @ar
toolkit definition: تسمية عبارة عن اسم شخص بلغة طبيعية مأخوذ من مخطط ترميز مفردات أو أنشئ باستخدام خطة ترميز سلسلة تمثيلات. @ar
label: té com a punt d’accés de persona @ca
definition: Relaciona una persona amb un nomen que és una apel·lació de persona en llenguatge natural que s’obté d’un esquema de codificació de vocabulari o s’elabora usant un esquema de codificació de cadenes. @ca
toolkit label: punt d’accés de persona @ca
toolkit definition: Nomen que és una apel·lació de persona en llenguatge natural que s’obté d’un esquema de codificació de vocabulari o s’elabora usant un esquema de codificació de cadenes. @ca
label: har søgeindgang for person @da
definition: Relaterer en person til en benævnelse på person på normalsprog, som er taget fra et vokabularkodningsskema eller er konstrueret ved hjælp af et strengkodningsskema. @da
toolkit label: søgeindgang for person @da
toolkit definition: Nomen, som er en benævnelse på person på normalsprog, som er taget fra et vokabularkodningsskema eller er konstrueret ved hjælp af et strengkodningsskema. @da
label: isiku otsielement @et
definition: Seostab isiku isiku nimetusega loomulikus keeles, mis on võetud leksikaalsest märkimissüsteemist või moodustatud stringilise märkimissüsteemi alusel. @et
toolkit label: isiku otsielement @et
toolkit definition: Isiku nimetus loomulikus keeles, mis on võetud leksikaalsest märkimissüsteemist või moodustatud stringilise märkimissüsteemi alusel. @et
label: hat Sucheinstieg für eine Person @de
definition: Setzt eine Person in Beziehung zu einer Bezeichnung für eine Person in natürlicher Sprache, die einem Vocabulary Encoding Scheme entnommen oder mit einem String Encoding Scheme konstruiert wird. @de
toolkit label: Sucheinstieg für eine Person @de
toolkit definition: Eine Bezeichnung für eine Person in natürlicher Sprache, die einem Vocabulary Encoding Scheme entnommen oder mit einem String Encoding Scheme konstruiert wird. @de
label: hozzáférési pont személyhez a következő: @hu
definition: Hozzákapcsol egy személy egy nomenhez, egy személy természetes nyelvű megnevezéséhez, amely egy szótárkódolási sémából származik, vagy egy karakterlánc-kódolási séma használatával szerkesztett. @hu
toolkit label: hozzáférési pont személyhez: @hu
toolkit definition: Egy nomen, egy személy természetes nyelvű megnevezése, amely egy szótárkódolási sémából származik, vagy egy karakterlánc-kódolási séma használatával szerkesztett. @hu
label: ha come punto d'accesso per persona @it
definition: Correla una persona con la denominazione di una persona in linguaggio naturale che è presa dallo schema di codifica di un vocabolario (vocabolario controllato) o è costruita usando uno schema di codifica di una stringa. @it
toolkit label: punto d'accesso per persona @it
toolkit definition: Denominazione di una persona in linguaggio naturale che è presa dallo schema di codifica di un vocabolario controllato o è costruita usando uno schema di codifica di una stringa. @it
label: έχει σημείο πρόσβασης για φυσικό πρόσωπο @el
toolkit label: σημείο πρόσβασης για φυσικό πρόσωπο @el
label: a pour point d’accès d’une personne @fr
definition: Met une personne en relation avec un nomen qui est une appellation de personne en langage naturel provenant d’un schéma d’encodage de vocabulaire ou construite à l’aide d’un schéma d’encodage de chaînes. @fr
toolkit label: point d’accès d’une personne @fr
toolkit definition: Nomen qui est une appellation de personne en langage naturel provenant d’un schéma d’encodage de vocabulaire ou construite à l’aide d’un schéma d’encodage de chaînes. @fr
label: personas pamatforma @lv
definition: Sasaista personu ar nomenu, kas ir personas vārds/nosaukums dabiskā valodā, kas ņemts no shēmas kontrolētu vārdnīcu kodēšanai vai tiek konstruēts, izmantojot virknes kodēšanas shēmu. @lv
toolkit label: personas pamatforma @lv
toolkit definition: Personas vārds/nosaukums dabiskā valodā, kas ņemts no shēmas kontrolētu vārdnīcu kodēšanai vai tiek konstruēts, izmantojot virknes kodēšanas shēmu. @lv
label: 有个人的检索点 @zh-hans
definition: 将一个个人与作为一个个人的称谓、取自一个词表编码体系或者用一个串编码体系构建、用自然语言的一个命名关联起来。 @zh-hans
toolkit label: 个人的检索点 @zh-hans
toolkit definition: 作为一个个人的称谓、取自一个词表编码体系或者用一个串编码体系构建、用自然语言的一个命名 @zh-hans
label: kişi için erişim noktası ile ilişkilidir @tr
definition: Bir kişiyi, bir kelime kodlama şemasından alınan veya bir dizi kodlama şeması kullanılarak oluşturulan, doğal dilde bir kişinin tanımlayıcı adı olan bir isimle ilişkilendirir. @tr
toolkit label: Kişi için erişim noktası @tr
toolkit definition: Bir kelime kodlama şemasından alınan veya bir dizi kodlama şeması kullanılarak oluşturulan, doğal dilde bir kişinin unvanı olan bir isim. @tr
has subproperty: henkilön auktorisoitu hakutieto
has subproperty: henkilön varianttihakutieto
has subproperty: P50377

näyttelijä (toimija) ekspressiossa
status: Published
label: is actor agent of @en
definition: Relates an agent to an expression that includes a contribution by an agent of acting as a cast member or player in a musical or dramatic presentation. @en
type: Property
domain: C10002
sub property of: esittäjä (toimija) ekspressiossa
lexical alias: actorAgentOf.en
label: est un agent acteur de @fr
definition: Met un agent en relation avec une expression qui intègre une contribution de la part d’un agent consistant à agir à titre de membre d’une distribution artistique ou de comédien dans une présentation musicale ou dramatique. @fr
toolkit label: agent acteur de @fr
toolkit definition: Expression qui intègre une contribution de la part d’un agent consistant à agir à titre de membre d’une distribution artistique ou de comédien dans une présentation musicale ou dramatique. @fr
toolkit label: actor agent of @en
toolkit definition: An expression that includes a contribution by an agent of acting as a cast member or player in a musical or dramatic presentation. @en
instruction number: 18.5
label: είναι ηθοποιός φορέας του @el
definition: Συνδέει έναν εκτελεστή, ο οποίος συνεισφέρει στην έκφραση ενός έργου ενεργώντας ως ηθοποιός ή εκτελεστής σε μια μουσική ή δραματική παράσταση κ.λπ., με μια έκφραση. @el
toolkit label: ηθοποιός φορέας του @el
toolkit definition: Μια έκφραση ενός έργου που ενσωματώνει τη συνεισφορά της υποκριτικής ερμηνείας ως μέλος του επιτελείου των ηθοποιών ή των εκτελεστών, σε μια μουσική ή δραματική παρουσίαση κ.λπ. @el
definition: Setzt einen Akteur in Beziehung zu einer Expression, zu der ein Akteur beiträgt, indem er als Ensemble-Mitglied oder Darstellerin/Darsteller in einer musikalischen oder dramatischen Darbietung fungiert. @de
toolkit label: Akteur als Schauspielerin/Schauspieler von @de
toolkit definition: Eine Expression, zu der ein Akteur beiträgt, indem er als Ensemble-Mitglied oder Darstellerin/Darsteller in einer musikalischen oder dramatischen Darbietung fungiert. @de
label: er agent, som er skuespiller af @da
definition: Relaterer en agent til et udtryk, som omfatter en agents bidrag ved at være skuespiller eller musiker i en musikalsk eller dramatisk præsentation. @da
toolkit label: agent, som er skuespiller af @da
toolkit definition: Udtryk, som omfatter en agents bidrag ved at være skuespiller eller musiker i en musikalsk eller dramatisk præsentation. @da
label: és agent actor de @ca
definition: Relaciona un agent amb una expressió que inclou una contribució d’un agent actuant com un membre del repartiment o com un comediant d’una representació musical o dramàtica. @ca
toolkit label: agent actor de @ca
toolkit definition: Expressió que inclou una contribució d’un agent actuant com un membre del repartiment o com un comediant d’una representació musical o dramàtica. @ca
definition: Liittää toimijan ekspressioon, jonka tekemiseen toimija osallistuu näyttelemällä musiikki- tai näytelmäesityksessä.
toolkit label: näyttelijä (toimija) ekspressiossa
toolkit definition: Ekspressio, jonka tekemiseen toimija osallistuu näyttelemällä musiikki- tai näytelmäesityksessä.
toolkit label: skuespiller i (agent) @no
toolkit definition: Et uttrykk som inkluderer et bidrag fra en agent i form av å spille en rolle i en musikalsk eller dramatisk presentasjon. @no
label: ist Akteur als Schauspielerin/Schauspieler von @de
has element type: 2
label: színész ágense a következőnek: @hu
definition: Hozzákapcsol egy ágenst egy kifejezési formához, amely magában foglalja egy ágensnek, mint a szereposztás egy tagjának vagy előadójának a közreműködését egy zenei vagy drámai bemutatóban. @hu
toolkit label: színész ágense: @hu
toolkit definition: Egy kifejezési forma, amely magában foglalja egy ágensnek, mint a szereposztás egy tagjának vagy előadójának a közreműködését egy zenei vagy drámai bemutatóban. @hu
alternative label: actor of @en
alternative label: esiintyjänä esityksessä
label: er skuespiller i (agent) @no
definition: Relaterer en agent til et uttrykk som inkluderer et bidrag fra en agent i form av å spille en rolle i en musikalsk eller dramatisk presentasjon. @no
alternative label: skuespiller i @no
label: is acteur-actor van @nl
definition: Relateert een actor aan een expressie die omvat een bijdrage door een actor die speelt als een lid van een gezelschap of speler in een muziek- of dramapresentatie. @nl
toolkit label: acteur-actor van @nl
toolkit definition: Een expressie die omvat een bijdrage door een actor die speelt als een lid van een gezelschap of speler in een muziek- of dramapresentatie. @nl
label: هو وكيل ممثل لـ @ar
definition: يربط وكيلا بتعبيرة تتضمن إسهام وكيل يعمل كعضو فريق تمثيل أو كعازف في عرض موسيقي أو درامي. @ar
alternative label: ممثل @ar
toolkit label: وكيل ممثل @ar
toolkit definition: تعبيرة تتضمن إسهام وكيل يعمل كعضو فريق تمثيل أو عازف في عرض موسيقي أو درامي. @ar
alternative label: actor de @ca
alternative label: skuespiller af @da
label: näitleja (tegija) väljenduses @et
definition: Seostab tegija väljendusega, millesse tegija on andnud panuse, osaledes trupiliikme või näitlejana muusika- või draamaetenduses. @et
alternative label: näitleja väljenduses @et
toolkit label: näitleja (tegija) väljenduses @et
toolkit definition: Väljendus, millesse tegija on andnud panuse, osaledes trupiliikme või näitlejana muusika- või draamaetenduses. @et
label: è attore agente di @it
definition: Correla un agente a un'espressione che include un contributo da parte di un agente che agisce come membro del cast o attore in una rappresentazione musicale o teatrale. @it
alternative label: attore di @it
toolkit label: attore agente di @it
toolkit definition: Espressione che include un contributo da parte di un agente che agisce come membro del cast o attore in una rappresentazione musicale o teatrale. @it
alternative label: ηθοποιός του @el
alternative label: acteur de @fr
label: ir aktieris (aģents) @lv
definition: Sasaista aģentu ar izteiksmi, kas ietver aģenta ieguldījumu, izpildot lomu dramatiskā uzvedumā vai spēlējot mūzikas uzvedumā. @lv
toolkit label: ir aktieris (aģents) @lv
toolkit definition: Izteiksme, kas ietver aģenta ieguldījumu, izpildot lomu dramatiskā uzvedumā vai spēlējot mūzikas uzvedumā. @lv
alternative label: Schauspieler von @de
alternative label: ……的演员 @zh-hans
label: 是……的演员行为者 @zh-hans
toolkit label: ……的演员行为者 @zh-hans
toolkit definition: 包括在音乐或戏剧呈现中扮演角色或演奏的一个行为者的贡献的一种内容表达 @zh-hans
toolkit label: Oyuncu temsilci @tr
toolkit definition: Bir müzikal veya dramatik sunumda oyuncu veya oyuncu kadrosu üyesi olarak hareket eden bir temsilcinin katkısını içeren bir anlatım. @tr
has subproperty: näyttelijä (yhteistoimija) ekspressiossa

näyttelijä (yhteistoimija) ekspressiossa
status: Published
label: is actor collective agent of @en
lexical alias: actorCollectiveAgentOf.en
definition: Relates a collective agent to an expression that includes a contribution by a collective agent of acting as a cast member or player in a musical or dramatic presentation. @en
toolkit label: actor collective agent of @en
toolkit definition: An expression that includes a contribution by a collective agent of acting as a cast member or player in a musical or dramatic presentation. @en
type: Property
domain: C10011
has element type: 2
sub property of: esittäjä (yhteistoimija) ekspressiossa
sub property of: näyttelijä (toimija) ekspressiossa
definition: Liittää yhteistoimijan ekspressioon, jonka tekemisessä yhteistoimija on osallisena näyttelemällä musiikki- tai näytelmäesityksessä.
toolkit label: näyttelijä (yhteistoimija) ekspressiossa
toolkit definition: Ekspressio, jonka tekemisessä yhteistoimija on osallisena näyttelemällä musiikki- tai näytelmäesityksessä.
label: er skuepiller for (kollektiv agent) @no
definition: Relaterer en kollektiv agent til et uttrykk som inkluderer et bidrag fra en kollektiv agent i form av å spille en rolle eller som utøver i en musikalsk eller dramatisk forestilling. @no
toolkit label: skuepiller for (kollektiv agent) @no
toolkit definition: Et uttrykk som inkluderer et bidrag fra en kollektiv agent i form av å spille en rolle eller som utøver i en musikalsk eller dramatisk forestilling. @no
label: is acteur-collectieve actor van @nl
definition: Relateert een collectieve actor aan een expressie die omvat een bijdrage door een collectieve actor die optreedt als een lid van een gezelschap of speler in een muziek- of dramapresentatie. @nl
toolkit label: acteur-collectieve actor van @nl
toolkit definition: Een expressie die omvat een bijdrage door een collectieve actor die optreedt als een lid van een gezelschap of speler in een muziek- of dramapresentatie. @nl
label: هو وكيل جماعي ممثل لـ @ar
definition: يربط وكيلا جماعيا بتعبيرة تتضمن إسهام وكيل جماعي يعمل كعضو فريق تمثيل أو عازف في عرض موسيقي أو درامي. @ar
toolkit label: وكيل جماعي ممثل @ar
toolkit definition: تعبيرة تتضمن إسهام وكيل جماعي يعمل كعضو فريق تمثيل أو عازف في عرض موسيقي أو درامي. @ar
label: és agent col·lectiu actor de @ca
definition: Relaciona un agent col·lectiu amb una expressió que inclou una contribució d’un agent col·lectiu actuant com un membre del repartiment o com un comediant d’una representació musical o dramàtica. @ca
toolkit label: agent col·lectiu actor de @ca
toolkit definition: Expressió que inclou una contribució d’un agent col·lectiu actuant com un membre del repartiment o com un comediant d’una representació musical o dramàtica. @ca
label: er kollektiv agent, som er skuespiller af @da
definition: Relaterer en kollektiv agent til et udtryk, som omfatter en kollektiv agents bidrag ved at være skuespiller eller musiker i en musikalsk eller dramatisk præsentation. @da
toolkit label: kollektiv agent, som er skuespiller af @da
toolkit definition: Udtryk, som omfatter en kollektiv agents bidrag ved at være skuespiller eller musiker i en musikalsk eller dramatisk præsentation. @da
label: näitleja (kollektiiv) väljenduses @et
definition: Seostab kollektiivi väljendusega, millesse kollektiiv on andnud panuse, osaledes trupiliikme või näitlejana muusika- või draamaetenduses. @et
toolkit label: näitleja (kollektiiv) väljenduses @et
toolkit definition: Väljendus, millesse kollektiiv on andnud panuse, osaledes trupiliikme või näitlejana muusika- või draamaetenduses. @et
label: ist gemeinschaftlicher Akteur als Schauspielerin/Schauspieler von @de
definition: Setzt einen gemeinschaftlichen Akteur in Beziehung zu einer Expression, zu der ein gemeinschaftlicher Akteur beiträgt, indem er als Ensemble-Mitglied oder Darstellerin/Darsteller in einer musikalischen oder dramatischen Darbietung fungiert. @de
toolkit label: Gemeinschaftlicher Akteur als Schauspielerin/Schauspieler von @de
toolkit definition: Eine Expression, zu der ein gemeinschaftlicher Akteur beiträgt, indem er als Ensemble-Mitglied oder Darstellerin/Darsteller in einer musikalischen oder dramatischen Darbietung fungiert. @de
label: színész kollektív ágense a következőnek: @hu
definition: Hozzákapcsol egy kollektív ágenst egy kifejezési formához, amely magában foglalja egy kollektív ágensnek, mint a szereposztás egy tagjának vagy előadójának a közreműködését egy zenei vagy drámai bemutatóban. @hu
toolkit label: színész kollektív ágense: @hu
toolkit definition: Egy kifejezési forma, amely magában foglalja egy kollektív ágensnek, mint a szereposztás egy tagjának vagy előadójának a közreműködését egy zenei vagy drámai bemutatóban. @hu
label: è attore agente collettivo di @it
definition: Correla un agente collettivo a un'espressione che comprende un contributo di un agente collettivo nella recitazione come membro del cast o musicista in una presentazione musicale o drammatica. @it
toolkit label: attore agente collettivo di @it
toolkit definition: Espressione che comprende un contributo di un agente collettivo nella recitazione come membro del cast o musicista in una presentazione musicale o drammatica. @it
label: είναι ηθοποιός συλλογικός φορέας του @el
toolkit label: ηθοποιός συλλογικός φορέας του @el
label: est un agent collectif acteur de @fr
definition: Met un agent collectif en relation avec une expression qui intègre une contribution de la part d’un agent collectif consistant à agir à titre de membre d’une distribution artistique ou de comédien dans une présentation musicale ou dramatique. @fr
toolkit label: agent collectif acteur de @fr
toolkit definition: Expression qui intègre une contribution de la part d’un agent collectif consistant à agir à titre de membre d’une distribution artistique ou de comédien dans une présentation musicale ou dramatique. @fr
label: ir aktieris (grupa) @lv
definition: Sasaista grupu ar izteiksmi, kas ietver grupas ieguldījumu, izpildot lomu dramatiskā uzvedumā vai spēlējot mūzikas uzvedumā. @lv
toolkit label: ir aktieris (grupa) @lv
toolkit definition: Izteiksme, kas ietver grupas ieguldījumu, izpildot lomu dramatiskā uzvedumā vai spēlējot mūzikas uzvedumā. @lv
label: 是……的演员集体行为者 @zh-hans
definition: 将一个集体行为者与包括在音乐或戏剧呈现中扮演角色或演奏的一个集体行为者的贡献的一种内容表达关联起来。 @zh-hans
toolkit label: ……的演员集体行为者 @zh-hans
toolkit definition: 包括在音乐或戏剧呈现中扮演角色或演奏的一个集体行为者的贡献的一种内容表达 @zh-hans
label: aktör kolektif temsilcisidir @tr
definition: Kolektif bir temsilciyi, müzikal veya dramatik bir sunumda oyuncu veya oyuncu olarak rol alan kolektif bir temsilcinin katkısını içeren bir anlatımla ilişkilendirir. @tr
toolkit label: Oyuncu kolektif temsilci @tr
toolkit definition: Müzikal veya dramatik bir sunumda oyuncu veya oyuncu kadrosu üyesi olarak rol alan kolektif bir temsilcinin katkısını içeren bir anlatım. @tr
has subproperty: näyttelijä (yhteisö) ekspressiossa
has subproperty: näyttelijä (suku) ekspressiossa
has subproperty: ääninäyttelijä (yhteistoimija) ekspressiossa
has subproperty: P50719

näyttelijä (yhteisö) ekspressiossa
status: Published
label: is actor corporate body of @en
lexical alias: actorCorporateBodyOf.en
definition: Relates a corporate body to an expression that includes a contribution by a corporate body of acting as a cast member or player in a musical or dramatic presentation. @en
toolkit label: actor corporate body of @en
toolkit definition: An expression that includes a contribution by a corporate body of acting as a cast member or player in a musical or dramatic presentation. @en
type: Property
domain: C10005
has element type: 2
sub property of: esittäjä (yhteisö) ekspressiossa
sub property of: näyttelijä (yhteistoimija) ekspressiossa
definition: Liittää yhteisön ekspressioon, jonka tekemisessä yhteisö on osallisena näyttelemällä musiikki- tai näytelmäesityksessä.
toolkit label: näyttelijä (yhteisö) ekspressiossa
toolkit definition: Ekspressio, jonka tekemisessä yhteisö on osallisena näyttelemällä musiikki- tai näytelmäesityksessä.
label: er skuepiller for (korporasjon) @no
definition: Relaterer en korporasjon til et uttrykk som inkluderer et bidrag fra en korporasjon i form av å spille en rolle eller som utøver i en musikalsk eller dramatisk forestilling. @no
toolkit label: skuepiller for (korporasjon) @no
toolkit definition: Et uttrykk som inkluderer et bidrag fra en korporasjon i form av å spille en rolle eller som utøver i en musikalsk eller dramatisk forestilling. @no
label: is acteur-corporatie van @nl
definition: Relateert een corporatie aan een expressie die omvat een bijdrage door een corporatie die optreedt als een lid van een gezelschap of speler in een muziek- of dramapresentatie. @nl
toolkit label: acteur-corporatie van @nl
toolkit definition: Een expressie die omvat een bijdrage door een corporatie die optreedt als een lid van een gezelschap of speler in een muziek- of dramapresentatie. @nl
label: هي هيئة ممثلة لـ @ar
definition: يربط هيئة بتعبيرة تتضمن إسهام هيئة تعمل كعضو فريق تمثيل أو عازف في عرض موسيقي أو درامي. @ar
toolkit label: هيئة ممثلة @ar
toolkit definition: تعبيرة تتضمن إسهام هيئة تعمل كعضو في فريق تمثيل أو عازف في عرض موسيقي أو درامي. @ar
label: és entitat corporativa actriu de @ca
definition: Relaciona una entitat corporativa amb una expressió que inclou una contribució d’una entitat corporativa actuant com un membre del repartiment o com un comediant d’una representació musical o dramàtica. @ca
toolkit label: entitat corporativa actriu de @ca
toolkit definition: Expressió que inclou una contribució d’una entitat corporativa actuant com un membre del repartiment o com un comediant d’una representació musical o dramàtica. @ca
label: er korporation, som er skuespiller af @da
definition: Relaterer en korporation til et udtryk, som omfatter en korporations bidrag ved at være skuespiller eller musiker i en musikalsk eller dramatisk præsentation. @da
toolkit label: korporation, som er skuespiller af @da
toolkit definition: Udtryk, som omfatter en korporations bidrag ved at være skuespiller eller musiker i en musikalsk eller dramatisk præsentation. @da
label: näitleja (asutus) väljenduses @et
definition: Seostab asutuse väljendusega, millesse asutus on andnud panuse, osaledes trupiliikme või näitlejana muusika- või draamaetenduses. @et
toolkit label: näitleja (asutus) väljenduses @et
toolkit definition: Väljendus, millesse asutus on andnud panuse, osaledes trupiliikme või näitlejana muusika- või draamaetenduses. @et
label: ist Körperschaft als Schauspielerin/Schauspieler von @de
definition: Setzt eine Körperschaft in Beziehung zu einer Expression, zu der eine Körperschaft beiträgt, indem sie als Ensemble-Mitglied oder Darstellerin/Darsteller in einer musikalischen oder dramatischen Darbietung fungiert. @de
toolkit label: Körperschaft als Schauspielerin/Schauspieler von @de
toolkit definition: Eine Expression, zu der eine Körperschaft beiträgt, indem sie als Ensemble-Mitglied oder Darstellerin/Darsteller in einer musikalischen oder dramatischen Darbietung fungiert. @de
label: színész testülete a következőnek: @hu
definition: Hozzákapcsol egy testületet egy kifejezési formához, amely magában foglalja egy testületnek, mint a szereposztás egy tagjának vagy előadójának a közreműködését egy zenei vagy drámai bemutatóban. @hu
toolkit label: színész testülete: @hu
toolkit definition: Egy kifejezési forma, amely magában foglalja egy testületnek, mint a szereposztás egy tagjának vagy előadójának a közreműködését egy zenei vagy drámai bemutatóban. @hu
label: è attore ente di @it
definition: Correla un ente a un'espressione che comprende un contributo di un ente nella recitazione come membro del cast o musicista in una presentazione musicale o drammatica. @it
toolkit label: attore ente di @it
toolkit definition: Espressione che comprende un contributo di un ente nella recitazione come membro del cast o musicista in una presentazione musicale o drammatica. @it
label: είναι ηθοποιός συλλογικό όργανο του @el
toolkit label: ηθοποιός συλλογικό όργανο του @el
label: est une collectivité actrice de @fr
definition: Met une collectivité en relation avec une expression qui intègre une contribution de la part d’une collectivité consistant à agir à titre de membre d’une distribution artistique ou de comédien dans une présentation musicale ou dramatique. @fr
toolkit label: collectivité actrice de @fr
toolkit definition: Expression qui intègre une contribution de la part d’une collectivité consistant à agir à titre de membre d’une distribution artistique ou de comédien dans une présentation musicale ou dramatique. @fr
label: ir aktieris (institūcija) @lv
definition: Sasaista institūciju ar izteiksmi, kas ietver institūcijas ieguldījumu, izpildot lomu dramatiskā uzvedumā vai spēlējot mūzikas uzvedumā. @lv
toolkit label: ir aktieris (institūcija) @lv
toolkit definition: Izteiksme, kas ietver institūcijas ieguldījumu, izpildot lomu dramatiskā uzvedumā vai spēlējot mūzikas uzvedumā. @lv
label: 是……的演员团体 @zh-hans
definition: 将一个团体与包括在音乐或戏剧呈现中扮演角色或演奏的一个团体的贡献的一种内容表达关联起来。 @zh-hans
toolkit label: ……的演员团体 @zh-hans
toolkit definition: 包括在音乐或戏剧呈现中扮演角色或演奏的一个团体的贡献的一种内容表达 @zh-hans
label: aktör tüzel kişisidir @tr
definition: Bir tüzel kişiyi, bir müzikal veya dramatik sunumda bir oyuncu veya oyuncu olarak hareket eden bir tüzel kişinin katkısını içeren bir anlatımla ilişkilendirir. @tr
toolkit label: Oyuncu tüzel kişi @tr
toolkit definition: Bir müzikal veya dramatik sunumda oyuncu veya oyuncu kadrosu üyesi olarak hareket eden tüzel bir kişinin katkısını içeren bir anlatım. @tr
has subproperty: ääninäyttelijä (yhteisö) ekspressiossa
has subproperty: P50870

näyttelijä (suku) ekspressiossa
status: Published
label: is actor family of @en
lexical alias: actorFamilyOf.en
definition: Relates a family to an expression that includes a contribution by a family of acting as a cast member or player in a musical or dramatic presentation. @en
toolkit label: actor family of @en
toolkit definition: An expression that includes a contribution by a family of acting as a cast member or player in a musical or dramatic presentation. @en
type: Property
domain: C10008
has element type: 2
sub property of: esittäjä (suku) ekspressiossa
sub property of: näyttelijä (yhteistoimija) ekspressiossa
definition: Liittää suvun ekspressioon, jonka tekemisessä suku on osallisena näyttelemällä musiikki- tai näytelmäesityksessä.
toolkit label: näyttelijä (suku) ekspressiossa
toolkit definition: Ekspressio, jonka tekemisessä suku on osallisena näyttelemällä musiikki- tai näytelmäesityksessä.
label: er skuepiller for (familie) @no
definition: Relaterer en familie til et uttrykk som inkluderer et bidrag fra en familie i form av å spille en rolle eller som utøver i en musikalsk eller dramatisk forestilling. @no
toolkit label: skuepiller for (familie) @no
toolkit definition: Et uttrykk som inkluderer et bidrag fra en familie i form av å spille en rolle eller som utøver i en musikalsk eller dramatisk forestilling. @no
label: is acteur-familie van @nl
definition: Relateert een familie aan een expressie die omvat een bijdrage door een familie die optreedt als een lid van een gezelschap of speler in een muziek- of dramapresentatie. @nl
toolkit label: acteur-familie van @nl
toolkit definition: Een expressie die omvat een bijdrage door een familie die optreedt als een lid van een gezelschap of speler in een muziek- of dramapresentatie. @nl
label: هي عائلة ممثلة لـ @ar
definition: يربط عائلة بتعبيرة تتضمن إسهام عائلة تعمل كعضو فريق تمثيل أو عازف في عرض موسيقي أو درامي. @ar
toolkit label: عائلة ممثلة @ar
toolkit definition: تعبيرة تتضمن إسهام عائلة تعمل كعضو فريق تمثيل أو عازف في عرض موسيقي أو درامي. @ar
label: és família actriu de @ca
definition: Relaciona una família amb una expressió que inclou una contribució d’una família actuant com un membre del repartiment o com un comediant d’una representació musical o dramàtica. @ca
toolkit label: família actriu de @ca
toolkit definition: Expressió que inclou una contribució d’una família actuant com un membre del repartiment o com un comediant d’una representació musical o dramàtica. @ca
label: er familie, som er skuespiller af @da
definition: Relaterer en familie til et udtryk, som omfatter en families bidrag ved at være skuespiller eller musiker i en musikalsk eller dramatisk præsentation. @da
toolkit label: familie, som er skuespiller af @da
toolkit definition: Udtryk, som omfatter en families bidrag ved at være skuespiller eller musiker i en musikalsk eller dramatisk præsentation. @da
label: näitleja (perekond) väljenduses @et
definition: Seostab perekonna väljendusega, millesse perekond on andnud panuse, osaledes trupiliikme või näitlejana muusika- või draamaetenduses. @et
toolkit label: näitleja (perekond) väljenduses @et
toolkit definition: Väljendus, millesse perekond on andnud panuse, osaledes trupiliikme või näitlejana muusika- või draamaetenduses. @et
label: ist Familie als Schauspielerin/Schauspieler von @de
definition: Setzt eine Familie in Beziehung zu einer Expression, zu der eine Familie beiträgt, indem sie als Ensemble-Mitglied oder Darstellerin/Darsteller in einer musikalischen oder dramatischen Darbietung fungiert. @de
toolkit label: Familie als Schauspielerin/Schauspieler von @de
toolkit definition: Eine Expression, zu der eine Familie beiträgt, indem sie als Ensemble-Mitglied oder Darstellerin/Darsteller in einer musikalischen oder dramatischen Darbietung fungiert. @de
label: színész családja a következőnek: @hu
definition: Hozzákapcsol egy családot egy kifejezési formához, amely magában foglalja egy családnak, mint a szereposztás egy tagjának vagy előadójának a közreműködését egy zenei vagy drámai bemutatóban. @hu
toolkit label: színész családja: @hu
toolkit definition: Egy kifejezési forma, amely magában foglalja egy családnak, mint a szereposztás egy tagjának vagy előadójának a közreműködését egy zenei vagy drámai bemutatóban. @hu
label: è attore famiglia di @it
definition: Correla una famiglia a un'espressione che comprende un contributo di una famiglia nella recitazione come membro del cast o musicista in una presentazione musicale o drammatica. @it
toolkit label: attore famiglia di @it
toolkit definition: Espressione che comprende un contributo di una famiglia nella recitazione come membro del cast o musicista in una presentazione musicale o drammatica. @it
label: είναι ηθοποιός οικογένεια του @el
toolkit label: ηθοποιός οικογένεια του @el
label: est une famille actrice de @fr
definition: Met une famille en relation avec une expression qui intègre une contribution de la part d’une famille consistant à agir à titre de membre d’une distribution artistique ou de comédien dans une présentation musicale ou dramatique. @fr
toolkit label: famille actrice de @fr
toolkit definition: Expression qui intègre une contribution de la part d’une famille consistant à agir à titre de membre d’une distribution artistique ou de comédien dans une présentation musicale ou dramatique. @fr
label: ir aktieris (dzimta/ģimene) @lv
definition: Sasaista dzimtu/ģimeni ar izteiksmi, kas ietver dzimtas/ģimenes ieguldījumu, izpildot lomu dramatiskā uzvedumā vai spēlējot mūzikas uzvedumā. @lv
toolkit label: ir aktieris (dzimta/ģimene) @lv
toolkit definition: Izteiksme, kas ietver dzimtas/ģimenes ieguldījumu, izpildot lomu dramatiskā uzvedumā vai spēlējot mūzikas uzvedumā. @lv
label: 是……的演员家族 @zh-hans
definition: 将一个家族与包括在音乐或戏剧呈现中扮演角色或演奏的一个家族的贡献的一种内容表达关联起来。 @zh-hans
toolkit label: ……的演员家族 @zh-hans
toolkit definition: 包括在音乐或戏剧呈现中扮演角色或演奏的一个家族的贡献的一种内容表达 @zh-hans
label: aktör ailesidir @tr
definition: Bir aileyi, müzikal veya dramatik bir sunumda oyuncu olarak yer alarak katkıda bulunan bir aileyi içeren bir anlatımla ilişkilendirir. @tr
toolkit label: Oyuncu aile @tr
toolkit definition: Bir müzikal veya dramatik sunumda oyuncu veya oyuncu kadrosu üyesi olarak hareket eden bir ailenin katkısını içeren bir anlatım. @tr
has subproperty: ääninäyttelijä (suku) ekspressiossa
has subproperty: P51021

näyttelijä (henkilö) ekspressiossa
status: Published
label: is actor person of @en
lexical alias: actorPersonOf.en
definition: Relates a person to an expression that includes a contribution by a person of acting as a cast member or player in a musical or dramatic presentation. @en
toolkit label: actor person of @en
toolkit definition: An expression that includes a contribution by a person of acting as a cast member or player in a musical or dramatic presentation. @en
type: Property
domain: C10004
has element type: 2
sub property of: esittäjä (henkilö) ekspressiossa
sub property of: näyttelijä (toimija) ekspressiossa
definition: Liittää henkilön ekspressioon, jonka tekemisessä henkilö on osallisena näyttelemällä musiikki- tai näytelmäesityksessä.
toolkit label: näyttelijä (henkilö) ekspressiossa
toolkit definition: Ekspressio, jonka tekemisessä henkilö on osallisena näyttelemällä musiikki- tai näytelmäesityksessä.
label: er skuepiller for (person) @no
definition: Relaterer en person til et uttrykk som inkluderer et bidrag fra en person i form av å spille en rolle eller som utøver i en musikalsk eller dramatisk forestilling. @no
toolkit label: skuepiller for (person) @no
toolkit definition: Et uttrykk som inkluderer et bidrag fra en person i form av å spille en rolle eller som utøver i en musikalsk eller dramatisk forestilling. @no
label: is acteur-persoon van @nl
definition: Relateert een persoon aan een expressie die omvat een bijdrage door een persoon die optreedt als een lid van een gezelschap of speler in een muziek- of dramapresentatie. @nl
toolkit label: acteur-persoon van @nl
toolkit definition: Een expressie die omvat een bijdrage door een persoon die optreedt als een lid van een gezelschap of speler in een muziek- of dramapresentatie. @nl
label: هو شخص ممثل لـ @ar
definition: يربط شخصا بتعبيرة تتضمن إسهام شخص يعمل كعضو في فريق تمثيل أو عازف في عرض موسيقي أو درامي. @ar
toolkit label: شخص ممثل @ar
toolkit definition: تعبيرة تتضمن إسهام شخص يعمل كعضو فريق تمثيل أو عازف في عرض موسيقي أو درامي. @ar
label: és persona actriu de @ca
definition: Relaciona una persona amb una expressió que inclou una contribució d’una persona actuant com un membre del repartiment o com un comediant d’una representació musical o dramàtica. @ca
toolkit label: persona actriu de @ca
toolkit definition: Expressió que inclou una contribució d’una persona actuant com un membre del repartiment o com un comediant d’una representació musical o dramàtica. @ca
label: er person, som er skuespiller af @da
definition: Relaterer en person til et udtryk, som omfatter en persons bidrag ved at være skuespiller eller musiker i en musikalsk eller dramatisk præsentation. @da
toolkit label: person, som er skuespiller af @da
toolkit definition: Udtryk, som omfatter en persons bidrag ved at være skuespiller eller musiker i en musikalsk eller dramatisk præsentation. @da
label: näitleja (isik) väljenduses @et
definition: Seostab isiku väljendusega, millesse isik on andnud panuse, osaledes trupiliikme või näitlejana muusika- või draamaetenduses. @et
toolkit label: näitleja (isik) väljenduses @et
toolkit definition: Väljendus, millesse isik on andnud panuse, osaledes trupiliikme või näitlejana muusika- või draamaetenduses. @et
label: ist Person als Schauspielerin/Schauspieler von @de
definition: Setzt eine Person in Beziehung zu einer Expression, zu der eine Person beiträgt, indem sie als Ensemble-Mitglied oder Darstellerin/Darsteller in einer musikalischen oder dramatischen Darbietung fungiert. @de
toolkit label: Person als Schauspielerin/Schauspieler von @de
toolkit definition: Eine Expression, zu der eine Person beiträgt, indem sie als Ensemble-Mitglied oder Darstellerin/Darsteller in einer musikalischen oder dramatischen Darbietung fungiert. @de
label: színész személye a következőnek: @hu
definition: Hozzákapcsol egy személyt egy kifejezési formához, amely magában foglalja egy személynek, mint a szereposztás egy tagjának vagy előadójának a közreműködését egy zenei vagy drámai bemutatóban. @hu
toolkit label: színész személye a következőnek @hu
toolkit definition: Egy kifejezési forma, amely magában foglalja egy személynek, mint a szereposztás egy tagjának vagy előadójának a közreműködését egy zenei vagy drámai bemutatóban. @hu
label: è attore persona di @it
definition: Correla una persona a un'espressione che comprende un contributo di una persona nella recitazione come membro del cast o musicista in una presentazione musicale o drammatica. @it
toolkit label: attore persona di @it
toolkit definition: Espressione che comprende un contributo di una persona nella recitazione come membro del cast o musicista in una presentazione musicale o drammatica. @it
label: είναι ηθοποιός φυσικό πρόσωπο του @el
toolkit label: ηθοποιός φυσικό πρόσωπο του @el
label: est une personne actrice de @fr
definition: Met une personne en relation avec une expression qui intègre une contribution de la part d’une personne consistant à agir à titre de membre d’une distribution artistique ou de comédien dans une présentation musicale ou dramatique. @fr
toolkit label: personne actrice de @fr
toolkit definition: Expression qui intègre une contribution de la part d’une personne consistant à agir à titre de membre d’une distribution artistique ou de comédien dans une présentation musicale ou dramatique. @fr
label: ir aktieris (persona) @lv
definition: Sasaista personu ar izteiksmi, kas ietver personas ieguldījumu, izpildot lomu dramatiskā uzvedumā vai spēlējot mūzikas uzvedumā. @lv
toolkit label: ir aktieris (persona) @lv
toolkit definition: Izteiksme, kas ietver personas ieguldījumu, izpildot lomu dramatiskā uzvedumā vai spēlējot mūzikas uzvedumā. @lv
label: 是……的演员个人 @zh-hans
definition: 将一个个人与包括在音乐或戏剧呈现中扮演角色或演奏的一个个人的贡献的一种内容表达关联起来。 @zh-hans
toolkit label: ……的演员个人 @zh-hans
toolkit definition: 包括在音乐或戏剧呈现中扮演角色或演奏的一个个人的贡献的一种内容表达 @zh-hans
label: aktör kişisidir @tr
definition: Bir kişiyi, müzikal veya dramatik bir sunumda oyuncu veya oyuncu olarak rol alan bir kişinin katkısını içeren bir anlatımla ilişkilendirir. @tr
toolkit label: Oyuncu kişi @tr
toolkit definition: Bir müzikal veya dramatik sunumda oyuncu veya oyuncu kadrosu üyesi olarak hareket eden bir kişinin katkısını içeren bir anlatım. @tr
has subproperty: ääninäyttelijä (henkilö) ekspressiossa
has subproperty: P50568

vastaanottaja (toimija) teoksessa
status: Published
label: is addressee agent of @en
definition: Relates an agent to a work or a portion of a work that is addressed to an agent. @en
type: Property
domain: C10002
sub property of: toimijaan liittyvä teos
lexical alias: addresseeAgentOf.en
label: est un agent destinataire de @fr
definition: Met un agent en relation avec une œuvre ou portion d’œuvre qui est adressée à un agent. @fr
toolkit label: agent destinataire de @fr
toolkit definition: Œuvre ou portion d’œuvre qui est adressée à un agent. @fr
toolkit label: addressee agent of @en
toolkit definition: A work or a portion of a work that is addressed to an agent. @en
instruction number: 18.5
label: είναι παραλήπτης φορέας του @el
definition: Συνδέει έναν φορέα, στον οποίο ένα έργο ή μέρος ενός έργου απευθύνεται, με ένα έργο. @el
toolkit label: παραλήπτης φορέας του @el
toolkit definition: Ένα έργο ή μέρος ενός έργου το οποίο απευθύνεται σε έναν φορέα. @el
definition: Setzt einen Akteur in Beziehung zu einem Werk oder einem Teil eines Werks, das an einen Akteur adressiert ist. @de
toolkit label: Akteur als Adressatin/Adressat von @de
toolkit definition: Ein Werk oder ein Teil eines Werks, das an einen Akteur adressiert ist. @de
label: er agent, som er adressat af @da
definition: Relaterer en agent til et værk eller en del af et værk, som er adresseret til en agent. @da
toolkit label: agent, som er adressat af @da
toolkit definition: Værk eller en del af et værk, som er adresseret til en agent. @da
label: és agent destinatari de @ca
definition: Relaciona un agent amb una obra o una part d’una obra que s’adreça a un agent. @ca
toolkit label: agent destinatari de @ca
toolkit definition: Obra o una part d’una obra que s’adreça a un agent. @ca
definition: Liittää toimijan teokseen tai teoksen osaan, joka on osoitettu toimijalle.
toolkit label: vastaanottaja (toimija) teoksessa
toolkit definition: Teos tai teoksen osa, joka on osoitettu toimijalle.
toolkit label: adressat for (agent) @no
toolkit definition: Et verk eller en del av et verk som er adressert til en agent. @no
label: ist Akteur als Adressatin/Adressat von @de
has element type: 2
label: címzett ágense a következőnek: @hu
definition: Hozzákapcsol egy ágenst egy ágensnek címzett műhöz, vagy műrészlethez. @hu
toolkit label: címzett ágense: @hu
toolkit definition: Egy ágensnek címzett mű, vagy műrészlet. @hu
alternative label: addressee of @en
alternative label: vastaanottajana teoksessa
label: er adressat for (agent) @no
definition: Relaterer en agent til et verk eller en del av et verk som er adressert til en agent. @no
alternative label: adressat for @no
label: is geadresseerde actor van @nl
definition: Relateert een actor aan een werk of een deel van een werk dat is gericht aan een actor. @nl
toolkit label: geadresseerde actor van @nl
toolkit definition: Een werk of een deel van een werk dat is gericht aan een actor. @nl
label: هو وكيل مرسل إليه لـ @ar
definition: يربط وكيلا بعمل أو بجزء من عمل مرسل إلى وكيل. @ar
alternative label: مرسل إليه @ar
toolkit label: هو وكيل مرسل إليه لـ @ar
toolkit definition: يربط وكيلا بعمل أو بجزء من عمل مرسل إلى وكيل. @ar
alternative label: destinatari de @ca
alternative label: modtager af @da
label: adressaat (tegija) teoses @et
definition: Seostab tegija teose või teose osaga, mis on adresseeritud tegijale. @et
alternative label: adressaat teoses @et
toolkit label: adressaat (tegija) teoses @et
toolkit definition: Teos või teose osa, mis on adresseeritud tegijale. @et
alternative label: címzettje: @hu
label: è destinatario agente di @it
definition: Correla un agente a un'opera o una porzione di un'opera indirizzata a un agente. @it
alternative label: destinatrio di @it
toolkit label: destinatrio agente di @it
toolkit definition: Opera o una porzione di un'opera indirizzata a un agente. @it
alternative label: παραλήπτης του @el
alternative label: destinataire de @fr
label: ir adresāts (aģents) @lv
definition: Sasaista aģentu ar darbu vai darba daļa, kas adresēta aģentam. @lv
toolkit label: ir adresāts (aģents) @lv
toolkit definition: Darbs vai darba daļa, kas adresēta aģentam. @lv
alternative label: Adressat von @de
alternative label: ……的接受者 @zh-hans
toolkit label: ……的接受者行为者 @zh-hans
toolkit definition: 要被一个行为者接受的一种作品或作品的一部分 @zh-hans
toolkit label: muhatap temsilci @tr
toolkit definition: Bir temsilciye hitap eden bir eser veya eserin bir bölümü. @tr
has subproperty: vastaanottaja (yhteistoimija) teoksessa

vastaanottaja (yhteistoimija) teoksessa
status: Published
label: is addressee collective agent of @en
lexical alias: addresseeCollectiveAgentOf.en
definition: Relates a collective agent to a work or a portion of a work that is addressed to a collective agent. @en
toolkit label: addressee collective agent of @en
toolkit definition: A work or a portion of a work that is addressed to a collective agent. @en
type: Property
domain: C10011
has element type: 2
sub property of: yhteistoimijaan liittyvä teos
sub property of: vastaanottaja (toimija) teoksessa
definition: Liittää yhteistoimijan teokseen tai teoksen osaan, joka on osoitettu yhteistoimijalle.
toolkit label: vastaanottaja (yhteistoimija) teoksessa
toolkit definition: Teos tai teoksen osa, joka on osoitettu yhteistoimijalle.
label: er adressat for (kollektiv agent) @no
definition: Relaterer en kollektiv agent til et verk eller en del av et verk som er adressert til en kollektiv agent. @no
toolkit label: adressat for (kollektiv agent) @no
toolkit definition: Et verk eller en del av et verk som er adressert til en kollektiv agent. @no
label: is geadresseerde collectieve actor van @nl
definition: Relateert een collectieve actor aan een werk of een deel van een werk dat is gericht aan een collectieve actor. @nl
toolkit label: geadresseerde collectieve actor van @nl
toolkit definition: Een werk of een deel van een werk dat is gericht aan een collectieve actor. @nl
label: هو وكيل جماعي مرسل إليه لـ @ar
definition: يربط وكيلا جماعيا بعمل أو جزء من عمل موجه إلى وكيل جماعي. @ar
toolkit label: وكيل جماعي مرسل إليه @ar
toolkit definition: عمل أو جزء من عمل موجه إلى وكيل جماعي. @ar
label: és agent col·lectiu destinatari de @ca
definition: Relaciona un agent col·lectiu amb una obra o part d’una obra que s’adreça a un agent col·lectiu. @ca
toolkit label: agent col·lectiu destinatari de @ca
toolkit definition: Obra o part d’una obra que s’adreça a un agent col·lectiu. @ca
label: er kollektiv agent, som er adressat af @da
definition: Relaterer en kollektiv agent til et værk eller en del af et værk, som er adresseret til en kollektiv agent. @da
toolkit label: kollektiv agent, som er adressat af @da
toolkit definition: Værk eller en del af et værk, som er adresseret til en kollektiv agent. @da
label: adressaat (kollektiiv) teoses @et
definition: Seostab kollektiivi teose või teose osaga, mis on adresseeritud kollektiivile. @et
toolkit label: adressaat (kollektiiv) teoses @et
toolkit definition: Teos või teose osa, mis on adresseeritud kollektiivile. @et
label: ist gemeinschaftlicher Akteur als Adressatin/Adressat von @de
definition: Setzt einen gemeinschaftlichen Akteur in Beziehung zu einem Werk oder einem Teil eines Werks, das an einen gemeinschaftlichen Akteur adressiert ist. @de
toolkit label: Gemeinschaftlicher Akteur als Adressatin/Adressat von @de
toolkit definition: Ein Werk oder ein Teil eines Werks, das an einen gemeinschaftlichen Akteur adressiert ist. @de
label: címzett kollektív ágense a következőnek: @hu
definition: Hozzákapcsol egy kollektív ágenst egy kollektív ágensnek címzett műhöz, vagy műrészlethez. @hu
toolkit label: címzett kollektív ágense: @hu
toolkit definition: Egy kollektív ágensnek címzett mű, vagy műrészlet. @hu
label: è destinatario agente collettivo di @it
definition: Correla un agente collettivo a un'opera o una porzione di un'opera indirizzata a un agente collettivo. @it
toolkit label: destinatario agente collettivo di @it
toolkit definition: Opera o porzione di un'opera indirizzata a un agente collettivo. @it
label: είναι παραλήπτης συλλογικός φορέας του @el
toolkit label: παραλήπτης συλλογικός φορέας του @el
label: est un agent collectif destinataire de @fr
definition: Met un agent collectif en relation avec une œuvre ou portion d’œuvre qui est adressée à un agent collectif. @fr
toolkit label: agent collectif destinataire de @fr
toolkit definition: Œuvre ou portion d’œuvre qui est adressée à un agent collectif. @fr
label: ir adresāts (grupa) @lv
definition: Sasaista grupu ar darbu vai darba daļa, kas adresēta grupai. @lv
toolkit label: ir adresāts (grupa) @lv
toolkit definition: Darbs vai darba daļa, kas adresēta grupai. @lv
label: 是……的接受者集体行为者 @zh-hans
definition: 将一个集体行为者与要被一个集体行为者接受的一种作品或作品的一部分关联起来。 @zh-hans
toolkit label: ……的接受者集体行为者 @zh-hans
toolkit definition: 要被一个集体行为者接受的一种作品或作品的一部分 @zh-hans
label: muhatap kolektif temsilcisidir @tr
definition: Kolektif bir temsilciyi, kolektif bir temsilciye hitap eden bir eserle veya eserin bir bölümüyle ilişkilendirir. @tr
toolkit label: Muhatap kolektif temsilci @tr
toolkit definition: Kolektif bir temsilciye hitap eden bir eser veya eserin bir bölümü. @tr
has subproperty: vastaanottaja (yhteisö) teoksessa
has subproperty: vastaanottaja (suku) teoksessa
has subproperty: P50674

vastaanottaja (yhteisö) teoksessa
status: Published
label: is addressee corporate body of @en
lexical alias: addresseeCorporateBodyOf.en
definition: Relates a corporate body to a work or a portion of a work that is addressed to a corporate body. @en
toolkit label: addressee corporate body of @en
toolkit definition: A work or a portion of a work that is addressed to a corporate body. @en
type: Property
domain: C10005
has element type: 2
sub property of: yhteisöön liittyvä teos
sub property of: vastaanottaja (yhteistoimija) teoksessa
definition: Liittää yhteisön teokseen tai teoksen osaan, joka on osoitettu yhteisölle.
toolkit label: vastaanottaja (yhteisö) teoksessa
toolkit definition: Teos tai teoksen osa, joka on osoitettu yhteisölle.
label: er adressat for (korporasjon) @no
definition: Relaterer en korporasjon til et verk eller en del av et verk som er adressert til en korporasjon. @no
toolkit label: adressat for (korporasjon) @no
toolkit definition: Et verk eller en del av et verk som er adressert til en korporasjon. @no
label: is geadresseerde corporatie van @nl
definition: Relateert een corporatie aan een werk of een deel van een werk dat is gericht aan een corporatie. @nl
toolkit label: geadresseerde corporatie van @nl
toolkit definition: Een werk of een deel van een werk dat is gericht aan een corporatie. @nl
label: هي هيئة مرسل إليها لـ @ar
definition: يربط هيئة بعمل أو جزء من عمل موجه إلى هيئة. @ar
toolkit label: هيئة مرسل إليها @ar
toolkit definition: عمل أو جزء من عمل موجه إلى هيئة. @ar
label: és entitat corporativa destinatària de @ca
definition: Relaciona una entitat corporativa amb una obra o una part d’una obra que s’adreça a una entitat corporativa. @ca
toolkit label: entitat corporativa destinatària de @ca
toolkit definition: Obra o una part d’una obra que s’adreça a una entitat corporativa. @ca
label: er korporation, som er adressat af @da
definition: Relaterer en korporation til et værk eller en del af et værk, som er adresseret til en korporation. @da
toolkit label: korporation, som er adressat af @da
toolkit definition: Værk eller en del af et værk, som er adresseret til en korporation. @da
label: adressaat (asutus) teoses @et
definition: Seostab asutuse teose või teose osaga, mis on adresseeritud asutusele. @et
toolkit label: adressaat (asutus) teoses @et
toolkit definition: Teos või teose osa, mis on adresseeritud asutusele. @et
label: ist Körperschaft als Adressatin/Adressat von @de
definition: Setzt eine Körperschaft in Beziehung zu einem Werk oder einem Teil eines Werks, das an eine Körperschaft adressiert ist. @de
toolkit label: Körperschaft als Adressatin/Adressat von @de
toolkit definition: Ein Werk oder ein Teil eines Werks, das an eine Körperschaft adressiert ist. @de
label: címzett testülete a következőnek: @hu
definition: Hozzákapcsol egy testületet egy testületnek címzett műhöz, vagy műrészlethez. @hu
toolkit label: címzett testülete: @hu
toolkit definition: Egy testületnek címzett mű, vagy műrészlet. @hu
label: è destinatario ente di @it
definition: Correla un ente a un'opera o porzione di un'opera indirizzata a un ente. @it
toolkit label: destinatario ente di @it
toolkit definition: Opera o porzione di un'opera indirizzata a un ente. @it
label: είναι παραλήπτης συλλογικό όργανο του @el
toolkit label: παραλήπτης συλλογικό όργανο του @el
label: est une collectivité destinataire de @fr
definition: Met une collectivité en relation avec une œuvre ou portion d’œuvre qui est adressée à une collectivité. @fr
toolkit label: collectivité destinataire de @fr
toolkit definition: Œuvre ou portion d’œuvre qui est adressée à une collectivité. @fr
label: ir adresāts (institūcija) @lv
definition: Sasaista institūciju ar darbu vai darba daļa, kas adresēta institūcijai. @lv
toolkit label: ir adresāts (institūcija) @lv
toolkit definition: Darbs vai darba daļa, kas adresēta institūcijai. @lv
label: 是……的接受者团体 @zh-hans
definition: 将一个团体与要被一个团体接受的一种作品或作品的一部分关联起来。 @zh-hans
toolkit label: ……的接受者团体 @zh-hans
toolkit definition: 要被一个团体接受的一种作品或作品的一部分 @zh-hans
label: muhatap tüzel kişisidir @tr
definition: Bir tüzel kişiyi, bir tüzel kişiye hitaben yazılmış bir eser veya eserin bir bölümü ile ilişkilendirir. @tr
toolkit label: muhatap tüzel kişi @tr
toolkit definition: Bir tüzel kişiye hitap eden eser veya eserin bir bölümü. @tr
has subproperty: P50825

vastaanottaja (suku) teoksessa
status: Published
label: is addressee family of @en
lexical alias: addresseeFamilyOf.en
definition: Relates a family to a work or a portion of a work that is addressed to a family. @en
toolkit label: addressee family of @en
toolkit definition: A work or a portion of a work that is addressed to a family. @en
type: Property
domain: C10008
has element type: 2
sub property of: sukuun liittyvä teos
sub property of: vastaanottaja (yhteistoimija) teoksessa
definition: Liittää suvun teokseen tai teoksen osaan, joka on osoitettu suvulle.
toolkit label: vastaanottaja (suku) teoksessa
toolkit definition: Teos tai teoksen osa, joka on osoitettu suvulle.
label: er adressat for (familie) @no
definition: Relaterer en familie til et verk eller en del av et verk som er adressert til en familie. @no
toolkit label: adressat for (familie) @no
toolkit definition: Et verk eller en del av et verk som er adressert til en familie. @no
label: is geadresseerde familie van @nl
definition: Relateert een familie aan een werk of een deel van een werk dat is gericht aan een familie. @nl
toolkit label: geadresseerde familie van @nl
toolkit definition: Een werk of een deel van een werk dat is gericht aan een familie. @nl
label: هي عائلة مرسل إليها لـ @ar
definition: يربط عائلة بعمل أو جزء من عمل موجه إلى عائلة. @ar
toolkit label: عائلة مرسل إليها @ar
toolkit definition: عمل أو جزء من عمل موجه إلى عائلة. @ar
label: és família destinatària de @ca
definition: Relaciona una família amb una obra o una part d’una obra que s’adreça a una família. @ca
toolkit label: família destinatària de @ca
toolkit definition: Obra o una part d’una obra que s’adreça a una família. @ca
label: er familie, som er adressat af @da
definition: Relaterer en familie til et værk eller en del af et værk, som er adresseret til en familie. @da
toolkit label: familie, som er adressat af @da
toolkit definition: Værk eller en del af et værk, som er adresseret til en familie. @da
label: adressaat (perekond) teoses @et
definition: Seostab perekonna teose või teose osaga, mis on adresseeritud perekonnale. @et
toolkit label: adressaat (perekond) teoses @et
toolkit definition: Teos või teose osa, mis on adresseeritud perekonnale. @et
label: ist Familie als Adressatin/Adressat von @de
definition: Setzt eine Familie in Beziehung zu einem Werk oder einem Teil eines Werks, das an eine Familie adressiert ist. @de
toolkit label: Familie als Adressatin/Adressat von @de
toolkit definition: Ein Werk oder ein Teil eines Werks, das an eine Familie adressiert ist. @de
label: címzett családja a következőnek: @hu
definition: Hozzákapcsol egy családot egy családnak címzett műhöz, vagy műrészlethez. @hu
toolkit label: címzett családja: @hu
toolkit definition: Egy családnak címzett mű, vagy műrészlet. @hu
label: è destinatario famiglia di @it
definition: Correla una famiglia a un'opera o porzione di un'opera indirizzata a una famiglia. @it
toolkit label: destinatario famiglia di @it
toolkit definition: Opera o porzione di un'opera indirizzata a una famiglia. @it
label: είναι παραλήπτης οικογένεια του @el
toolkit label: παραλήπτης οικογένεια του @el
label: est une famille destinataire de @fr
definition: Met une famille en relation avec une œuvre ou portion d’œuvre qui est adressée à une famille. @fr
toolkit label: famille destinataire de @fr
toolkit definition: Œuvre ou portion d’œuvre qui est adressée à une famille. @fr
label: ir adresāts (dzimta/ģimene) @lv
definition: Sasaista dzimtu/ģimeni ar darbu vai darba daļa, kas adresēta dzimtai/ģimenei. @lv
toolkit label: ir adresāts (dzimta/ģimene) @lv
toolkit definition: Darbs vai darba daļa, kas adresēta dzimtai/ģimenei. @lv
label: 是……的接受者家族 @zh-hans
definition: 将一个家族与要被一个家族接受的一种作品或作品的一部分关联起来。 @zh-hans
toolkit label: ……的接受者家族 @zh-hans
toolkit definition: 要被一个家族接受的一种作品或作品的一部分 @zh-hans
label: muhatap ailesidir @tr
definition: Bir aileyi bir eserle veya bir aileye hitap eden bir eserin bir bölümüyle ilişkilendirir. @tr
toolkit definition: Bir aileye hitap eden bir eser veya eserin bir bölümü. @tr
toolkit label: muhatap aile @tr
has subproperty: P50976

vastaanottaja (henkilö) teoksessa
status: Published
label: is addressee person of @en
lexical alias: addresseePersonOf.en
definition: Relates a person to a work or a portion of a work that is addressed to a person. @en
toolkit label: addressee person of @en
toolkit definition: A work or a portion of a work that is addressed to a person. @en
type: Property
domain: C10004
has element type: 2
sub property of: henkilöön liittyvä teos
sub property of: vastaanottaja (toimija) teoksessa
definition: Liittää henkilön teokseen tai teoksen osaan, joka on osoitettu henkilölle.
toolkit label: vastaanottaja (henkilö) teoksessa
toolkit definition: Teos tai teoksen osa, joka on osoitettu henkilölle.
label: er adressat for (person) @no
definition: Relaterer en person til et verk eller en del av et verk som er adressert til en person. @no
toolkit label: adressat for (person) @no
toolkit definition: Et verk eller en del av et verk som er adressert til en person. @no
label: is geadresseerde persoon van @nl
definition: Relateert een persoon aan een werk of een deel van een werk dat is gericht aan een persoon. @nl
toolkit label: geadresseerde persoon van @nl
toolkit definition: Een werk of een deel van een werk dat is gericht aan een persoon. @nl
label: هو شخص مرسل إليه لـ @ar
definition: يربط شخصا بعمل أو بجزء من عمل موجه إلى شخص. @ar
toolkit label: شخص مرسل إليه @ar
toolkit definition: عمل أو جزء من عمل موجه إلى شخص. @ar
label: és persona destinatària de @ca
definition: Relaciona una persona amb una obra o una part d’una obra que s’adreça a una persona. @ca
toolkit label: persona destinatària de @ca
toolkit definition: Obra o una part d’una obra que s’adreça a una persona. @ca
label: er person, som er adressat af @da
definition: Relaterer en person til et værk eller en del af et værk, som er adresseret til en person. @da
toolkit label: person, som er adressat af @da
toolkit definition: Værk eller en del af et værk, som er adresseret til en person. @da
label: adressaat (isik) teoses @et
definition: Seostab isiku teose või teose osaga, mis on adresseeritud isikule. @et
toolkit label: adressaat (isik) teoses @et
toolkit definition: Teos või teose osa, mis on adresseeritud isikule. @et
label: ist Person als Adressatin/Adressat von @de
definition: Setzt eine Person in Beziehung zu einem Werk oder einem Teil eines Werks, das an eine Person adressiert ist. @de
toolkit label: Person als Adressatin/Adressat von @de
toolkit definition: Ein Werk oder ein Teil eines Werks, das an eine Person adressiert ist. @de
label: címzett személye a következőnek: @hu
definition: Hozzákapcsol egy személyt egy személynek címzett műhöz, vagy műrészlethez. @hu
toolkit label: címzett személye: @hu
toolkit definition: Egy személynek címzett mű, vagy műrészlet. @hu
label: è destinatario persona di @it
definition: Correla una persona a un'opera o porzione di un'opera indirizzata a una persona. @it
toolkit label: destinatario persona di @it
toolkit definition: Opera o porzione di un'opera indirizzata a una persona. @it
label: είναι παραλήπτης φυσικό πρόσωπο του @el
toolkit label: παραλήπτης φυσικό πρόσωπο του @el
label: est une personne destinataire de @fr
definition: Met une personne en relation avec une œuvre ou portion d’œuvre qui est adressée à une personne. @fr
toolkit label: personne destinataire de @fr
toolkit definition: Œuvre ou portion d’œuvre qui est adressée à une personne. @fr
label: ir adresāts (persona) @lv
definition: Sasaista personu ar darbu vai darba daļa, kas adresēta personai. @lv
toolkit label: ir adresāts (persona) @lv
toolkit definition: Darbs vai darba daļa, kas adresēta personai @lv
label: 是……的接受者个人 @zh-hans
definition: 将一个个人与要被一个个人接受的一种作品或作品的一部分关联起来。 @zh-hans
toolkit label: ……的接受者个人 @zh-hans
toolkit definition: 要被一个个人接受的一种作品或作品的一部分 @zh-hans
label: muhatap kişisidir @tr
definition: Bir kişiyi, kişinin muhatabı olduğu bir eserle veya eserin bir bölümüyle ilişkilendirir. @tr
toolkit label: Muhatap kişi @tr
toolkit definition: Bir kişiye hitap eden bir eser veya eserin bir bölümü. @tr
has subproperty: P50523

toimijan osoite
status: Published
label: has address of agent @en
type: Property
lexical alias: addressOfAgent.en
definition: Relates an agent to an address of an agent. @en
domain: C10002
toolkit label: address of agent @en
toolkit definition: An address of an agent. @en
has element type: 6
scope note: Includes an email or other online address. @en
definition: Liittää toimijan sen osoitteeseen.
scope note: Sisältää sähköpostin tai muun verkko-osoitteen.
toolkit label: toimijan osoite
toolkit definition: Toimijan osoite.
label: har adresse for agent @no
definition: Relaterer en agent til en adresse for en agent. @no
scope note: Inkluderer en epost eller annen online adresse. @no
toolkit label: adresse for agent @no
toolkit definition: En adresse for en agent. @no
label: heeft adres van actor @nl
definition: Relateert een actor aan een adres van een actor. @nl
scope note: Omvat tevens een e-mail of ander online adres. @nl
toolkit label: adres van actor @nl
toolkit definition: Een adres van een actor. @nl
label: لديه عنوان لوكيل @ar
definition: يربط وكيلا بعنوان مراسلة لوكيل. @ar
scope note: يتضمن العنوان البريد الإلكتروني أو أي عنوان آخر على الإنترنت. @ar
toolkit label: عنوان وكيل @ar
toolkit definition: عنوان مراسلة وكيل معين. @ar
label: té com a adreça d’un agent @ca
definition: Relaciona un agent amb una adreça d’un agent. @ca
scope note: Inclou un correu electrònic o qualsevol altra adreça en línia. @ca
toolkit label: adreça d’un agent @ca
toolkit definition: Adreça d’un agent. @ca
label: har adresse på agent @da
definition: Relaterer en agent til en adresse på en agent. @da
scope note: Omfatter en e-mail eller anden online-adresse. @da
toolkit label: adresse på agent @da
toolkit definition: Adresse på en agent. @da
label: tegija aadress @et
definition: Seostab tegija tegija aadressiga. @et
scope note: Hõlmab ka e-posti vm võrguaadressi. @et
toolkit label: tegija aadress @et
toolkit definition: Tegija aadress. @et
label: hat Adresse eines Akteurs @de
definition: Setzt einen Akteur in Beziehung zu einer Adresse eines Akteurs. @de
scope note: Darunter fallen E-Mail-Adressen oder andere Online-Adressen. @de
toolkit label: Adresse eines Akteurs @de
toolkit definition: Eine Adresse eines Akteurs. @de
label: ágens címe a következő: @hu
definition: Hozzákapcsol egy ágenst egy ágens címéhez. @hu
scope note: Email vagy más online cím is idetartozik. @hu
toolkit label: ágens címe: @hu
toolkit definition: Egy ágens címe. @hu
label: ha come indirizzo di agente @it
definition: Correla un agente a un indirizzo di un agente. @it
scope note: Comprende un indirizzo di posta elettronica o altro indirizzo online. @it
toolkit label: indirizzo di agente @it
toolkit definition: Indirizzo di un agente. @it
label: έχει διεύθυνση του φορέα @el
toolkit label: διεύθυνση του φορέα @el
label: a pour adresse d’un agent @fr
definition: Met un agent en relation avec une adresse d’un agent. @fr
scope note: Comprend une adresse de courrier électronique ou une autre adresse en ligne. @fr
toolkit label: adresse d’un agent @fr
toolkit definition: Adresse d’un agent. @fr
label: aģenta adrese @lv
definition: Sasaista aģentu ar aģenta adresi. @lv
toolkit label: aģenta adrese @lv
toolkit definition: Aģenta adrese. @lv
scope note: Ietver e-pastu vai citu tiešsaistes adresi. @lv
label: 有行为者的地址 @zh-hans
definition: 将一个行为者与一个行为者的一个地址关联起来。 @zh-hans
toolkit label: 行为者的地址 @zh-hans
toolkit definition: 一个行为者的一个地址 @zh-hans
scope note: 包括电子邮件地址和其他联机地址 @zh-hans
label: temsilcinin adresi ile ilişkilidir @tr
definition: Bir temsilciyi, bir temsilcinin adresiyle ilişkilendirir. @tr
toolkit label: Temsilcinin adresi @tr

yhteistoimijan osoite
status: Published
label: has address of collective agent @en
type: Property
lexical alias: addressOfCollectiveAgent.en
definition: Relates a collective agent to an address of a collective agent. @en
domain: C10011
sub property of: toimijan osoite
toolkit label: address of collective agent @en
toolkit definition: An address of a collective agent. @en
has element type: 6
scope note: Includes an email or other online address. @en
definition: Liittää yhteistoimijan sen osoitteeseen.
scope note: Sisältää sähköpostin tai muun verkko-osoitteen.
toolkit label: yhteistoimijan osoite
toolkit definition: Yhteistoimijan osoite.
label: har adresse for kollektiv agent @no
definition: Relaterer en kollektiv agent til en adresse for en kollektiv agent. @no
scope note: Inkluderer en epost eller annen online adresse. @no
toolkit label: adresse for kollektiv agent @no
toolkit definition: En adresse for en kollektiv agent. @no
label: heeft adres van collectieve actor @nl
definition: Relateert een collectieve actor aan een adres van een collectieve actor. @nl
scope note: Omvat tevens een e-mail of ander online adres. @nl
toolkit label: adres van collectieve actor @nl
toolkit definition: Een adres van een collectieve actor. @nl
label: له عنوان مراسلة لوكيل جماعي @ar
definition: يربط وكيلا جماعيا بعنوان مراسلة لوكيل جماعي. @ar
scope note: يتضمن العنوان البريد الإلكتروني أو أي عنوان آخر على الإنترنت. @ar
toolkit label: عنوان وكيل جماعي @ar
toolkit definition: عنوان مراسلة وكيل جماعي. @ar
label: té com a adreça d’un agent col·lectiu @ca
definition: Relaciona un agent col·lectiu amb una adreça d’un agent col·lectiu. @ca
scope note: Inclou un correu electrònic o qualsevol altra adreça en línia. @ca
toolkit label: adreça d’un agent col·lectiu @ca
toolkit definition: Adreça d’un agent col·lectiu. @ca
label: har adresse på kollektiv agent @da
definition: Relaterer en kollektiv agent til en adresse på en kollektiv agent. @da
scope note: Omfatter en e-mail eller anden online-adresse. @da
toolkit label: adresse på kollektiv agent @da
toolkit definition: Adresse på en kollektiv agent. @da
label: kollektiivi aadress @et
definition: Seostab kollektiivi kollektiivi aadressiga. @et
scope note: Hõlmab ka e-posti vm võrguaadressi. @et
toolkit label: kollektiivi aadress @et
toolkit definition: Kollektiivi aadress. @et
label: hat Adresse eines gemeinschaftlichen Akteurs @de
definition: Setzt einen gemeinschaftlichen Akteur in Beziehung zu einer Adresse eines gemeinschaftlichen Akteurs. @de
scope note: Darunter fallen E-Mail-Adressen oder andere Online-Adressen. @de
toolkit label: Adresse eines gemeinschaftlichen Akteurs @de
toolkit definition: Eine Adresse eines gemeinschaftlichen Akteurs. @de
label: kollektív ágens címe a következő: @hu
definition: Hozzákapcsol egy kollektív ágenst egy kollektív ágens címéhez. @hu
scope note: Email vagy más online cím is idetartozik. @hu
toolkit label: kollektív ágens címe: @hu
toolkit definition: Egy kollektív ágens címe. @hu
label: ha come indirizzo di agente collettivo @it
definition: Correla un agente collettivo a un indirizzo di un agente collettivo. @it
scope note: Comprende un indirizzo di posta elettronica o altro indirizzo online. @it
toolkit label: indirizzo di agente collettivo @it
toolkit definition: Indirizzo di un agente collettivo. @it
label: έχει διεύθυνση του συλλογικού φορέα @el
toolkit label: διεύθυνση του συλλογικού φορέα @el
label: a pour adresse d’un agent collectif @fr
definition: Met un agent collectif en relation avec une adresse d’un agent collectif. @fr
scope note: Comprend une adresse de courrier électronique ou une autre adresse en ligne. @fr
toolkit label: adresse d’un agent collectif @fr
toolkit definition: Adresse d’un agent collectif. @fr
label: grupas adrese @lv
definition: Sasaista grupu ar grupas adresi. @lv
toolkit label: grupas adrese @lv
toolkit definition: Grupas adrese. @lv
scope note: Ietver e-pastu vai citu tiešsaistes adresi. @lv
label: 有集体行为者的地址 @zh-hans
definition: 将一个集体行为者与一个集体行为者的一个地址关联起来。 @zh-hans
toolkit label: 集体行为者的地址 @zh-hans
toolkit definition: 一个集体行为者的一个地址 @zh-hans
scope note: 包括电子邮件地址和其他联机地址 @zh-hans
label: kolektif temsilcinin adresi ile ilişkilidir @tr
definition: Kolektif bir temsilciyi, bir kollektif temsilcinin adresiyle ilişkilendirir. @tr

suvun osoite
status: Published
label: has address of family @en
type: Property
lexical alias: addressOfFamily.en
definition: Relates a family to an address of a family. @en
domain: C10008
sub property of: yhteistoimijan osoite
toolkit label: address of family @en
toolkit definition: An address of a family. @en
has element type: 6
scope note: Includes an email or other online address. @en
definition: Liittää suvun sen osoitteeseen.
scope note: Sisältää sähköpostin tai muun verkko-osoitteen.
toolkit label: suvun osoite
toolkit definition: Suvun osoite.
label: har adresse for familie @no
definition: Relaterer en familie til en adresse for en familie. @no
scope note: Inkluderer en epost eller annen online adresse. @no
toolkit label: adresse for familie @no
toolkit definition: En adresse for en familie. @no
label: heeft adres van familie @nl
definition: Relateert een familie aan een adres van een familie. @nl
scope note: Omvat tevens een e-mail of ander online adres. @nl
toolkit label: adres van familie @nl
toolkit definition: Een adres van een familie. @nl
label: لها عنوان مراسلة لعائلة @ar
definition: يربط عائلة بعنوان مراسلة لعائلة. @ar
scope note: يتضمن العنوان البريد الإلكتروني أو أي عنوان آخر على الإنترنت. @ar
toolkit label: عنوان عائلة @ar
toolkit definition: عنوان مراسلة لعائلة. @ar
label: té com a adreça d’una família @ca
definition: Relaciona una família amb una adreça d’una família. @ca
scope note: Inclou un correu electrònic o qualsevol altra adreça en línia. @ca
toolkit label: adreça d’una família @ca
toolkit definition: Adreça d’una família. @ca
label: har adresse på familie @da
definition: Relaterer en familie til en adresse på en familie. @da
scope note: Omfatter en e-mail eller anden online-adresse. @da
toolkit label: adresse på agent @da
toolkit definition: Adresse på en familie. @da
label: perekonna aadress @et
definition: Seostab perekonna perekonna aadressiga. @et
scope note: Hõlmab ka e-posti vm võrguaadressi. @et
toolkit label: perekonna aadress @et
toolkit definition: Perekonna aadress. @et
label: hat Adresse einer Familie @de
definition: Setzt eine Familie in Beziehung zu einer Adresse einer Familie. @de
scope note: Darunter fallen E-Mail-Adressen oder andere Online-Adressen. @de
toolkit label: Adresse einer Familie @de
toolkit definition: Eine Adresse einer Familie. @de
label: család címe a következő: @hu
definition: Hozzákapcsol egy családot egy család címéhez. @hu
scope note: Email vagy más online cím is idetartozik. @hu
toolkit label: család címe: @hu
toolkit definition: Egy család címe. @hu
label: ha come indirizzo di famiglia @it
definition: Correla una famiglia a un indirizzo di una famiglia. @it
scope note: Comprende un indirizzo di posta elettronica o altro indirizzo online. @it
toolkit label: indirizzo di famiglia @it
toolkit definition: Indirizzo di una famiglia. @it
label: έχει διεύθυνση της οικογένειας @el
toolkit label: διεύθυνση της οικογένειας @el
label: a pour adresse d’une famille @fr
definition: Met une famille en relation avec une adresse d’une famille. @fr
scope note: Comprend une adresse de courrier électronique ou une autre adresse en ligne. @fr
toolkit label: adresse d’une famille @fr
toolkit definition: Adresse d’une famille. @fr
label: dzimtas/ģimenes adrese @lv
definition: Sasaista dzimtu/ģimeni ar dzimtas/ģimenes adresi. @lv
toolkit label: dzimtas/ģimenes adrese @lv
toolkit definition: Dzimtas/ģimenes adrese. @lv
scope note: Ietver e-pastu vai citu tiešsaistes adresi. @lv
label: 有家族的地址 @zh-hans
definition: 将一个家族与一个家族的一个地址关联起来。 @zh-hans
toolkit label: 家族的地址 @zh-hans
toolkit definition: 一个家族的一个地址 @zh-hans
scope note: 包括电子邮件地址和其他联机地址 @zh-hans
label: ailenin adresi ile ilişkilidir @tr
definition: Bir aileyi, bir ailenin adresi ile ilişkilendirir. @tr

viiteryhmä
status: Deprecated
type: Property
domain: C10004
lexical alias: affiliation.en
instruction number: 9.13
label: a pour affiliation @fr
definition: Met une personne en relation avec un groupe auquel une personne est ou a été affiliée par recrutement, acquisition de la qualité de membre, identité culturelle, etc. @fr
toolkit label: affiliation @fr
toolkit definition: Groupe auquel une personne est ou a été affiliée par recrutement, acquisition de la qualité de membre, identité culturelle, etc. @fr
toolkit label: afiliación @es
toolkit definition: Un grupo con el que la persona está afiliada, o ha estado afiliada, mediante empleo, membresía, identidad cultural, etc. @es
label: har organisatorisk tillhörighet @sv
toolkit label: organisatorisk tillhörighet @sv
label: έχει σύνδεση @el
definition: Συνδέει ένα φυσικό πρόσωπο με μια ομάδα με την οποία το φυσικό πρόσωπο συνδέεται ή έχει συνδεθεί μέσω εργασίας, συνδρομής μέλους, πολιτιστικής ταυτότητας κ.λπ. @el
toolkit label: σύνδεση @el
toolkit definition: Μια ομάδα με την οποία το φυσικό πρόσωπο συνδέεται ή έχει συνδεθεί μέσω εργασίας, συνδρομής μέλους, πολιτιστικής ταυτότητας κ.λπ. @el
definition: Setzt eine Person mit einer Gruppe, die durch Anstellung, Mitgliedschaft, kulturelle Identität usw. zugehörig ist oder war, in Beziehung. @de
toolkit label: Affiliation @de
toolkit definition: Eine Gruppe, zu der eine Person durch Anstellung, Mitgliedschaft, kulturelle Identität usw. zugehörig ist oder war. @de
label: har tilhørsforhold @da
definition: Relaterer en person til en gruppe, som en person er eller har været tilknyttet via beskæftigelse, medlemskab, kulturel identitet etc. @da
toolkit label: tilhørsforhold @da
toolkit definition: Gruppe, som en person er eller har været tilknyttet via beskæftigelse, medlemskab, kulturel identitet etc. @da
label: té com a afiliació @ca
definition: Relaciona una persona amb un grup en el qual una persona està o ha estat afiliada per qüestions de feina, en qualitat de membre, per afinitat cultural, etc. @ca
toolkit label: afiliació @ca
toolkit definition: Grup en el qual una persona està o ha estat afiliada per qüestions de feina, en qualitat de membre, per afinitat cultural, etc. @ca
definition: Liittää henkilön ryhmään, johon henkilöllä on ollut yhteys työn, jäsenyyden, kulttuuri-identiteetin tms. kautta.
toolkit label: viiteryhmä
toolkit definition: Ryhmä, johon henkilöllä on ollut yhteys työn, jäsenyyden, kulttuuri-identiteetin tms. kautta.
toolkit definition: En gruppe som en person har eller har hatt tilknytning til gjennom arbeid, medlemskap, kulturell identitet, etc. @no
label: hat Affiliation @de
has subproperty: P50101

toimija aiheena teoksessa
status: Published
type: Property
label: is subject agent of @en
lexical alias: subjectAgentOf.en
domain: C10002
definition: Relates an agent to a work that is about an agent. @en
label: είναι θέμα φορέας του @el
definition: Συνδέει έναν φορέα με ένα έργο το οποίο αναφέρεται σε έναν φορέα. @el
label: er agent, som er subjekt af @da
definition: Relaterer en agent til et værk, som handler om en agent. @da
label: és agent de matèria de @ca
definition: Relaciona un agent amb una obra que tracta d’un agent. @ca
definition: Liittää toimijan teokseen, joka käsittelee toimijaa.
toolkit label: toimija aiheena teoksessa
toolkit definition: Teos, joka käsittelee toimijaa.
label: est un agent sujet de @fr
definition: Met un agent en relation avec une œuvre qui traite d’un agent. @fr
toolkit label: subject agent of @en
toolkit definition: A work that is about an agent. @en
sub property of: toimijaan liittyvä teos
has element type: 2
label: ágens tárgya a következőnek: @hu
definition: Hozzákapcsol egy ágenst egy műhöz, amely egy ágensről szól. @hu
sub property of: P00014
label: er agent som emne for @no
definition: Relaterer en agent til et verk som handler om en agent. @no
toolkit label: agent som emne for @no
toolkit definition: Et verk som handler om en agent. @no
label: is actor als onderwerp van @nl
definition: Relateert een actor aan een werk dat gaat over een actor. @nl
toolkit label: actor als onderwerp van @nl
toolkit definition: Een werk dat gaat over een actor. @nl
label: هو وكيل موضوع لـ @ar
definition: يربط وكيلا بعمل عن وكيل. @ar
toolkit label: موضوع وكيل @ar
toolkit definition: عمل عن وكيل. @ar
toolkit label: agent de matèria de @ca
toolkit definition: Obra que tracta d’un agent. @ca
toolkit label: agent, som er subjekt af @da
toolkit definition: Værk, som handler om en agent. @da
label: teema (tegija) teoses @et
definition: Seostab tegija teosega, mis on tegija kohta. @et
toolkit label: teema (tegija) teoses @et
toolkit definition: Teos, mis on tegija kohta. @et
label: ist Akteur als Thema von @de
definition: Setzt einen Akteur in Beziehung zu einem Werk, das von einem Akteur handelt. @de
toolkit label: Akteur als Thema von @de
toolkit definition: Ein Werk, das von einem Akteur handelt. @de
toolkit label: ágens tárgya: @hu
toolkit definition: Egy mű, amely egy ágensről szól. @hu
label: è soggetto agente di @it
definition: Correla un agente a un'opera che tratta di un agente. @it
toolkit label: agente soggetto di @it
toolkit definition: Opera che tratta di un agente. @it
toolkit label: θέμα φορέας του @el
toolkit label: agent sujet de @fr
toolkit definition: Œuvre qui traite d’un agent. @fr
label: ir temats (aģents) @lv
definition: Sasaista aģentu ar darbu, kura temats ir aģents. @lv
toolkit label: ir temats (aģents) @lv
toolkit definition: Darbs, kura temats ir aģents. @lv
label: 是……的主题行为者 @zh-hans
definition: 将一个行为者与关于一个行为者的一种作品关联起来。 @zh-hans
toolkit label: ……的主题行为者 @zh-hans
toolkit definition: 关于一个行为者的一种作品 @zh-hans
label: Konu temsilcisi @tr
definition: Bir temsilciyi, bir temsilciyi konu alan bir eserle ilişkilendirir. @tr
toolkit label: konu alınan temsilci @tr
toolkit definition: Bir temsilci hakkındaki bir eser. @tr
has subproperty: toimijan kuvaus
has subproperty: yhteistoimija aiheena teoksessa
has subproperty: henkilö aiheena teoksessa
has subproperty: P50366

toimijan kuvaus
status: Published
label: is agent described by @en
type: Property
definition: Relates an agent to a work that is a description of an agent @en
domain: C10002
sub property of: toimija aiheena teoksessa
toolkit label: agent described by @en
toolkit definition: A work that is a description of an agent @en
has element type: 2
alternative label: described in (agent) @en
definition: Liittää toimijan teokseen, joka kuvailee toimijaa.
alternative label: kuvattu teoksessa (toimija)
toolkit label: toimijan kuvaus
toolkit definition: Teos, joka kuvailee toimijaa.
label: er agent beskrevet i @no
definition: Relaterer en agent til et verk som beskriver en agent. @no
alternative label: beskrevet i (agent) @no
toolkit label: agent beskrevet i @no
toolkit definition: Et verk som beskriver en agent. @no
label: is actor beschreven in @nl
definition: Relateert een actor aan een werk dat een actor beschrijft. @nl
toolkit label: actor beschreven in @nl
toolkit definition: Een werk dat een actor beschrijft. @nl
label: هو وكيل موصوف في @ar
definition: يربط وكيلا بعمل يصف وكيلا. @ar
alternative label: موصوف في (وكيل ) @ar
toolkit label: وكيل موصوف في @ar
toolkit definition: عمل يصف وكيلا. @ar
label: és agent descrit per @ca
definition: Relaciona un agent amb una obra que és una descripció d’un agent. @ca
alternative label: descrit en (agent) @ca
toolkit label: agent descrit per @ca
toolkit definition: Obra que és una descripció d’un agent. @ca
definition: Relaterer en agent til et værk, som beskriver en agent. @da
toolkit label: agent beskrevet i @da
toolkit definition: Værk, som beskriver en agent. @da
label: tegija kirjeldus @et
definition: Seostab tegija teosega, milles tegijat kirjeldatakse. @et
toolkit label: tegija kirjeldus @et
toolkit definition: Teos, milles tegijat kirjeldatakse. @et
label: ist Akteur beschrieben in @de
definition: Setzt einen Akteur in Beziehung zu einem Werk, das einen Akteur beschreibt. @de
toolkit label: Akteur beschrieben in @de
toolkit definition: Ein Werk, das einen Akteur beschreibt. @de
label: ágens leírva a következőben: @hu
definition: Hozzákapcsol egy ágenst egy műhöz, amely egy ágenst ír le. @hu
toolkit label: ágens leírva a következőben: @hu
toolkit definition: Egy mű, amely egy ágenst ír le. @hu
label: è agente descritto in @it
definition: Correla un agente a un'opera che descrive un agente. @it
alternative label: descritto in (agente) @it
toolkit label: agente descritto in @it
toolkit definition: Opera che descrive un agente. @it
label: είναι φορέας περιγραφόμενος σε @el
alternative label: περιγράφεται σε (φορέας) @el
toolkit label: φορέας περιγραφόμενος σε @el
label: est un agent décrit par @fr
definition: Met un agent en relation avec une œuvre qui consiste en une description d’un agent. @fr
toolkit label: agent décrit par @fr
toolkit definition: Œuvre qui consiste en une description d’un agent. @fr
lexical alias: agentDescribedBy.en
label: aģenta apraksts @lv
definition: Sasaista aģentu ar darbu, kurā aprakstīts konkrētais aģents. @lv
toolkit label: aģenta apraksts @lv
toolkit definition: Darbs, kurā aprakstīts konkrētais aģents @lv
alternative label: Beschrieben in (Akteur) @de
alternative label: 被描述于（行为者） @zh-hans
label: 是被……描述的一个行为者 @zh-hans
definition: 将一个行为者与作为一个行为者之描述的一种作品关联起来。 @zh-hans
toolkit label: 被……描述的一个行为者 @zh-hans
toolkit definition: 作为一个行为者之描述的一种作品 @zh-hans
alternative label: descrito en (agente) @es
alternative label: décrit dans (agent) @fr
alternative label: agent décrit dans @fr
alternative label: leírva a következőben (ágens): @hu
toolkit label: Tarafından tanımlanan temsilci @tr
toolkit definition: Bir temsilcinin tanımı olan bir eser @tr
has subproperty: yhteistoimijan kuvaus
has subproperty: henkilöä kuvaava teos
has subproperty: toimijaa metatiedoilla kuvaileva teos

aggregaattori (toimija) teoksessa
status: Published
label: is aggregator agent of @en
lexical alias: aggregatorAgentOf.en
definition: Relates an agent to a work that involves a responsibility of an agent for aggregation by selecting and arranging expressions of other works. @en
toolkit label: aggregator agent of @en
toolkit definition: A work that involves a responsibility of an agent for aggregation by selecting and arranging expressions of other works. @en
type: Property
domain: C10002
sub property of: teoksen tekijä (toimija) teoksessa
has element type: 2
definition: Liittää toimijan teokseen, jossa toimija on vastuussa aggregoivan teoksen luomisesta valitsemalla ja järjestämällä muiden teosten ekspressioita.
toolkit label: aggregaattori (toimija) teoksessa
toolkit definition: Teos, jossa toimija on vastuussa aggregoivan teoksen luomisesta valitsemalla ja järjestämällä muiden teosten ekspressioita.
label: er aggregator for (agent) @no
definition: Relaterer en agent til et verk som involverer ansvar fra en agent for aggregering ved å velge ut og arrangere uttrykk av andre verk. @no
toolkit label: aggregator for (agent) @no
toolkit definition: Et verk som involverer ansvar fra en agent for aggregering ved å velge ut og arrangere uttrykk av andre verk. @no
label: is aggregator-actor van @nl
definition: Relateert een actor aan een werk dat met zich meebrengt een verantwoordelijkheid van een actor voor aggregeren door middel van selectie en arrangeren van expressies van andere werken. @nl
toolkit label: aggregator-actor van @nl
toolkit definition: Een werk dat met zich meebrengt een verantwoordelijkheid van een actor voor aggregeren door middel van selectie en arrangeren van expressies van andere werken. @nl
label: هو وكيل مجمع لـ @ar
definition: يربط وكيلا بعمل يترتب عليه مسئولية وكيل عن التجميع عن طريق اختيار تعبيرات الأعمال الأخرى وترتيبها. @ar
toolkit label: وكيل مجمع @ar
toolkit definition: عمل يترتب عليه مسئولية وكيل عن التجميع عن طريق اختيار وترتيب تعبيرات الأعمال الأخرى. @ar
label: és agent agregador de @ca
definition: Relaciona un agent amb una obra que implica una responsabilitat d’un agent en l’agregació mitjançant la selecció i l’arranjament d’expressions d’altres obres. @ca
toolkit label: agent agregador de @ca
toolkit definition: Obra que implica una responsabilitat d’un agent en l’agregació mitjançant la selecció i l’arranjament d’expressions d’altres obres. @ca
label: er agent, som er samler af @da
definition: Relaterer en agent til et værk, som involverer en agents ansvar for sammenlægning ved at udvælge og arrangere udtryk af andre værk. @da
toolkit label: agent, som er samler af @da
toolkit definition: Værk, som involverer en agents ansvar for sammenlægning ved at udvælge og arrangere udtryk af andre værk. @da
label: liitja (tegija) teoses @et
definition: Seostab tegija teosega, mis sisaldab tegija vastutust liitumi loomise eest, valides ja korrastades teiste teoste väljendused. @et
toolkit label: liitja (tegija) teoses @et
toolkit definition: Teos, mis sisaldab tegija vastutust liitumi loomise eest, valides ja korrastades teiste teoste väljendused. @et
label: ist Akteur als Aggregatorin/Aggregator von @de
definition: Setzt einen Akteur in Beziehung zu einem Werk, bei dem ein Akteur für die Aggregation verantwortlich ist, indem er Expressionen von anderen Werken auswählt und zusammenstellt. @de
toolkit label: Akteur als Aggregatorin/Aggregator von @de
toolkit definition: Ein Werk, bei dem ein Akteur für die Aggregation verantwortlich ist, indem er Expressionen von anderen Werken auswählt und zusammenstellt. @de
label: aggregátor ágense a következőnek: @hu
definition: Hozzákapcsol egy ágenst egy műhöz, amelyhez hozzátartozik egy ágens felelőssége más művek kifejezési formáinak kiválasztásával és elrendezésével járó aggregálásáért. @hu
toolkit label: aggregátor ágense: @hu
toolkit definition: Egy mű, amelyhez hozzátartozik egy ágens felelőssége más művek kifejezési formáinak kiválasztásával és elrendezésével járó aggregálásáért. @hu
label: è aggregatore agente di @it
definition: Correla un agente con un'opera che implica una responsabilità di un agente nell'aggregazione tramite selezione e sistemazione di espressioni di altre opere. @it
toolkit label: aggregatore agente di @it
toolkit definition: Opera che implica una responsabilità di un agente nell'aggregazione tramite selezione e sistemazione di espressioni di altre opere. @it
label: είναι ερανιστής φορέας του @el
toolkit label: συναθροιστής φορέας του @el
label: est un agent agrégateur de @fr
definition: Met un agent en relation avec une œuvre qui comporte une responsabilité de la part d’un agent en ce qui concerne l’agrégation par la sélection et l’arrangement d’expressions d’autres œuvres. @fr
toolkit label: agent agrégateur de @fr
toolkit definition: Œuvre qui comporte une responsabilité de la part d’un agent en ce qui concerne l’agrégation par la sélection et l’arrangement d’expressions d’autres œuvres. @fr
label: ir apkopotājs (aģents) @lv
definition: Sasaista aģentu ar darbu, kas ietver aģenta atbildību par apkopošanu, atlasot un sakārtojot citu darbu izteiksmes. @lv
toolkit label: ir apkopotājs (aģents) @lv
toolkit definition: Darbs, kas ietver aģenta atbildību par apkopošanu, atlasot un sakārtojot citu darbu izteiksmes. @lv
label: 是……的合集编者行为者 @zh-hans
definition: 将一个行为者与涉及把其他作品的内容表达选择和整理后编制合集的一个行为者的责任的一种作品关联起来。 @zh-hans
toolkit label: ……的合集编者行为者 @zh-hans
toolkit definition: 涉及把其他作品的内容表达选择和整理后编制合集的一个行为者的责任的一种作品 @zh-hans
label: toplayıcı temsilcisidir @tr
definition: Bir temsilciyi, diğer eserlerin anlatımlarını seçerek ve düzenleyerek toplamakla sorumlu bir temsilcinin sorumluluğunu içeren bir eserle ilişkilendirir. @tr
toolkit label: Toplayıcı temsilci @tr
toolkit definition: Diğer eserlerin anlatımlarını seçip düzenleyerek bir araya getirmek için bir temsilcinin sorumluluğunu içeren bir çalışma. @tr
has subproperty: aggregaattori (yhteistoimija) teoksessa
has subproperty: aggregaattori (henkilö) teoksessa
has subproperty: kokoaja (toimija) teoksessa
has subproperty: P50453

aggregaattori (yhteistoimija) teoksessa
status: Published
label: is aggregator collective agent of @en
lexical alias: aggregatorCollectiveAgentOf.en
definition: Relates a collective agent to a work that involves a responsibility of a collective agent for aggregation by selecting and arranging expressions of other works. @en
toolkit label: aggregator collective agent of @en
toolkit definition: A work that involves a responsibility of a collective agent for aggregation by selecting and arranging expressions of other works. @en
type: Property
domain: C10011
has element type: 2
sub property of: teoksen tekijä (yhteistoimija) teoksessa
sub property of: aggregaattori (toimija) teoksessa
definition: Liittää yhteistoimijan teokseen, jossa yhteistoimija on vastuussa aggregoivan teoksen luomisesta valitsemalla ja järjestämällä muiden teosten ekspressioita.
toolkit label: aggregaattori (yhteistoimija) teoksessa
toolkit definition: Teos, jossa yhteistoimija on vastuussa aggregoivan teoksen luomisesta valitsemalla ja järjestämällä muiden teosten ekspressioita.
label: er aggregator av (kollektiv agent) @no
definition: Relaterer en kollektiv agent til et verk som involverer et ansvar for en kollektiv agent i form av aggregering gjennom å velge ut og arrangere uttrykk av andre verk. @no
toolkit label: aggregator av (kollektiv agent) @no
toolkit definition: Et verk som involverer et ansvar for en kollektiv agent i form av aggregering gjennom å velge ut og arrangere uttrykk av andre verk. @no
label: is aggregator-collectieve actor van @nl
definition: Relateert een collectieve actor aan een werk dat met zich meebrengt een verantwoordelijkheid van een collectieve actor voor aggregeren door middel van selectie en arrangeren van expressies van andere werken. @nl
toolkit label: aggregator-collectieve actor van @nl
toolkit definition: Een werk dat met zich meebrengt een verantwoordelijkheid van een collectieve actor voor aggregeren door middel van selectie en arrangeren van expressies van andere werken. @nl
label: هو وكيل جماعي مجمع لـ @ar
definition: يربط وكيلا جماعيا بعمل يترتب عليه مسئولية وكيل جماعي عن التجميع من خلال اختيار تعبيرات أعمال أخرى وترتيبها. @ar
toolkit label: وكيل جماعي مجمّع @ar
toolkit definition: عمل يترتب عليه مسئولية وكيل جماعي عن التجميع عن طريق اختيار وترتيب تعبيرات الأعمال الأخرى. @ar
label: és agent col·lectiu agregador de @ca
definition: Relaciona un agent col·lectiu amb una obra que implica una responsabilitat d’un agent col·lectiu en l’agregació mitjançant la selecció i l’arranjament d’expressions d’altres obres. @ca
toolkit label: agent col·lectiu agregador de @ca
toolkit definition: Obra que implica una responsabilitat d’un agent col·lectiu en l’agregació mitjançant la selecció i l’arranjament d’expressions d’altres obres. @ca
label: er kollektiv agent, som er samler af @da
definition: Relaterer en kollektiv agent til et værk, som involverer en kollektiv agents ansvar for sammenlægning ved at udvælge og arrangere udtryk af andre værk. @da
toolkit label: kollektiv agent, som er samler af @da
toolkit definition: Værk, som involverer en kollektiv agents ansvar for sammenlægning ved at udvælge og arrangere udtryk af andre værk. @da
label: liitja (kollektiiv) teoses @et
definition: Seostab kollektiivi teosega, mis sisaldab kollektiivi vastutust liitumi loomise eest, valides ja korrastades teiste teoste väljendused. @et
toolkit label: liitja (kollektiiv) teoses @et
toolkit definition: Teos, mis sisaldab kollektiivi vastutust liitumi loomise eest, valides ja korrastades teiste teoste väljendused. @et
label: ist gemeinschaftlicher Akteur als Aggregatorin/Aggregator von @de
definition: Setzt einen gemeinschaftlichen Akteur in Beziehung zu einem Werk, bei dem ein gemeinschaftlicher Akteur für die Aggregation verantwortlich ist, indem er Expressionen von anderen Werken auswählt und zusammenstellt. @de
toolkit label: Gemeinschaftlicher Akteur als Aggregatorin/Aggregator von @de
toolkit definition: Ein Werk, bei dem ein gemeinschaftlicher Akteur für die Aggregation verantwortlich ist, indem er Expressionen von anderen Werken auswählt und zusammenstellt. @de
label: aggregátor kollektív ágense a következőnek: @hu
definition: Hozzákapcsol egy kollektív ágenst egy műhöz, amelyhez hozzátartozik egy kollektív ágens felelőssége más művek kifejezési formáinak kiválasztásával és elrendezésével járó aggregálásért. @hu
toolkit label: aggregátor kollektív ágense: @hu
toolkit definition: Egy mű, amelyhez hozzátartozik egy kollektív ágens felelőssége más művek kifejezési formáinak kiválasztásával és elrendezésével járó aggregálásért. @hu
label: è aggregatore agente collettivo di @it
definition: Correla un agente collettivo a un'opera che implica una responsabilità di un agente collettivo nell'aggregazione selezionando e organizzando espressioni di altre opere. @it
toolkit label: aggregatore agente collettivo di @it
toolkit definition: Opera che implica una responsabilità di un agente collettivo nell'aggregazione selezionando e organizzando espressioni di altre opere. @it
label: είναι ερανιστής συλλογικός φορέας του ? @el
toolkit label: συναθροιστής συλλογικός φορέας του ? @el
label: est un agent collectif agrégateur de @fr
definition: Met un agent collectif en relation avec une œuvre qui comporte une responsabilité de la part d’un agent collectif en ce qui concerne l’agrégation par la sélection et l’arrangement d’expressions d’autres œuvres. @fr
toolkit label: agent collectif agrégateur de @fr
toolkit definition: Œuvre qui comporte une responsabilité de la part d’un agent collectif en ce qui concerne l’agrégation par la sélection et l’arrangement d’expressions d’autres œuvres. @fr
label: ir apkopotājs (grupa) @lv
definition: Sasaista grupu ar darbu, kas ietver grupas atbildību par apkopošanu, atlasot un sakārtojot citu darbu izteiksmes. @lv
toolkit label: ir apkopotājs (grupa) @lv
toolkit definition: Darbs, kas ietver grupas atbildību par apkopošanu, atlasot un sakārtojot citu darbu izteiksmes. @lv
label: 是……的合集编者集体行为者 @zh-hans
definition: 将一个集体行为者与涉及把其他作品的内容表达选择和整理后编制合集的一个集体行为者的责任的一种作品关联起来。 @zh-hans
toolkit label: ……的合集编者集体行为者 @zh-hans
toolkit definition: 涉及把其他作品的内容表达选择和整理后编制合集的一个集体行为者的责任的一种作品 @zh-hans
label: toplayıcı kolektif temsilcisidir @tr
definition: Kolektif bir temsilciyi, diğer eserlerin ifadelerini seçerek ve düzenleyerek bir araya getirme sorumluluğunu içeren bir eserle ilişkilendirir. @tr
toolkit label: Toplayıcı kolektif temsilci @tr
toolkit definition: Diğer eserlerin ifadelerini seçerek ve düzenleyerek bir araya getirmek için kolektif bir temsilcinin sorumluluğunu içeren bir eser. @tr
has subproperty: aggregaattori (yhteisö) teoksessa
has subproperty: aggregaattori (suku) teoksessa
has subproperty: kokoaja (yhteistoimija) teoksessa
has subproperty: P50679

aggregaattori (yhteisö) teoksessa
status: Published
label: is aggregator corporate body of @en
lexical alias: aggregatorCorporateBodyOf.en
definition: Relates a corporate body to a work that involves a responsibility of a corporate body for aggregation by selecting and arranging expressions of other works. @en
toolkit label: aggregator corporate body of @en
toolkit definition: A work that involves a responsibility of a corporate body for aggregation by selecting and arranging expressions of other works. @en
type: Property
domain: C10005
has element type: 2
sub property of: teoksen tekijä (yhteisö) teoksessa
sub property of: aggregaattori (yhteistoimija) teoksessa
definition: Liittää yhteisön teokseen, jossa yhteisö on vastuussa aggregoivan teoksen luomisesta valitsemalla ja järjestämällä muiden teosten ekspressioita.
toolkit label: aggregaattori (yhteisö) teoksessa
toolkit definition: Teos, jossa yhteisö on vastuussa aggregoivan teoksen luomisesta valitsemalla ja järjestämällä muiden teosten ekspressioita.
label: er aggregator av (korporasjon) @no
definition: Relaterer en korporasjon til et verk som involverer et ansvar for en korporasjon i form av aggregering gjennom å velge ut og arrangere uttrykk av andre verk. @no
toolkit label: aggregator av (korporasjon) @no
toolkit definition: Et verk som involverer et ansvar for en korporasjon i form av aggregering gjennom å velge ut og arrangere uttrykk av andre verk. @no
label: is aggregator-corporatie van @nl
definition: Relateert een corporatie aan een werk dat met zich meebrengt een verantwoordelijkheid van een corporatie voor aggregeren door middel van selectie en arrangeren van expressies van andere werken. @nl
toolkit label: aggregator-corporatie van @nl
toolkit definition: Een werk dat met zich meebrengt een verantwoordelijkheid van een corporatie voor aggregeren door middel van selectie en arrangeren van expressies van andere werken. @nl
label: هي هيئة مُجمعة لـ @ar
definition: يربط هيئة بعمل يترتب عليه مسئولية هيئة عن التجميع من خلال اختيار تعبيرات الأعمال الأخرى وترتيبها. @ar
toolkit label: هيئة مُجمعة لـ @ar
toolkit definition: عمل يترتب عليه مسئولية هيئة عن التجميع من خلال اختيار تعبيرات الأعمال الأخرى وترتيبها. @ar
label: és entitat corporativa agregadora de @ca
definition: Relaciona una entitat corporativa amb una obra que implica una responsabilitat d’una entitat corporativa en l’agregació mitjançant la selecció i l’arranjament d’expressions d’altres obres. @ca
toolkit label: entitat corporativa agregadora de @ca
toolkit definition: Obra que implica una responsabilitat d’una entitat corporativa en l’agregació mitjançant la selecció i l’arranjament d’expressions d’altres obres. @ca
label: er korporation, som er samler af @da
definition: Relaterer en korporation til et værk, som involverer en korporations ansvar for sammenlægning ved at udvælge og arrangere udtryk af andre værk. @da
toolkit label: korporation, som er samler af @da
toolkit definition: Værk, som involverer en korporations ansvar for sammenlægning ved at udvælge og arrangere udtryk af andre værk. @da
label: liitja (asutus) teoses @et
definition: Seostab asutuse teosega, mis sisaldab asutuse vastutust liitumi loomise eest, valides ja korrastades teiste teoste väljendused. @et
toolkit label: liitja (asutus) teoses @et
toolkit definition: Teos, mis sisaldab asutuse vastutust liitumi loomise eest, valides ja korrastades teiste teoste väljendused. @et
label: ist Körperschaft als Aggregatorin/Aggregator von @de
definition: Setzt eine Körperschaft in Beziehung zu einem Werk, bei dem eine Körperschaft für die Aggregation verantwortlich ist, indem sie Expressionen von anderen Werken auswählt und zusammenstellt. @de
toolkit label: Körperschaft als Aggregatorin/Aggregator von @de
toolkit definition: Ein Werk, bei dem eine Körperschaft für die Aggregation verantwortlich ist, indem sie Expressionen von anderen Werken auswählt und zusammenstellt. @de
label: aggregátor testülete a következőnek: @hu
definition: Hozzákapcsol egy testületet egy műhöz, amelyhez hozzátartozik egy testület felelőssége más művek kifejezési formáinak kiválasztásával és elrendezésével járó aggregálásáért. @hu
toolkit label: aggregátor testülete: @hu
toolkit definition: Egy mű, amelyhez hozzátartozik egy testület felelőssége más művek kifejezési formáinak kiválasztásával és elrendezésével járó aggregálásáért. @hu
label: è aggregatore ente di @it
definition: Correla un ente a un'opera che implica una responsabilità di un ente per l'aggregazione selezionando e organizzando espressioni di altre opere. @it
toolkit label: aggregatore ente di @it
toolkit definition: Opera che implica la responsabilità di un ente per l'aggregazione selezionando e organizzando espressioni di altre opere. @it
label: είναι ερανιστής συλλογικό όργανο του @el
toolkit label: ερανιστής συλλογικό όργανο του ? @el
label: est une collectivité agrégatrice de @fr
definition: Met une collectivité en relation avec une œuvre qui comporte une responsabilité de la part d’une collectivité en ce qui concerne l’agrégation par la sélection et l’arrangement d’expressions d’autres œuvres. @fr
toolkit label: collectivité agrégatrice de @fr
toolkit definition: Œuvre qui comporte une responsabilité de la part d’une collectivité en ce qui concerne l’agrégation par la sélection et l’arrangement d’expressions d’autres œuvres. @fr
label: ir apkopotājs (institūcija) @lv
definition: Sasaista institūciju ar darbu, kas ietver institūcijas atbildību par apkopošanu, atlasot un sakārtojot citu darbu izteiksmes. @lv
toolkit label: ir apkopotājs (institūcija) @lv
toolkit definition: Darbs, kas ietver institūcijas atbildību par apkopošanu, atlasot un sakārtojot citu darbu izteiksmes. @lv
label: 是……的合集编者团体 @zh-hans
definition: 将一个团体与涉及把其他作品的内容表达选择和整理后编制合集的一个团体的责任的一种作品关联起来。 @zh-hans
toolkit label: ……的合集编者团体 @zh-hans
toolkit definition: 涉及把其他作品的内容表达选择和整理后编制合集的一个团体的责任的一种作品 @zh-hans
label: toplayıcı tüzel kişisidir @tr
definition: Bir tüzel kişiyi, diğer işlerin ifadelerini seçerek ve düzenleyerek birleştirme sorumluluğunu içeren bir eserle ilişkilendirir. @tr
toolkit label: Toplayıcı tüzel kişi @tr
toolkit definition: Diğer eserlerin anlatımlarını seçip düzenleyerek bir araya getirmek için bir tüzel kişinin sorumluluğunu içeren bir çalışma. @tr
has subproperty: kokoaja (yhteisö) teoksessa
has subproperty: P50830

aggregaattori (suku) teoksessa
status: Published
label: is aggregator family of @en
lexical alias: aggregatorFamilyOf.en
definition: Relates a family to a work that involves a responsibility of a family for aggregation by selecting and arranging expressions of other works. @en
toolkit label: aggregator family of @en
toolkit definition: A work that involves a responsibility of a family for aggregation by selecting and arranging expressions of other works. @en
type: Property
domain: C10008
has element type: 2
sub property of: teoksen tekijä (suku) teoksessa
sub property of: aggregaattori (yhteistoimija) teoksessa
definition: Liittää suvun teokseen, jossa suku on vastuussa aggregoivan teoksen luomisesta valitsemalla ja järjestämällä muiden teosten ekspressioita.
toolkit label: aggregaattori (suku) teoksessa
toolkit definition: Teos, jossa suku on vastuussa aggregoivan teoksen luomisesta valitsemalla ja järjestämällä muiden teosten ekspressioita.
label: er aggregator av (familie) @no
definition: Relaterer en familie til et verk som involverer et ansvar for en familie i form av aggregering gjennom å velge ut og arrangere uttrykk av andre verk. @no
toolkit label: aggregator av (familie) @no
toolkit definition: Et verk som involverer et ansvar for en familie i form av aggregering gjennom å velge ut og arrangere uttrykk av andre verk. @no
label: is aggregator-familie van @nl
definition: Relateert een familie aan een werk dat met zich meebrengt een verantwoordelijkheid van een familie voor aggregeren door middel van selectie en arrangeren van expressies van andere werken. @nl
toolkit label: aggregator-familie van @nl
toolkit definition: Een werk dat met zich meebrengt een verantwoordelijkheid van een familie voor aggregeren door middel van selectie en arrangeren van expressies van andere werken. @nl
label: هي عائلة مجمعة لـ @ar
definition: يربط عائلة بعمل يترتب عليه مسئولية عائلة عن التجميع عن طريق اختيار وترتيب تعبيرات الأعمال الأخرى. @ar
toolkit label: عائلة مجمعة @ar
toolkit definition: عمل يترتب عليه مسئولية عائلة للتجميع عن طريق اختيار وترتيب تعبيرات الأعمال الأخرى. @ar
label: és família agregadora de @ca
definition: Relaciona una família amb una obra que implica una responsabilitat d’una família en l’agregació mitjançant la selecció i l’arranjament d’expressions d’altres obres. @ca
toolkit label: família agregadora de @ca
toolkit definition: Obra que implica una responsabilitat d’una família en l’agregació mitjançant la selecció i l’arranjament d’expressions d’altres obres. @ca
label: er familie, som er samler af @da
definition: Relaterer en familie til et værk, som involverer en families ansvar for sammenlægning ved at udvælge og arrangere udtryk af andre værk. @da
toolkit label: familie, som er samler af @da
toolkit definition: Værk, som involverer en families ansvar for sammenlægning ved at udvælge og arrangere udtryk af andre værk. @da
label: liitja (perekond) teoses @et
definition: Seostab perekonna teosega, mis sisaldab perekonna vastutust liitumi loomise eest, valides ja korrastades teiste teoste väljendused. @et
toolkit label: liitja (perekond) teoses @et
toolkit definition: Teos, mis sisaldab perekonna vastutust liitumi loomise eest, valides ja korrastades teiste teoste väljendused. @et
label: ist Familie als Aggregatorin/Aggregator von @de
definition: Setzt eine Familie in Beziehung zu einem Werk, bei dem eine Familie für die Aggregation verantwortlich ist, indem sie Expressionen von anderen Werken auswählt und zusammenstellt. @de
toolkit label: Familie als Aggregatorin/Aggregator von @de
toolkit definition: Ein Werk, bei dem eine Familie für die Aggregation verantwortlich ist, indem sie Expressionen von anderen Werken auswählt und zusammenstellt. @de
label: aggregátor családja a következőnek: @hu
definition: Hozzákapcsol egy családot egy műhöz, amelyhez hozzátartozik egy család felelőssége más művek kifejezési formáinak kiválasztásával és elrendezésével járó aggregálásért. @hu
toolkit label: aggregátor családja: @hu
toolkit definition: Egy mű, amelyhez hozzátartozik egy család felelőssége más művek kifejezési formáinak kiválasztásával és elrendezésével járó aggregálásért. @hu
label: è aggregatore famiglia di @it
definition: Correla una famiglia a un'opera che implica la responsabilità di una famiglia per l'aggregazione selezionando e organizzando espressioni di altre opere. @it
toolkit label: aggregatore famiglia di @it
toolkit definition: Opera che implica una responsabilità di una famiglia per l'aggregazione selezionando e organizzando espressioni di altre opere. @it
label: είναι ερανιστής οικογένεια του @el
toolkit label: ερανιστής οικογένεια του @el
label: est une famille agrégatrice de @fr
definition: Met une famille en relation avec une œuvre qui comporte une responsabilité de la part d’une famille en ce qui concerne l’agrégation par la sélection et l’arrangement d’expressions d’autres œuvres. @fr
toolkit label: famille agrégatrice de @fr
toolkit definition: Œuvre qui comporte une responsabilité de la part d’une famille en ce qui concerne l’agrégation par la sélection et l’arrangement d’expressions d’autres œuvres. @fr
label: ir apkopotājs (dzimta/ģimene) @lv
definition: Sasaista dzimtu/ģimeni ar darbu, kas ietver dzimtas/ģimenes atbildību par apkopošanu, atlasot un sakārtojot citu darbu izteiksmes. @lv
toolkit label: ir apkopotājs (dzimta/ģimene) @lv
toolkit definition: Darbs, kas ietver dzimtas/ģimenes atbildību par apkopošanu, atlasot un sakārtojot citu darbu izteiksmes. @lv
label: 是……的合集编者家族 @zh-hans
definition: 将一个家族与涉及把其他作品的内容表达选择和整理后编制合集的一个家族的责任的一种作品关联起来。 @zh-hans
toolkit label: ……的合集编者家族 @zh-hans
toolkit definition: 涉及把其他作品的内容表达选择和整理后编制合集的一个家族的责任的一种作品 @zh-hans
label: toplayıcı ailesidir @tr
definition: Bir aileyi, diğer eserlerin ifadelerini seçip düzenleyerek bir ailenin toplanma sorumluluğunu içeren bir eserle ilişkilendirir. @tr
toolkit label: Toplayıcı aile @tr
toolkit definition: Diğer eserlerin anlatımlarını seçip düzenleyerek bir araya getirmek için bir ailenin sorumluluğunu içeren bir çalışma. @tr
has subproperty: kokoaja (suku) teoksessa
has subproperty: P50981

aggregaattori (henkilö) teoksessa
status: Published
label: is aggregator person of @en
lexical alias: aggregatorPersonOf.en
definition: Relates a person to a work that involves a responsibility of a person for aggregation by selecting and arranging expressions of other works. @en
toolkit label: aggregator person of @en
toolkit definition: A work that involves a responsibility of a person for aggregation by selecting and arranging expressions of other works. @en
type: Property
domain: C10004
has element type: 2
sub property of: teoksen tekijä (henkilö) teoksessa
sub property of: aggregaattori (toimija) teoksessa
definition: Liittää henkilön teokseen, jossa henkilö on vastuussa aggregoivan teoksen luomisesta valitsemalla ja järjestämällä muiden teosten ekspressioita.
toolkit label: aggregaattori (henkilö) teoksessa
toolkit definition: Teos, jossa henkilö on vastuussa aggregoivan teoksen luomisesta valitsemalla ja järjestämällä muiden teosten ekspressioita.
label: er aggregator av (person) @no
definition: Relaterer en person til et verk som involverer et ansvar for en person i form av aggregering gjennom å velge ut og arrangere uttrykk av andre verk. @no
toolkit label: aggregator av (person) @no
toolkit definition: Et verk som involverer et ansvar for en person i form av aggregering gjennom å velge ut og arrangere uttrykk av andre verk. @no
label: is aggregator-persoon van @nl
definition: Relateert een persoon aan een werk dat met zich meebrengt een verantwoordelijkheid van een persoon voor aggregeren door middel van selectie en arrangeren van expressies van andere werken. @nl
toolkit label: aggregator-persoon van @nl
toolkit definition: Een werk dat met zich meebrengt een verantwoordelijkheid van een persoon voor aggregeren door middel van selectie en arrangeren van expressies van andere werken. @nl
label: هو شخص مجمع لـ @ar
definition: يربط شخصا بعمل يترتب عليه مسئولية شخص عن التجميع من خلال اختيار تعبيرات الأعمال الأخرى وترتيبها. @ar
toolkit label: شخص مجمع @ar
toolkit definition: عمل يترتب عليه مسئولية شخص عن التجميع من خلال اختيار تعبيرات الأعمال الأخرى وترتيبها. @ar
label: és persona agregadora de @ca
definition: Relaciona una persona amb una obra que implica una responsabilitat d’una persona en l’agregació mitjançant la selecció i l’arranjament d’expressions d’altres obres. @ca
toolkit label: persona agregadora de @ca
toolkit definition: Obra que implica una responsabilitat d’una persona en l’agregació mitjançant la selecció i l’arranjament d’expressions d’altres obres. @ca
label: er person, som er samler af @da
definition: Relaterer en person til et værk, som involverer en persons ansvar for sammenlægning ved at udvælge og arrangere udtryk af andre værk. @da
toolkit label: person, som er samler af @da
toolkit definition: Værk, som involverer en persons ansvar for sammenlægning ved at udvælge og arrangere udtryk af andre værk. @da
label: liitja (isik) teoses @et
definition: Seostab isiku teosega, mis sisaldab isiku vastutust liitumi loomise eest, valides ja korrastades teiste teoste väljendused. @et
toolkit label: liitja (isik) teoses @et
toolkit definition: Teos, mis sisaldab isiku vastutust liitumi loomise eest, valides ja korrastades teiste teoste väljendused. @et
label: Person als Aggregatorin/Aggregator von @de
definition: Setzt eine Person in Beziehung zu einem Werk, bei dem eine Person für die Aggregation verantwortlich ist, indem sie Expressionen von anderen Werken auswählt und zusammenstellt. @de
toolkit label: Person als Aggregatorin/Aggregator von @de
toolkit definition: Ein Werk, bei dem eine Person für die Aggregation verantwortlich ist, indem sie Expressionen von anderen Werken auswählt und zusammenstellt. @de
label: aggregátor személye a következőnek: @hu
definition: Hozzákapcsol egy személyt egy műhöz, amelyhez hozzátartozik egy személy felelőssége más művek kifejezési formáinak kiválasztásával és elrendezésével járó aggregálásért. @hu
toolkit label: aggregátor személye: @hu
toolkit definition: Egy mű, amelyhez hozzátartozik egy személy felelőssége más művek kifejezési formáinak kiválasztásával és elrendezésével járó aggregálásért. @hu
label: è aggregatore persona di @it
definition: Correla una persona a un'opera che implica una responsabilità di una persona nell'aggregazione selezionando e organizzando espressioni di altre opere. @it
toolkit label: aggregatore persona di @it
toolkit definition: Opera che implica una responsabilità di una persona nell'aggregazione selezionando e organizzando espressioni di altre opere. @it
label: είναι ερανιστής φυσικό πρόσωπο του @el
toolkit label: συναθροιστής φυσικό πρόσωπο του @el
label: est une personne agrégatrice de @fr
definition: Met une personne en relation avec une œuvre qui comporte une responsabilité de la part d’une personne en ce qui concerne l’agrégation par la sélection et l’arrangement d’expressions d’autres œuvres. @fr
toolkit label: personne agrégatrice de @fr
toolkit definition: Œuvre qui comporte une responsabilité de la part d’une personne en ce qui concerne l’agrégation par la sélection et l’arrangement d’expressions d’autres œuvres. @fr
label: ir apkopotājs (persona) @lv
definition: Sasaista personu ar darbu, kas ietver personas atbildību par apkopošanu, atlasot un sakārtojot citu darbu izteiksmes. @lv
toolkit label: ir apkopotājs (persona) @lv
toolkit definition: Darbs, kas ietver personas atbildību par apkopošanu, atlasot un sakārtojot citu darbu izteiksmes. @lv
label: 是……的合集编者个人 @zh-hans
definition: 将一个个人与涉及把其他作品的内容表达选择和整理后编制合集的一个个人的责任的一种作品关联起来。 @zh-hans
toolkit label: ……的合集编者个人 @zh-hans
toolkit definition: 涉及把其他作品的内容表达选择和整理后编制合集的一个个人的责任的一种作品 @zh-hans
label: toplayıcı kişisidir @tr
definition: Bir kişiyi, başka eserlerin ifadelerini seçerek ve düzenleyerek bir araya getirme sorumluluğunu içeren bir eserle ilişkilendirir. @tr
toolkit label: Toplayıcı kişi @tr
toolkit definition: Diğer eserlerin anlatımlarını seçip düzenleyerek bir araya getirmek için bir kişinin sorumluluğunu içeren bir çalışma. @tr
has subproperty: kokoaja (henkilö) teoksessa
has subproperty: P50528

nimikirjoituksen kirjoittaja kappaleessa
status: Published
label: is autographer of @en
definition: Relates a person to an item that involves a responsibility of a person for a manuscript signature appearing on it. @en
type: Property
domain: C10004
sub property of: muokkaaja (henkilö) kappaleessa
lexical alias: autographerOf.en
label: est un signataire autographe de @fr
definition: Met une personne en relation avec un item qui comporte une responsabilité en ce qui concerne une signature manuscrite figurant sur lui. @fr
toolkit label: signataire autographe de @fr
toolkit definition: Item qui comporte une responsabilité en ce qui concerne une signature manuscrite figurant sur lui. @fr
toolkit label: autographer of @en
toolkit definition: An item that involves a responsibility for a manuscript signature appearing on it. @en
instruction number: 18.5
label: είναι αυτoγραφέας του @el
definition: Συνδέει ένα φυσικό πρόσωπο, του οποίου η χειρόγραφη υπογραφή υπάρχει σε ένα αντίτυπο, με ένα αντίτυπο. @el
toolkit label: αυτoγραφέας του @el
toolkit definition: Ένα αντίτυπο στο οποίο εμφανίζεται μια χειρόγραφη υπογραφή. @el
definition: Setzt eine Person in Beziehung zu einem Exemplar, das von der Person handschriftlich unterschrieben wurde. @de
toolkit label: Unterzeichnerin/Unterzeichner von @de
toolkit definition: Ein Exemplar, das von der Person handschriftlich unterschrieben wurde. @de
label: er autografskriver af @da
definition: Relaterer en person til et eksemplar, som involverer en persons ansvar for at en signatur forekommer på et eksemplar. @da
toolkit label: autografskriver af @da
toolkit definition: Eksemplar, som involverer en persons ansvar for at en signatur forekommer på et eksemplar. @da
label: és signatari d’un autògraf de @ca
definition: Relaciona una persona amb un ítem que implica una responsabilitat d’una persona en una signatura autògrafa que hi figura. @ca
toolkit label: signatari d’un autògraf de @ca
toolkit definition: Ítem que implica una responsabilitat d’una persona en una signatura autògrafa que hi figura. @ca
definition: Liittää henkilön kappaleeseen, jossa henkilö on vastuussa siinä olevasta käsinkirjoitetusta nimikirjoituksesta.
toolkit label: nimikirjoituksen kirjoittaja kappaleessa
toolkit definition: Kappale, jossa olevasta käsinkirjoitetusta nimikirjoituksesta henkilö on vastuussa.
toolkit label: person som har signert på @no
toolkit definition: Et eksemplar som involverer ansvar for en signatur som forekommer på et manuskript. @no
label: ist Unterzeichnerin/Unterzeichner von @de
has element type: 2
label: aláírója a következőnek: @hu
definition: Hozzákapcsol egy személyt egy példányhoz, amelyhez hozzátartozik egy személy felelőssége az azon megjelenő kézírásos aláírásért. @hu
toolkit label: aláírója: @hu
toolkit definition: Egy példány, amelyhez hozzátartozik egy személy felelőssége az azon megjelenő kézírásos aláírásért. @hu
label: er person som har signert på @no
definition: Relaterer en person til et eksemplar som involverer ansvar for en signatur som forekommer på et manuskript. @no
label: is handtekening-zetter van @nl
definition: Relateert een persoon aan een item dat met zich meebrengt een verantwoordelijkheid voor een handgeschreven handtekening daarop. @nl
toolkit label: handtekening-zetter van @nl
toolkit definition: Een item dat met zich meebrengt een verantwoordelijkheid voor een handgeschreven handtekening daarop. @nl
label: هو موقِّع على @ar
definition: يربط شخصا بمفردة تنطوي على مسئولية شخص عن توقيع يظهر على مخطوط. @ar
toolkit label: موقِّع على @ar
toolkit definition: مفردة تنطوي على مسئولية شخص عن توقيع يظهر على مخطوط. @ar
label: autograafi kirjutaja eksemplaris @et
definition: Seostab isiku eksemplariga, mis sisaldab isiku vastutust selles või sellel oleva omakäelise nime või nimemärgi eest. @et
toolkit label: autograafi kirjutaja eksemplaris @et
toolkit definition: Eksemplar, mis sisaldab isiku vastutust selles või sellel oleva omakäelise nime või nimemärgi eest. @et
label: è firmatario di @it
definition: Correla una persona a un item che implica la responsabilità di una persona per la firma manoscritta che vi appare. @it
toolkit label: firmatario di @it
toolkit definition: Item che implica la responsabilità di una persona per la firma manoscritta che vi appare. @it
label: ir autogrāfa ierakstītājs @lv
definition: Sasaista personu ar vienību, kas ietver peronas atbildību par autogrāfu uz tās. @lv
toolkit label: ir autogrāfa ierakstītājs @lv
toolkit definition: Vienība, kas ietver peronas atbildību par autogrāfu uz tās. @lv
label: 是……的亲笔签名者 @zh-hans
definition: 将一个个人与涉及在手稿上出现的签名的个人的责任的单件关联起来。 @zh-hans
toolkit label: ……的亲笔签名者 @zh-hans
toolkit definition: 涉及在手稿上出现的签名的个人的责任的单件 @zh-hans
label: imza sahibidir @tr
definition: Bir kişiyi, üzerinde görünen el yazması imzasının sorumluluğunu içeren bir kopyayla ilişkilendirir. @tr
toolkit label: imzalayan @tr
toolkit definition: Üzerinde görünen el yazması imzanın sorumluluğunu içeren bir kopya. @tr
has subproperty: P50129

perustamisajankohta
status: Published
label: has date of establishment @en
definition: Relates a corporate body to a timespan during which a corporate body is established or founded. @en
type: Property
domain: C10005
sub property of: yhteisöön liittyvä ajanjakso
lexical alias: dateOfEstablishment.en
instruction number: 11.4.3
toolkit label: date of establishment @en
toolkit definition: A timespan during which a corporate body is established or founded. @en
label: a pour date de fondation @fr
definition: Met une collectivité en relation avec un laps de temps pendant lequel une collectivité est établie ou fondée. @fr
toolkit label: date de fondation @fr
toolkit definition: Laps de temps pendant lequel une collectivité est établie ou fondée. @fr
toolkit label: fecha de establecimiento @es
toolkit definition: La fecha en que se estableció o fundó una entidad corporativa. @es
label: har tid för institutionens grundande @sv
toolkit label: tid för institutionens grundande @sv
label: έχει χρονολογία της εγκαθύδρισης @el
definition: Συνδέει ένα συλλογικό όργανο με ένα χρονικό διάστημα κατά το οποίο ένα συλλογικό όργανο συστάθηκε ή ιδρύθηκε. @el
toolkit label: χρονολογία της εγκαθίδρυσης @el
toolkit definition: Μια χρονολογία κατά την οποία ένα συλλογικό όργανο συστάθηκε ή ιδρύθηκε. @el
definition: Setzt eine Körperschaft in Beziehung zu einem Zeitraum, in dem eine Körperschaft eingeführt oder gegründet wurde. @de
toolkit label: Gründungsdatum @de
toolkit definition: Ein Zeitraum, in dem eine Körperschaft eingeführt oder gegründet wurde. @de
label: har dato for etablering @da
definition: Relaterer en korporation til en tidsperiode, hvorunder en korporation er etableret eller grundlagt. @da
toolkit label: dato for etablering @da
toolkit definition: Tidsperiode, hvorunder en korporation er etableret eller grundlagt. @da
label: té com a data de creació @ca
definition: Relaciona una entitat corporativa amb un interval de temps durant el qual una entitat corporativa es crea o es funda. @ca
toolkit label: data de creació @ca
toolkit definition: Interval de temps durant el qual una entitat corporativa es crea o es funda. @ca
definition: Liittää yhteisön ajanjaksoon, jolloin yhteisö on perustettu.
toolkit label: perustamisajankohta
toolkit definition: Ajanjakso, jolloin yhteisö on perustettu.
toolkit label: tidspunkt for opprettelse @no
toolkit definition: Et tidsrom hvor en korporasjon blir etablert eller grunnlagt. @no
label: hat Gründungsdatum @de
has element type: 3
label: alapításának időpontja a következő: @hu
definition: Hozzákapcsol egy testületet egy időtartamhoz, amely alatt egy testületet alapítottak vagy létesítettek. @hu
toolkit label: alapítás időpontja: @hu
toolkit definition: Egy időtartam, amely alatt egy testületet alapítottak vagy létesítettek. @hu
label: har tidspunkt for opprettelse @no
definition: Relaterer en korporasjon til et tidsrom hvor en korporasjon blir etablert eller grunnlagt. @no
label: heeft datum van oprichting @nl
definition: Relateert een corporatie aan een tijdspanne gedurende welke een corporatie wordt vastgesteld of opgericht. @nl
toolkit label: datum van oprichting @nl
toolkit definition: Een tijdspanne gedurende welke een corporatie wordt vastgesteld of opgericht. @nl
label: لها تاريخ تأسيس @ar
definition: يربط هيئة بفترة زمنية نشأت أو تأسست خلالها هيئة. @ar
toolkit label: تاريخ تأسيس @ar
toolkit definition: فترة زمنية نشأت أو تأسست خلالها هيئة. @ar
label: asutamisaeg @et
definition: Seostab asutuse ajavahemikuga, millal asutus on asutatud. @et
toolkit label: asutamisaeg @et
toolkit definition: Ajavahemik, millal asutus on asutatud. @et
label: ha come data di costituzione @it
definition: Correla un ente a un arco di tempo nel quale un ente è stato costituito o fondato. @it
toolkit label: data di costituzione @it
toolkit definition: Arco di tempo durante il quale un ente è stato costituito o fondato @it
label: nodibināšanas datējums @lv
definition: Sasaista institūciju ar laikposmu, kas ir institūcijas izveidošanas vai nodibināšanas datējums. @lv
toolkit label: nodibināšanas datējums @lv
toolkit definition: Institūcijas izveidošanas vai nodibināšanas datējums. @lv
label: 有成立日期 @zh-hans
definition: 将一个团体与一个团体成立或创办的时间段关联起来。 @zh-hans
toolkit label: 成立日期 @zh-hans
toolkit definition: 一个团体成立或创办的时间段 @zh-hans
label: kuruluş tarihi ile ilişkilidir @tr
definition: Bir tüzel kişiyi, bir tüzel kişiliğin kurulduğu veya oluşturulduğu bir zaman aralığı ile ilişkilendirir. @tr
toolkit label: kuruluş tarihi @tr
toolkit definition: Bir tüzel kuruluşun kurulduğu veya oluşturulduğu zaman aralığı. @tr
has subproperty: P50037

työntekijä
status: Published
label: has employee @en
definition: Relates a corporate body to a person who is employed by a corporate body. @en
type: Property
domain: C10005
lexical alias: employee.en
toolkit label: employee @en
toolkit definition: A person who is employed by a corporate body. @en
label: a pour employé @fr
definition: Met une collectivité en relation avec une personne qui est employée par une collectivité. @fr
toolkit label: employé @fr
toolkit definition: Personne qui est employée par une collectivité. @fr
toolkit label: empleado @es
toolkit definition: Una persona empleada por la entidad corporativa. @es
instruction number: 29.5
label: έχει εργαζόμενο @el
definition: Συνδέει ένα συλλογικό όργανο με ένα φυσικό πρόσωπο το οποίο απασχολείται από το συλλογικό όργανο. @el
toolkit label: εργαζόμενος @el
toolkit definition: Ένα φυσικό πρόσωπο που απασχολείται από ένα συλλογικό όργανο. @el
definition: Setzt eine Körperschaft in Beziehung zu einer Person, die bei einer Körperschaft beschäftigt ist. @de
toolkit label: Arbeitnehmerin/Arbeitnehmer @de
toolkit definition: Eine Person, die bei einer Körperschaft beschäftigt ist. @de
label: har ansat @da
definition: Relaterer en korporation til en person, som er ansat hos en korporation. @da
toolkit label: ansat @da
toolkit definition: Person, som er ansat hos en korporation. @da
label: té com a empleat @ca
definition: Relaciona una entitat corporativa amb una persona que és empleada per una entitat corporativa. @ca
toolkit label: empleat @ca
toolkit definition: Persona que és empleada per una entitat corporativa. @ca
definition: Liittää yhteisön henkilöön, joka on työntekijänä yhteisössä.
toolkit label: työntekijä
toolkit definition: Henkilö, joka on työntekijänä yhteisössä.
toolkit label: ansatt @no
toolkit definition: En person som er ansatt i en korporasjon. @no
label: hat Arbeitnehmerin/Arbeitnehmer @de
has element type: 2
sub property of: yhteisön henkilöjäsen
label: alkalmazottja a következő: @hu
definition: Hozzákapcsol egy testületet egy személyhez, akit egy testület alkalmaz. @hu
toolkit label: alkalmazott: @hu
toolkit definition: Egy személy, akit egy testület alkalmaz. @hu
label: har ansatt @no
definition: Relaterer en korporasjon til en person som er ansatt i en korporasjon. @no
label: heeft werknemer @nl
definition: Relateert een corporatie aan een persoon die in dienst is bij een corporatie. @nl
toolkit label: werknemer @nl
toolkit definition: Een persoon die in dienst is bij een corporatie. @nl
label: لها موظف @ar
definition: يربط هيئة بشخص يعمل موظفا لدى هيئة. @ar
toolkit label: موظف @ar
toolkit definition: شخص توظفه هيئة. @ar
label: töötaja @et
definition: Seostab asutuse isikuga, kelle asutus on tööle palganud. @et
toolkit label: töötaja @et
toolkit definition: Isik, kelle asutus on tööle palganud. @et
label: ha come impiegato @it
definition: Correla un ente a una persona che è impiegata presso un ente. @it
toolkit label: impiegato @it
toolkit definition: Persona che è impiegata presso un ente @it
label: darbinieks @lv
definition: Sasaista institūciju ar personu, kuru nodarbina institūcija. @lv
toolkit label: darbinieks @lv
toolkit definition: Persona, kuru nodarbina institūcija. @lv
label: 有雇员 @zh-hans
definition: 将一个团体与被一个团体雇用的一个个人关联起来。 @zh-hans
toolkit label: 雇员 @zh-hans
toolkit definition: 被一个团体雇用的一个个人 @zh-hans
label: çalışan ile ilişkilidir @tr
definition: Bir tüzel kişiyi, bir tüzel kişiliğin altında çalışan bir kişi ile ilişkilendirir. @tr
toolkit label: çalışan @tr
toolkit definition: Bir tüzel kişi altında çalışan bir kişi @tr
has subproperty: P50026

respondentti teoksessa
status: Published
label: is respondent of @en
definition: Relates a person to a work that is a thesis provided by the praeses in an academic disputation that is defended or opposed by a candidate for a degree. @en
type: Property
domain: C10004
sub property of: teoksen tekijä (henkilö) teoksessa
lexical alias: respondentOf.en
label: est un répondant de @fr
definition: Met une personne en relation avec une œuvre qui consiste en une thèse proposée par le praeses lors d’une disputation académique et que défend ou réfute un candidat à un grade universitaire. @fr
toolkit label: répondant de @fr
toolkit definition: Œuvre qui consiste en une thèse proposée par le praeses lors d’une disputation académique et que défend ou réfute un candidat à un grade universitaire. @fr
toolkit label: respondent of @en
toolkit definition: A work that is a thesis provided by the praeses in an academic disputation that is defended or opposed by a candidate for a degree. @en
instruction number: 18.5
label: είναι συμμετέχων του @el
definition: Συνδέει έναν υποψήφιο διδάκτορα, ο οποίος επιχειρηματολογεί υπέρ ή κατά μιας θέσης που τίθεται από τον επόπτη σε ακαδημαϊκή διαβούλευση, με ένα έργο. @el
toolkit label: συμμετέχων του @el
toolkit definition: Μια θέση που τίθεται από τον επόπτη σε ακαδημαϊκή διαβούλευση, η οποία [θέση] υποστηρίζεται από τον υποψήφιο διδάκτορα. @el
definition: Setzt eine Person in Beziehung zu einer These (Werk), die vom Praeses in einer akademischen Disputation aufgestellt wird und die von einer Kandidatin/einem Kandidaten für einen akademischen Grad verteidigt oder abgelehnt wird. @de
toolkit label: Respondentin/Respondent von @de
toolkit definition: Eine These (Werk), die vom Praeses in einer akademischen Disputation aufgestellt wird und die von einer Kandidatin/einem Kandidaten für einen akademischen Grad verteidigt oder abgelehnt wird. @de
label: er respondent af @da
definition: Relaterer en person til en disputats, som er fremsat af præses i et akademisk disputation, som forsvares eller opponeres af en kandidat til en akademisk grad. @da
toolkit label: respondent af @da
toolkit definition: Værk, som er en disputats, som er fremsat af præses i en akademisk disputation, som forsvares eller opponeres af en kandidat til en akademisk grad. @da
label: és respondens de @ca
definition: Relaciona una persona amb una obra que és una tesi proposada pel praeses en una disputa acadèmica la qual defensa o a la qual s’oposa un candidat a un grau acadèmic. @ca
toolkit label: respondens de @ca
toolkit definition: Obra que és una tesi proposada pel praeses en una disputa acadèmica la qual defensa o a la qual s’oposa un candidat a un grau acadèmic. @ca
definition: Liittää oppiarvoa tavoittelevan, puolustavan tai opponoivan kandidaatin teokseen, joka on väitöskirja, jonka preeses esittelee akateemisessa väitöstilaisuudessa.
toolkit label: respondentti teoksessa
toolkit definition: Teos, joka on väitöskirja, jonka preeses esittelee akateemisessa väitöstilaisuudessa ja jota oppiarvoa tavoitteleva kandidaatti puolustaa tai opponoi.
toolkit label: respondent til @no
toolkit definition: En avhandling levert av preses i en akademisk disputas og som kandidaten for en grad enten forsvarer eller bestrider. @no
label: ist Respondentin/Respondent von @de
has element type: 2
label: válaszadója a következőnek: @hu
definition: Egy személyt hozzákapcsol az elnök által egy tudományos vitában előterjesztett szakdolgozathoz, amelyet a fokozat jelöltje megvéd vagy opponál. @hu
toolkit label: válaszadója a következőnek: @hu
toolkit definition: Egy elnök által egy tudományos vitában előterjesztett szakdolgozat, amelyet a tudományos fokozat jelöltje megvéd vagy opponál. @hu
alternative label: väitöskirja
label: er respondent til @no
definition: Relaterer en person til en avhandling levert av preses i en akademisk disputas og som kandidaten for en grad enten forsvarer eller bestrider. @no
label: is respondent van @nl
definition: Relateert een persoon aan een werk dat is een stelling verstrekt door de preses in een academisch dispuut dat verdedigd of aangevallen wordt door een kandidaat voor een graad. @nl
toolkit label: respondent van @nl
toolkit definition: Een werk dat is een stelling verstrekt door de preses in een academisch dispuut dat verdedigd of aangevallen wordt door een kandidaat voor een graad. @nl
label: هو مستجيب لـ @ar
definition: يربط شخصا بعمل عبارة عن أطروحة يقدمها رئيس الجلسة في مناظرة أكاديمية، ويدافع عنها أو يعارضها مرشح للحصول على درجة علمية. @ar
toolkit label: مستجيب لـ @ar
toolkit definition: عمل عبارة عن أطروحة يقدمها رئيس الجلسة في مناظرة أكاديمية، ويدافع عنها أو يعارضها مرشح للحصول على درجة علمية. @ar
label: respondens teoses @et
definition: Seostab isiku praeses'e esitletud teesidega, mida kraadi taotlev isik akadeemilises väitluses kaitseb või oponeerib. @et
toolkit label: respondens teoses @et
toolkit definition: Praeses'e esitletud teesid, mida kraadi taotlev isik akadeemilises väitluses kaitseb või oponeerib. @et
label: è rispondente di @it
definition: Correla una persona a una tesi fornita dal presidente in una dissertazione universitaria che è sostenuta o confutata da un candidato alla laurea. @it
toolkit label: rispondente di @it
toolkit definition: Tesi fornita dal presidente in una dissertazione universitaria che è sostenuta o confutata da un candidato alla laurea. @it
label: ir respondents akadēmiskajā disputā @lv
definition: Sasaista personu ar darbu, kas ir akadēmiskā disputa vadītāja piedāvātās tēzes, kuras aizstāv vai kam oponē kandidāts grāda iegūšanai. @lv
toolkit label: ir respondents akadēmiskajā disputā @lv
toolkit definition: Akadēmiskā disputa vadītāja piedāvātās tēzes, kuras aizstāv vai kam oponē kandidāts grāda iegūšanai. @lv
label: 是……的答辩人 @zh-hans
definition: 将一个个人与学位论文答辩中评审人提供的一篇论文之作品关联起来。 @zh-hans
toolkit label: ……的答辩人 @zh-hans
toolkit definition: 学位论文答辩中评审人提供的一篇论文之作品 @zh-hans
label: tez yazarıdır @tr
definition: Bir akademik derece adayının savunduğu veya karşı çıktığı akademik bir savunmada akademik derece adayının başarısını gösteren çalışma olan tez ile adayı ilişkilendirir. @tr
toolkit label: tez savunan kişi @tr
toolkit definition: Bir akademik tartışmada danışman tarafından sunulan ve bir derece adayı tarafından savunulan veya karşı çıkılan bir tez olan çalışma. @tr
has subproperty: P50001

henkilö muutoksenhakijan vastapuolena teoksessa
status: Published
label: is appellee person of @en
definition: Relates a person to a work that is a legal work of a higher court that records a decision of a lower court that appeals against a person. @en
type: Property
domain: C10004
sub property of: teoksen tekijä (henkilö) teoksessa
lexical alias: appelleePersonOf.en
label: est une personne intimée de @fr
definition: Met une personne en relation avec une œuvre juridique d’un tribunal supérieur qui enregistre une décision d’un tribunal inférieur portant un appel contre une personne. @fr
toolkit label: personne intimée de @fr
toolkit definition: Œuvre juridique d’un tribunal supérieur qui enregistre une décision d’un tribunal inférieur portant un appel contre une personne. @fr
toolkit label: appellee person of @en
toolkit definition: A work that is a legal work of a higher court that records a decision of a lower court that appeals against a person. @en
instruction number: 18.5
label: είναι εφεσίβλητο/αναιρεσίβλητο φυσικό πρόσωπο του @el
definition: Συνδέει ένα φυσικό πρόσωπο, που ασκεί έφεση εναντίον μιας απόφασης κατώτερου δικαστηρίου για μεταβίβαση της υπόθεσης σε ανώτερο δικαστήριο, με ένα έργο. @el
toolkit label: εφεσίβλητο/αναιρεσίβλητο φυσικό πρόσωπο του @el
toolkit definition: Ένα νομικό έργο που καταχωρίστηκε στα πρακτικά ενός ανώτερου δικαστηρίου, που ασκεί έφεση εναντίον απόφασης κατώτερου δικαστηρίου, για φυσικό πρόσωπο. @el
definition: Setzt eine Person in Beziehung zu einem juristischen Werk einer höheren Instanz, das ein Gerichtsurteil festhält, bei dem gegen eine Person Rechtsmittel gegen ein Gerichtsurteil einer unteren Instanz eingelegt werden. @de
toolkit label: Person als Berufungsbeklagte/Berufungsbeklagter/Revisionsbeklagte/Revisionsbeklagter von @de
toolkit definition: Ein juristisches Werk einer höheren Instanz, das ein Gerichtsurteil festhält, bei dem gegen eine Person Rechtsmittel gegen ein Gerichtsurteil einer unteren Instanz eingelegt werden. @de
label: er person, som er indstævnte af @da
definition: Relaterer en person til et juridisk værk fra en højere retsinstans, som registrerer en lavere retsinstans dom, som appellerer imod en person. @da
toolkit label: person, som er indstævnte af @da
toolkit definition: Juridisk værk fra en højere retsinstans, som registrerer en lavere retsinstans dom, som appellerer imod en person. @da
label: és persona apel·lada de @ca
definition: Relaciona una persona amb una obra que és una obra jurídica d’un tribunal superior que enregistra una decisió d’un tribunal inferior que apel·la contra una persona. @ca
toolkit label: persona apel·lada de @ca
toolkit definition: Obra que és una obra jurídica d’un tribunal superior que enregistra una decisió d’un tribunal inferior que apel·la contra una persona. @ca
definition: Liittää henkilön juridiseen teokseen, jolla haetaan muutosta alemman oikeusasteen päätökseen ja joka kohdistuu henkilöön.
toolkit label: henkilö muutoksenhakijan vastapuolena teoksessa
toolkit definition: Juridinen teos, jolla haetaan muutosta alemman oikeusasteen päätökseen ja joka kohdistuu henkilöön.
toolkit label: appellee - person for @no
toolkit definition: Et juridisk verk fra en høyere rettsinstans som registrerer en avgjørelse fra en lavere rettsinstans som anker mot en person. @no
label: ist Person als Berufungsbeklagte/Berufungsbeklagter/Revisionsbeklagte/Revisionsbeklagter von @de
has element type: 2
label: fellebezési alperes személye a következőnek: @hu
definition: Hozzákapcsol egy személyt egy felsőbb bíróság jogi művéhez, amely rögzíti egy alsóbb bíróság egy személy ellenében fellebbező ítéletét. @hu
toolkit label: fellebbezési alperes személye: @hu
toolkit definition: Felsőbb bíróság jogi műve, amely rögzíti egy alsóbb bíróság egy személy ellenében fellebbező ítéletét. @hu
alternative label: henkilöön kohdistuva muutoshakemus
label: er appellee - person for @no
definition: Relaterer en person til et juridisk verk fra en høyere rettsinstans som registrerer en avgjørelse fra en lavere rettsinstans som anker mot en person. @no
label: is gedaagde-persoon van @nl
definition: Relateert een persoon aan een juridisch werk van een hoger gerechtshof dat een oordeel vastlegt van een lager gerechtshof waarbij in beroep gegaan wordt tegen een persoon. @nl
toolkit label: gedaagde-persoon van @nl
toolkit definition: Een juridisch werk van een hoger gerechtshof dat een oordeel vastlegt van een lager gerechtshof waarbij in beroep gegaan wordt tegen een persoon. @nl
label: هو شخص مستأنف ضده لـ @ar
definition: يربط شخصا بعمل قضائي لمحكمة أعلى درجة تسجل قرار محكمة أدنى درجة تستأنف ضد شخص. @ar
toolkit label: شخص مستأنف ضده @ar
toolkit definition: عمل قضائي لمحكمة أعلى درجة تسجل قرار محكمة أدنى درجة تستأنف ضد شخص. @ar
label: vastustaja (isik) teoses @et
definition: Seostab isiku kõrgema astme kohtu juriidilise teosega, milles on dokumenteeritud alama astme kohtu otsus, mille peale on isiku vastu esitatud apellatsioon. @et
toolkit label: vastustaja (isik) teoses @et
toolkit definition: Kõrgema astme kohtu juriidiline teos, milles on dokumenteeritud alama astme kohtu otsus, mille peale on isiku vastu esitatud apellatsioon. @et
label: è appellato persona di @it
definition: Correla una persona a un opera legale di un tribunale superiore che registra una decisione di un tribunale inferiore che fa ricorso contro una persona. @it
toolkit label: appellato persona di @it
toolkit definition: Opera legale di un tribunale superiore che registra una decisione di un tribunale inferiore che fa ricorso contro una persona. @it
label: ir apsūdzētais (persona) @lv
definition: Sasaista personu ar augstākās tiesas sprieduma ierakstu par zemākas instances tiesas lēmumu, kas ir apelācija pret personu. @lv
toolkit label: ir apsūdzētais (persona) @lv
toolkit definition: Augstākās tiesas sprieduma ieraksts par zemākas instances tiesas lēmumu, kas ir apelācija pret personu. @lv
label: 是……的被上诉者个人 @zh-hans
definition: 将一个个人与一种记录下级法院起诉一个个人的决定的上级法院的法律作品关联起来。 @zh-hans
toolkit label: ……的被上诉者个人 @zh-hans
toolkit definition: 一种记录下级法院起诉一个个人的决定的上级法院的法律作品 @zh-hans
label: temyiz edilen kişisidir @tr
definition: Bir kişiyi, bir kişi aleyhine temyize giden bir alt mahkemenin kararını kaydeden bir üst mahkemenin yasal çalışması olan bir eserle ilişkilendirir. @tr
toolkit label: temyiz edilen kişi @tr
toolkit definition: Bir alt mahkemenin bir kişiye karşı temyiz ettiği kararını kaydeden yüksek mahkemeye ait hukuki bir çalışma. @tr
has subproperty: P50085

henkilö vastaajana kanteessa
status: Published
type: Property
label: is defendant person of @en
lexical alias: defendantPersonOf.en
definition: Relates a person to a work that involves a responsibility of a person being accused in a criminal proceeding or sued in a civil proceeding. @en
domain: C10004
label: est une personne défenderesse de @fr
definition: Met une personne en relation avec une œuvre qui comporte une responsabilité de la part d’une personne accusée dans une poursuite criminelle ou poursuivie dans une poursuite civile. @fr
toolkit label: personne défenderesse de @fr
toolkit definition: Œuvre qui comporte une responsabilité de la part d’une personne accusée dans une poursuite criminelle ou poursuivie dans une poursuite civile. @fr
toolkit label: defendant person of @en
toolkit definition: A work that involves a responsibility of a person being accused in a criminal proceeding or sued in a civil proceeding. @en
instruction number: 18.5
sub property of: teoksen tekijä (henkilö) teoksessa
label: είναι εναγόμενο φυσικό πρόσωπο του @el
definition: Συνδέει ένα φυσικό πρόσωπο, το οποίο ασκεί αγωγή στο πλαίσιο αστικής διαδικασίας, με ένα έργο. @el
toolkit label: εναγόμενο φυσικό πρόσωπο του @el
toolkit definition: Ένα έργο που περιλαμβάνει την ευθύνη για ένα φυσικό πρόσωπο, εναντίον του οποίου ασκείται αγωγή στο πλαίσιο αστικής διαδικασίας. @el
definition: Setzt eine Person in Beziehung zu einem Werk, das mit einer Verantwortung verbunden ist, als Person in einem Strafverfahren angeklagt oder in einem Zivilverfahren verklagt zu werden. @de
toolkit label: Person als Angeklagte/Angeklagter/Beklagte/Beklagter von @de
toolkit definition: Ein Werk, das mit einer Verantwortung verbunden ist, als Person in einem Strafverfahren angeklagt oder in einem Zivilverfahren verklagt zu werden. @de
label: er sagsøgt person af @da
definition: Relaterer en person til et værk, som involverer et ansvar for at være en person, som er anklaget i en straffesag eller sagsøgt i en civilsag. @da
toolkit label: sagsøgt person af @da
toolkit definition: Værk, som involverer et ansvar for at være en person, som er anklaget i en straffesag eller sagsøgt i en civilsag. @da
label: és persona acusada de @ca
definition: Relaciona una persona amb una obra que implica una responsabilitat d’una persona com a part acusada en un procés penal o demandada en un procés civil. @ca
toolkit label: persona acusada de @ca
toolkit definition: Obra que implica una responsabilitat d’una persona com a part acusada en un procés penal o demandada en un procés civil. @ca
definition: Liittää henkilön teokseen, joka sisältää henkilöön kohdistuvan syytteen rikosoikeudenkäynnissä tai haasteen siviilioikeudenkäynnissä.
toolkit label: henkilö vastaajana kanteessa
toolkit definition: Teos, joka sisältää henkilöön kohdistuvan syytteen rikosoikeudenkäynnissä tai haasteen siviilioikeudenkäynnissä.
toolkit label: saksøkt person for @no
toolkit definition: Et verk som involverer et ansvar for å være en person som er tiltalt i en straffesak eller saksøkt i en sivilrettslig sak. @no
label: ist Person als Angeklagte/Angeklagter/Beklagte/Beklagter von @de
has element type: 2
label: alperes személye a következőnek: @hu
definition: Hozzákapcsol egy személyt egy műhöz, amelyhez hozzátartozik annak felelőssége, hogy egy személyt egy büntetőeljárásban megvádolnak, vagy egy polgári perben beperelnek. @hu
toolkit label: alperes személye: @hu
toolkit definition: Egy mű, amelyhez hozzátartozik annak felelőssége, hogy egy személyt egy büntetőeljárásban megvádolnak, vagy egy polgári perben beperelnek. @hu
alternative label: henkilö kohteena kanteessa
label: er saksøkt person for @no
definition: Relaterer en person et verk som involverer et ansvar for å være en person som er tiltalt i en straffesak eller saksøkt i en sivilrettslig sak. @no
label: is verweerder-persoon van @nl
definition: Relateert een actor aan een werk dat met zich meebrengt een verantwoordelijkheid van beschuldigd worden als een persoon in een civielrechtelijke procedure. @nl
toolkit label: verweerder-persoon van @nl
toolkit definition: Een werk dat met zich meebrengt een verantwoordelijkheid van beschuldigd worden als een persoon in een civielrechtelijke procedure. @nl
label: kostja (isik) teoses @et
definition: Seostab isiku teosega, mis sisaldab isiku vastu esitatud süüdistust kriminaalkohtumenetluses või hagi tsiviilkohtumenetluses. @et
alternative label: süüdistatav (isik) teoses @et
toolkit label: kostja (isik) teoses @et
toolkit definition: Teos, mis sisaldab isiku vastu esitatud süüdistust kriminaalkohtumenetluses või hagi tsiviilkohtumenetluses. @et
label: è difendente persona di @it
definition: Correla una persona a un'opera che implica la responsabilità di essere accusato come persona in un procedimento penale o querelato in procedimento civile. @it
toolkit label: persona che si difende di @it
toolkit definition: Opera che implica la responsabilità di essere accusato come persona in un procedimento penale o querelato in un procedimento civile. @it
label: ir atbildētājs (persona) @lv
definition: Sasaista personu ar darbu, kas ietver atbildību par to, ka persona apsūdzēta kriminālprocesā vai iesūdzēta civillietā. @lv
toolkit label: ir atbildētājs (persona) @lv
toolkit definition: Darbs, kas ietver atbildību par to, ka persona apsūdzēta kriminālprocesā vai iesūdzēta civillietā. @lv
label: هو شخص مدعى عليه @ar
definition: يربط شخص بعمل ينطوي على مسئولية اتهامه كشخص في دعوى جنائية أو مقاضاته في دعوى مدنية. @ar
toolkit label: شخص مدعى عليه @ar
toolkit definition: عمل يترتب عليه تحمل مسئولية اتهامه كشخص في دعوى جنائية أو مقاضاته في دعوى مدنية. @ar
label: 是……的被告个人 @zh-hans
definition: 将一个个人与涉及在刑事或民事诉讼中被控告的一个个人的责任的一种作品关联起来。 @zh-hans
toolkit label: ……的被告个人 @zh-hans
toolkit definition: 涉及在刑事或民事诉讼中被控告的一个个人的责任的一种作品 @zh-hans
label: davalı kişisidir @tr
definition: Bir kişiyi, bir ceza yargılamasında kişi olarak suçlanma veya bir hukuk yargılamasında dava edilme sorumluluğunu içeren bir eserle ilişkilendirir. @tr
toolkit label: sanık kişi @tr
toolkit definition: Bir ceza davasında kişi olarak suçlanma veya bir hukuk davasında dava edilme sorumluluğunu içeren bir çalışma. @tr
has subproperty: henkilövastaaja siviilioikeudessa teoksessa
has subproperty: henkilövastaaja rikosoikeudessa teoksessa
has subproperty: P50259

yhteisö vastaajana kanteessa
status: Published
type: Property
label: is defendant corporate body of @en
lexical alias: defendantCorporateBodyOf.en
definition: Relates a corporate body to work that involves a responsibility of a corporate body being accused in a criminal proceeding or sued in a civil proceeding. @en
domain: C10005
label: est une collectivité défenderesse de @fr
definition: Met une collectivité en relation avec une œuvre qui comporte une responsabilité de la part d’une collectivité accusée dans une poursuite criminelle ou poursuivie dans une poursuite civile. @fr
toolkit label: collectivité défenderesse de @fr
toolkit definition: Œuvre qui comporte une responsabilité de la part d’une collectivité accusée dans une poursuite criminelle ou poursuivie dans une poursuite civile. @fr
toolkit label: defendant corporate body of @en
toolkit definition: A work that involves a responsibility of a corporate body being accused in a criminal proceeding or sued in a civil proceeding. @en
instruction number: 18.5
sub property of: teoksen tekijä (yhteisö) teoksessa
label: είναι εναγόμενο συλλογικό όργανο του @el
definition: Συνδέει ένα συλλογικό όργανο, το οποίο ασκεί αγωγή στο πλαίσιο αστικής διαδικασίας, με ένα έργο. @el
toolkit label: εναγόμενο συλλογικό όργανο του @el
toolkit definition: Ένα έργο που περιλαμβάνει την ευθύνη για ένα συλλογικό όργανο, εναντίον του οποίου ασκείται αγωγή στο πλαίσιο αστικής διαδικασίας. @el
definition: Setzt eine Körperschaft in Beziehung zu einem Werk, das mit einer Verantwortung verbunden ist, als Körperschaft in einem Strafverfahren angeklagt oder in einem Zivilverfahren verklagt zu werden. @de
toolkit label: Körperschaft als Angeklagte/Angeklagter/Beklagte/Beklagter von @de
toolkit definition: Ein Werk, das mit einer Verantwortung verbunden ist, als Körperschaft in einem Strafverfahren angeklagt oder in einem Zivilverfahren verklagt zu werden. @de
label: er sagsøgt korporation af @da
definition: Relaterer en korporation til et værk, som involverer et ansvar for at være anklaget, som en korporation, i en straffesag eller sagsøgt i en civilsag. @da
toolkit label: sagsøgt korporation af @da
toolkit definition: Værk, som involverer et ansvar for at være anklaget, som en korporation, i en straffesag eller sagsøgt i en civilsag. @da
label: és entitat corporativa acusada de @ca
definition: Relaciona una entitat corporativa amb una obra que implica una responsabilitat d’una entitat corporativa com a part acusada en un procés penal o demandada en un procés civil. @ca
toolkit label: entitat corporativa acusada de @ca
toolkit definition: Obra que implica una responsabilitat d’una entitat corporativa com a part acusada en un procés penal o demandada en un procés civil. @ca
definition: Liittää yhteisön teokseen, joka sisältää yhteisöön kohdistuvan syytteen rikosoikeudenkäynnissä tai haasteen siviilioikeudenkäynnissä.
toolkit label: yhteisö vastaajana kanteessa
toolkit definition: Teos, joka sisältää yhteisöön kohdistuvan syytteen rikosoikeudenkäynnissä tai haasteen siviilioikeudenkäynnissä.
toolkit label: saksøkt korporasjon for @no
toolkit definition: Et verk som involverer et ansvar for å være en korporasjon som er tiltalt i en straffesak eller saksøkt i en sivilrettslig sak. @no
label: ist Körperschaft als Angeklagte/Angeklagter/Beklagte/Beklagter von @de
has element type: 2
label: alperes testülete a következőnek: @hu
definition: Hozzákapcsol egy testületet egy műhöz, amelyhez hozzátartozik annak felelőssége, hogy egy testületet egy büntetőeljárásban megvádolnak, vagy egy polgári perben beperelnek. @hu
toolkit label: alperes testülete: @hu
toolkit definition: Egy mű, amelyhez hozzátartozik annak felelőssége, hogy egy testületet egy büntetőeljárásban megvádolnak, vagy egy polgári perben beperelnek. @hu
alternative label: yhteisö kohteena kanteessa
label: er saksøkt korporasjon for @no
definition: Relaterer en korporasjon til et verk som involverer et ansvar for å være en korporasjon som er tiltalt i en straffesak eller saksøkt i en sivilrettslig sak. @no
label: is verweerder-corporatie van @nl
definition: Relateert een corporatie aan een werk dat met zich meebrengt een verantwoordelijkheid van beschuldigd worden als een corporatie in een civielrechtelijke procedure. @nl
toolkit label: verweerder-corporatie van @nl
toolkit definition: Een werk dat met zich meebrengt een verantwoordelijkheid van beschuldigd worden als een corporatie in een civielrechtelijke procedure. @nl
label: kostja (asutus) teoses @et
definition: Seostab asutuse teosega, mis sisaldab asutuse vastu esitatud süüdistust kriminaalkohtumenetluses või hagi tsiviilkohtumenetluses. @et
alternative label: süüdistatav (asutus) teoses @et
toolkit label: kostja (asutus) teoses @et
toolkit definition: Teos, mis sisaldab asutuse vastu esitatud süüdistust kriminaalkohtumenetluses või hagi tsiviilkohtumenetluses. @et
label: è difendente ente di @it
definition: Collega un ente a un'opera che implica la responsabilità di essere accusato come ente in un procedimento penale o querelato in procedimento civile. @it
toolkit label: ente che si difendedi @it
toolkit definition: Opera che implica la responsabilità di essere accusato come ente in un procedimento penale o querelato in un procedimento civile. @it
label: ir atbildētājs (institūcija) @lv
definition: Sasaista institūciju ar darbu, kas ietver atbildību par to, ka institūcija apsūdzēta kriminālprocesā vai iesūdzēta civillietā. @lv
toolkit label: ir atbildētājs (institūcija) @lv
toolkit definition: Darbs, kas ietver atbildību par to, ka institūcija apsūdzēta kriminālprocesā vai iesūdzēta civillietā. @lv
label: هي هيئة مدعى عليها لـ @ar
definition: يربط هيئة بعمل يترتب عليه مسئولية اتهامها كهيئة في دعوى جنائية، أو مقاضاتها في دعوى مدنية. @ar
toolkit label: هيئة مدعى عليها @ar
toolkit definition: عمل يترتب عليه تحمل مسئولية اتهامها كهيئة في دعوى جنائية أو مقاضاتها في دعوى مدنية. @ar
label: 是……的被告团体 @zh-hans
definition: 将一个团体与涉及在刑事或民事诉讼中被控告的一个团体的责任的一种作品关联起来。 @zh-hans
toolkit label: ……的被告团体 @zh-hans
toolkit definition: 涉及在刑事或民事诉讼中被控告的一个团体的责任的一种作品 @zh-hans
label: davalı tüzel kişidir @tr
definition: Bir tüzel kişiyi, bir ceza davasında tüzel kişi olarak suçlanma veya bir hukuk davasında dava edilme sorumluluğunu içeren bir eserle ilişkilendirir. @tr
toolkit label: sanık tüzel kişi @tr
toolkit definition: Bir ceza davasında tüzel kişi olarak suçlanma veya bir hukuk davasında dava edilme sorumluluğunu içeren bir eser. @tr
has subproperty: yhteisövastaaja siviilioikeudessa teoksessa
has subproperty: yhteisövastaaja rikosoikeudessa teoksessa
has subproperty: P50258

toinen identiteetti
status: Deprecated
definition: Relates a person to a pseudonymous or other identity assumed by a person. (Deprecated) @en
type: Property
domain: C10004
lexical alias: alternateIdentity.en
label: a pour identité alternative @fr
definition: Met une personne en relation avec un pseudonyme ou une autre identité adoptée par une personne. @fr
toolkit label: identité alternative @fr
toolkit definition: Pseudonyme ou autre identité adoptée par une personne. @fr
toolkit label: identidad alternativa @es
toolkit definition: Un seudónimo u otra identidad asumida por la persona. @es
instruction number: 29.5
label: έχει εναλλακτική ταυτότητα @el
definition: Συνδέει ένα φυσικό πρόσωπο με ένα ψευδώνυμο ή άλλη ψευδή ταυτότητα ενός φυσικού προσώπου. @el
toolkit label: εναλλακτική ταυτότητα @el
toolkit definition: Ένα ψευδώνυμο ή άλλη ψευδής ταυτότητα ενός φυσικού προσώπου. @el
definition: Setzt eine Person mit einem Pseudonym oder einer sonstigen Identität, das/die eine Person annimmt, in Beziehung. @de
toolkit label: Andere Identität @de
toolkit definition: Ein Pseudonym oder eine sonstige Identität, das/die eine Person annimmt. @de
label: har alternativ identitet @da
definition: Relaterer en person til en pseudonym eller anden identitet antaget af en person. @da
toolkit label: alternativ identitet @da
toolkit definition: Pseudonym eller anden identitet antaget af en person. @da
label: té com a identitat alternativa @ca
definition: Relaciona una persona amb un pseudònim o qualsevol altra identitat adoptada per una persona. @ca
toolkit label: identitat alternativa @ca
toolkit definition: Pseudònim o qualsevol altra identitat adoptada per una persona. @ca
definition: Liittää henkilön henkilön omaksumaan toiseen identiteettiiin.
toolkit label: toinen identiteetti
toolkit definition: Henkilön omaksuma toinen identiteetti.
toolkit definition: Et pseudonym eller en annen identitet som forbindes med en person. @no
label: hat andere Identität @de
has subproperty: P50105

henkilön toinen identiteetti
status: Published
label: has alternate identity of person @en
type: Property
lexical alias: alternateIdentityOfPerson.en
definition: Relates a person to a nomen that is a pseudonym or other appellation used by a person. @en
domain: C10004
toolkit label: alternate identity of person @en
toolkit definition: A nomen that is a pseudonym or other appellation used by a person. @en
has element type: 3
sub property of: henkilöön liittyvä nomen
alternative label: alternate identity @en
definition: Liittää henkilön nomeniin, joka on pseudonyymi tai muu henkilön käyttämä nimitys.
toolkit label: henkilön toinen identiteetti
toolkit definition: Nomen, joka on pseudonyymi tai muu henkilön käyttämä nimitys.
label: har alternativ identitet for person @no
definition: Relaterer en person til et nomen som er et pseudonym eller en annen betegnelse som brukes av en person. @no
toolkit label: alternativ identitet for person @no
toolkit definition: Et nomen som er et pseudonym eller en annen betegnelse som brukes av en person. @no
label: heeft alternatieve identiteit van persoon @nl
definition: Relateert een persoon aan een nomen dat een pseudoniem of andere aanduiding is gebruikt door een persoon. @nl
toolkit label: alternatieve identiteit van persoon @nl
toolkit definition: Een nomen dat een pseudoniem of andere aanduiding is gebruikt door een persoon. @nl
alternative label: toinen identiteetti
label: له هوية بديلة لشخص @ar
definition: يربط شخصا بتسمية هي اسم مستعار أو اسم آخر يستخدمه شخص @ar
toolkit label: هوية بديلة لشخص @ar
toolkit definition: تسمية هي اسم مستعار أو اسما آخر يستخدمه شخص. @ar
label: té com a identitat alternativa de persona @ca
definition: Relaciona una persona amb un nomen que és un pseudònim o una altra apel·lació usada per una persona. @ca
toolkit label: identitat alternativa de persona @ca
toolkit definition: Nomen que és un pseudònim o una altra apel·lació usada per una persona. @ca
definition: Relaterer en person til et nomen, som er et pseudonym eller anden benævnelse, som bruges af en person. @da
toolkit definition: Nomen, som er et pseudonym eller anden benævnelse, som bruges af en person. @da
label: isiku teine identiteet @et
definition: Seostab isiku nomen'iga, mis on pseudonüüm või muu isiku poolt kasutatav nimi. @et
toolkit label: isiku teine identiteet @et
toolkit definition: Nomen, mis on pseudonüüm või muu isiku poolt kasutatav nimi. @et
label: hat andere Identität einer Person @de
definition: Setzt eine Person in Beziehung zu einem Pseudonym oder einer anderen, von einer Person verwendeten, Bezeichnung. @de
toolkit label: Andere Identität einer Person @de
toolkit definition: Ein Pseudonym oder eine andere, von einer Person verwendete, Bezeichnung. @de
label: személy alternatív identitása a következő: @hu
definition: Hozzákapcsol egy személyt egy nomenhez, amely egy álnév vagy más, egy személy által használt megnevezés. @hu
toolkit label: személy alternatív identitása: @hu
toolkit definition: Egy nomen, amely egy álnév vagy más, egy személy által használt megnevezés. @hu
label: ha come identità alternativa di persona @it
definition: Correla una persona a un nomen che è uno pseudonimo o altra denominazione usata da una persona. @it
toolkit label: identità alternativa di persona @it
toolkit definition: Nomen che è uno pseudonimo o altra denominazione usata da una persona. @it
label: έχει εναλλακτική ταυτότητα του φυσικού προσώπου @el
toolkit label: εναλλακτική ταυτότητα του φυσικού προσώπου @el
label: a pour identité alternative d’une personne @fr
definition: Met une personne en relation avec un nomen qui consiste en un pseudonyme ou en une autre appellation utilisée par une personne. @fr
toolkit label: identité alternative d’une personne @fr
toolkit definition: Nomen qui consiste en un pseudonyme ou en une autre appellation utilisée par une personne. @fr
label: personas cita identitāte @lv
definition: Sasaista personu ar nomenu, kas ir pseidonīms vai cita identitāte, ko persona ir pieņēmusi. @lv
toolkit label: personas cita identitāte @lv
toolkit definition: Nomens, kas ir pseidonīms vai cita identitāte, ko persona ir pieņēmusi. @lv
alternative label: هوية بديلة @ar
alternative label: alternativ identitet @da
alternative label: Andere Identität @de
alternative label: identitat alternativa @ca
alternative label: 交替身份 @zh-hans
label: 有个人的交替身份 @zh-hans
definition: 将一个个人与作为一个个人所使用的一个化名或其他称谓的命名关联起来。 @zh-hans
toolkit label: 个人的交替身份 @zh-hans
toolkit definition: 作为一个个人所使用的一个化名或其他称谓的命名 @zh-hans
alternative label: identidad alterna de persona @es
alternative label: identité alternative @fr
alternative label: alternatív identitása: @hu
alternative label: Alternatif kimlik @tr
label: kişinin alternatif kimliği ile ilişkilidir @tr
definition: Bir kişiyi, bir kişi tarafından kullanılan bir takma isim veya başka bir unvan olan biri isimle ilişkilendirir. @tr
toolkit label: Kişinin alternatif kimliği @tr
toolkit definition: Bir kişi tarafından kullanılan bir takma isim veya başka bir unvan olan bir isim. @tr
has subproperty: P50428

animaattori (toimija) ekspressiossa
status: Published
label: is animator agent of @en
definition: Relates an agent to an expression that includes a contribution by an agent of giving apparent movement to inanimate objects or drawings. @en
type: Property
domain: C10002
sub property of: esitykseen osallinen toimija ekspressiossa
lexical alias: animatorAgentOf.en
label: est un agent animateur de @fr
definition: Met un agent en relation avec une expression qui intègre une contribution de la part d’un agent consistant à donner l’illusion du mouvement à des objets inanimés ou à des dessins. @fr
toolkit label: agent animateur de @fr
toolkit definition: Expression qui intègre une contribution de la part d’un agent consistant à donner l’illusion du mouvement à des objets inanimés ou à des dessins. @fr
toolkit label: animator agent of @en
toolkit definition: An expression that includes a contribution by an agent of giving apparent movement to inanimate objects or drawings. @en
see also: taiteilija (toimija) teoksessa
instruction number: 18.5
label: είναι [σχεδιαστής] κινησιομοίωσης φορέας του @el
definition: Συνδέει έναν φορέα, ο οποίος συνεισφέρει σε μια έκφραση ενός έργου κινητής εικόνας ή προγράμματος υπολογιστή δίνοντας φαινομενική κίνηση σε άψυχα αντικείμενα ή σχέδια, με μια έκφραση. @el
toolkit label: [σχεδιαστής] κινησιομοίωσης φορέας του @el
toolkit definition: Μια έκφραση ενός έργου κινητής εικόνας ή προγράμματος υπολογιστή που ενσωματώνει τη συνεισφορά της παροχής φαινομενικής κίνησης σε άψυχα αντικείμενα ή σχέδια. @el
definition: Setzt einen Akteur in Beziehung zu einer Expression, zu der ein Akteur beiträgt, indem er unbelebte Objekte oder Zeichnungen in scheinbare Bewegung versetzt. @de
toolkit label: Akteur als Trickfilmzeichnerin/Trickfilmzeichner von @de
toolkit definition: Eine Expression, zu der ein Akteur beiträgt, indem er unbelebte Objekte oder Zeichnungen in scheinbare Bewegung versetzt. @de
label: er agent, som er animator af @da
definition: Relaterer en agent til et udtryk, som omfatter en agents bidrag ved at give en illusion af bevægelse til livløse objekter eller tegninger. @da
toolkit label: agent, som er animator af @da
toolkit definition: Udtryk, som omfatter en agents bidrag ved at give en illusion af bevægelse til livløse objekter eller tegninger. @da
label: és agent animador de @ca
definition: Relaciona un agent amb una expressió que inclou una contribució d’un agent donant l’aparença de moviment a objectes o dibuixos inanimats. @ca
toolkit label: agent animador de @ca
toolkit definition: Expressió que inclou una contribució d’un agent donant l’aparença de moviment a objectes o dibuixos inanimats. @ca
definition: Liittää toimijan ekspressioon, jonka tekemiseen toimija osallistuu tuottamalla näennäistä liikettä elottomiin esineisiin tai piirroksiin.
toolkit label: animaattori (toimija) ekspressiossa
toolkit definition: Ekspressio, jonka tekemiseen toimija osallistuu tuottamalla näennäistä liikettä elottomiin esineisiin tai piirroksiin.
toolkit label: animatør av (agent) @no
toolkit definition: Et uttrykk som inkluderer et bidrag fra en agent i form av å gi tilsynelatende bevegelse til tegninger eller figurer. @no
label: ist Akteur als Trickfilmzeichnerin/Trickfilmzeichner von @de
has element type: 2
label: animátor ágense a következőnek: @hu
definition: Hozzákapcsol egy ágenst egy kifejezési formához, amely magában foglalja egy ágens közreműködését élettelen tárgyak vagy rajzok látszólagos mozgatásában. @hu
toolkit label: animátor ágense: @hu
toolkit definition: Egy kifejezési forma, amely magában foglalja egy ágens közreműködését élettelen tárgyak vagy rajzok látszólagos mozgatásában. @hu
alternative label: animator of @en
alternative label: animaatio
label: er animatør av (agent) @no
definition: Relaterer en agent til et uttrykk som inkluderer et bidrag fra en agent i form av å gi tilsynelatende bevegelse til tegninger eller figurer. @no
alternative label: animatør av @no
label: is animator-actor van @nl
definition: Relateert een actor aan een expressie die omvat een bijdrage door een actor door het geven van schijnbare beweging aan levenloze objecten of tekeningen. @nl
toolkit label: animator-actor van @nl
toolkit definition: Een expressie die omvat een bijdrage door een actor door het geven van schijnbare beweging aan levenloze objecten of tekeningen. @nl
label: هو وكيل فنان رسوم متحركة لـ @ar
definition: يربط وكيلا بتعبيرة تتضمن إسهام وكيل في جعل كائنات أو رسومات جامدة تتحرك حركة واضحة. @ar
alternative label: فنان رسوم متحركة @ar
toolkit label: وكيل فنان رسوم متحركة @ar
toolkit definition: تعبيرة تتضمن إسهام وكيل في جعل أو رسومات جامدة تتحرك حركة واضحة. @ar
alternative label: animador de @ca
alternative label: animator af @da
label: animaator (tegija) väljenduses @et
definition: Seostab tegija väljendusega, millesse tegija on andnud panuse, pannes näiliselt liikuma elutud esemed või joonistused. @et
alternative label: animaator väljenduses @et
toolkit label: animaator (tegija) väljenduses @et
toolkit definition: Väljendus, millesse tegija on andnud panuse, pannes näiliselt liikuma elutud esemed või joonistused. @et
alternative label: animátora: @hu
label: è animatore agente di @it
definition: Correla un agente a un'espressione che include un contributo da parte di un agente nel dare movimento apparente a oggetti o disegni inanimati. @it
alternative label: animatore di @it
toolkit label: animatore agente di @it
toolkit definition: Espressione che include un contributo da parte di un agente nel dare movimento apparente a oggetti o disegni inanimanti. @it
alternative label: [σχεδιαστής] κινουμένων σχεδίων @el
alternative label: animateur de @fr
label: ir animators (aģents) @lv
definition: Sasaista aģentu ar izteiksmi, kas ietver aģenta ieguldījumu, pieškirot šķietamu kustību nekustīgiem objektiem vai zīmējumiem. @lv
toolkit label: ir animators (aģents) @lv
toolkit definition: Izteiksme, kas ietver aģenta ieguldījumu, pieškirot šķietamu kustību nekustīgiem objektiem vai zīmējumiem. @lv
alternative label: Trickfilmzeichner von @de
alternative label: ……的动画师 @zh-hans
toolkit label: ……的动画师行为者 @zh-hans
toolkit definition: 包括一个行为者对给予无生命对象或绘画以貌似运动之贡献的一种内容表达 @zh-hans
toolkit label: animatör temsilcisi @tr
toolkit definition: Cansız nesnelere veya çizimlere görünür hareket veren bir temsilcinin katkısını içeren bir anlatım. @tr

animaattori (yhteistoimija) ekspressiossa
status: Published
label: is animator collective agent of @en
lexical alias: animatorCollectiveAgentOf.en
definition: Relates a collective agent to an expression that includes a contribution by a collective agent of giving apparent movement to inanimate objects or drawings. @en
toolkit label: animator collective agent of @en
toolkit definition: An expression that includes a contribution by a collective agent of giving apparent movement to inanimate objects or drawings. @en
type: Property
domain: C10011
has element type: 2
sub property of: esitykseen osallinen yhteistoimija ekspressiossa
sub property of: animaattori (toimija) ekspressiossa
definition: Liittää yhteistoimijan ekspressioon, jonka tekemisessä yhteistoimija on osallisena tuottamalla näennäistä liikettä elottomiin esineisiin tai piirroksiin.
toolkit label: animaattori (yhteistoimija) ekspressiossa
toolkit definition: Ekspressio, jonka tekemisessä yhteistoimija on osallisena tuottamalla näennäistä liikettä elottomiin esineisiin tai piirroksiin.
label: er animatør for (kollektiv agent) @no
definition: Relaterer en kollektiv agent til et uttrykk som inkluderer et bidrag fra en kollektiv agent i form av å gi tilsynelatende bevegelse til tegninger eller figurer. @no
toolkit label: animatør for (kollektiv agent) @no
toolkit definition: Et uttrykk som inkluderer et bidrag fra en kollektiv agent i form av å gi tilsynelatende bevegelse til tegninger eller figurer. @no
label: is animator-collectieve actor van @nl
definition: Relateert een collectieve actor aan een expressie die omvat een bijdrage door een collectieve actor door het geven van schijnbare beweging aan levenloze objecten of tekeningen. @nl
toolkit label: animator-collectieve actor van @nl
toolkit definition: Een expressie die omvat een bijdrage door een collectieve actor door het geven van schijnbare beweging aan levenloze objecten of tekeningen. @nl
label: هو وكيل جماعي فنان رسوم متحركة لـ @ar
definition: يربط وكيلا جماعيا بتعبيرة تتضمن إسهام وكيل جماعي في جعل كائنات أو رسومات جامدة تتحرك حركة واضحة. @ar
toolkit label: وكيل جماعي فنان رسوم متحركة @ar
toolkit definition: تعبيرة تتضمن إسهام وكيل جماعي في جعل كائنات أو رسومات جامدة تتحرك حركة واضحة. @ar
label: és agent col·lectiu animador de @ca
definition: Relaciona un agent col·lectiu amb una expressió que inclou una contribució d’un agent col·lectiu donant l’aparença de moviment a objectes o dibuixos inanimats. @ca
toolkit label: agent col·lectiu animador de @ca
toolkit definition: Expressió que inclou una contribució d’un agent col·lectiu donant l’aparença de moviment a objectes o dibuixos inanimats. @ca
label: er kollektiv agent, som er animator af @da
definition: Relaterer en kollektiv agent til et udtryk, som omfatter en kollektiv agents bidrag ved at give en illusion af bevægelse til livløse objekter eller tegninger. @da
toolkit label: kollektiv agent, som er animator af @da
toolkit definition: Udtryk, som omfatter en kollektiv agents bidrag ved at give en illusion af bevægelse til livløse objekter eller tegninger. @da
label: animaator (kollektiiv) väljenduses @et
definition: Seostab kollektiivi väljendusega, millesse kollektiiv on andnud panuse, pannes näiliselt liikuma elutud esemed või joonistused. @et
toolkit label: animaator (kollektiiv) väljenduses @et
toolkit definition: Väljendus, millesse kollektiiv on andnud panuse, pannes näiliselt liikuma elutud esemed või joonistused. @et
label: ist gemeinschaftlicher Akteur als Trickfilmzeichnerin/Trickfilmzeichner von @de
definition: Setzt einen gemeinschaftlichen Akteur in Beziehung zu einer Expression, zu der ein gemeinschaftlicher Akteur beiträgt, indem er unbelebte Objekte oder Zeichnungen in scheinbare Bewegung versetzt. @de
toolkit label: Gemeinschaftlicher Akteur als Trickfilmzeichnerin/Trickfilmzeichner von @de
toolkit definition: Eine Expression, zu der ein gemeinschaftlicher Akteur beiträgt, indem er unbelebte Objekte oder Zeichnungen in scheinbare Bewegung versetzt. @de
label: animátor kollektív ágense a következőnek: @hu
definition: Hozzákapcsol egy kollektív ágenst egy kifejezési formához, amely magában foglalja egy kollektív ágens közreműködését élettelen tárgyak vagy rajzok látszólagos mozgatásában. @hu
toolkit label: animátor kollektív ágense: @hu
toolkit definition: Egy kifejezési forma, amely magában foglalja egy kollektív ágens közreműködését élettelen tárgyak vagy rajzok látszólagos mozgatásában. @hu
label: è animatore agente collettivo di @it
definition: Correla un agente collettivo a un'espressione che comprende un contributo di un agente collettivo nel dare movimento apparente a oggetti inanimati o disegni. @it
toolkit label: animatore agente collettivo di @it
toolkit definition: Espressione che comprende un contributo di un agente collettivo nel dare movimento apparente a oggetti inanimati o disegni. @it
label: είναι [σχεδιαστής] κινουμένων σχεδίων συλλογικός φορέας του @el
toolkit label: [σχεδιαστής] κινουμένων σχεδίων συλλογικός φορέας του @el
label: est un agent collectif animateur de @fr
definition: Met un agent collectif en relation avec une expression qui intègre une contribution de la part d’un agent collectif consistant à donner l’illusion du mouvement à des objets inanimés ou à des dessins. @fr
toolkit label: agent collectif animateur de @fr
toolkit definition: Expression qui intègre une contribution de la part d’un agent collectif consistant à donner l’illusion du mouvement à des objets inanimés ou à des dessins. @fr
label: ir animators (grupa) @lv
definition: Sasaista grupu ar izteiksmi, kas ietver grupas ieguldījumu, pieškirot šķietamu kustību nekustīgiem objektiem vai zīmējumiem. @lv
toolkit label: ir animators (grupa) @lv
toolkit definition: Izteiksme, kas ietver grupas ieguldījumu, pieškirot šķietamu kustību nekustīgiem objektiem vai zīmējumiem. @lv
label: 是……的动画师集体行为者 @zh-hans
definition: 将一个集体行为者与包括一个集体行为者对给予无生命对象或绘画以貌似运动之贡献的一种内容表达关联起来。 @zh-hans
toolkit label: ……的动画师集体行为者 @zh-hans
toolkit definition: 包括一个集体行为者对给予无生命对象或绘画以貌似运动之贡献的一种内容表达 @zh-hans
label: animatör kolektif temsilcisidir @tr
definition: Kolektif bir temsilciyi, bir kolektif temsilcinin cansız nesnelere veya çizimlere görsel hareket sağlama katkısını içeren anlatımla ilişkilendirir. @tr
toolkit label: animatör kolektif temsilcisi @tr
toolkit definition: Cansız nesnelere veya çizimlere görünür hareket sağlanmasında kolektif bir temsilcinin katkısını içeren bir anlatım. @tr
has subproperty: animaattori (yhteisö) ekspressiossa
has subproperty: animaattori (suku) ekspressiossa
has subproperty: P50738

animaattori (yhteisö) ekspressiossa
status: Published
label: is animator corporate body of @en
lexical alias: animatorCorporateBodyOf.en
definition: Relates a corporate body to an expression that includes a contribution by a corporate body of giving apparent movement to inanimate objects or drawings. @en
toolkit label: animator corporate body of @en
toolkit definition: An expression that includes a contribution by a corporate body of giving apparent movement to inanimate objects or drawings. @en
type: Property
domain: C10005
has element type: 2
sub property of: esitykseen osallinen yhteisö ekspressiossa
sub property of: animaattori (yhteistoimija) ekspressiossa
definition: Liittää yhteisön ekspressioon, jonka tekemisessä yhteisö on osallisena tuottamalla näennäistä liikettä elottomiin esineisiin tai piirroksiin.
toolkit label: animaattori (yhteisö) ekspressiossa
toolkit definition: Ekspressio, jonka tekemisessä yhteisö on osallisena tuottamalla näennäistä liikettä elottomiin esineisiin tai piirroksiin.
label: er animatør for (korporasjon) @no
definition: Relaterer en korporasjon til et uttrykk som inkluderer et bidrag fra en korporasjon i form av å gi tilsynelatende bevegelse til tegninger eller figurer. @no
toolkit label: animatør for (korporasjon) @no
toolkit definition: Et uttrykk som inkluderer et bidrag fra en korporasjon i form av å gi tilsynelatende bevegelse til tegninger eller figurer. @no
label: is animator-corporatie van @nl
definition: Relateert een corporatie aan een expressie die omvat een bijdrage door een corporatie door het geven van schijnbare beweging aan levenloze objecten of tekeningen. @nl
toolkit label: animator-corporatie van @nl
toolkit definition: Een expressie die omvat een bijdrage door een corporatie door het geven van schijnbare beweging aan levenloze objecten of tekeningen. @nl
label: هي هيئة فنانة رسوم متحركة لـ @ar
definition: يربط هيئة بتعبيرة تتضمن إسهام هيئة في جعل كائنات أو رسومات جامدة تتحرك حركة واضحة. @ar
toolkit label: هيئة فنانة رسوم متحركة @ar
toolkit definition: تعبيرة تتضمن إسهام هيئة في جعل كائنات أو رسومات جامدة تتحرك حركة واضحة. @ar
label: és entitat corporativa animadora de @ca
definition: Relaciona una entitat corporativa amb una expressió que inclou una contribució d’una entitat corporativa donant l’aparença de moviment a objectes o dibuixos inanimats. @ca
toolkit label: entitat corporativa animadora de @ca
toolkit definition: Expressió que inclou una contribució d’una entitat corporativa donant l’aparença de moviment a objectes o dibuixos inanimats. @ca
label: er korporation, som er animator af @da
definition: Relaterer en korporation til et udtryk, som omfatter en korporations bidrag ved at give en illusion af bevægelse til livløse objekter eller tegninger. @da
toolkit label: korporation, som er animator af @da
toolkit definition: Udtryk, som omfatter en korporations bidrag ved at give en illusion af bevægelse til livløse objekter eller tegninger. @da
label: animaator (asutus) väljenduses @et
definition: Seostab asutuse väljendusega, millesse asutus on andnud panuse, pannes näiliselt liikuma elutud esemed või joonistused. @et
toolkit label: animaator (asutus) väljenduses @et
toolkit definition: Väljendus, millesse asutus on andnud panuse, pannes näiliselt liikuma elutud esemed või joonistused. @et
label: ist Körperschaft als Trickfilmzeichnerin/Trickfilmzeichner von @de
definition: Setzt eine Körperschaft in Beziehung zu einer Expression, zu der eine Körperschaft beiträgt, indem sie unbelebte Objekte oder Zeichnungen in scheinbare Bewegung versetzt. @de
toolkit label: Körperschaft als Trickfilmzeichnerin/Trickfilmzeichner von @de
toolkit definition: Eine Expression, zu der eine Körperschaft beiträgt, indem sie unbelebte Objekte oder Zeichnungen in scheinbare Bewegung versetzt. @de
label: animátor testülete a következőnek: @hu
definition: Hozzákapcsol egy testületet egy kifejezési formához, amely magában foglalja egy testület közreműködését élettelen tárgyak vagy rajzok látszólagos mozgatásában. @hu
toolkit label: animátor testülete: @hu
toolkit definition: Egy kifejezési forma, amely magában foglalja egy testület közreműködését élettelen tárgyak vagy rajzok látszólagos mozgatásában. @hu
label: è animatore ente di @it
definition: Correla un ente a un'espressione che comprende un contributo di un ente nel dare movimento apparente a oggetti inanimati o disegni. @it
toolkit label: animatore ente di @it
toolkit definition: Espressione che comprende un contributo di un ente nel dare movimento apparente a oggetti inanimati o disegni. @it
label: είναι [σχεδιαστής] κινουμένων σχεδίων συλλογικό όργανο του @el
toolkit label: [σχεδιαστής] κινουμένων σχεδίων συλλογικό όργανο του @el
label: est une collectivité animatrice de @fr
definition: Met une collectivité en relation avec une expression qui intègre une contribution de la part d’une collectivité consistant à donner l’illusion du mouvement à des objets inanimés ou à des dessins. @fr
toolkit label: collectivité animatrice de @fr
toolkit definition: Expression qui intègre une contribution de la part d’une collectivité consistant à donner l’illusion du mouvement à des objets inanimés ou à des dessins. @fr
label: ir animators (institūcija) @lv
definition: Sasaista institūciju ar izteiksmi, kas ietver institūcijas ieguldījumu, pieškirot šķietamu kustību nekustīgiem objektiem vai zīmējumiem. @lv
toolkit label: ir animators (institūcija) @lv
toolkit definition: Izteiksme, kas ietver institūcijas ieguldījumu, pieškirot šķietamu kustību nekustīgiem objektiem vai zīmējumiem. @lv
label: 是……的动画师团体 @zh-hans
definition: 将一个团体与包括一个团体对给予无生命对象或绘画以貌似运动之贡献的一种内容表达关联起来。 @zh-hans
toolkit label: ……的动画师团体 @zh-hans
toolkit definition: 包括一个团体对给予无生命对象或绘画以貌似运动之贡献的一种内容表达 @zh-hans
label: animatör tüzel kişisidir @tr
definition: Bir tüzel kişiyi, cansız nesnelere veya çizimlere görünür hareket veren bir tüzel kişiliğin katkısını içeren bir anlatımla ilişkilendirir. @tr
toolkit label: animatör tüzel kişisi @tr
toolkit definition: Cansız nesnelere veya çizimlere görünür hareket veren tüzel bir kişinin katkısını içeren bir anlatım. @tr
has subproperty: P50889

animaattori (suku) ekspressiossa
status: Published
label: is animator family of @en
lexical alias: animatorFamilyOf.en
definition: Relates a family to an expression that includes a contribution by a family of giving apparent movement to inanimate objects or drawings. @en
toolkit label: animator family of @en
toolkit definition: An expression that includes a contribution by a family of giving apparent movement to inanimate objects or drawings. @en
type: Property
domain: C10008
has element type: 2
sub property of: esitykseen osallinen suku ekspressiossa
sub property of: animaattori (yhteistoimija) ekspressiossa
definition: Liittää suvun ekspressioon, jonka tekemisessä suku on osallisena tuottamalla näennäistä liikettä elottomiin esineisiin tai piirroksiin.
toolkit label: animaattori (suku) ekspressiossa
toolkit definition: Ekspressio, jonka tekemisessä suku on osallisena tuottamalla näennäistä liikettä elottomiin esineisiin tai piirroksiin.
label: er animatør for (familie) @no
definition: Relaterer en familie til et uttrykk som inkluderer et bidrag fra en familie i form av å gi tilsynelatende bevegelse til tegninger eller figurer. @no
toolkit label: animatør for (familie) @no
toolkit definition: Et uttrykk som inkluderer et bidrag fra en familie i form av å gi tilsynelatende bevegelse til tegninger eller figurer. @no
label: is animator-familie van @nl
definition: Relateert een familie aan een expressie die omvat een bijdrage door een familie door het geven van schijnbare beweging aan levenloze objecten of tekeningen. @nl
toolkit label: animator-familie van @nl
toolkit definition: Een expressie die omvat een bijdrage door een familie door het geven van schijnbare beweging aan levenloze objecten of tekeningen. @nl
label: هي عائلة فنانة رسوم متحركة لـ @ar
definition: يربط عائلة بتعبيرة تتضمن إسهام عائلة لجعل كائنات أو رسومات جامدة تتحرك حركة واضحة. @ar
toolkit label: عائلة فنانة رسوم متحركة @ar
toolkit definition: تعبيرة تتضمن إسهام عائلة في جعل كائنات أو رسومات جامدة تتحرك حركة واضحة. @ar
label: és família animadora de @ca
definition: Relaciona una família amb una expressió que inclou una contribució d’una família donant l’aparença de moviment a objectes o dibuixos inanimats. @ca
toolkit label: família animadora de @ca
toolkit definition: Expressió que inclou una contribució d’una família donant l’aparença de moviment a objectes o dibuixos inanimats. @ca
label: er familie, som er animator af @da
definition: Relaterer en familie til et udtryk, som omfatter en families bidrag ved at give en illusion af bevægelse til livløse objekter eller tegninger. @da
toolkit label: familie, som er animator af @da
toolkit definition: Udtryk, som omfatter en families bidrag ved at give en illusion af bevægelse til livløse objekter eller tegninger. @da
label: animaator (perekond) väljenduses @et
definition: Seostab perekonna väljendusega, millesse perekond on andnud panuse, pannes näiliselt liikuma elutud esemed või joonistused. @et
toolkit label: animaator (perekond) väljenduses @et
toolkit definition: Väljendus, millesse perekond on andnud panuse, pannes näiliselt liikuma elutud esemed või joonistused. @et
label: ist Familie als Trickfilmzeichnerin/Trickfilmzeichner von @de
definition: Setzt eine Familie in Beziehung zu einer Expression, zu der eine Familie beiträgt, indem sie unbelebte Objekte oder Zeichnungen in scheinbare Bewegung versetzt. @de
toolkit label: Familie als Trickfilmzeichnerin/Trickfilmzeichner von @de
toolkit definition: Eine Expression, zu der eine Familie beiträgt, indem sie unbelebte Objekte oder Zeichnungen in scheinbare Bewegung versetzt. @de
label: animátor családja a következőnek: @hu
definition: Hozzákapcsol egy családot egy kifejezési formához, amely magában foglalja egy család közreműködését élettelen tárgyak vagy rajzok látszólagos mozgatásában. @hu
toolkit label: animátor családja: @hu
toolkit definition: Egy kifejezési forma, amely magában foglalja egy család közreműködését élettelen tárgyak vagy rajzok látszólagos mozgatásában. @hu
label: è animatore famiglia di @it
definition: Correla una famiglia a un'espressione che comprende un contributo di una famiglia nel dare movimento apparente a oggetti inanimati o disegni. @it
toolkit label: animatore famiglia di @it
toolkit definition: Espressione che comprende un contributo di una famiglia nel dare movimento apparente a oggetti inanimati o disegni. @it
label: είναι [σχεδιαστής] κινουμένων σχεδίων οικογένεια του @el
toolkit label: [σχεδιαστής] κινουμένων σχεδίων οικογένεια του @el
label: est une famille animatrice de @fr
definition: Met une famille en relation avec une expression qui intègre une contribution de la part d’une famille consistant à donner l’illusion du mouvement à des objets inanimés ou à des dessins. @fr
toolkit label: famille animatrice de @fr
toolkit definition: Expression qui intègre une contribution de la part d’une famille consistant à donner l’illusion du mouvement à des objets inanimés ou à des dessins. @fr
label: ir animators (dzimta/ģimene) @lv
definition: Sasaista dzimtu/ģimeni ar izteiksmi, kas ietver dzimtas/ģimenes ieguldījumu, pieškirot šķietamu kustību nekustīgiem objektiem vai zīmējumiem. @lv
toolkit label: ir animators (dzimta/ģimene) @lv
toolkit definition: Izteiksme, kas ietver dzimtas/ģimenes ieguldījumu, pieškirot šķietamu kustību nekustīgiem objektiem vai zīmējumiem. @lv
label: 是……的动画师家族 @zh-hans
definition: 将一个家族与包括一个家族对给予无生命对象或绘画以貌似运动之贡献的一种内容表达关联起来。 @zh-hans
toolkit label: ……的动画师家族 @zh-hans
toolkit definition: 包括一个家族对给予无生命对象或绘画以貌似运动之贡献的一种内容表达 @zh-hans
label: animatör ailesidir @tr
definition: Bir ailenin cansız nesnelere veya çizimlere görünür hareket kazandırma katkısını içeren bir anlatımla ilişkilendirir. @tr
toolkit label: animatör aile @tr
toolkit definition: Cansız nesnelere veya çizimlere görünür hareket veren bir ailenin katkısını içeren bir anlatım. @tr
has subproperty: P51040

animaattori (henkilö) ekspressiossa
status: Published
label: is animator person of @en
lexical alias: animatorPersonOf.en
definition: Relates a person to an expression that includes a contribution by a person of giving apparent movement to inanimate objects or drawings. @en
toolkit label: animator person of @en
toolkit definition: An expression that includes a contribution by a person of giving apparent movement to inanimate objects or drawings. @en
type: Property
domain: C10004
has element type: 2
sub property of: esitykseen osallinen henkilö ekspressiossa
sub property of: animaattori (toimija) ekspressiossa
definition: Liittää henkilön ekspressioon, jonka tekemisessä henkilö on osallisena tuottamalla näennäistä liikettä elottomiin esineisiin tai piirroksiin.
toolkit label: animaattori (henkilö) ekspressiossa
toolkit definition: Ekspressio, jonka tekemisessä henkilö on osallisena tuottamalla näennäistä liikettä elottomiin esineisiin tai piirroksiin.
label: er animatør for (person) @no
definition: Relaterer en person til et uttrykk som inkluderer et bidrag fra en person i form av å gi tilsynelatende bevegelse til tegninger eller figurer. @no
toolkit label: animatør for (person) @no
toolkit definition: Et uttrykk som inkluderer et bidrag fra en person i form av å gi tilsynelatende bevegelse til tegninger eller figurer. @no
label: is animator-persoon van @nl
definition: Relateert een persoon aan een expressie die omvat een bijdrage door een persoon door het geven van schijnbare beweging aan levenloze objecten of tekeningen. @nl
toolkit label: animator-persoon van @nl
toolkit definition: Een expressie die omvat een bijdrage door een persoon door het geven van schijnbare beweging aan levenloze objecten of tekeningen. @nl
label: هو شخص فنان رسوم متحركة لـ @ar
definition: يربط شخصا بتعبيرة تتضمن إسهام شخص لجعل كائنات أو رسومات جامدة تتحرك حركة واضحة. @ar
toolkit label: شخص فنان رسوم متحركة @ar
toolkit definition: تعبيرة تتضمن إسهام شخص لجعل كائنات أو رسومات جامدة تتحرك حركة واضحة. @ar
label: és persona animadora de @ca
definition: Relaciona una persona amb una expressió que inclou una contribució d’una persona donant l’aparença de moviment a objectes o dibuixos inanimats. @ca
toolkit label: persona animadora de @ca
toolkit definition: Expressió que inclou una contribució d’una persona donant l’aparença de moviment a objectes o dibuixos inanimats. @ca
label: er person, som er animator af @da
definition: Relaterer en person til et udtryk, som omfatter en persons bidrag ved at give en illusion af bevægelse til livløse objekter eller tegninger. @da
toolkit label: person, som er animator af @da
toolkit definition: Udtryk, som omfatter en persons bidrag ved at give en illusion af bevægelse til livløse objekter eller tegninger. @da
label: animaator (isik) väljenduses @et
definition: Seostab isiku väljendusega, millesse isik on andnud panuse, pannes näiliselt liikuma elutud esemed või joonistused. @et
toolkit label: animaator (isik) väljenduses @et
toolkit definition: Väljendus, millesse isik on andnud panuse, pannes näiliselt liikuma elutud esemed või joonistused. @et
label: ist Person als Trickfilmzeichnerin/Trickfilmzeichner von @de
definition: Setzt eine Person in Beziehung zu einer Expression, zu der eine Person beiträgt, indem sie unbelebte Objekte oder Zeichnungen in scheinbare Bewegung versetzt. @de
toolkit label: Person als Trickfilmzeichnerin/Trickfilmzeichner von @de
toolkit definition: Eine Expression, zu der eine Person beiträgt, indem sie unbelebte Objekte oder Zeichnungen in scheinbare Bewegung versetzt. @de
label: animátor személye a következőnek: @hu
definition: Hozzákapcsol egy személyt egy kifejezési formához, amely magában foglalja egy személy közreműködését élettelen tárgyak vagy rajzok látszólagos mozgatásában. @hu
toolkit label: animátor személye: @hu
toolkit definition: Egy kifejezési forma, amely magában foglalja egy személy közreműködését élettelen tárgyak vagy rajzok látszólagos mozgatásában. @hu
label: è animatore persona di @it
definition: Correla una persona a un'espressione che comprende un contributo di una persona nel dare movimento apparente a oggetti inanimati o disegni. @it
toolkit label: animatore persona di @it
toolkit definition: Espressione che comprende un contributo di una persona nel dare movimento apparente a oggetti inanimati o disegni. @it
label: είναι [σχεδιαστής] κινουμένων σχεδίων φυσικό πρόσωπο του @el
toolkit label: [σχεδιαστής] κινουμένων σχεδίων φυσικό πρόσωπο του @el
label: est une personne animatrice de @fr
definition: Met une personne en relation avec une expression qui intègre une contribution de la part d’une personne consistant à donner l’illusion du mouvement à des objets inanimés ou à des dessins. @fr
toolkit label: personne animatrice de @fr
toolkit definition: Expression qui intègre une contribution de la part d’une personne consistant à donner l’illusion du mouvement à des objets inanimés ou à des dessins. @fr
label: ir animators (persona) @lv
definition: Sasaista personu ar izteiksmi, kas ietver personas ieguldījumu, pieškirot šķietamu kustību nekustīgiem objektiem vai zīmējumiem. @lv
toolkit label: ir animators (persona) @lv
toolkit definition: Izteiksme, kas ietver personas ieguldījumu, pieškirot šķietamu kustību nekustīgiem objektiem vai zīmējumiem. @lv
label: 是……的动画师个人 @zh-hans
definition: 将一个个人与包括一个个人对给予无生命对象或绘画以貌似运动之贡献的一种内容表达关联起来。 @zh-hans
toolkit label: ……的动画师个人 @zh-hans
toolkit definition: 包括一个个人对给予无生命对象或绘画以貌似运动之贡献的一种内容表达 @zh-hans
label: animatör kişisidir @tr
definition: Bir kişiyi, bir kişinin cansız nesnelere veya çizimlere görünür hareket verme katkısını içeren bir anlatımla ilişkilendirir. @tr
toolkit label: animatör kişi @tr
toolkit definition: Cansız nesnelere veya çizimlere görünür hareket veren bir kişinin katkısını içeren bir anlatım. @tr
has subproperty: P50587

muutoshakemus
status: Deprecated
type: Property
sub property of: muuna toimijana teoksessa
lexical alias: appellantOf.en
label: est un appelant de @fr
definition: Met une personne ou collectivité qui en appelle d’une décision d’un tribunal inférieur enregistrée dans une œuvre juridique d’un tribunal supérieur en relation avec une œuvre. @fr
toolkit label: appelant de @fr
toolkit definition: Œuvre juridique d’un tribunal supérieur qui enregistre une décision d’un tribunal inférieur portée en appel par une personne ou une collectivité. @fr
instruction number: 18.5
label: είναι εκκαλών/αναιρεσείων του @el
definition: Συνδέει ένα φυσικό πρόσωπο ή συλλογικό όργανο, που ασκεί έφεση εναντίον απόφασης κατώτερου δικαστηρίου, που καταχωρίστηκε στα πρακτικά ενός ανωτέρου δικαστηρίου, με ένα έργο. @el
toolkit label: εκκαλών/αναιρεσείων του @el
toolkit definition: Ένα έργο που καταχωρίστηκε στα πρακτικά ενός ανωτέρου δικαστηρίου,για το οποίο ασκείται έφεση εναντίον απόφασης κατώτερου δικαστηρίου από φυσικό πρόσωπο ή συλλογικό όργανο. @el
definition: Setzt eine Person oder eine Körperschaft, die gegen ein Gerichtsurteil einer unteren Instanz, das in einem juristischen Werk einer höheren Instanz erfasst ist, Rechtsmittel (Berufung/Revision) einlegt, mit einem Werk in Beziehung. @de
toolkit label: Berufungskläger/Revisionskläger von @de
toolkit definition: Ein juristisches Werk einer höheren Instanz, bei der eine Person oder eine Körperschaft gegen ein Gerichtsurteil einer unteren Instanz, das in einem juristischen Werk einer höheren Instanz erfasst ist, Rechtsmittel (Berufung/Revision) einlegt. @de
label: er appellant af @da
definition: Relaterer en person eller korporation, der appelerer en underrets beslutning, der er registrereret i et juridisk værk fra en højerere retsinstans til et værk. @da
toolkit label: appellant af @da
toolkit definition: Juridisk værk fra en højere retsinstans, der har registreret en beslutning fra en underret, der bliver appelleret af en person eller korporation. @da
label: és apel·lant de @ca
definition: Relaciona una persona o entitat corporativa, que recorre a un tribunal superior perquè esmeni la sentència d’un tribunal inferior, amb una obra. @ca
toolkit label: apel·lant de @ca
toolkit definition: Obra jurídica d’un tribunal superior perquè esmeni una sentència d’un tribunal inferior apel·lada per una persona o entitat corporativa. @ca
definition: Liittää henkilön tai yhteisön hakemukseen, jolla henkilö tai yhteisö hakee muutosta alemman oikeusasteen päätökseen.
toolkit label: muutoshakemus
toolkit definition: Hakemus, jolla henkilö tai yhteisö hakee muutosta alemman oikeusasteen päätökseen.
toolkit label: appellant for @no
toolkit definition: Et juridisk verk fra en høyere rettsinstans som registrerer en avgjørelse fra en lavere rettsinstans som ankes av en person eller korporasjon. @no
label: ist Berufungskläger/Revisionskläger von @de

toimijan nimitys
status: Published
type: Property
label: has appellation of agent @en
lexical alias: appellationOfAgent.en
definition: Relates an agent to a nomen that is used within a given scheme or context to refer to an agent. @en
domain: C10002
toolkit label: appellation of agent @en
toolkit definition: A nomen that is used within a given scheme or context to refer to an agent. @en
sub property of: toimijaan liittyvä nomen
has element type: 2
sub property of: P00017
definition: Liittää toimijan nomeniin, jota on käytetty tietyssä järjestelmässä tai kontekstissa viittaamaan toimijaan.
toolkit label: toimijan nimitys
toolkit definition: Nomen, jota on käytetty tietyssä järjestelmässä tai kontekstissa viittaamaan toimijaan.
label: har betegnelse for agent @no
definition: Relaterer en agent til et nomen som er brukt i et bestemt skjema eller kontekst for å referere til en agent. @no
toolkit label: betegnelse for agent @no
toolkit definition: Et nomen som er brukt i et bestemt skjema eller kontekst for å referere til en agent. @no
label: heeft benaming van actor @nl
definition: Relateert een actor aan een nomen dat wordt gebruikt binnen een bepaald schema of context om een actor aan te duiden. @nl
toolkit label: benaming van actor @nl
toolkit definition: Een nomen dat wordt gebruikt binnen een bepaald schema of context om een actor aan te duiden. @nl
label: له اسم تعريفي لوكيل @ar
definition: يربط وكيلا بتسمية مستخدمة في خطة أو في سياق محدد للإشارة إلى وكيل. @ar
toolkit label: اسم تعريفي لوكيل @ar
toolkit definition: تسمية مستخدمة في خطة أو في سياق محدد للإشارة إلى وكيل. @ar
label: té com a apel·lació d’agent @ca
definition: Relaciona un agent amb un nomen que s’usa en un esquema o un context determinat per referir-se a un agent. @ca
toolkit label: apel·lació d’agent @ca
toolkit definition: Nomen que s’usa en un esquema o un context determinat per referir-se a un agent. @ca
label: har benævnelse på agent @da
definition: Relaterer en agent til et nomen, som anvendes inden for et givet skema eller kontekst for at henvise til en agent. @da
toolkit label: benævnelse på agent @da
toolkit definition: Nomen, som anvendes inden for et givet skema eller kontekst for at henvise til en agent. @da
label: tegija nimetus @et
definition: Seostab tegija nomen'iga, mida antud süsteemis või kontekstis kasutatakse tegijale viitamiseks. @et
toolkit label: tegija nimetus @et
toolkit definition: Nomen, mida antud süsteemis või kontekstis kasutatakse tegijale viitamiseks. @et
label: hat Bezeichnung für einen Akteur @de
definition: Setzt einen Akteur in Beziehung zu einem Nomen, das in einem bestimmten Schema oder Kontext verwendet wird, um einen Akteur zu referenzieren. @de
toolkit label: Bezeichnung für einen Akteur @de
toolkit definition: Ein Nomen, das in einem bestimmten Schema oder Kontext verwendet wird, um einen Akteur zu referenzieren. @de
label: ágens megnevezése a következő: @hu
definition: Hozzákapcsol egy ágenst egy nomenhez, amelyet egy adott sémán vagy kontextuson belül használnak egy ágensre való hivatkozásra. @hu
toolkit label: ágens megnevezése: @hu
toolkit definition: Egy nomen, amelyet egy adott sémán vagy kontextuson belül használnak egy ágensre való hivatkozásra. @hu
label: ha come denominazione di agente @it
definition: Correla un agente a un nomen che è usato all'interno di un dato schema o contesto per far riferimento a un agente. @it
toolkit label: denominazione di agente collettivo @it
toolkit definition: Nomen che è usato all'interno di un dato schema o contesto per far riferimento a un agente. @it
label: έχει ονομασία του φορέα @el
toolkit label: ονομασία του φορέα @el
label: a pour appellation d’agent @fr
definition: Met un agent en relation avec un nomen qui est utilisé à l’intérieur d’un schéma ou d’un contexte donnés pour désigner un agent. @fr
toolkit label: appellation d’agent @fr
toolkit definition: Nomen qui est utilisé à l’intérieur d’un schéma ou d’un contexte donnés pour désigner un agent. @fr
label: aģenta apzīmējums @lv
definition: Sasaista aģentu ar nomenu, ko lieto konkrētajā sistēmā vai kontekstā, lai norādītu uz aģentu. @lv
toolkit label: aģenta apzīmējums @lv
toolkit definition: Nomens, ko lieto konkrētajā sistēmā vai kontekstā, lai norādītu uz aģentu. @lv
label: 有行为者的称谓 @zh-hans
definition: 将一个行为者与在一个给定的体系或语境中指称一个行为者所用的一个命名关联起来。 @zh-hans
toolkit label: 行为者的称谓 @zh-hans
toolkit definition: 在一个给定的体系或语境中指称一个行为者所用的一个命名 @zh-hans
label: temsilcinin unvanı ile ilişkilidir @tr
definition: Bir temsilciyi, bir şema veya bağlam içinde bir temsilciye atıfta bulunmak için kullanılan bir isimle ilişkilendirir. @tr
toolkit label: temsilcinin unvanı @tr
toolkit definition: Bir şema veya bağlam içinde bir temsilciye atıfta bulunmak için kullanılan bir nomen @tr
has subproperty: toimijan hakutieto
has subproperty: yhteistoimijan nimitys
has subproperty: henkilön nimitys
has subproperty: toimijan tunniste
has subproperty: toimijan nimi
has subproperty: P50378

yhteistoimijan nimitys
status: Published
type: Property
label: has appellation of collective agent @en
lexical alias: appellationOfCollectiveAgent.en
definition: Relates a collective agent to a nomen that is used within a given scheme or context to refer to a collective agent. @en
domain: C10011
toolkit label: appellation of collective agent @en
toolkit definition: A nomen that is used within a given scheme or context to refer to a collective agent. @en
sub property of: yhteistoimijaan liittyvä nomen
sub property of: toimijan nimitys
has element type: 2
definition: Liittää yhteistoimijan nomeniin, jota on käytetty tietyssä järjestelmässä tai kontekstissa viittaamaan yhteistoimijaan.
toolkit label: yhteistoimijan nimitys
toolkit definition: Nomen, jota on käytetty tietyssä järjestelmässä tai kontekstissa viittaamaan yhteistoimijaan.
label: har betegnelse for kollektiv agent @no
definition: Relaterer en kollektiv agent til et nomen som er brukt i et bestemt skjema eller kontekst for å referere til en kollektiv agent. @no
toolkit label: betegnelse for kollektiv agent @no
toolkit definition: Et nomen som er brukt i et bestemt skjema eller kontekst for å referere til en kollektiv agent. @no
label: heeft benaming van collectieve actor @nl
definition: Relateert een collectieve actor aan een nomen dat wordt gebruikt binnen een bepaald schema of context om een collectieve actor aan te duiden. @nl
toolkit label: benaming van collectieve actor @nl
toolkit definition: Een nomen dat wordt gebruikt binnen een bepaald schema of context om een collectieve actor aan te duiden. @nl
label: له اسم تعريفي لوكيل جماعي @ar
definition: يربط وكيلا جماعيا بتسمية مستخدمة في خطة أو في سياق محدد للإشارة إلى وكيل جماعي . @ar
toolkit label: اسم تعريفي لوكيل جماعي @ar
toolkit definition: تسمية مستخدمة في خطة أو في سياق محدد للإشارة إلى وكيل جماعي. @ar
label: té com a apel·lació d’agent col·lectiu @ca
definition: Relaciona un agent col·lectiu amb un nomen que s’usa en un esquema o un context determinat per referir-se a un agent col·lectiu. @ca
toolkit label: apel·lació d’agent col·lectiu @ca
toolkit definition: Nomen que s’usa en un esquema o un context determinat per referir-se a un agent col·lectiu. @ca
label: har benævnelse på kollektiv agent @da
definition: Relaterer en kollektiv agent til et nomen, som anvendes inden for et givet skema eller kontekst for at henvise til en kollektiv agent. @da
toolkit label: benævnelse på kollektiv agent @da
toolkit definition: Nomen, som anvendes inden for et givet skema eller kontekst for at henvise til en kollektiv agent. @da
label: kollektiivi nimetus @et
definition: Seostab kollektiivi nomen'iga, mida antud süsteemis või kontekstis kasutatakse kollektiivile viitamiseks. @et
toolkit label: kollektiivi nimetus @et
toolkit definition: Nomen, mida antud süsteemis või kontekstis kasutatakse kollektiivile viitamiseks. @et
label: hat Bezeichnung für einen gemeinschaftlichen Akteur @de
definition: Setzt einen gemeinschaftlichen Akteur in Beziehung zu einem Nomen, das in einem bestimmten Schema oder Kontext verwendet wird, um einen gemeinschaftlichen Akteur zu referenzieren. @de
toolkit label: Bezeichnung für einen gemeinschaftlichen Akteur @de
toolkit definition: Ein Nomen, das in einem bestimmten Schema oder Kontext verwendet wird, um einen gemeinschaftlichen Akteur zu referenzieren. @de
label: kollektív ágens megnevezése a következő: @hu
definition: Hozzákapcsol egy kollektív ágenst egy nomenhez, amelyet egy adott sémán vagy kontextuson belül használnak egy kollektív ágensre való hivatkozásra. @hu
toolkit label: kollektív ágens megnevezése: @hu
toolkit definition: Egy nomen, amelyet egy adott sémán vagy kontextuson belül használnak egy kollektív ágensre való hivatkozásra. @hu
label: ha come denominazione di agente collettivo @it
definition: Correla un agente collettivo a un nomen che è usato all'interno di un dato schema o contesto per far riferimento a un agente collettivo. @it
toolkit label: denominazione di agente @it
toolkit definition: Nomen che è usato all'interno di un dato schema o contesto per far riferimento a un agente collettivo. @it
label: έχει ονομασία του συλλογικού φορέα @el
toolkit label: ονομασία του συλλογικού φορέα @el
label: a pour appellation d’agent collectif @fr
definition: Met un agent collectif en relation avec un nomen qui est utilisé à l’intérieur d’un schéma ou d’un contexte donnés pour désigner un agent collectif. @fr
toolkit label: appellation d’agent collectif @fr
toolkit definition: Nomen qui est utilisé à l’intérieur d’un schéma ou d’un contexte donnés pour désigner un agent collectif. @fr
label: grupas apzīmējums @lv
definition: Sasaista grupu ar nomenu, ko lieto konkrētajā sistēmā vai kontekstā, lai norādītu uz aģenta grupu. @lv
toolkit label: grupas apzīmējums @lv
toolkit definition: Nomens, ko lieto konkrētajā sistēmā vai kontekstā, lai norādītu uz aģenta grupu. @lv
label: 有集体行为者的称谓 @zh-hans
definition: 将一个集体行为者与在一个给定的体系或语境中指称一个集体行为者所用的一个命名关联起来。 @zh-hans
toolkit label: 集体行为者的称谓 @zh-hans
toolkit definition: 在一个给定的体系或语境中指称一个集体行为者所用的一个命名 @zh-hans
label: kolektif temsilcinin unvanı ile ilişkilidir @tr
definition: Kolektif bir temsilciyi, bir şema veya bağlam içinde bir kolektif temsilciye atıfta bulunmak için kullanılan bir isim ile ilişkilendirir. @tr
toolkit label: kolektif temsilcinin unvanı @tr
toolkit definition: Bir şema veya bağlam içinde bir kolektif temsilciye atıfta bulunmak için kullanılan bir isim @tr
has subproperty: yhteistoimijan hakutieto
has subproperty: yhteisön nimitys
has subproperty: suvun nimitys
has subproperty: yhteistoimijan tunniste
has subproperty: yhteistoimijan nimi
has subproperty: P50379

yhteisön nimitys
status: Published
type: Property
label: has appellation of corporate body @en
lexical alias: appellationOfCorporateBody.en
definition: Relates a corporate body to a nomen that is used within a given scheme or context to refer to a corporate body. @en
domain: C10005
toolkit label: appellation of corporate body @en
toolkit definition: A nomen that is used within a given scheme or context to refer to a corporate body. @en
sub property of: yhteisöön liittyvä nomen
sub property of: yhteistoimijan nimitys
has element type: 2
definition: Liittää yhteisön nomeniin, jota on käytetty tietyssä järjestelmässä tai kontekstissa viittaamaan yhteisöön.
toolkit label: yhteisön nimitys
toolkit definition: Nomen, jota on käytetty tietyssä järjestelmässä tai kontekstissa viittaamaan yhteisöön.
label: har betegnelse for korporasjon @no
definition: Relaterer en korporasjon til et nomen som er brukt i et bestemt skjema eller kontekst for å referere til en korporasjon. @no
toolkit label: betegnelse for korporasjon @no
toolkit definition: Et nomen som er brukt i et bestemt skjema eller kontekst for å referere til en korporasjon. @no
label: heeft benaming van corporatie @nl
definition: Relateert een corporatie aan een nomen dat wordt gebruikt binnen een bepaald schema of context om een corporatie aan te duiden. @nl
toolkit label: benaming van corporatie @nl
toolkit definition: Een nomen dat wordt gebruikt binnen een bepaald schema of context om een corporatie aan te duiden. @nl
label: له تسمية هيئة @ar
definition: يربط هيئة بتسمية مستخدمة في خطة أو في سياق محدد للإشارة إلى هيئة. @ar
toolkit label: تسمية لهيئة @ar
toolkit definition: تسمية مستخدمة في خطة أو في سياق محدد للإشارة إلى هيئة. @ar
label: té com a apel·lació d’entitat corporativa @ca
definition: Relaciona una entitat corporativa amb un nomen que s’usa en un esquema o un context determinat per referir-se a una entitat corporativa. @ca
toolkit label: apel·lació d’entitat corporativa @ca
toolkit definition: Nomen que s’usa en un esquema o un context determinat per referir-se a una entitat corporativa. @ca
label: har benævnelse på korporation @da
definition: Relaterer en korporation til et nomen, som anvendes inden for et givet skema eller kontekst for at henvise til en korporation. @da
toolkit label: benævnelse på korporation @da
toolkit definition: Nomen, som anvendes inden for et givet skema eller kontekst for at henvise til en korporation. @da
label: asutuse nimetus @et
definition: Seostab asutuse nomen'iga, mida antud süsteemis või kontekstis kasutatakse asutusele viitamiseks. @et
toolkit label: asutuse nimetus @et
toolkit definition: Nomen, mida antud süsteemis või kontekstis kasutatakse asutusele viitamiseks. @et
label: hat Bezeichnung für eine Körperschaft @de
definition: Setzt eine Körperschaft in Beziehung zu einem Nomen, das in einem bestimmten Schema oder Kontext verwendet wird, um eine Körperschaft zu referenzieren. @de
toolkit label: Bezeichnung für eine Körperschaft @de
toolkit definition: Ein Nomen, das in einem bestimmten Schema oder Kontext verwendet wird, um eine Körperschaft zu referenzieren. @de
label: testület megnevezése a következő: @hu
definition: Hozzákapcsol egy testületet egy nomenhez, amelyet egy adott sémán vagy kontextuson belül használnak egy testületre való hivatkozásra. @hu
toolkit label: testület megnevezése: @hu
toolkit definition: Egy nomen, amelyet egy adott sémán vagy kontextuson belül használnak egy testületre való hivatkozásra. @hu
label: ha come denominazione di ente @it
definition: Correla un ente a un nomen che è usato all'interno di un dato schema o contestoper far riferimento a un ente. @it
toolkit label: denominazione di ente @it
toolkit definition: Nomen che è usato all'interno di un dato schema o contestoper far riferimento a un ente. @it
label: έχει ονομασία του συλλογικού οργάνου @el
toolkit label: ονομασία του συλλογικού οργάνου @el
label: a pour appellation de collectivité @fr
definition: Met une collectivité en relation avec un nomen qui est utilisé à l’intérieur d’un schéma ou d’un contexte donnés pour désigner une collectivité. @fr
toolkit label: appellation de collectivité @fr
toolkit definition: Nomen qui est utilisé à l’intérieur d’un schéma ou d’un contexte donnés pour désigner une collectivité. @fr
label: institūcijas apzīmējums @lv
definition: Sasaista institūciju ar nomenu, ko lieto konkrētajā sistēmā vai kontekstā, lai norādītu uz institūciju. @lv
toolkit label: institūcijas apzīmējums @lv
toolkit definition: Nomens, ko lieto konkrētajā sistēmā vai kontekstā, lai norādītu uz institūciju @lv
label: 有团体的称谓 @zh-hans
definition: 将一个团体与在一个给定的体系或语境中指称一个团体的一个命名关联起来。 @zh-hans
toolkit label: 团体的称谓 @zh-hans
toolkit definition: 在一个给定的体系或语境中指称一个团体的一个命名 @zh-hans
label: tüzel kişinin unvanı ile ilişkilidir @tr
definition: Bir tüzel kişiyi, bir şema veya bağlam içinde bir tüzel kişiye atıfta bulunmak için kullanılan bir isim ile ilişkilendirir. @tr
toolkit label: tüzel kişinin unvanı @tr
toolkit definition: Bir şema veya bağlam içinde bir tüzel kişiye atıfta bulunmak için kullanılan bir isim @tr
has subproperty: yhteisön hakutieto
has subproperty: yhteisön tunniste
has subproperty: yhteisön nimi
has subproperty: P50380

suvun nimitys
status: Published
type: Property
label: has appellation of family @en
lexical alias: appellationOfFamily.en
definition: Relates a family to a nomen that is used within a given scheme or context to refer to a family. @en
domain: C10008
toolkit label: appellation of family @en
toolkit definition: A nomen that is used within a given scheme or context to refer to a family. @en
sub property of: sukuun liittyvä nomen
sub property of: yhteistoimijan nimitys
has element type: 2
definition: Liittää suvun nomeniin, jota on käytetty tietyssä järjestelmässä tai kontekstissa viittaamaan sukuun.
toolkit label: suvun nimitys
toolkit definition: Nomen, jota on käytetty tietyssä järjestelmässä tai kontekstissa viittaamaan sukuun.
label: har betegnelse for familie @no
definition: Relaterer en familie til et nomen som er brukt i et bestemt skjema eller kontekst for å referere til en familie. @no
toolkit label: betegnelse for familie @no
toolkit definition: Et nomen som er brukt i et bestemt skjema eller kontekst for å referere til en familie. @no
label: heeft benaming van familie @nl
definition: Relateert een familie aan een nomen dat wordt gebruikt binnen een bepaald schema of context om een familie aan te duiden. @nl
toolkit label: benaming van familie @nl
toolkit definition: Een nomen dat wordt gebruikt binnen een bepaald schema of context om een familie aan te duiden. @nl
label: له اسم تعريفي لعائلة @ar
definition: يربط عائلة بتسمية مستخدمة في خطة أو في سياق محدد للإشارة إلى عائلة. @ar
toolkit label: اسم تعريفي لعائلة @ar
toolkit definition: تسمية مستخدمة في خطة أو في سياق محدد للإشارة إلى عائلة. @ar
label: té com a apel·lació de família @ca
definition: Relaciona una família amb un nomen que s’usa en un esquema o un context determinat per referir-se a una família. @ca
toolkit label: apel·lació de família @ca
toolkit definition: Nomen que s’usa en un esquema o un context determinat per referir-se a una família. @ca
label: har benævnelse på familie @da
definition: Relaterer en familie til et nomen, som anvendes inden for et givet skema eller kontekst for at henvise til en familie. @da
toolkit label: benævnelse på familie @da
toolkit definition: Nomen, som anvendes inden for et givet skema eller kontekst for at henvise til en familie. @da
label: perekonna nimetus @et
definition: Seostab perekonna nomen'iga, mida antud süsteemis või kontekstis kasutatakse perekonnale viitamiseks. @et
toolkit label: perekonna nimetus @et
toolkit definition: Nomen, mida antud süsteemis või kontekstis kasutatakse perekonnale viitamiseks. @et
label: hat Bezeichnung für eine Familie @de
definition: Setzt eine Familie in Beziehung zu einem Nomen, das in einem bestimmten Schema oder Kontext verwendet wird, um eine Familie zu referenzieren. @de
toolkit label: Bezeichnung für eine Familie @de
toolkit definition: Ein Nomen, das in einem bestimmten Schema oder Kontext verwendet wird, um eine Familie zu referenzieren. @de
label: család megnevezése a következő: @hu
definition: Hozzákapcsol egy családot egy nomenhez, amelyet egy adott sémán vagy kontextuson belül használnak egy családra való hivatkozásra. @hu
toolkit label: család megnevezése: @hu
toolkit definition: Egy nomen, amelyet egy adott sémán vagy kontextuson belül használnak egy családra való hivatkozásra. @hu
label: ha come denominazione di famiglia @it
definition: Correla una famiglia a un nomen che è usato all'interno di un dato schema o contestoper far riferimento a una famiglia. @it
toolkit label: denominazione di famiglia @it
toolkit definition: Nomen che è usato all'interno di un dato schema o contesto per far riferimento a una famiglia. @it
label: έχει ονομασία της οικογένειας @el
toolkit label: ονομασία της οικογένειας @el
label: a pour appellation de famille @fr
definition: Met une famille en relation avec un nomen qui est utilisé à l’intérieur d’un schéma ou d’un contexte donnés pour désigner une famille. @fr
toolkit label: appellation de famille @fr
toolkit definition: Nomen qui est utilisé à l’intérieur d’un schéma ou d’un contexte donnés pour désigner une famille. @fr
label: dzimtas/ģimenes apzīmējums @lv
definition: Sasaista dzimtu/ģimeni ar nomenu, ko lieto konkrētajā sistēmā vai kontekstā, lai norādītu uz dzimtu/ģimenei. @lv
toolkit label: dzimtas/ģimenes apzīmējums @lv
toolkit definition: Nomens, ko lieto konkrētajā sistēmā vai kontekstā, lai norādītu uz dzimtu/ģimenei @lv
label: 有家族的称谓 @zh-hans
definition: 将一个家族与在一个给定的体系或语境中指称一个家族的一个命名关联起来。 @zh-hans
toolkit label: 家族的称谓 @zh-hans
toolkit definition: 在一个给定的体系或语境中指称一个家族的一个命名 @zh-hans
label: ailenin unvanı ile ilişkilidir @tr
definition: Bir aileyi, bir şema veya bağlam içinde bir aileye atıfta bulunmak için kullanılan bir isim ile ilişkilendirir. @tr
toolkit label: ailenin unvanı @tr
toolkit definition: Bir şema veya bağlam içinde bir aileye atıfta bulunmak için kullanılan bir isim. @tr
has subproperty: suvun hakutieto
has subproperty: suvun tunniste
has subproperty: suvun nimi
has subproperty: P50381

henkilön nimitys
status: Published
type: Property
label: has appellation of person @en
lexical alias: appellationOfPerson.en
definition: Relates a person to a nomen that is used within a given scheme or context to refer to a person. @en
domain: C10004
toolkit label: appellation of person @en
toolkit definition: A nomen that is used within a given scheme or context to refer to a person. @en
sub property of: henkilöön liittyvä nomen
sub property of: toimijan nimitys
has element type: 2
definition: Liittää henkilön nomeniin, jota on käytetty tietyssä järjestelmässä tai kontekstissa viittaamaan henkilöön.
toolkit label: henkilön nimitys
toolkit definition: Nomen, jota on käytetty tietyssä järjestelmässä tai kontekstissa viittaamaan henkilöön.
label: har betegnelse for person @no
definition: Relaterer en familie til et nomen som er brukt i et bestemt skjema eller kontekst for å referere til en person. @no
toolkit label: betegnelse for person @no
toolkit definition: Et nomen som er brukt i et bestemt skjema eller kontekst for å referere til en person. @no
label: heeft benaming van persoon @nl
definition: Relateert een persoon aan een nomen dat wordt gebruikt binnen een bepaald schema of context om een persoon aan te duiden. @nl
toolkit label: benaming van persoon @nl
toolkit definition: Een nomen dat wordt gebruikt binnen een bepaald schema of context om een persoon aan te duiden. @nl
label: له تسمية شخص @ar
definition: يربط شخصا بتسمية مستخدمة في خطة أو في سياق محدد للإشارة إلى شخص. @ar
toolkit label: اسم تعريفي لشخص @ar
toolkit definition: تسمية مستخدمة في خطة أو في سياق محدد للإشارة إلى شخص. @ar
label: té com a apel·lació de persona @ca
definition: Relaciona una persona amb un nomen que s’usa en un esquema o un context determinat per referir-se a una persona. @ca
toolkit label: apel·lació de persona @ca
toolkit definition: Nomen que s’usa en un esquema o un context determinat per referir-se a una persona. @ca
label: har benævnelse på person @da
definition: Relaterer en person til et nomen, som anvendes inden for et givet skema eller kontekst for at henvise til en person. @da
toolkit label: benævnelse på person @da
toolkit definition: Nomen, som anvendes inden for et givet skema eller kontekst for at henvise til en person. @da
label: isiku nimetus @et
definition: Seostab isiku nomen'iga, mida antud süsteemis või kontekstis kasutatakse isikule viitamiseks. @et
toolkit label: isiku nimetus @et
toolkit definition: Nomen, mida antud süsteemis või kontekstis kasutatakse isikule viitamiseks. @et
label: hat Bezeichnung für eine Person @de
definition: Setzt eine Person in Beziehung zu einen Nomen, das in einem bestimmten Schema oder Kontext verwendet wird, um eine Person zu referenzieren. @de
toolkit label: Bezeichnung für eine Person @de
toolkit definition: Ein Nomen, das in einem bestimmten Schema oder Kontext verwendet wird, um eine Person zu referenzieren. @de
label: személy megnevezése a következő: @hu
definition: Hozzákapcsol egy személyt egy nomenhez, amelyet egy adott sémán vagy kontextuson belül használnak egy személyre való hivatkozásra. @hu
toolkit label: személy megnevezése: @hu
toolkit definition: Egy nomen, amelyet egy adott sémán vagy kontextuson belül használnak egy személyre való hivatkozásra. @hu
label: ha come denominazione di persona @it
definition: Correla una persona a un nomen che è usato all'interno di un dato schema o contestoper far riferimento a una persona.. @it
toolkit label: denominazione di persona @it
toolkit definition: Nomen che è usato all'interno di un dato schema o contesto per far riferimento a una persona.. @it
label: έχει ονομασία του φυσικού προσώπου @el
toolkit label: ονομασία του φυσικού προσώπου @el
label: a pour appellation de personne @fr
definition: Met une personne en relation avec un nomen qui est utilisé à l’intérieur d’un schéma ou d’un contexte donnés pour désigner une personne. @fr
toolkit label: appellation de personne @fr
toolkit definition: Nomen qui est utilisé à l’intérieur d’un schéma ou d’un contexte donnés pour désigner une personne. @fr
label: personas apzīmējums @lv
definition: Sasaista personu ar nomenu, ko lieto konkrētajā sistēmā vai kontekstā, lai norādītu uz personu. @lv
toolkit label: personas apzīmējums @lv
toolkit definition: Nomens, ko lieto konkrētajā sistēmā vai kontekstā, lai norādītu uz personu @lv
label: 有个人的称谓 @zh-hans
definition: 将一个个人与在一个给定的体系或语境中指称一个个人的一个命名关联起来。 @zh-hans
toolkit label: 个人的称谓 @zh-hans
toolkit definition: 在一个给定的体系或语境中指称一个个人的一个命名 @zh-hans
label: kişinin unvanı ile ilişkilidir @tr
definition: Bir kişiyi, bir şema veya bağlam içinde bir kişiye atıfta bulunmak için kullanılan bir isimle ilişkilendirir. @tr
toolkit label: kişinin unvanı @tr
toolkit definition: Bir şema veya bağlam içinde bir kişiye atıfta bulunmak için kullanılan bir isim. @tr
has subproperty: henkilön hakutieto
has subproperty: henkilön tunniste
has subproperty: henkilön nimi
has subproperty: P50382

kohdistettu muutoshakemus
status: Deprecated
type: Property
sub property of: muuna toimijana teoksessa
lexical alias: appelleeOf.en
label: est un intimé de @fr
definition: Met une personne ou collectivité contre laquelle a été formé un appel d’une décision d’un tribunal inférieur enregistrée dans une œuvre juridique d’un tribunal supérieur en relation avec une œuvre. @fr
toolkit label: intimé de @fr
toolkit definition: Œuvre juridique d’un tribunal supérieur qui enregistre une décision d’un tribunal inférieur portant un appel contre une personne ou une collectivité. @fr
instruction number: 18.5
label: είναι εφεσίβλητος/αναιρεσίβλητος του @el
definition: Συνδέει ένα φυσικό πρόσωπο ή συλλογικό όργανο που ασκεί έφεση εναντίον απόφασης κατώτερου δικαστηρίου, που καταχωρίστηκε στα πρακτικά ενός ανωτέρου δικαστηρίου, με ένα έργο. @el
toolkit label: εφεσίβλητος/αναιρεσίβλητος του @el
toolkit definition: Ένα νομικό έργο για το οποίο ασκεί έφεση εναντίον απόφασης κατώτερου δικαστηρίου, που καταχωρίστηκε στα πρακτικά ενός ανωτέρου δικαστηρίου, ένα φυσικό πρόσωπο ή συλλογικό όργανο. @el
definition: Setzt eine Person oder eine Körperschaft, gegen die Rechtsmittel (Berufung/Revision) gegen ein Gerichtsurteil einer unteren Instanz, das in einem juristischen Werk einer höheren Instanz erfasst ist, eingelegt werden, mit einem Werk in Beziehung. @de
toolkit label: Berufungsbeklagter/Revisionsbeklagter von @de
toolkit definition: Ein juristisches Werk einer höheren Instanz, bei dem gegen eine Person oder gegen eine Körperschaft Rechtsmittel gegen ein Gerichtsurteil der unteren Instanz eingelegt werden. @de
label: er indstævnet af @da
definition: Relaterer en person eller korporation mod hvem der er gjort indsigelse over en underrets beslutning, der er registreret i et juridisk værk fra en højere retsinstans til et værk. @da
toolkit label: indstævnet af @da
toolkit definition: Juridisk værk fra en højere retsinstans, der registrerer en beslutning fra en underret, der har gjort indsigelse mod en person eller korporation. @da
label: és apel·at de @ca
definition: Relaciona una persona o entitat corporativa, contra la qual es recorre en un tribunal superior perquè esmeni la sentència d’un tribunal inferior, amb una obra. @ca
toolkit label: apel·lat de @ca
toolkit definition: Obra jurídica d’un tribunal superior perquè esmeni una sentència d’un tribunal inferior que apel·la contra una persona o entitat corporativa. @ca
definition: Liittää henkilön tai yhteisön hakemukseen, jolla haetaan muutosta alemman oikeusasteen päätökseen ja joka kohdistuu henkilöön tai sukuun
toolkit label: kohdistettu muutoshakemus
toolkit definition: Hakemus, jolla haetaan muutosta alemman oikeusasteen päätökseen ja joka kohdistuu henkilöön tai sukuun.
toolkit label: appellee for @no
toolkit definition: Et juridisk verk fra en høyere rettsinstans som registrerer en avgjørelse fra en lavere rettsinstans som anker mot en person eller korporasjon. @no
label: ist Berufungsbeklagter/Revisionsbeklagter von @de

arkkitehti (toimija) teoksessa
status: Published
label: is architect agent of @en
definition: Relates an agent to a work that involves a responsibility of an agent for creating an architectural design, including a pictorial representation intended to show how a building or other structure will look when completed. @en
type: Property
domain: C10002
sub property of: teoksen tekijä (toimija) teoksessa
lexical alias: architectAgentOf.en
label: est un agent architecte de @fr
definition: Met un agent en relation avec une œuvre qui comporte une responsabilité de la part d’un agent en ce qui concerne une conception architecturale, y compris une représentation illustrée conçue pour montrer à quoi ressemblera un bâtiment ou une autre structure une fois la construction terminée. @fr
toolkit label: agent architecte de @fr
toolkit definition: Œuvre qui comporte une responsabilité de la part d’un agent consistant à créer une conception architecturale, y compris une représentation illustrée conçue pour montrer à quoi ressemblera un bâtiment ou une autre structure une fois la construction terminée. @fr
toolkit label: architect agent of @en
toolkit definition: A work that involves a responsibility of an agent for creating an architectural design, including a pictorial representation intended to show how a building or other structure will look when completed. @en
instruction number: 18.5
label: είναι αρχιτέκτων φορέας του @el
definition: Συνδέει έναν φορέα, υπεύθυνο για τη δημιουργία ενός αρχιτεκτονικού σχεδίου, περιλαμβανομένης μιας οπτικής αναπαράστασης με στόχο να δείξει π.χ., την όψη του κτηρίου όταν αυτό θα έχει ολοκληρωθεί, με ένα έργο. @el
toolkit label: αρχιτέκτων φορέας του @el
toolkit definition: Ένα έργο που περιλαμβάνει την ευθύνη της δημιουργίας ενός αρχιτεκτονικού σχεδίου, περιλαμβανομένης μιας οπτικής αναπαράστασης, με στόχο να δείξει π.χ., την όψη του κτηρίου όταν αυτό θα έχει ολοκληρωθεί. @el
definition: Setzt einen Akteur in Beziehung zu einem Werk, bei dem ein Akteur für die Schaffung eines architektonischen Entwurfs verantwortlich ist, einschließlich einer bildlichen Darstellung, die zeigt, wie ein Gebäude oder eine andere Konstruktion nach der Fertigstellung aussehen soll. @de
toolkit label: Akteur als Architektin/Architekt von @de
toolkit definition: Ein Werk, bei dem ein Akteur für die Schaffung eines architektonischen Entwurfs verantwortlich ist, einschließlich einer bildlichen Darstellung, die zeigt, wie ein Gebäude oder eine andere Konstruktion nach der Fertigstellung aussehen soll. @de
label: er agent, som er arkitekt af @da
definition: Relaterer en agent til et værk, som involverer en agents ansvar for at skabe et arkitektonisk design, inkl. en billedrepræsentation, som skal vise, hvordan en bygning eller anden struktur vil se ud, når den er færdig. @da
toolkit label: agent, som er arkitekt af @da
toolkit definition: Værk, som involverer en agents ansvar for at skabe et arkitektonisk design, inkl. en billedrepræsentation, som skal vise, hvordan en bygning eller anden struktur vil se ud, når den er færdig. @da
label: és agent arquitecte de @ca
definition: Relaciona un agent amb una obra que implica una responsabilitat d’un agent en la creació d’un disseny arquitectònic, inclosa una representació il·lustrada concebuda per mostrar com serà un edifici o qualsevol altra estructura una vegada complet. @ca
toolkit label: agent arquitecte de @ca
toolkit definition: Obra que implica una responsabilitat d’un agent en la creació d’un disseny arquitectònic, inclosa una representació il·lustrada concebuda per mostrar com serà un edifici o qualsevol altra estructura una vegada complet. @ca
definition: Liittää toimijan teokseen, jossa toimija on vastuussa arkkitehtisuunnitelman luomisesta, mukaan lukien kuvaesityksestä, jonka tarkoitus on näyttää, miltä rakennus tai muu rakennelma näyttää valmiina.
toolkit label: arkkitehti (toimija) teoksessa
toolkit definition: Teos, jossa toimija on vastuussa arkkitehtisuunnitelman luomisesta, mukaan lukien kuvaesityksestä, jonka tarkoitus on näyttää, miltä rakennus tai muu rakennelma näyttää valmiina.
toolkit label: arkitekt for (agent) @no
label: ist Akteur als Architektin/Architekt von @de
has element type: 2
label: építész ágense a következőnek: @hu
definition: Hozzákapcsol egy ágenst egy műhöz, amelyhez hozzátartozik egy ágens felelőssége egy építészeti terv létrehozásáért, beleértve egy képi reprezentációt, amely bemutatja, hogy egy épület vagy más szerkezet hogyan fog kinézni, amikor elkészül. @hu
toolkit label: építész ágense: @hu
toolkit definition: Egy mű, amelyhez hozzátartozik egy ágens felelőssége egy építészeti terv létrehozásáért, beleértve egy képi reprezentációt, amely bemutatja, hogy egy épület vagy más szerkezet hogyan fog kinézni, amikor elkészül. @hu
alternative label: architect of @en
alternative label: arkkitehtinä teoksessa
label: er arkitekt for (agent) @no
definition: Relaterer en agent til et verk som involverer ansvar for en agent i form av arkitekturdesign, inkludert en billedlig representasjon som er ment å vise hvordan en bygning eller annen struktur vil se ut når den er fullført. @no
alternative label: arkitekt for @no
toolkit definition: Et verk som involverer ansvar for en agent i form av arkitekturdesign, inkludert en billedlig representasjon som er ment å vise hvordan en bygning eller annen struktur vil se ut når den er fullført. @no
label: is architect-actor van @nl
definition: Relateert een actor aan een werk dat met zich meebrengt een verantwoordelijkheid van een actor voor het creëren van een architectonisch ontwerp, omvattende een picturale representatie bedoeld te laten zien hoe een gebouw of andere structuur er na voltooiing uit zal zien. @nl
toolkit label: architect-actor van @nl
toolkit definition: Een werk dat met zich meebrengt een verantwoordelijkheid van een actor voor het creëren van een architectonisch ontwerp, omvattende een picturale representatie bedoeld te laten zien hoe een gebouw of andere structuur er na voltooiing uit zal zien. @nl
label: هو وكيل مهندس معماري لـ @ar
definition: يربط وكيلا بعمل يترتب عليه مسئولية وكيل عن إنشاء تصميم معماري، ويشمل ذلك إعداد عرض تصويري يبين كيف سيبدو المبنى أو أي بناء آخر عند اكتماله. @ar
alternative label: مهندس معماري @ar
toolkit label: وكيل مهندس معماري @ar
toolkit definition: عمل يترتب عليه مسئولية وكيل عن إنشاء تصميم معماري، ويشمل ذلك إعداد عرض تصويري يبين كيف سيبدو المبنى أو أي بناء آخر عند اكتماله. @ar
alternative label: arquitecte de @ca
alternative label: arkitekt af @da
label: arhitekt (tegija) teoses @et
definition: Seostab tegija teosega, mis sisaldab tegija vastutust arhitektuurse kujunduse loomise eest, k.a pildiline esitus näitamaks, kuidas ehitis või muu konstruktsioon valmides välja hakkab nägema. @et
alternative label: arhitekt teoses @et
toolkit label: arhitekt (tegija) teoses @et
toolkit definition: Teos, mis sisaldab tegija vastutust arhitektuurse kujunduse loomise eest, k.a pildiline esitus näitamaks, kuidas ehitis või muu konstruktsioon valmides välja hakkab nägema. @et
alternative label: építésze: @hu
label: è architetto agente di @it
definition: Correla un agente a un'opera che implica la responsabilità di un agente nella creazione di un progetto architettonico, inclusa una rappresentazione pittorica destinata a mostrare come apparirà un edificio o altra struttura una volta completato. @it
alternative label: architetto di @it
toolkit label: architetto agente di @it
toolkit definition: Opera che implica la responsabilità di un agente nella creazione di un progetto architettonico, inclusa una rappresentazione pittorica destinata a mostrare come apparirà un edificio o altra struttura una volta completato. @it
scope note: Ένας σκηνοθέτης είναι ατομικά υπεύθυνος για τη σύλληψη και την εκτέλεση όλων των πτυχών μιας ταινίας. @el
alternative label: αρχιτέκτων του @el
alternative label: architecte de @fr
label: ir arhitekts (aģents) @lv
definition: Sasaista aģentu ar darbu, kas ietver aģenta atbildību par arhitektūras projekta radīšanu, ieskaitot projekta skici, lai parādītu, kā ēka vai cita struktūra izskatīsies, kad tā tiks pabeigta. @lv
toolkit label: ir arhitekts (aģents) @lv
toolkit definition: Darbs, kas ietver aģenta atbildību par arhitektūras projekta radīšanu, ieskaitot projekta skici, lai parādītu, kā ēka vai cita struktūra izskatīsies, kad tā tiks pabeigta. @lv
alternative label: Architekt von @de
alternative label: ……的建筑设计师 @zh-hans
toolkit label: ……的建筑设计师行为者 @zh-hans
toolkit definition: 涉及建筑设计（包括用于展示建筑或其他结构完成之后外观效果的绘画作品）创作的一个行为者的责任的一种作品 @zh-hans
toolkit label: mimar temsilci @tr
toolkit definition: Bir binanın veya başka bir yapının tamamlandığında nasıl görüneceğini göstermeyi amaçlayan görsel bir temsil de dahil olmak üzere, bir temsilcinin mimari bir tasarım oluşturma sorumluluğunu içeren bir çalışma. @tr

arkkitehti (yhteistoimija) teoksessa
status: Published
label: is architect collective agent of @en
lexical alias: architectCollectiveAgentOf.en
definition: Relates a collective agent to a work that involves a responsibility of a collective agent for creating an architectural design, including a pictorial representation intended to show how a building or other structure will look when completed. @en
toolkit label: architect collective agent of @en
toolkit definition: A work that involves a responsibility of a collective agent for creating an architectural design, including a pictorial representation intended to show how a building or other structure will look when completed. @en
type: Property
domain: C10011
has element type: 2
sub property of: teoksen tekijä (yhteistoimija) teoksessa
sub property of: arkkitehti (toimija) teoksessa
definition: Liittää yhteistoimijan teokseen, jossa yhteistoimija on vastuussa arkkitehtisuunnitelman luomisesta, mukaan lukien kuvaesityksestä, jonka tarkoitus on näyttää, miltä rakennus tai muu rakennelma näyttää valmiina.
toolkit label: arkkitehti (yhteistoimija) teoksessa
toolkit definition: Teos, jossa yhteistoimija on vastuussa arkkitehtisuunnitelman luomisesta, mukaan lukien kuvaesityksestä, jonka tarkoitus on näyttää, miltä rakennus tai muu rakennelma näyttää valmiina.
label: er arkitekt for (kollektiv agent) @no
definition: Relaterer en kollektiv agent til et verk som involverer et ansvar for en kollektiv agent i form av arkitektonisk utforming, inkludert en gjengivelse i bildeform som er ment å vise hvordan en bygning eller annen struktur vil se ut når den er ferdig. @no
toolkit label: arkitekt for (kollektiv agent) @no
toolkit definition: Et verk som involverer et ansvar for en kollektiv agent i form av arkitektonisk utforming, inkludert en gjengivelse i bildeform som er ment å vise hvordan en bygning eller annen struktur vil se ut når den er ferdig. @no
label: is architect-collectieve actor van @nl
definition: Relateert een collectieve actor aan een werk dat met zich meebrengt een verantwoordelijkheid van een collectieve actor voor het creëren van een architectonisch ontwerp, omvattende een picturale representatie bedoeld te laten zien hoe een gebouw of andere structuur er na voltooiing uit zal zien. @nl
toolkit label: architect-collectieve actor van @nl
toolkit definition: Een werk dat met zich meebrengt een verantwoordelijkheid van een collectieve actor voor het creëren van een architectonisch ontwerp, omvattende een picturale representatie bedoeld te laten zien hoe een gebouw of andere structuur er na voltooiing uit zal zien. @nl
label: وكيل جماعي مهندس معماري @ar
definition: يربط وكيلا جماعيا بعمل يترتب عليه مسئولية وكيل جماعي عن إنشاء تصميم معماري، ويشمل ذلك إعداد عرض تصويري يبين كيف سيبدو المبنى أو أي بناء آخر عند اكتماله. @ar
toolkit label: وكيل جماعي مهندس معماري @ar
toolkit definition: عمل يترتب عليه مسئولية وكيل جماعي عن إنشاء تصميم معماري، ويشمل ذلك إعداد عرض تصويري يبين كيف سيبدو المبنى أو أي بناء آخر عند اكتماله. @ar
label: és agent col·lectiu arquitecte de @ca
definition: Relaciona un agent col·lectiu amb una obra que implica una responsabilitat d’un agent col·lectiu en la creació d’un disseny arquitectònic, inclosa una representació il·lustrada concebuda per mostrar com serà un edifici o qualsevol altra estructura una vegada complet. @ca
toolkit label: agent col·lectiu arquitecte de @ca
toolkit definition: Obra que implica una responsabilitat d’un agent col·lectiu en la creació d’un disseny arquitectònic, inclosa una representació il·lustrada concebuda per mostrar com serà un edifici o qualsevol altra estructura una vegada complet. @ca
label: er kollektiv agent, som er arkitekt af @da
definition: Relaterer en kollektiv agent til et værk, som involverer en kollektiv agents ansvar for at skabe et arkitektonisk design, inkl. en billedrepræsentation, som skal vise, hvordan en bygning eller anden struktur vil se ud, når den er færdig. @da
toolkit label: kollektiv agent, som er arkitekt af @da
toolkit definition: Værk, som involverer en kollektiv agents ansvar for at skabe et arkitektonisk design, inkl. en billedrepræsentation, som skal vise, hvordan en bygning eller anden struktur vil se ud, når den er færdig. @da
label: arhitekt (kollektiiv) teoses @et
definition: Seostab kollektiivi teosega, mis sisaldab kollektiivi vastutust arhitektuurse kujunduse loomise eest, k.a pildiline esitus näitamaks, kuidas ehitis või muu konstruktsioon valmides välja hakkab nägema. @et
toolkit label: arhitekt (kollektiiv) teoses @et
toolkit definition: Teos, mis sisaldab kollektiivi vastutust arhitektuurse kujunduse loomise eest, k.a pildiline esitus näitamaks, kuidas ehitis või muu konstruktsioon valmides välja hakkab nägema. @et
label: ist gemeinschaftlicher Akteur als Architektin/Architekt von @de
definition: Setzt einen gemeinschaftlichen Akteur in Beziehung zu einem Werk, bei dem ein gemeinschaftlicher Akteur für die Schaffung eines architektonischen Entwurfs verantwortlich ist, einschließlich einer bildlichen Darstellung, die zeigt, wie ein Gebäude oder eine andere Konstruktion nach der Fertigstellung aussehen soll. @de
toolkit label: Gemeinschaftlicher Akteur als Architektin/Architekt von @de
toolkit definition: Ein Werk, bei dem ein gemeinschaftlicher Akteur für die Schaffung eines architektonischen Entwurfs verantwortlich ist, einschließlich einer bildlichen Darstellung, die zeigt, wie ein Gebäude oder eine andere Konstruktion nach der Fertigstellung aussehen soll. @de
label: építész kollektív ágense a következőnek: @hu
definition: Hozzákapcsol egy kollektív ágenst egy műhöz, amelyhez hozzátartozik egy kollektív ágens felelőssége egy építészeti terv létrehozásáért, beleértve egy képi reprezentációt, amely bemutatja, hogy egy épület vagy más szerkezet hogyan fog kinézni, amikor elkészül. @hu
toolkit label: építész kollektív ágense: @hu
toolkit definition: Egy mű, amelyhez hozzátartozik egy kollektív ágens felelőssége egy építészeti terv létrehozásáért, beleértve egy képi reprezentációt, amely bemutatja, hogy egy épület vagy más szerkezet hogyan fog kinézni, amikor elkészül. @hu
label: è architetto agente collettivo di @it
definition: Correla un agente collettivo a un'opera che implica una responsabilità di un agente collettivo nella creazione di un progetto architettonico, inclusa una rappresentazione pittorica destinata a mostrare come apparirà un edificio o altra struttura una volta completato. @it
toolkit label: architetto agente collettivo di @it
toolkit definition: Opera che implica una responsabilità di un agente collettivo nella creazione di un progetto architettonico, inclusa una rappresentazione pittorica intesa a mostrare come apparirà un edificio o altra struttura una volta completato. @it
label: είναι αρχιτέκτονας συλλογικός φορέας του @el
toolkit label: αρχιτέκτονας συλλογικός φορέας του @el
label: est un agent collectif architecte de @fr
definition: Met un agent collectif en relation avec une œuvre qui comporte une responsabilité de la part d’un agent collectif en ce qui concerne une conception architecturale, y compris une représentation illustrée conçue pour montrer à quoi ressemblera un bâtiment ou une autre structure une fois la construction terminée. @fr
toolkit label: agent collectif architecte de @fr
toolkit definition: Œuvre qui comporte une responsabilité de la part d’un agent collectif consistant à créer une conception architecturale, y compris une représentation illustrée conçue pour montrer à quoi ressemblera un bâtiment ou une autre structure une fois la construction terminée. @fr
label: ir arhitekts (grupa) @lv
definition: Sasaista grupu ar darbu, kas ietver grupas atbildību par arhitektūras projekta radīšanu, ieskaitot projekta skici, lai parādītu, kā ēka vai cita struktūra izskatīsies, kad tā tiks pabeigta. @lv
toolkit label: ir arhitekts (grupa) @lv
toolkit definition: Darbs, kas ietver grupas atbildību par arhitektūras projekta radīšanu, ieskaitot projekta skici, lai parādītu, kā ēka vai cita struktūra izskatīsies, kad tā tiks pabeigta. @lv
label: 是……的建筑设计师集体行为者 @zh-hans
definition: 将一个集体行为者与涉及建筑设计（包括用于展示建筑或其他结构完成之后外观效果的绘画作品）创作的一个集体行为者的责任的一种作品关联起来。 @zh-hans
toolkit label: ……的建筑设计师集体行为者 @zh-hans
toolkit definition: 涉及建筑设计（包括用于展示建筑或其他结构完成之后外观效果的绘画作品）创作的一个集体行为者的责任的一种作品 @zh-hans
label: mimar kolektif temsilcisidir @tr
definition: Kolektif bir temsilciyi, bir binanın veya başka bir yapının tamamlandığında nasıl görüneceğini göstermeyi amaçlayan görsel bir temsil de dâhil olmak üzere, bir mimari tasarım oluşturmak için kolektif bir temsilcinin sorumluluğunu içeren bir eserle ilişkilendirir. @tr
toolkit label: mimar kolektif temsilci @tr
toolkit definition: Bir binanın veya başka bir yapının tamamlandığında nasıl görüneceğini göstermeyi amaçlayan görsel bir temsil de dâhil olmak üzere, bir mimari tasarım oluşturmak için kolektif bir temsilcinin sorumluluğunu içeren bir eser. @tr
has subproperty: arkkitehti (yhteisö) teoksessa
has subproperty: arkkitehti (suku) teoksessa
has subproperty: maisema-arkkitehti (yhteistoimija) teoksessa
has subproperty: RDA:n toimijan ominaisuudet
has subproperty: P50680

arkkitehti (yhteisö) teoksessa
status: Published
label: is architect corporate body of @en
lexical alias: architectCorporateBodyOf.en
definition: Relates a corporate body to a work that involves a responsibility of a corporate body for creating an architectural design, including a pictorial representation intended to show how a building or other structure will look when completed. @en
toolkit label: architect corporate body of @en
toolkit definition: A work that involves a responsibility of a corporate body for creating an architectural design, including a pictorial representation intended to show how a building or other structure will look when completed. @en
type: Property
domain: C10005
has element type: 2
sub property of: teoksen tekijä (yhteisö) teoksessa
sub property of: arkkitehti (yhteistoimija) teoksessa
definition: Liittää yhteisön teokseen, jossa yhteisö on vastuussa arkkitehtisuunnitelman luomisesta, mukaan lukien kuvaesityksestä, jonka tarkoitus on näyttää, miltä rakennus tai muu rakennelma näyttää valmiina.
toolkit label: arkkitehti (yhteisö) teoksessa
toolkit definition: Teos, jossa yhteisö on vastuussa arkkitehtisuunnitelman luomisesta, mukaan lukien kuvaesityksestä, jonka tarkoitus on näyttää, miltä rakennus tai muu rakennelma näyttää valmiina.
label: er arkitekt for (korporasjon) @no
definition: Relaterer en korporasjon til et verk som involverer et ansvar for en korporasjon i form av arkitektonisk utforming, inkludert en gjengivelse i bildeform som er ment å vise hvordan en bygning eller annen struktur vil se ut når den er ferdig. @no
toolkit label: arkitekt for (korporasjon) @no
toolkit definition: Et verk som involverer et ansvar for en korporasjon i form av arkitektonisk utforming, inkludert en gjengivelse i bildeform som er ment å vise hvordan en bygning eller annen struktur vil se ut når den er ferdig. @no
label: is architect-corporatie van @nl
definition: Relateert een corporatie aan een werk dat met zich meebrengt een verantwoordelijkheid van een corporatie voor het creëren van een architectonisch ontwerp, omvattende een picturale representatie bedoeld te laten zien hoe een gebouw of andere structuur er na voltooiing uit zal zien. @nl
toolkit label: architect-corporatie van @nl
toolkit definition: Een werk dat met zich meebrengt een verantwoordelijkheid van een corporatie voor het creëren van een architectonisch ontwerp, omvattende een picturale representatie bedoeld te laten zien hoe een gebouw of andere structuur er na voltooiing uit zal zien. @nl
label: هي هيئة مسئولة عن الهندسة المعمارية لـ @ar
definition: يربط هيئة بعمل يترتب عليه مسئولية هيئة عن إنشاء تصميم معماري، ويشمل ذلك إعداد عرض تصويري يبين كيف سيبدو المبنى أو أي بناء آخر عند اكتماله. @ar
toolkit label: هيئة مسئولة عن الهندسة المعمارية @ar
toolkit definition: عمل يترتب عليه مسئولية هيئة عن إنشاء تصميم معماري، ويشمل ذلك إعداد عرض تصويري يبين كيف سيبدو المبنى أو أي بناء آخر عند اكتماله. @ar
label: és entitat corporativa arquitecta de @ca
definition: Relaciona una entitat corporativa amb una obra que implica una responsabilitat d’una entitat corporativa en la creació d’un disseny arquitectònic, inclosa una representació il·lustrada concebuda per mostrar com serà un edifici o qualsevol altra estructura una vegada complet. @ca
toolkit label: entitat corporativa arquitecta de @ca
toolkit definition: Obra que implica una responsabilitat d’una entitat corporativa en la creació d’un disseny arquitectònic, inclosa una representació il·lustrada concebuda per mostrar com serà un edifici o qualsevol altra estructura una vegada complet. @ca
label: er korporation, som er arkitekt af @da
definition: Relaterer en korporation til et værk, som involverer en korporations ansvar for at skabe et arkitektonisk design, inkl. en billedrepræsentation, som skal vise, hvordan en bygning eller anden struktur vil se ud, når den er færdig. @da
toolkit label: korporation, som er arkitekt af @da
toolkit definition: Værk, som involverer en korporations ansvar for at skabe et arkitektonisk design, inkl. en billedrepræsentation, som skal vise, hvordan en bygning eller anden struktur vil se ud, når den er færdig. @da
label: arhitekt (asutus) teoses @et
definition: Seostab asutuse teosega, mis sisaldab asutuse vastutust arhitektuurse kujunduse loomise eest, k.a pildiline esitus näitamaks, kuidas ehitis või muu konstruktsioon valmides välja hakkab nägema. @et
toolkit label: arhitekt (asutus) teoses @et
toolkit definition: Teos, mis sisaldab asutuse vastutust arhitektuurse kujunduse loomise eest, k.a pildiline esitus näitamaks, kuidas ehitis või muu konstruktsioon valmides välja hakkab nägema. @et
label: ist Körperschaft als Architektin/Architekt von @de
definition: Setzt eine Körperschaft in Beziehung zu einem Werk, bei dem eine Körperschaft für die Schaffung eines architektonischen Entwurfs verantwortlich ist, einschließlich einer bildlichen Darstellung, die zeigt, wie ein Gebäude oder eine andere Konstruktion nach der Fertigstellung aussehen soll. @de
toolkit label: Körperschaft als Architektin/Architekt von @de
toolkit definition: Ein Werk, bei dem eine Körperschaft für die Schaffung eines architektonischen Entwurfs verantwortlich ist, einschließlich einer bildlichen Darstellung, die zeigt, wie ein Gebäude oder eine andere Konstruktion nach der Fertigstellung aussehen soll. @de
label: építész testülete a következőnek: @hu
definition: Hozzákapcsol egy testületet egy műhöz, amelyhez hozzátartozik egy testület felelőssége egy építészeti terv létrehozásáért, beleértve egy képi reprezentációt, amely bemutatja, hogy egy épület vagy más szerkezet hogyan fog kinézni, amikor elkészül. @hu
toolkit label: építész testülete: @hu
toolkit definition: Egy mű, amelyhez hozzátartozik egy testület felelőssége egy építészeti terv létrehozásáért, beleértve egy képi reprezentációt, amely bemutatja, hogy egy épület vagy más szerkezet hogyan fog kinézni, amikor elkészül. @hu
label: è architetto ente di @it
definition: Correla un ente a un'opera che implica una responsabilità di un ente per la creazione di un progetto architettonico, inclusa una rappresentazione pittorica volta a mostrare come apparirà un edificio o altra struttura una volta completato. @it
toolkit label: architetto ente di @it
toolkit definition: Opera che implica una responsabilità di un ente per la creazione di un progetto architettonico, inclusa una rappresentazione pittorica volta a mostrare come apparirà un edificio o altra struttura una volta completato. @it
label: είναι αρχιτέκτονας συλλογικό όργανο του @el
toolkit label: αρχιτέκτονας συλλογικό όργανο του @el
label: est une collectivité architecte de @fr
definition: Met une collectivité en relation avec une œuvre qui comporte une responsabilité de la part d’une collectivité en ce qui concerne une conception architecturale, y compris une représentation illustrée conçue pour montrer à quoi ressemblera un bâtiment ou une autre structure une fois la construction terminée. @fr
toolkit label: collectivité architecte de @fr
toolkit definition: Œuvre qui comporte une responsabilité de la part d’une collectivité consistant à créer une conception architecturale, y compris une représentation illustrée conçue pour montrer à quoi ressemblera un bâtiment ou une autre structure une fois la construction terminée. @fr
label: ir arhitekts (institūcija) @lv
definition: Sasaista institūciju ar darbu, kas ietver institūcijas atbildību par arhitektūras projekta radīšanu, ieskaitot projekta skici, lai parādītu, kā ēka vai cita struktūra izskatīsies, kad tā tiks pabeigta. @lv
toolkit label: ir arhitekts (institūcija) @lv
toolkit definition: Darbs, kas ietver institūcijas atbildību par arhitektūras projekta radīšanu, ieskaitot projekta skici, lai parādītu, kā ēka vai cita struktūra izskatīsies, kad tā tiks pabeigta. @lv
label: 是……的建筑设计师团体 @zh-hans
definition: 将一个团体与涉及建筑设计（包括用于展示建筑或其他结构完成之后外观效果的绘画作品）创作的一个团体的责任的一种作品关联起来。 @zh-hans
toolkit label: ……的建筑设计师团体 @zh-hans
toolkit definition: 涉及建筑设计（包括用于展示建筑或其他结构完成之后外观效果的绘画作品）创作的一个团体的责任的一种作品 @zh-hans
label: mimar tüzel kişisidir @tr
definition: Bir tüzel kişiyi, bir binanın veya başka bir yapının tamamlandığında nasıl görüneceğini göstermeyi amaçlayan resimli bir sunum da dahil olmak üzere, bir mimari tasarım oluşturmak için bir tüzel kişiliğin sorumluluğunu içeren bir eserle ilişkilendirir. @tr
toolkit label: mimar tüzel kişi @tr
toolkit definition: Bir binanın veya başka bir yapının tamamlandığında nasıl görüneceğini göstermeyi amaçlayan resimsel bir temsil de dahil olmak üzere, bir mimari tasarım oluşturmak için bir tüzel kişinin sorumluluğunu içeren bir çalışma. @tr
has subproperty: maisema-arkkitehti (yhteisö) teoksessa
has subproperty: P50831

arkkitehti (suku) teoksessa
status: Published
label: is architect family of @en
lexical alias: architectFamilyOf.en
definition: Relates a family to a work that involves a responsibility of a family for creating an architectural design, including a pictorial representation intended to show how a building or other structure will look when completed. @en
toolkit label: architect family of @en
toolkit definition: A work that involves a responsibility of a family for creating an architectural design, including a pictorial representation intended to show how a building or other structure will look when completed. @en
type: Property
domain: C10008
has element type: 2
sub property of: teoksen tekijä (suku) teoksessa
sub property of: arkkitehti (yhteistoimija) teoksessa
definition: Liittää suvun teokseen, jossa suku on vastuussa arkkitehtisuunnitelman luomisesta, mukaan lukien kuvaesityksestä, jonka tarkoitus on näyttää, miltä rakennus tai muu rakennelma näyttää valmiina.
toolkit label: arkkitehti (suku) teoksessa
toolkit definition: Teos, jossa suku on vastuussa arkkitehtisuunnitelman luomisesta, mukaan lukien kuvaesityksestä, jonka tarkoitus on näyttää, miltä rakennus tai muu rakennelma näyttää valmiina.
label: er arkitekt for (familie) @no
definition: Relaterer en familie til et verk som involverer et ansvar for en familie i form av arkitektonisk utforming, inkludert en gjengivelse i bildeform som er ment å vise hvordan en bygning eller annen struktur vil se ut når den er ferdig. @no
toolkit label: arkitekt for (familie) @no
toolkit definition: Et verk som involverer et ansvar for en familie i form av arkitektonisk utforming, inkludert en gjengivelse i bildeform som er ment å vise hvordan en bygning eller annen struktur vil se ut når den er ferdig. @no
label: is architect-familie van @nl
definition: Relateert een familie aan een werk dat met zich meebrengt een verantwoordelijkheid van een familie voor het creëren van een architectonisch ontwerp, omvattende een picturale representatie bedoeld te laten zien hoe een gebouw of andere structuur er na voltooiing uit zal zien. @nl
toolkit label: architect-familie van @nl
toolkit definition: Een werk dat met zich meebrengt een verantwoordelijkheid van een familie voor het creëren van een architectonisch ontwerp, omvattende een picturale representatie bedoeld te laten zien hoe een gebouw of andere structuur er na voltooiing uit zal zien. @nl
label: هي عائلة مسئولة عن الهندسة المعمارية لـ @ar
definition: يربط عائلة بعمل يترتب عليه مسئولية عائلة عن إنشاء تصميم معماري، ويشمل ذلك إعداد عرض تصويري لبيان كيف سيبدو المبنى أو أي بناء آخر عند اكتماله. @ar
toolkit label: عائلة مسئولة عن الهندسة المعمارية @ar
toolkit definition: عمل يترتب عليه مسئولية عائلة عن إنشاء تصميم معماري، ويشمل ذلك إعداد عرض تصويري يبين كيف سيبدو المبنى أو أي بناء آخر عند اكتماله. @ar
label: és família arquitecta de @ca
definition: Relaciona una família amb una obra que implica una responsabilitat d’una família en la creació d’un disseny arquitectònic, inclosa una representació il·lustrada concebuda per mostrar com serà un edifici o qualsevol altra estructura una vegada complet. @ca
toolkit label: família arquitecta de @ca
toolkit definition: Obra que implica una responsabilitat d’una família en la creació d’un disseny arquitectònic, inclosa una representació il·lustrada concebuda per mostrar com serà un edifici o qualsevol altra estructura una vegada complet. @ca
label: er familie, som er arkitekt af @da
definition: Relaterer en familie til et værk, som involverer en families ansvar for at skabe et arkitektonisk design, inkl. en billedrepræsentation, som skal vise, hvordan en bygning eller anden struktur vil se ud, når den er færdig. @da
toolkit label: familie, som er arkitekt af @da
toolkit definition: Værk, som involverer en families ansvar for at skabe et arkitektonisk design, inkl. en billedrepræsentation, som skal vise, hvordan en bygning eller anden struktur vil se ud, når den er færdig. @da
label: arhitekt (perekond) teoses @et
definition: Seostab perekonna teosega, mis sisaldab perekonna vastutust arhitektuurse kujunduse loomise eest, k.a pildiline esitus näitamaks, kuidas ehitis või muu konstruktsioon valmides välja hakkab nägema. @et
toolkit label: arhitekt (perekond) teoses @et
toolkit definition: Teos, mis sisaldab perekonna vastutust arhitektuurse kujunduse loomise eest, k.a pildiline esitus näitamaks, kuidas ehitis või muu konstruktsioon valmides välja hakkab nägema. @et
label: ist Familie als Architektin/Architekt von @de
definition: Setzt eine Person in Beziehung zu einem Werk, bei dem eine Familie für eine die Schaffung eines architektonischen Entwurfs verantwortlich ist, einschließlich einer bildlichen Darstellung, die zeigt, wie ein Gebäude oder eine andere Konstruktion nach der Fertigstellung aussehen soll. @de
toolkit label: Familie als Architektin/Architekt von @de
toolkit definition: Ein Werk, bei dem eine Familie für die Schaffung eines architektonischen Entwurfs verantwortlich ist, einschließlich einer bildlichen Darstellung, die zeigt, wie ein Gebäude oder eine andere Konstruktion nach der Fertigstellung aussehen soll. @de
label: építész családja a következőnek: @hu
definition: Hozzákapcsol egy családot egy műhöz, amelyhez hozzátartozik egy család felelőssége egy építészeti terv létrehozásáért, beleértve egy képi reprezentációt, amely bemutatja, hogy egy épület vagy más szerkezet hogyan fog kinézni, amikor elkészül. @hu
toolkit label: építész családja: @hu
toolkit definition: Egy mű, amelyhez hozzátartozik egy család felelőssége egy építészeti terv létrehozásáért, beleértve egy képi reprezentációt, amely bemutatja, hogy egy épület vagy más szerkezet hogyan fog kinézni, amikor elkészül. @hu
label: è architetto famiglia di @it
definition: Correla una famiglia a un'opera che implica una responsabilità di una famiglia nella creazione di un progetto architettonico, inclusa una rappresentazione pittorica destinata a mostrare come apparirà un edificio o altra struttura una volta completato. @it
toolkit label: architetto famiglia di @it
toolkit definition: Opera che implica una responsabilità di una famiglia nella creazione di un progetto architettonico, inclusa una rappresentazione pittorica destinata a mostrare come apparirà un edificio o altra struttura una volta completato. @it
label: είναι αρχιτέκτονας οικογένεια του @el
toolkit label: αρχιτέκτονας οικογένεια του @el
label: est une famille architecte de @fr
definition: Met une famille en relation avec une œuvre qui comporte une responsabilité de la part d’une famille en ce qui concerne une conception architecturale, y compris une représentation illustrée conçue pour montrer à quoi ressemblera un bâtiment ou une autre structure une fois la construction terminée. @fr
toolkit label: famille architecte de @fr
toolkit definition: Œuvre qui comporte une responsabilité de la part d’une famille consistant à créer une conception architecturale, y compris une représentation illustrée conçue pour montrer à quoi ressemblera un bâtiment ou une autre structure une fois la construction terminée. @fr
label: ir arhitekts (dzimta/ģimene) @lv
definition: Sasaista dzimtu/ģimeni ar darbu, kas ietver dzimtas/ģimenes atbildību par arhitektūras projekta radīšanu, ieskaitot projekta skici, lai parādītu, kā ēka vai cita struktūra izskatīsies, kad tā tiks pabeigta. @lv
toolkit label: ir arhitekts (dzimta/ģimene) @lv
toolkit definition: Darbs, kas ietver dzimtas/ģimenes atbildību par arhitektūras projekta radīšanu, ieskaitot projekta skici, lai parādītu, kā ēka vai cita struktūra izskatīsies, kad tā tiks pabeigta. @lv
label: 是……的建筑设计师家族 @zh-hans
definition: 将一个家族与涉及建筑设计（包括用于展示建筑或其他结构完成之后外观效果的绘画作品）创作的一个家族的责任的一种作品关联起来。 @zh-hans
toolkit label: ……的建筑设计师家族 @zh-hans
toolkit definition: 涉及建筑设计（包括用于展示建筑或其他结构完成之后外观效果的绘画作品）创作的一个家族的责任的一种作品 @zh-hans
has subproperty: maisema-arkkitehti (suku) teoksessa
has subproperty: P50982
label: mimar ailesidir @tr
definition: Bir aileyi, bir binanın veya başka bir yapının tamamlandığında nasıl görüneceğini göstermeyi amaçlayan resimsel bir temsil de dahil olmak üzere, bir ailenin mimari tasarım oluşturma sorumluluğunu içeren bir eserle ilişkilendirir. @tr
toolkit label: mimar aile @tr
toolkit definition: Bir binanın veya başka bir yapının tamamlandığında nasıl görüneceğini göstermeyi amaçlayan resimsel bir temsil de dahil olmak üzere, bir ailenin mimari tasarım oluşturma sorumluluğunu içeren bir çalışma. @tr

arkkitehti (henkilö) teoksessa
status: Published
label: is architect person of @en
lexical alias: architectPersonOf.en
definition: Relates a person to a work that involves a responsibility of a person for creating an architectural design, including a pictorial representation intended to show how a building or other structure will look when completed. @en
toolkit label: architect person of @en
toolkit definition: A work that involves a responsibility of a person for creating an architectural design, including a pictorial representation intended to show how a building or other structure will look when completed. @en
type: Property
domain: C10004
has element type: 2
sub property of: teoksen tekijä (henkilö) teoksessa
sub property of: arkkitehti (toimija) teoksessa
definition: Liittää henkilön teokseen, jossa henkilö on vastuussa arkkitehtisuunnitelman luomisesta, mukaan lukien kuvaesityksestä, jonka tarkoitus on näyttää, miltä rakennus tai muu rakennelma näyttää valmiina.
toolkit label: arkkitehti (henkilö) teoksessa
toolkit definition: Teos, jossa henkilö on vastuussa arkkitehtisuunnitelman luomisesta, mukaan lukien kuvaesityksestä, jonka tarkoitus on näyttää, miltä rakennus tai muu rakennelma näyttää valmiina.
label: er arkitekt for (person) @no
definition: Relaterer en person til et verk som involverer et ansvar for en person i form av arkitektonisk utforming, inkludert en gjengivelse i bildeform som er ment å vise hvordan en bygning eller annen struktur vil se ut når den er ferdig. @no
toolkit label: arkitekt for (person) @no
toolkit definition: Et verk som involverer et ansvar for en person i form av arkitektonisk utforming, inkludert en gjengivelse i bildeform som er ment å vise hvordan en bygning eller annen struktur vil se ut når den er ferdig. @no
label: is architect-persoon van @nl
definition: Relateert een persoon aan een werk dat met zich meebrengt een verantwoordelijkheid van een persoon voor het creëren van een architectonisch ontwerp, omvattende een picturale representatie bedoeld te laten zien hoe een gebouw of andere structuur er na voltooiing uit zal zien. @nl
toolkit label: architect-persoon van @nl
toolkit definition: Een werk dat met zich meebrengt een verantwoordelijkheid van een persoon voor het creëren van een architectonisch ontwerp, omvattende een picturale representatie bedoeld te laten zien hoe een gebouw of andere structuur er na voltooiing uit zal zien. @nl
label: هو شخص مهندس معماري لـ @ar
definition: يربط شخصا بعمل يترتب عليه مسئولية شخص عن إنشاء تصميم معماري، ويشمل ذلك إعداد عرض تصويري يبين كيف سيبدو المبنى أو أي بناء آخر عند اكتماله. @ar
toolkit label: شخص مهندس معماري @ar
toolkit definition: عمل يترتب عليه مسئولية شخص عن إنشاء تصميم معماري، ويشمل ذلك إعداد عرض تصويري يبين كيف سيبدو المبنى أو أي بناء آخر عند اكتماله. @ar
label: és persona arquitecta de @ca
definition: Relaciona una persona amb una obra que implica una responsabilitat d’una persona en la creació d’un disseny arquitectònic, inclosa una representació il·lustrada concebuda per mostrar com serà un edifici o qualsevol altra estructura una vegada complet. @ca
toolkit label: persona arquitecta de @ca
toolkit definition: Obra que implica una responsabilitat d’una persona en la creació d’un disseny arquitectònic, inclosa una representació il·lustrada concebuda per mostrar com serà un edifici o qualsevol altra estructura una vegada complet. @ca
label: er person, som er arkitekt af @da
definition: Relaterer en person til et værk, som involverer en persons ansvar for at skabe et arkitektonisk design, inkl. en billedrepræsentation, som skal vise, hvordan en bygning eller anden struktur vil se ud, når den er færdig. @da
toolkit label: person, som er arkitekt af @da
toolkit definition: Værk, som involverer en persons ansvar for at skabe et arkitektonisk design, inkl. en billedrepræsentation, som skal vise, hvordan en bygning eller anden struktur vil se ud, når den er færdig. @da
label: arhitekt (isik) teoses @et
definition: Seostab isiku teosega, mis sisaldab isiku vastutust arhitektuurse kujunduse loomise eest, k.a pildiline esitus näitamaks, kuidas ehitis või muu konstruktsioon valmides välja hakkab nägema. @et
toolkit label: arhitekt (isik) teoses @et
toolkit definition: Teos, mis sisaldab isiku vastutust arhitektuurse kujunduse loomise eest, k.a pildiline esitus näitamaks, kuidas ehitis või muu konstruktsioon valmides välja hakkab nägema. @et
label: ist Person als Architektin/Architekt von @de
definition: Setzt eine Person in Beziehung zu einem Werk, bei dem eine Person für die Schaffung eines architektonischen Entwurfs verantwortlich ist, einschließlich einer bildlichen Darstellung, die zeigt, wie ein Gebäude oder eine andere Konstruktion nach der Fertigstellung aussehen soll. @de
toolkit label: Person als Architektin/Architekt von @de
toolkit definition: Ein Werk, bei dem eine Person für die Schaffung eines architektonischen Entwurfs verantwortlich ist, einschließlich einer bildlichen Darstellung, die zeigt, wie ein Gebäude oder eine andere Konstruktion nach der Fertigstellung aussehen soll. @de
label: építész személye a következőnek: @hu
definition: Hozzákapcsol egy személyt egy műhöz, amelyhez hozzátartozik egy személy felelőssége egy építészeti terv létrehozásáért, beleértve egy képi reprezentációt, amely bemutatja, hogy egy épület vagy más szerkezet hogyan fog kinézni, amikor elkészül. @hu
toolkit label: építész személye: @hu
toolkit definition: Egy mű, amelyhez hozzátartozik egy személy felelőssége egy építészeti terv létrehozásáért, beleértve egy képi reprezentációt, amely bemutatja, hogy egy épület vagy más szerkezet hogyan fog kinézni, amikor elkészül. @hu
label: è architetto persona di @it
definition: Correla una persona a un'opera che implica una responsabilità di una persona nella creazione di un progetto architettonico, inclusa una rappresentazione pittorica destinata a mostrare come apparirà un edificio o altra struttura una volta completato. @it
toolkit label: architetto persona di @it
toolkit definition: Opera che implica una responsabilità di una persona nella creazione di un progetto architettonico, inclusa una rappresentazione pittorica destinata a mostrare come apparirà un edificio o altra struttura una volta completato. @it
label: είναι αρχιτέκτονας φυσικό πρόσωπο του @el
toolkit label: αρχιτέκτονας φυσικό πρόσωπο του @el
label: est une personne architecte de @fr
definition: Met une personne en relation avec une œuvre qui comporte une responsabilité de la part d’une personne en ce qui concerne une conception architecturale, y compris une représentation illustrée conçue pour montrer à quoi ressemblera un bâtiment ou une autre structure une fois la construction terminée. @fr
toolkit label: personne architecte de @fr
toolkit definition: Œuvre qui comporte une responsabilité de la part d’une personne consistant à créer une conception architecturale, y compris une représentation illustrée conçue pour montrer à quoi ressemblera un bâtiment ou une autre structure une fois la construction terminée. @fr
label: ir arhitekts (persona) @lv
definition: Sasaista personu ar darbu, kas ietver personas atbildību par arhitektūras projekta radīšanu, ieskaitot projekta skici, lai parādītu, kā ēka vai cita struktūra izskatīsies, kad tā tiks pabeigta. @lv
toolkit label: ir arhitekts (persona) @lv
toolkit definition: Darbs, kas ietver personas atbildību par arhitektūras projekta radīšanu, ieskaitot projekta skici, lai parādītu, kā ēka vai cita struktūra izskatīsies, kad tā tiks pabeigta. @lv
label: 是……的建筑设计师个人 @zh-hans
definition: 将一个个人与涉及建筑设计（包括用于展示建筑或其他结构完成之后外观效果的绘画作品）创作的个人的责任的一种作品关联起来。 @zh-hans
toolkit label: ……的建筑设计师个人 @zh-hans
toolkit definition: 涉及建筑设计（包括用于展示建筑或其他结构完成之后外观效果的绘画作品）创作的个人的责任的一种作品 @zh-hans
label: mimar kişisidir @tr
definition: Bir kişiyi, bir binanın veya başka bir yapının tamamlandığında nasıl görüneceğini göstermeyi amaçlayan görsel bir temsil de dahil olmak üzere, bir kişinin mimari bir tasarım oluşturma sorumluluğunu içeren bir eserle ilişkilendirir. @tr
toolkit label: mimar kişi @tr
toolkit definition: Bir binanın veya başka bir yapının tamamlandığında nasıl görüneceğini göstermeyi amaçlayan görsel bir temsil de dahil olmak üzere, bir kişinin mimari bir tasarım oluşturma sorumluluğunu içeren bir çalışma. @tr
has subproperty: maisema-arkkitehti (henkilö) teoksessa
has subproperty: P50529

sovittaja (toimija) ekspressiossa
status: Published
label: is arranger agent of music of @en
definition: Relates an agent to an expression that includes a contribution by an agent of rewriting a musical composition for a medium of performance different from that for which the work was originally intended. @en
type: Property
scope note: An arranger of music may also modify the work for the same medium of performance, etc., keeping the musical substance of the original composition essentially unchanged. @en
domain: C10002
sub property of: tarkastaja (toimija) ekspressiossa
lexical alias: arrangerAgentOfMusicOf.en
label: est un agent arrangeur de musique de @fr
definition: Met un agent en relation avec une expression qui intègre une contribution de la part d’un agent consistant à réécrire une composition musicale pour une distribution d’exécution différente de celle à laquelle l’œuvre était destinée à l’origine. @fr
scope note: Un arrangeur de musique peut aussi modifier l’œuvre pour la même distribution d’exécution, etc. tout en gardant la substance musicale de la composition originale essentiellement inchangée. @fr
toolkit label: agent arrangeur de musique de @fr
toolkit definition: Expression qui intègre une contribution de la part d’un agent consistant à réécrire une composition musicale pour une distribution d’exécution différente de celle à laquelle l’œuvre était destinée à l’origine. @fr
toolkit label: arranger agent of music of @en
toolkit definition: An expression that includes a contribution by an agent of rewriting a musical composition for a medium of performance different from that for which the work was originally intended. @en
see also: teoksen säveltäjä (toimija) musiikkiteoksessa
instruction number: 18.5
label: είναι διασκευαστής φορέας της μουσικής του @el
definition: Συνδέει έναν φορέα, ο οποίος συνεισφέρει σε μια έκφραση ενός μουσικού έργου μέσω της μεταγραφής της σύνθεσης για μέσο εκτέλεσης διαφορετικό από το πρωτότυπο, με μια έκφραση. @el
scope note: Ένας διασκευαστής μουσικής μπορεί επίσης να τροποποιήσει το έργο για το ίδιο μέσο εκτέλεσης κ.λπ. τηρώντας τη μουσική ουσία της πρωτότυπης σύνθεσης ουσιαστικά αμετάβλητη. @el
toolkit label: διασκευαστής φορέας της μουσικής του @el
toolkit definition: Μια έκφραση ενός μουσικού έργου που ενσωματώνει τη συνεισφορά της μεταγραφής της σύνθεσης για μέσο εκτέλεσης διαφορετικό από το πρωτότυπο. @el
definition: Setzt einen Akteur in Beziehung zu einer Expression, zu der ein Akteur beiträgt, indem er eine Komposition für eine bestimmte Besetzung umschreibt, die sich von der Originalbesetzung unterscheidet, für die das Werk ursprünglich konzipiert war. @de
scope note: Eine Arrangeurin/Ein Arrangeur kann das Werk auch für die gleiche Besetzung verändern und so weiter, solange die musikalische Substanz der Originalkomposition im Wesentlichen unverändert bleibt. @de
toolkit label: Akteur als Arrangeurin/Arrangeur von @de
toolkit definition: Eine Expression, zu der ein Akteur beiträgt, indem er eine Komposition für eine bestimmte Besetzung umschreibt, die sich von der Originalbesetzung unterscheidet, für die das Werk ursprünglich konzipiert war. @de
label: er agent, som er musikarrangør af @da
definition: Relaterer en agent til et udtryk, som omfatter en agents bidrag ved at omskrive en komposition til en anden besætning end den, værket oprindeligt var beregnet til. @da
scope note: En musikarrangør kan også modificere værket for samme besætning etc. og derved i alt væsentligt bevare den originale kompositions musikalske substans uændret. @da
toolkit label: agent, som er musikarrangør af @da
toolkit definition: Udtryk, som omfatter en agents bidrag ved at omskrive en komposition til en anden besætning end den, værket oprindeligt var beregnet til. @da
label: és agent arranjador de música de @ca
definition: Relaciona un agent amb una expressió que inclou una contribució d’un agent de reescriure una composició musical per a un repartiment d’execució diferent d’aquell per al qual l’obra va ser concebuda originalment. @ca
toolkit label: agent arranjador de música de @ca
toolkit definition: Expressió que inclou una contribució d’un agent de reescriure una composició musical per a un repartiment d’execució diferent d’aquell per al qual l’obra va ser concebuda originalment. @ca
definition: Liittää toimijan ekspressioon, jonka tekemiseen toimija osallistuu muokkaamalla sävellyksen alkuperäisteoksesta poikkeavalle esityskokoonpanolle.
scope note: Sovittaja voi myös muokata teosta samalle esityskokoonpanolle tms. säilyttäen alkuperäisen sävellyksen musiikillisen sisällön olennaisilta osin muuttumattomana.
toolkit label: sovittaja (toimija) ekspressiossa
toolkit definition: Ekspressio, jonka tekemiseen toimija osallistuu muokkaamalla sävellyksen alkuperäisteoksesta poikkeavalle esityskokoonpanolle.
toolkit label: arrangør av musikk for (agent) @no
toolkit definition: Et uttrykk som inkludrerer et bidrag fra en agent i form av omskriving av en musikalsk komposisjon for en annen besetning enn verket opprinnelig var ment for. @no
label: ist Akteur als Arrangeurin/Arrangeur von @de
has element type: 2
label: zenei hangszerelő ágense a következőnek: @hu
definition: Hozzákapcsol egy ágenst egy kifejezési formához, amely magában foglalja egy ágens közreműködését egy zenei kompozíció olyan előadásmédiumra átírásával, amely különbözik a műnek eredetileg szánt médiumtól. @hu
scope note: zenei hangszerelő ágense: @hu
toolkit label: Egy kifejezési forma, amely magában foglalja egy ágens közreműködését egy zenei kompozíció olyan előadásmédiumra átírásával, amely különbözik a műnek eredetileg szánt médiumtól. @hu
toolkit definition: zenei hangszerelője: @hu
alternative label: arranger of music of @en
alternative label: sovittajana musiikissa
label: er arrangør av musikk for (agent) @no
definition: Relaterer en agent til et uttrykk som inkludrerer et bidrag fra en agent i form av omskriving av en musikalsk komposisjon for en annen besetning enn verket opprinnelig var ment for. @no
scope note: En arrangør av musikk kan også gjøre endringer i verket for samme besetning etc., og beholde det musikalske innholdet av originalkomposisjonen hovedsaklig uendret. @no
alternative label: arrangør av musikk for @no
label: is arrangeur-actor van muziek van @nl
definition: Relateert een actor aan een expressie die omvat een bijdrage door een actor door herschrijven van een muzikale compositie voor een uitvoeringsmedium anders dan waarvoor het werk oorspronkelijk bedoeld was. @nl
scope note: Een arrangeur van muziek kan het werk ook bewerken voor hetzelfde uitvoeringsmedium etc., waarbij de muzikale inhoud van de originele compositie in essentie onveranderd gehouden wordt. @nl
toolkit label: arrangeur-actor van muziek van @nl
toolkit definition: Een expressie die omvat een bijdrage door een actor door herschrijven van een muzikale compositie voor een uitvoeringsmedium anders dan waarvoor het werk oorspronkelijk bedoeld was. @nl
label: هو وكيل موزع موسيقي لـ @ar
definition: يربط وكيلا بتعبيرة تتضمن إسهام وكيل في إعادة كتابة لحن موسيقي لوسيط أداء يختلف عن الوسيط الذي كان العمل مقررا له أصلاً. @ar
scope note: قد يقوم موزع موسيقي أيضًا بتعديل العمل بما يلائم وسيط الأداء ذاته، الخ، مع الإبقاء على اللحن الأصلي دون تغيير جوهري. @ar
alternative label: موزع موسيقي @ar
toolkit label: وكيل موزع موسيقي @ar
toolkit definition: تعبيرة تتضمن إسهام وكيل في إعادة كتابة لحن موسيقي لوسيط أداء يختلف عن الوسيط الذي كان العمل مقررا له أصلاً. @ar
scope note: Un arranjador de música també pot modificar l’obra per al mateix repartiment d’execució, etc., tot mantenint la substància musical de la composició original essencialment sense modificar. @ca
alternative label: arranjador de música de @ca
alternative label: musikarrangør af @da
label: muusika seadja (tegija) väljenduses @et
definition: Seostab tegija väljendusega, millesse tegija on andnud panuse, arranžeerides kompositsiooni esituskoosseisule, mis erineb sellest, millele teos oli algselt mõeldud. @et
scope note: Muusika seadja võib teose seada ka samale esituskoosseisule, muutmata olemuslikult algse kompositsiooni muusikalist sisu. @et
alternative label: muusika seadja väljenduses @et
toolkit label: muusika seadja (tegija) väljenduses @et
toolkit definition: Väljendus, millesse tegija on andnud panuse, arranžeerides kompositsiooni esituskoosseisule, mis erineb sellest, millele teos oli algselt mõeldud. @et
alternative label: Egy zenei hangszerelő módosíthatja a művet a mű elrendezéséhez egyező előadásmédiumra, stb., amikor alapvetően változatlanul megtartja az eredeti kompozíció zenei lényegét. @hu
label: è arrangiatore di musica agente di @it
definition: Correla un agente a un'espressione che include un contributo da parte di un agente nella riscrittura di una composizione musicale per uno strumento di esecuzione differente da quello per il quale l'opera era stata originariamente concepita. @it
scope note: Un arrangiatore di musica può anche modificare l'opera per lo stesso mezzo di esecuzione etc. mantenenendo essenzialmente immutata la sostanza musicale della composizione originale. @it
alternative label: arrangiatore di musica di @it

sovittaja (yhteistoimija) ekspressiossa
status: Published
label: is arranger collective agent of music of @en
lexical alias: arrangerCollectiveAgentOfMusicOf.en
definition: Relates a collective agent to an expression that includes a contribution by a collective agent of rewriting a musical composition for a medium of performance different from that for which the work was originally intended. @en
toolkit label: arranger collective agent of music of @en
toolkit definition: An expression that includes a contribution by a collective agent of rewriting a musical composition for a medium of performance different from that for which the work was originally intended. @en
type: Property
domain: C10011
has element type: 2
sub property of: tarkastaja (yhteistoimija) ekspressiossa
sub property of: sovittaja (toimija) ekspressiossa
scope note: An arranger of music may also modify the work for the same medium of performance, etc., keeping the musical substance of the original composition essentially unchanged. @en
definition: Liittää yhteistoimijan ekspressioon, jonka tekemisessä yhteistoimija on osallisena muokkaamalla sävellyksen alkuperäisteoksesta poikkeavalle esityskokoonpanolle.
scope note: Sovittaja voi myös muokata teosta samalle esityskokoonpanolle tms. säilyttäen alkuperäisen sävellyksen musiikillisen sisällön olennaisilta osin muuttumattomana.
toolkit label: sovittaja (yhteistoimija) ekspressiossa
toolkit definition: Ekspressio, jonka tekemisessä yhteistoimija on osallisena muokkaamalla sävellyksen alkuperäisteoksesta poikkeavalle esityskokoonpanolle.
label: er arrangør av musikk for (kollektiv agent) @no
definition: Relaterer en kollektiv agent til et uttrykk som inkluderer et bidrag fra en kollektiv agent i form av å omskrive en komposisjon for en annen besetning enn verket opprinnelig var ment for. @no
scope note: En arrangør av musikk kan også endre verket for samme besetning etc. der originalkomposisjonens musikalske substans forblir hovedsakelig uendret. @no
toolkit label: arrangør av musikk for (kollektiv agent) @no
toolkit definition: Et uttrykk som inkluderer et bidrag fra en kollektiv agent i form av å omskrive en komposisjon for en annen besetning enn verket opprinnelig var ment for. @no
label: is arrangeur-collectieve actor van muziek van @nl
definition: Relateert een collectieve actor aan een expressie die omvat een bijdrage door een collectieve actor door herschrijven van een muzikale compositie voor een uitvoeringsmedium anders dan waarvoor het werk oorspronkelijk bedoeld was. @nl
scope note: Een arrangeur van muziek kan het werk ook bewerken voor hetzelfde uitvoeringsmedium etc., waarbij de muzikale inhoud van de originele compositie in essentie onveranderd gehouden wordt. @nl
toolkit label: arrangeur-collectieve actor van muziek van @nl
toolkit definition: Een expressie die omvat een bijdrage door een collectieve actor door herschrijven van een muzikale compositie voor een uitvoeringsmedium anders dan waarvoor het werk oorspronkelijk bedoeld was. @nl
label: هو وكيل جماعي موزع موسيقى لـ @ar
definition: يربط وكيلا جماعيا بتعبيرة تتضمن إسهام وكيل جماعي في إعادة كتابة لحن موسيقي لوسيط أداء يختلف عن الوسيط الذي كان العمل مقررا له أصلاً. @ar
scope note: قد يقوم موزع موسيقي أيضًا بتعديل العمل بما يلائم وسيط الأداء نفسه، الخ، مع الإبقاء على اللحن الأصلي دون تغيير جوهري. @ar
toolkit label: وكيل جماعي موزع موسيقى @ar
toolkit definition: تعبيرة تتضمن إسهام وكيل جماعي في إعادة كتابة لحن موسيقي لوسيط أداء يختلف عن الوسيط الذي كان العمل مقررا له أصلاً. @ar
label: és agent col·lectiu arranjador de música de @ca
definition: Relaciona un agent col·lectiu amb una expressió que inclou una contribució d’un agent col·lectiu de reescriure una composició musical per a un repartiment d’execució diferent d’aquell per al qual l’obra va ser concebuda originalment. @ca
scope note: Un arranjador de música també pot modificar l’obra per al mateix repartiment d’execució, etc., tot mantenint la substància musical de la composició original essencialment sense modificar. @ca
toolkit label: agent col·lectiu arranjador de música de @ca
toolkit definition: Expressió que inclou una contribució d’un agent col·lectiu de reescriure una composició musical per a un repartiment d’execució diferent d’aquell per al qual l’obra va ser concebuda originalment. @ca
label: er kollektiv agent, som er musikarrangør af @da
definition: Relaterer en kollektiv agent til et udtryk, som omfatter en kollektiv agents bidrag ved at omskrive en komposition til en anden besætning end den, værket oprindeligt var beregnet til. @da
scope note: En musikarrangør kan også modificere værket for samme besætning etc. og derved i alt væsentligt bevare den originale kompositions musikalske substans uændret. @da
toolkit label: kollektiv agent, som er musikarrangør af @da
toolkit definition: Udtryk, som omfatter en kollektiv agents bidrag ved at omskrive en komposition til en anden besætning end den, værket oprindeligt var beregnet til. @da
label: muusika seadja (kollektiiv) väljenduses @et
definition: Seostab kollektiivi väljendusega, millesse kollektiiv on andnud panuse, arranžeerides kompositsiooni esituskoosseisule, mis erineb sellest, millele teos oli algselt mõeldud. @et
scope note: Muusika seadja võib teose seada ka samale esituskoosseisule, muutmata olemuslikult algse kompositsiooni muusikalist sisu. @et
toolkit label: muusika seadja (kollektiiv) väljenduses @et
toolkit definition: Väljendus, millesse kollektiiv on andnud panuse, arranžeerides kompositsiooni esituskoosseisule, mis erineb sellest, millele teos oli algselt mõeldud. @et
label: ist gemeinschaftlicher Akteur als Arrangeurin/Arrangeur von @de
definition: Setzt einen gemeinschaftlichen Akteur in Beziehung zu einer Expression, zu der ein gemeinschaftlicher Akteur beiträgt, indem er eine Komposition für eine bestimmte Besetzung umschreibt, die sich von der Originalbesetzung unterscheidet, für die das Werk ursprünglich konzipiert war. @de
scope note: Eine Arrangeurin/Ein Arrangeur kann das Werk auch für die gleiche Besetzung verändern und so weiter, solange die musikalische Substanz der Originalkomposition im Wesentlichen unverändert bleibt. @de
toolkit label: Gemeinschaftlicher Akteur als Arrangeurin/Arrangeur von @de
toolkit definition: Eine Expression, zu der ein gemeinschaftlicher Akteur beiträgt, indem er eine Komposition für eine bestimmte Besetzung umschreibt, die sich von der Originalbesetzung unterscheidet, für die das Werk ursprünglich konzipiert war. @de
label: zenei hangszerelő kollektív ágense a következőnek: @hu
definition: Hozzákapcsol egy kollektív ágenst egy kifejezési formához, amely magában foglalja egy kollektív ágens közreműködését zenei kompozíció olyan előadásmédiumra átírásával, amely különbözik a műnek eredetileg szánt médiumtól. @hu
scope note: Egy zenei hangszerelő módosíthatja a művet a mű elrendezéséhez egyező előadásmédiumra, stb., amikor alapvetően változatlanul megtartja az eredeti kompozíció zenei lényegét. @hu
toolkit label: zenei hangszerelő kollektív ágense: @hu
toolkit definition: Egy kifejezési forma, amely magában foglalja egy kollektív ágens közreműködését zenei kompozíció olyan előadásmédiumra átírásával, amely különbözik a műnek eredetileg szánt médiumtól. @hu
label: è arrangiatore agente collettivo di musica di @it
definition: Correla un agente collettivo a un'espressione che comprende un contributo di un agente collettivo per riscrivere una composizione musicale per un mezzo di esecuzione diverso da quello per il quale l'opera era originariamente intesa. @it
scope note: Un arrangiatore di musica può anche modificare l'opera per lo stesso mezzo di esecuzione, etc., mantenendo sostanzialmente immutata la sostanza musicale della composizione originale. @it
toolkit label: arrangiatore agente collettivo di musica di @it
toolkit definition: Espressione che comprende un contributo di un agente collettivo per riscrivere una composizione musicale per un mezzo di esecuzione diverso da quello per il quale il lavoro era originariamente inteso. @it
label: είναι διασκευαστής συλλογικός φορέας της μουσικής του @el
toolkit label: διασκευαστής συλλογικός φορέας της μουσικής του @el
label: est un agent collectif arrangeur de musique de @fr
definition: Met un agent collectif en relation avec une expression qui intègre une contribution de la part d’un agent collectif consistant à réécrire une composition musicale pour une distribution d’exécution différente de celle à laquelle l’œuvre était destinée à l’origine. @fr
scope note: Un arrangeur de musique peut aussi modifier l’œuvre pour la même distribution d’exécution, etc. tout en gardant la substance musicale de la composition originale essentiellement inchangée. @fr
toolkit label: agent collectif arrangeur de musique de @fr
toolkit definition: Expression qui intègre une contribution de la part d’un agent collectif consistant à réécrire une composition musicale pour une distribution d’exécution différente de celle à laquelle l’œuvre était destinée à l’origine. @fr
label: ir aranžētājs (grupa) @lv
definition: Sasaista grupu ar izteiksmi, kas ietver grupas ieguldījumu, pārrakstot mūzikas kompozīciju izpildījumam, kas atšķirīgs no tā, kas sākotnēji bija paredzēts. @lv
toolkit label: ir aranžētājs (grupa) @lv
toolkit definition: Izteiksme, kas ietver grupas ieguldījumu, pārrakstot mūzikas kompozīciju izpildījumam, kas atšķirīgs no tā, kas sākotnēji bija paredzēts. @lv
scope note: Mūzikas aranžētājs var arī pārveidot darbu tam pašam izpildījumam, u. tml. saglabājot oriģinālās kompozīcijas muzikālo būtību nemainīgu. @lv
label: 是……的音乐改编者集体行为者 @zh-hans
definition: 将一个集体行为者与包括一个改写音乐作曲用于不同于其最初意图的一个表演媒介的一个集体行为者的贡献的一种内容表达关联起来。 @zh-hans
toolkit label: ……的音乐改编者集体行为者 @zh-hans
toolkit definition: 包括一个改写音乐作曲用于不同于其最初意图的一个表演媒介的一个集体行为者的贡献的一种内容表达 @zh-hans
scope note: 音乐的改编者也可以保留原作曲基本内容修改为同一个表演媒体等的作品 @zh-hans
label: müziğinin aranjör kolektif temsilcisidir @tr

sovittaja (yhteisö) ekspressiossa
status: Published
label: is arranger corporate body of music of @en
lexical alias: arrangerCorporateBodyOfMusicOf.en
definition: Relates a corporate body to an expression that includes a contribution by a corporate body of rewriting a musical composition for a medium of performance different from that for which the work was originally intended. @en
toolkit label: arranger corporate body of music of @en
toolkit definition: An expression that includes a contribution by a corporate body of rewriting a musical composition for a medium of performance different from that for which the work was originally intended. @en
type: Property
domain: C10005
has element type: 2
sub property of: tarkastaja (yhteisö) ekspressiossa
sub property of: sovittaja (yhteistoimija) ekspressiossa
scope note: An arranger of music may also modify the work for the same medium of performance, etc., keeping the musical substance of the original composition essentially unchanged. @en
definition: Liittää yhteisön ekspressioon, jonka tekemisessä yhteisö on osallisena muokkaamalla sävellyksen alkuperäisteoksesta poikkeavalle esityskokoonpanolle.
scope note: Sovittaja voi myös muokata teosta samalle esityskokoonpanolle tms. säilyttäen alkuperäisen sävellyksen musiikillisen sisällön olennaisilta osin muuttumattomana.
toolkit label: sovittaja (yhteisö) ekspressiossa
toolkit definition: Ekspressio, jonka tekemisessä yhteisö on osallisena muokkaamalla sävellyksen alkuperäisteoksesta poikkeavalle esityskokoonpanolle.
label: er arrangør av musikk for (korporasjon) @no
definition: Relaterer en korporasjon til et uttrykk som inkluderer et bidrag fra en korporasjon i form av å omskrive en komposisjon for en annen besetning enn verket opprinnelig var ment for. @no
scope note: En arrangør av musikk kan også endre verket for samme besetning etc. der originalkomposisjonens musikalske substans forblir hovedsakelig uendret. @no
toolkit label: arrangør av musikk for (korporasjon) @no
toolkit definition: Et uttrykk som inkluderer et bidrag fra en korporasjon i form av å omskrive en komposisjon for en annen besetning enn verket opprinnelig var ment for. @no
label: is arrangeur-corporatie van muziek van @nl
definition: Relateert een corporatie aan een expressie die omvat een bijdrage door een corporatie door herschrijven van een muzikale compositie voor een uitvoeringsmedium anders dan waarvoor het werk oorspronkelijk bedoeld was. @nl
scope note: Een arrangeur van muziek kan het werk ook bewerken voor hetzelfde uitvoeringsmedium etc., waarbij de muzikale inhoud van de originele compositie in essentie onveranderd gehouden wordt. @nl
toolkit label: arrangeur-corporatie van muziek van @nl
toolkit definition: Een expressie die omvat een bijdrage door een corporatie door herschrijven van een muzikale compositie voor een uitvoeringsmedium anders dan waarvoor het werk oorspronkelijk bedoeld was. @nl
label: هي هيئة مسئولة عن التوزيع الموسيقي لـ @ar
definition: يربط هيئة بتعبيرة تتضمن إسهام هيئة في إعادة كتابة لحن موسيقي لوسيط أداء يختلف عن الوسيط الذي كان العمل مقررا له أصلاً. @ar
scope note: قد يقوم موزع موسيقي أيضًا بتعديل العمل بما يلائم وسيط الأداء نفسه، الخ، مع الإبقاء على اللحن الأصلي دون تغيير جوهري. @ar
toolkit label: هيئة مسئولة عن التوزيع الموسيقي @ar
toolkit definition: تعبيرة تتضمن إسهام هيئة في إعادة كتابة لحن موسيقي لوسيط أداء يختلف عن الوسيط الذي كان العمل مقررا له أصلاً. @ar
label: és entitat corporativa arranjadora de música de @ca
definition: Relaciona una entitat corporativa amb una expressió que inclou una contribució d’una entitat corporativa de reescriure una composició musical per a un repartiment d’execució diferent d’aquell per al qual l’obra va ser concebuda originalment. @ca
scope note: Un arranjador de música també pot modificar l’obra per al mateix repartiment d’execució, etc., tot mantenint la substància musical de la composició original essencialment sense modificar. @ca
toolkit label: entitat corporativa arranjadora de música de @ca
toolkit definition: Expressió que inclou una contribució d’una entitat corporativa de reescriure una composició musical per a un repartiment d’execució diferent d’aquell per al qual l’obra va ser concebuda originalment. @ca
label: er korporation, som er musikarrangør af @da
definition: Relaterer en korporation til et udtryk, som omfatter en korporations bidrag ved at omskrive en komposition til en anden besætning end den, værket oprindeligt var beregnet til. @da
scope note: En musikarrangør kan også modificere værket for samme besætning etc. og derved i alt væsentligt bevare den originale kompositions musikalske substans uændret. @da
toolkit label: korporation, som er musikarrangør af @da
toolkit definition: Udtryk, som omfatter en korporations bidrag ved at omskrive en komposition til en anden besætning end den, værket oprindeligt var beregnet til. @da
label: muusika seadja (asutus) väljenduses @et
definition: Seostab asutuse väljendusega, millesse asutus on andnud panuse, arranžeerides kompositsiooni esituskoosseisule, mis erineb sellest, millele teos oli algselt mõeldud. @et
scope note: Muusika seadja võib teose seada ka samale esituskoosseisule, muutmata olemuslikult algse kompositsiooni muusikalist sisu. @et
toolkit label: muusika seadja (asutus) väljenduses @et
toolkit definition: Väljendus, millesse asutus on andnud panuse, arranžeerides kompositsiooni esituskoosseisule, mis erineb sellest, millele teos oli algselt mõeldud. @et
label: ist Körperschaft als Arrangeurin/Arrangeur von @de
definition: Setzt eine Körperschaft in Beziehung zu einer Expression, zu der eine Körperschaft beiträgt, indem sie eine Komposition für eine bestimmte Besetzung umschreibt, die sich von der Originalbesetzung unterscheidet, für die das Werk ursprünglich konzipiert war. @de
scope note: Eine Arrangeurin/Ein Arrangeur kann das Werk auch für die gleiche Besetzung verändern und so weiter, solange die musikalische Substanz der Originalkomposition im Wesentlichen unverändert bleibt. @de
toolkit label: Körperschaft als Arrangeurin/Arrangeur von @de
toolkit definition: Eine Expression, zu der eine Körperschaft beiträgt, indem sie eine Komposition für eine bestimmte Besetzung umschreibt, die sich von der Originalbesetzung unterscheidet, für die das Werk ursprünglich konzipiert war. @de
label: zenei hangszerelő testülete a következőnek: @hu
definition: Hozzákapcsol egy testületet egy kifejezési formához, amely magában foglalja egy testület közreműködését zenei kompozíció olyan előadásmédiumra átírásával, amely különbözik a műnek eredetileg szánt médiumtól. @hu
scope note: Egy zenei hangszerelő módosíthatja a művet a művével egyező előadásmédiumra, stb., amikor alapvetően változatlanul megtartja az eredeti kompozíció zenei lényegét. @hu
toolkit label: zenei hangszerelő testülete: @hu
toolkit definition: Egy kifejezési forma, amely magában foglalja egy testület közreműködését zenei kompozíció olyan előadásmédiumra átírásával, amely különbözik a műnek eredetileg szánt médiumtól. @hu
label: è arrangiatore ente di musica di @it
definition: Correla un ente a un'espressione che comprende un contributo di un ente per riscrivere una composizione musicale per un mezzo di esecuzione diverso da quello per cui l'opera era originariamente intesa. @it
scope note: Un arrangiatore di musica può anche modificare l'opera per lo stesso mezzo di esecuzione, etc., mantenendo sostanzialmente immutata la sostanza musicale della composizione originale. @it
toolkit label: arrangiatore ente di musica di @it
toolkit definition: Espressione che comprende un contributo di un ente per riscrivere una composizione musicale per un mezzo di esecuzione diverso da quello per cui l'opera era originariamente intesa. @it
label: είναι διασκευαστής συλλογικό όργανο της μουσικής του @el
scope note: Ένας διασκευαστής μουσικής μπορεί επίσης να τροποποιήσει το έργο για το ίδιο μέσο εκτέλεσης κ.λπ. τηρώντας τη μουσική ουσία της πρωτότυπης σύνθεσης ουσιαστικά αμετάβλητη. @el
toolkit label: διασκευαστής συλλογικό όργανο της μουσικής του @el
label: est une collectivité arrangeuse de musique de @fr
definition: Met une collectivité en relation avec une expression qui intègre une contribution de la part d’une collectivité consistant à réécrire une composition musicale pour une distribution d’exécution différente de celle à laquelle l’œuvre était destinée à l’origine. @fr
scope note: Un arrangeur de musique peut aussi modifier l’œuvre pour la même distribution d’exécution, etc. tout en gardant la substance musicale de la composition originale essentiellement inchangée. @fr
toolkit label: collectivité arrangeuse de musique de @fr
toolkit definition: Expression qui intègre une contribution de la part d’une collectivité consistant à réécrire une composition musicale pour une distribution d’exécution différente de celle à laquelle l’œuvre était destinée à l’origine. @fr
label: ir aranžētājs (institūcija) @lv
definition: Sasaista institūciju ar izteiksmi, kas ietver institūcijas ieguldījumu, pārrakstot mūzikas kompozīciju izpildījumam, kas atšķirīgs no tā, kas sākotnēji bija paredzēts. @lv
toolkit label: ir aranžētājs (institūcija) @lv
toolkit definition: Izteiksme, kas ietver institūcijas ieguldījumu, pārrakstot mūzikas kompozīciju izpildījumam, kas atšķirīgs no tā, kas sākotnēji bija paredzēts. @lv
scope note: Mūzikas aranžētājs var arī pārveidot darbu tam pašam izpildījumam, u. tml. saglabājot oriģinālās kompozīcijas muzikālo būtību nemainīgu. @lv
label: 是……的音乐改编者团体 @zh-hans
definition: 将一个团体与包括一个改写音乐作曲用于不同于其最初意图的一个表演媒介的一个团体的贡献的一种内容表达关联起来。 @zh-hans
toolkit label: ……的音乐改编者团体 @zh-hans
toolkit definition: 包括一个改写音乐作曲用于不同于其最初意图的一个表演媒介的一个团体的贡献的一种内容表达 @zh-hans
scope note: 音乐的改编者也可以保留原作曲基本内容修改为同一个表演媒体等的作品 @zh-hans

sovittaja (suku) ekspressiossa
status: Published
label: is arranger family of music of @en
lexical alias: arrangerFamilyOfMusicOf.en
definition: Relates a family to an expression that includes a contribution by a family of rewriting a musical composition for a medium of performance different from that for which the work was originally intended. @en
toolkit label: arranger family of music of @en
toolkit definition: An expression that includes a contribution by a family of rewriting a musical composition for a medium of performance different from that for which the work was originally intended. @en
type: Property
domain: C10008
has element type: 2
sub property of: tarkastaja (suku) ekspressiossa
sub property of: sovittaja (yhteistoimija) ekspressiossa
scope note: An arranger of music may also modify the work for the same medium of performance, etc., keeping the musical substance of the original composition essentially unchanged. @en
definition: Liittää suvun ekspressioon, jonka tekemisessä suku on osallisena muokkaamalla sävellyksen alkuperäisteoksesta poikkeavalle esityskokoonpanolle.
scope note: Sovittaja voi myös muokata teosta samalle esityskokoonpanolle tms. säilyttäen alkuperäisen sävellyksen musiikillisen sisällön olennaisilta osin muuttumattomana. Tähän ei sisälly laaja muokkaaminen, joka johtaa uuden musiikkiteoksen luomiseen.
toolkit label: sovittaja (suku) ekspressiossa
toolkit definition: Ekspressio, jonka tekemisessä suku on osallisena muokkaamalla sävellyksen alkuperäisteoksesta poikkeavalle esityskokoonpanolle.
label: er arrangør av musikk for (familie) @no
definition: Relaterer en familie til et uttrykk som inkluderer et bidrag fra en familie i form av å omskrive en komposisjon for en annen besetning enn verket opprinnelig var ment for. @no
scope note: En arrangør av musikk kan også endre verket for samme besetning etc. der originalkomposisjonens musikalske substans forblir hovedsakelig uendret. @no
toolkit label: arrangør av musikk for (familie) @no
toolkit definition: Et uttrykk som inkluderer et bidrag fra en familie i form av å omskrive en komposisjon for en annen besetning enn verket opprinnelig var ment for. @no
label: is arrangeur-familie van muziek van @nl
definition: Relateert een familie aan een expressie die omvat een bijdrage door een familie door herschrijven van een muzikale compositie voor een uitvoeringsmedium anders dan waarvoor het werk oorspronkelijk bedoeld was. @nl
scope note: Een arrangeur van muziek kan het werk ook bewerken voor hetzelfde uitvoeringsmedium etc., waarbij de muzikale inhoud van de originele compositie in essentie onveranderd gehouden wordt. @nl
toolkit label: arrangeur-familie van muziek van @nl
toolkit definition: Een expressie die omvat een bijdrage door een familie door herschrijven van een muzikale compositie voor een uitvoeringsmedium anders dan waarvoor het werk oorspronkelijk bedoeld was. @nl
label: هي عائلة مسئولة عن التوزيع الموسيقى لـ @ar
definition: يربط عائلة بتعبيرة تتضمن إسهام عائلة في إعادة كتابة لحن موسيقي لوسيط أداء يختلف عن الوسيط الذي كان العمل مقررا له أصلاً. @ar
scope note: قد يقوم موزع موسيقي أيضًا بتعديل العمل بما يلائم وسيط الأداء نفسه، الخ، مع الإبقاء على اللحن الأصلي دون تغيير جوهري. @ar
toolkit label: عائلة مسئولة عن التوزيع الموسيقى @ar
toolkit definition: تعبيرة تتضمن إسهام عائلة في إعادة كتابة تأليف موسيقي لوسيط الأداء يختلف عن ذلك الذي كان الغرض من العمل أصلاً. @ar
label: és família arranjadora de música de @ca
definition: Relaciona una família amb una expressió que inclou una contribució d’una família de reescriure una composició musical per a un repartiment d’execució diferent d’aquell per al qual l’obra va ser concebuda originalment. @ca
scope note: Un arranjador de música també pot modificar l’obra per al mateix repartiment d’execució, etc., tot mantenint la substància musical de la composició original essencialment sense modificar. @ca
toolkit label: família arranjadora de música de @ca
toolkit definition: Expressió que inclou una contribució d’una família de reescriure una composició musical per a un repartiment d’execució diferent d’aquell per al qual l’obra va ser concebuda originalment. @ca
label: er familie, som er musikarrangør af @da
definition: Relaterer en familie til et udtryk, som omfatter en families bidrag ved at omskrive en komposition til en anden besætning end den, værket oprindeligt var beregnet til. @da
scope note: En musikarrangør kan også modificere værket for samme besætning etc. og derved i alt væsentligt bevare den originale kompositions musikalske substans uændret. @da
toolkit label: familie, som er musikarrangør af @da
toolkit definition: Udtryk, som omfatter en families bidrag ved at omskrive en komposition til en anden besætning end den, værket oprindeligt var beregnet til. @da
label: muusika seadja (perekond) väljenduses @et
definition: Seostab perekonna väljendusega, millesse perekond on andnud panuse, arranžeerides kompositsiooni esituskoosseisule, mis erineb sellest, millele teos oli algselt mõeldud. @et
scope note: Muusika seadja võib teose seada ka samale esituskoosseisule, muutmata olemuslikult algse kompositsiooni muusikalist sisu. @et
toolkit label: muusika seadja (perekond) väljenduses @et
toolkit definition: Väljendus, millesse perekond on andnud panuse, arranžeerides kompositsiooni esituskoosseisule, mis erineb sellest, millele teos oli algselt mõeldud. @et
label: ist Familie als Arrangeurin/Arrangeur von @de
definition: Setzt eine Familie in Beziehung zu einer Expression, zu der eine Familie beiträgt, indem sie eine Komposition für eine bestimmte Besetzung umschreibt, die sich von der Originalbesetzung unterscheidet, für die das Werk ursprünglich konzipiert war. @de
scope note: Eine Arrangeurin/Ein Arrangeur kann das Werk auch für die gleiche Besetzung verändern und so weiter, solange die musikalische Substanz der Originalkomposition im Wesentlichen unverändert bleibt. @de
toolkit label: Familie als Arrangeurin/Arrangeur von @de
toolkit definition: Eine Expression, zu der eine Familie beiträgt, indem sie eine Komposition für eine bestimmte Besetzung umschreibt, die sich von der Originalbesetzung unterscheidet, für die das Werk ursprünglich konzipiert war. @de
label: zenei hangszerelő családja a következőnek: @hu
definition: Hozzákapcsol egy családot egy kifejezési formához, amely magában foglalja egy család közreműködését zenei kompozíció olyan előadásmédiumra átírásával, amely különbözik a műnek eredetileg szánt médiumtól. @hu
scope note: Egy zenei hangszerelő módosíthatja a művet a művével egyező előadásmédiumra, stb., amikor alapvetően változatlanul megtartja az eredeti kompozíció zenei lényegét. @hu
toolkit label: zenei hangszerelő családja: @hu
toolkit definition: Egy kifejezési forma, amely magában foglalja egy család közreműködését zenei kompozíció olyan előadásmédiumra átírásával, amely különbözik a műnek eredetileg szánt médiumtól. @hu
label: è arrangiatore famiglia di musica di @it
definition: Correla una famiglia a un'espressione che comprende un contributo di una famiglia per riscrivere una composizione musicale per un mezzo di esecuzione diverso da quello per cui l'opera era originariamente intesa. @it
scope note: Un arrangiatore di musica può anche modificare l'opera per lo stesso mezzo di esecuzione, etc., mantenendo sostanzialmente immutata la sostanza musicale della composizione originale. @it
toolkit label: arrangiatore famiglia di musica di @it
toolkit definition: Espressione che comprende un contributo di una famiglia per riscrivere una composizione musicale per un mezzo di esecuzione diverso da quello per cui l'opera era originariamente intesa. @it
label: είναι διασκευαστής οικογένεια της μουσικής του @el
scope note: Ένας διασκευαστής μουσικής μπορεί επίσης να τροποποιήσει το έργο για το ίδιο μέσο εκτέλεσης κ.λπ. τηρώντας τη μουσική ουσία της πρωτότυπης σύνθεσης ουσιαστικά αμετάβλητη. @el
toolkit label: διασκευαστής οικογένεια της μουσικής του @el
label: est une famille arrangeuse de musique de @fr
definition: Met une famille en relation avec une expression qui intègre une contribution de la part d’une famille consistant à réécrire une composition musicale pour une distribution d’exécution différente de celle à laquelle l’œuvre était destinée à l’origine. @fr
scope note: Un arrangeur de musique peut aussi modifier l’œuvre pour la même distribution d’exécution, etc. tout en gardant la substance musicale de la composition originale essentiellement inchangée. @fr
toolkit label: famille arrangeuse de musique de @fr
toolkit definition: Expression qui intègre une contribution de la part d’une famille consistant à réécrire une composition musicale pour une distribution d’exécution différente de celle à laquelle l’œuvre était destinée à l’origine. @fr
label: ir aranžētājs (dzimta/ģimene) @lv
definition: Sasaista dzimtu/ģimeni ar izteiksmi, kas ietver dzimtas/ģimenes ieguldījumu, pārrakstot mūzikas kompozīciju izpildījumam, kas atšķirīgs no tā, kas sākotnēji bija paredzēts. @lv
toolkit label: ir aranžētājs (dzimta/ģimene) @lv
toolkit definition: Izteiksme, kas ietver dzimtas/ģimenes ieguldījumu, pārrakstot mūzikas kompozīciju izpildījumam, kas atšķirīgs no tā, kas sākotnēji bija paredzēts. @lv
scope note: Mūzikas aranžētājs var arī pārveidot darbu tam pašam izpildījumam, u. tml. saglabājot oriģinālās kompozīcijas muzikālo būtību nemainīgu. @lv
label: 是……的音乐改编者家族 @zh-hans
definition: 将一个家族与包括一个改写音乐作曲用于不同于其最初意图的一个表演媒介的一个家族的贡献的一种内容表达关联起来。 @zh-hans
toolkit label: ……的音乐改编者家族 @zh-hans
toolkit definition: 包括一个改写音乐作曲用于不同于其最初意图的一个表演媒介的一个家族的贡献的一种内容表达 @zh-hans
scope note: 音乐的改编者也可以保留原作曲基本内容修改为同一个表演媒介等的作品 @zh-hans

sovittaja (henkilö) ekspressiossa
status: Published
label: is arranger person of music of @en
lexical alias: arrangerPersonOfMusicOf.en
definition: Relates a person to an expression that includes a contribution by a person of rewriting a musical composition for a medium of performance different from that for which the work was originally intended. @en
toolkit label: arranger person of music of @en
toolkit definition: An expression that includes a contribution by a person of rewriting a musical composition for a medium of performance different from that for which the work was originally intended. @en
type: Property
domain: C10004
has element type: 2
sub property of: tarkastaja (henkilö) ekspressiossa
sub property of: sovittaja (toimija) ekspressiossa
scope note: An arranger of music may also modify the work for the same medium of performance, etc., keeping the musical substance of the original composition essentially unchanged. @en
definition: Liittää henkilön ekspressioon, jonka tekemisessä henkilö on osallisena muokkaamalla sävellyksen alkuperäisteoksesta poikkeavalle esityskokoonpanolle.
scope note: Sovittaja voi myös muokata teosta samalle esityskokoonpanolle tms. säilyttäen alkuperäisen sävellyksen musiikillisen sisällön olennaisilta osin muuttumattomana.
toolkit label: sovittaja (henkilö) ekspressiossa
toolkit definition: Ekspressio, jonka tekemisessä henkilö on osallisena muokkaamalla sävellyksen alkuperäisteoksesta poikkeavalle esityskokoonpanolle.
label: er arrangør av musikk for (person) @no
definition: Relaterer en person til et uttrykk som inkluderer et bidrag fra en person i form av å omskrive en komposisjon for en annen besetning enn verket opprinnelig var ment for. @no
scope note: En arrangør av musikk kan også endre verket for samme besetning etc. der originalkomposisjonens musikalske substans forblir hovedsakelig uendret. @no
toolkit label: arrangør av musikk for (person) @no
toolkit definition: Et uttrykk som inkluderer et bidrag fra en person i form av å omskrive en komposisjon for en annen besetning enn verket opprinnelig var ment for. @no
label: is arrangeur-persoon van muziek van @nl
definition: Relateert een persoon aan een expressie die omvat een bijdrage door een persoon door herschrijven van een muzikale compositie voor een uitvoeringsmedium anders dan waarvoor het werk oorspronkelijk bedoeld was. @nl
scope note: Een arrangeur van muziek kan het werk ook bewerken voor hetzelfde uitvoeringsmedium etc., waarbij de muzikale inhoud van de originele compositie in essentie onveranderd gehouden wordt. @nl
toolkit label: arrangeur-persoon van muziek van @nl
toolkit definition: Een expressie die omvat een bijdrage door een persoon door herschrijven van een muzikale compositie voor een uitvoeringsmedium anders dan waarvoor het werk oorspronkelijk bedoeld was. @nl
label: هو شخص موزع موسيقى لـ @ar
definition: يربط وكيلا بتعبيرة تتضمن إسهام وكيل في إعادة كتابة لحن موسيقي لوسيط أداء يختلف عن الوسيط الذي كان العمل مقررا له أصلاً. @ar
scope note: قد يقوم موزع موسيقي أيضًا بتعديل العمل بما يلائم وسيط الأداء نفسه، الخ، مع الإبقاء على اللحن الأصلي دون تغيير جوهري. @ar
toolkit label: شخص موزع موسيقى @ar
toolkit definition: تعبيرة تتضمن إسهام شخص في إعادة كتابة لحن موسيقي لوسيط أداء يختلف عن الوسيط الذي كان العمل مقررا له أصلاً. @ar
label: és persona arranjadora de música de @ca
definition: Relaciona una persona amb una expressió que inclou una contribució d’una persona de reescriure una composició musical per a un repartiment d’execució diferent d’aquell per al qual l’obra va ser concebuda originalment. @ca
scope note: Un arranjador de música també pot modificar l’obra per al mateix repartiment d’execució, etc., tot mantenint la substància musical de la composició original essencialment sense modificar. @ca
toolkit label: persona arranjadora de música de @ca
toolkit definition: Expressió que inclou una contribució d’una persona de reescriure una composició musical per a un repartiment d’execució diferent d’aquell per al qual l’obra va ser concebuda originalment. @ca
label: er person, som er musikarrangør af @da
definition: Relaterer en person til et udtryk, som omfatter en persons bidrag ved at omskrive en komposition til en anden besætning end den, værket oprindeligt var beregnet til. @da
scope note: En musikarrangør kan også modificere værket for samme besætning etc. og derved i alt væsentligt bevare den originale kompositions musikalske substans uændret. @da
toolkit label: person, som er musikarrangør af @da
toolkit definition: Udtryk, som omfatter en persons bidrag ved at omskrive en komposition til en anden besætning end den, værket oprindeligt var beregnet til. @da
label: muusika seadja (isik) väljenduses @et
definition: Seostab isiku väljendusega, millesse isik on andnud panuse, arranžeerides kompositsiooni esituskoosseisule, mis erineb sellest, millele teos oli algselt mõeldud. @et
scope note: Muusika seadja võib teose seada ka samale esituskoosseisule, muutmata olemuslikult algse kompositsiooni muusikalist sisu. @et
toolkit label: muusika seadja (isik) väljenduses @et
toolkit definition: Väljendus, millesse isik on andnud panuse, arranžeerides kompositsiooni esituskoosseisule, mis erineb sellest, millele teos oli algselt mõeldud. @et
label: ist Person als Arrangeurin/Arrangeur von @de
definition: Setzt eine Person in Beziehung zu einer Expression, zu der eine Person beiträgt, indem sie eine Komposition für eine bestimmte Besetzung umschreibt, die sich von der Originalbesetzung unterscheidet, für die das Werk ursprünglich konzipiert war. @de
scope note: Eine Arrangeurin/Ein Arrangeur kann das Werk auch für die gleiche Besetzung verändern und so weiter, solange die musikalische Substanz der Originalkomposition im Wesentlichen unverändert bleibt. @de
toolkit label: Person als Arrangeurin/Arrangeur von @de
toolkit definition: Eine Expression, zu der eine Person beiträgt, indem sie eine Komposition für eine bestimmte Besetzung umschreibt, die sich von der Originalbesetzung unterscheidet, für die das Werk ursprünglich konzipiert war. @de
label: zenei hangszerelő személye a következőnek: @hu
definition: Hozzákapcsol egy személyt egy kifejezési formához, amely magában foglalja egy személy közreműködését zenei kompozíció olyan előadásmédiumra átírásával, amely különbözik a műnek eredetileg szánt médiumtól. @hu
scope note: Egy zenei hangszerelő módosíthatja a művet a mű elrendezéséhez egyező előadásmédiumra, stb., amikor alapvetően változatlanul megtartja az eredeti kompozíció zenei lényegét. @hu
toolkit label: zenei hangszerelő személye: @hu
toolkit definition: Egy kifejezési forma, amely magában foglalja egy személy közreműködését zenei kompozíció olyan előadásmédiumra átírásával, amely különbözik a műnek eredetileg szánt médiumtól. @hu
label: è arrangiatore persona di musica di @it
definition: Correla una persona a un'espressione che comprende un contributo di una persona nella riscrittura di una composizione musicale per un mezzo di esecuzione diverso da quello per cui l'opera era stata originariamente concepita. @it
scope note: Un arrangiatore di musica può anche modificare l'opera per lo stesso mezzo di esecuzione, etc., mantenendo sostanzialmente immutata la sostanza musicale della composizione originale. @it
toolkit label: arrangiatore persona di musica di @it
toolkit definition: Espressione che comprende un contributo di una persona nella riscrittura di una composizione musicale per un mezzo di esecuzione diverso da quello per cui l'opera era stata originariamente concepita. @it
label: είναι διασκευαστής φυσικό πρόσωπο της μουσικής του @el
toolkit label: διασκευαστής φυσικό πρόσωπο της μουσικής του @el
label: est une personne arrangeuse de musique de @fr
definition: Met une personne en relation avec une expression qui intègre une contribution de la part d’une personne consistant à réécrire une composition musicale pour une distribution d’exécution différente de celle à laquelle l’œuvre était destinée à l’origine. @fr
scope note: Un arrangeur de musique peut aussi modifier l’œuvre pour la même distribution d’exécution, etc. tout en gardant la substance musicale de la composition originale essentiellement inchangée. @fr
toolkit label: personne arrangeuse de musique de @fr
toolkit definition: Expression qui intègre une contribution de la part d’une personne consistant à réécrire une composition musicale pour une distribution d’exécution différente de celle à laquelle l’œuvre était destinée à l’origine. @fr
label: ir aranžētājs (persona) @lv
definition: Sasaista personu ar izteiksmi, kas ietver personas ieguldījumu, pārrakstot mūzikas kompozīciju izpildījumam, kas atšķirīgs no tā, kas sākotnēji bija paredzēts. @lv
toolkit label: ir aranžētājs (persona) @lv
toolkit definition: Izteiksme, kas ietver personas ieguldījumu, pārrakstot mūzikas kompozīciju izpildījumam, kas atšķirīgs no tā, kas sākotnēji bija paredzēts. @lv
scope note: Mūzikas aranžētājs var arī pārveidot darbu tam pašam izpildījumam, u. tml. saglabājot oriģinālās kompozīcijas muzikālo būtību nemainīgu. @lv
label: 是……的音乐改编者个人 @zh-hans
definition: 将一个个人与包括一个改写音乐作曲用于不同于其最初意图的一个表演媒介的一个个人的贡献的一种内容表达关联起来。 @zh-hans
toolkit label: ……的音乐改编者个人 @zh-hans
toolkit definition: 包括一个改写音乐作曲用于不同于其最初意图的一个表演媒介的一个个人的贡献的一种内容表达 @zh-hans
scope note: 音乐的改编者也可以保留原作曲基本内容修改为同一个表演媒体等的作品 @zh-hans
label: müziğinin aranjör kişisidir @tr

lavastaja (toimija) ekspressiossa
status: Published
label: is art director agent of @en
definition: Relates an agent to an expression that includes a contribution by an agent of overseeing artists and craftspeople who build sets for moving image productions. @en
type: Property
domain: C10002
sub property of: esitykseen osallinen toimija ekspressiossa
lexical alias: artDirectorAgentOf.en
label: est un agent directeur artistique de @fr
definition: Met un agent en relation avec une expression qui intègre une contribution de la part d’un agent consistant à superviser les artistes et les artisans qui construisent les décors pour des productions d’images animées. @fr
toolkit label: agent directeur artistique de @fr
toolkit definition: Expression qui intègre une contribution de la part d’un agent consistant à superviser les artistes et les artisans qui construisent les décors pour des productions d’images animées. @fr
toolkit label: art director agent of @en
toolkit definition: An expression that includes a contribution by an agent of overseeing artists and craftspeople who build sets for moving image productions. @en
instruction number: 18.5
label: είναι καλλιτεχνικός διευθυντής φορέας του @el
definition: Συνδέει έναν φορέα, ο οποίος συνεισφέρει σε μια έκφραση ενός έργου επιβλέποντας τους καλλιτέχνες και τους τεχνικούς που κατασκευάζουν σκηνικά για παραγωγές κινητής εικόνας, με μια έκφραση. @el
toolkit label: καλλιτεχνικός διευθυντής φορέας του @el
toolkit definition: Μια έκφραση ενός έργου που ενσωματώνει τη συνεισφορά της επίβλεψης των καλλιτεχνών και των τεχνικών που κατασκευάζουν σκηνικά για παραγωγές κινητής εικόνας. @el
definition: Setzt einen Akteur in Beziehung zu einer Expression, zu der ein Akteur beiträgt, indem er Künstlerinnen/Künstler und Kunsthandwerkerinnen/Kunsthandwerker betreut, die Sets für Bewegtbildproduktionen aufbauen. @de
toolkit label: Akteur als Art Director von @de
toolkit definition: Eine Expression, zu der ein Akteur beiträgt, indem er Künstlerinnen/Künstler und Kunsthandwerkerinnen/Kunsthandwerker betreut, die Sets für Bewegtbildproduktionen aufbauen. @de
label: er agent, som er artdirector af @da
definition: Relaterer en agent til et udtryk, som omfatter en agents bidrag ved at føre tilsyn med kunstnere og håndværkere, som bygger kulisser til levende billedproduktioner. @da
toolkit label: agent, som er artdirector af @da
toolkit definition: Udtryk, som omfatter en agents bidrag ved at føre tilsyn med kunstnere og håndværkere, som bygger kulisser til levende billedproduktioner. @da
label: és agent director artístic de @ca
definition: Relaciona un agent amb una expressió que inclou una contribució d’un agent supervisant els artistes i els artesans que construeixen els decorats de les produccions d’imatge en moviment. @ca
toolkit label: agent director artístic de @ca
toolkit definition: Expressió que inclou una contribució d’un agent supervisant els artistes i els artesans que construeixen els decorats de les produccions d’imatge en moviment. @ca
definition: Liittää toimijan ekspressioon, jonka tekemiseen toimija osallistuu valvomalla taiteilijoita ja käsityöläisiä, jotka rakentavat lavasteita elokuvatuotantoihin.
toolkit label: lavastaja (toimija) ekspressiossa
toolkit definition: Ekspressio, jonka tekemiseen toimija osallistuu valvomalla taiteilijoita ja käsityöläisiä, jotka rakentavat lavasteita elokuvatuotantoihin.
toolkit label: scenograf for (agent) @no
toolkit definition: Et uttrykk som inkluderer et bidrag fra en agent i form av å lede kunstnerne og håndverkerne som bygger kulissene for spillefilmproduksjoner. @no
label: ist Akteur als Art Director von @de
has element type: 2
label: művészeti vezető ágense a következőnek: @hu
definition: Hozzákapcsol egy ágenst egy kifejezési formához, amely magában foglalja egy ágens közreműködését, amely mozgókép-produkciókhoz díszletépítő művészeket és mesterembereket felügyel. @hu
toolkit label: művészeti vezető ágense: @hu
toolkit definition: Egy kifejezési forma, amely magában foglalja egy ágens közreműködését, amely mozgókép-produkciókhoz díszletépítő művészeket és mesterembereket felügyel. @hu
alternative label: art director of @en
label: er scenograf for (agent) @no
definition: Relaterer en agent til et uttrykk som inkluderer et bidrag fra en agent i form av å lede kunstnerne og håndverkerne som bygger kulissene for spillefilmproduksjoner. @no
alternative label: scenograf for @no
label: is artdirector-actor van @nl
definition: Relateert een actor aan een expressie die omvat een bijdrage door een actor door toezicht houden op kunstenaars en ambachtslieden die decors bouwen voor bewegend beeld-producties. @nl
toolkit label: artdirector-actor van @nl
toolkit definition: Een expressie die omvat een bijdrage door een actor door toezicht houden op kunstenaars en ambachtslieden die decors bouwen voor bewegend beeld-producties. @nl
label: هو وكيل مخرج فني لـ @ar
definition: يربط وكيلا بتعبيرة تتضمن إسهام وكيل بالإشراف على الفنيين والحرفيين الذين يبنون مواقع لإنتاج الأفلام. @ar
alternative label: مخرج فني @ar
toolkit label: وكيل مخرج فني @ar
toolkit definition: تعبيرة تتضمن إسهام وكيل بالإشراف على الفنيين والحرفيين الذين يبنون مواقع لإنتاج الأفلام. @ar
alternative label: director artístic de @ca
alternative label: art director af @da
label: filmikunstnik (tegija) väljenduses @et
definition: Seostab tegija väljendusega, millesse tegija on andnud panuse, juhendades kunstnikke ja oskustöölisi, kes valmistavad filmi tootmise jaoks dekoratsioonid ja rekvisiidid. @et
alternative label: filmikunstnik väljenduses @et
toolkit label: filmikunstnik (tegija) väljenduses @et
toolkit definition: Väljendus, millesse tegija on andnud panuse, juhendades kunstnikke ja oskustöölisi, kes valmistavad filmi tootmise jaoks dekoratsioonid ja rekvisiidid. @et
alternative label: művészeti vezetője: @hu
label: è direttore artistico agente di @it
definition: Correla un agente a un'espressione che include un contributo da parte di un agente nel supervisionare artisti e artigiani che costruiscono set cinematografici. @it
alternative label: direttore artistico di @it
toolkit label: direttore artistico agente di @it
toolkit definition: Espressione che include un contributo da parte di un agente nel supervisionare artisti e artigiani che costruiscono set cinematografici. @it
alternative label: καλλιτεχνικός διευθυντής του @el
alternative label: directeur artistique de @fr
label: ir galvenais mākslinieks (aģents) @lv
definition: Sasaista aģentu ar izteiksmi, kas ietver aģenta ieguldījumu, uzraugot māksliniekus un meistarus, kuri darbojas kustīgu attēlu veidošanā. @lv
toolkit label: ir galvenais mākslinieks (aģents) @lv
toolkit definition: Izteiksme, kas ietver aģenta ieguldījumu, uzraugot māksliniekus un meistarus, kuri darbojas kustīgu attēlu veidošanā. @lv
alternative label: Art Director von @de
alternative label: ……的艺术总监 @zh-hans
label: 是……的艺术总监行为者 @zh-hans
toolkit label: ……的艺术总监行为者 @zh-hans
toolkit definition: 包括监督为动态图像制作建造布景的艺术家和艺人的一个行为者的贡献的一种内容表达 @zh-hans
toolkit label: Sanat yönetmeni temsilcisi @tr
toolkit definition: Hareketli görüntü prodüksiyonları için setler inşa eden sanatçılar ve zanaatkarlardan oluşan bir temsilcinin katkısını içeren bir anlatım. @tr
has subproperty: lavastaja (yhteistoimija) ekspressiossa

lavastaja (yhteistoimija) ekspressiossa
status: Published
label: is art director collective agent of @en
lexical alias: artDirectorCollectiveAgentOf.en
definition: Relates a collective agent to an expression that includes a contribution by a collective agent of overseeing artists and craftspeople who build sets for moving image productions. @en
toolkit label: art director collective agent of @en
toolkit definition: An expression that includes a contribution by a collective agent of overseeing artists and craftspeople who build sets for moving image productions. @en
type: Property
domain: C10011
has element type: 2
sub property of: esitykseen osallinen yhteistoimija ekspressiossa
sub property of: lavastaja (toimija) ekspressiossa
definition: Liittää yhteistoimijan ekspressioon, jonka tekemisessä yhteistoimija on osallisena valvomalla taiteilijoita ja käsityöläisiä, jotka rakentavat lavasteita elokuvatuotantoihin.
toolkit label: lavastaja (yhteistoimija) ekspressiossa
toolkit definition: Ekspressio, jonka tekemisessä yhteistoimija on osallisena valvomalla taiteilijoita ja käsityöläisiä, jotka rakentavat lavasteita elokuvatuotantoihin.
label: er scenograf for (kollektiv agent) @no
definition: Relaterer en kollektiv agent til et uttrykk som inkluderer et bidrag fra en kollektiv agent i form av å lede kunstnerne og håndverkerne som bygger kulissene for spillefilmproduksjoner. @no
toolkit label: scenograf for (kollektiv agent) @no
toolkit definition: Et uttrykk som inkluderer et bidrag fra en kollektiv agent i form av å lede kunstnerne og håndverkerne som bygger kulissene for spillefilmproduksjoner. @no
label: is artdirector-collectieve actor van @nl
definition: Relateert een collectieve actor aan een expressie die omvat een bijdrage door een collectieve actor door toezicht houden op kunstenaars en ambachtslieden die decors bouwen voor bewegend beeld-producties. @nl
toolkit label: artdirector-collectieve actor van @nl
toolkit definition: Een expressie die omvat een bijdrage door een collectieve actor door toezicht houden op kunstenaars en ambachtslieden die decors bouwen voor bewegend beeld-producties. @nl
label: وكيل جماعي مخرج فني @ar
definition: يربط وكيلا جماعيا بتعبيرة تتضمن إسهام وكيل جماعي بالإشراف على الفنيين والحرفيين الذين يبنون مواقع لإنتاج الأفلام. @ar
toolkit label: وكيل جماعي جامع مخرج فني @ar
toolkit definition: تعبيرة تتضمن إسهام وكيل جماعي بالإشراف على الفنيين والحرفيين الذين يبنون مواقع لإنتاج الأفلام. @ar
label: és agent col·lectiu director artístic de @ca
definition: Relaciona un agent col·lectiu amb una expressió que inclou una contribució d’un agent col·lectiu supervisant els artistes i els artesans que construeixen els decorats de les produccions d’imatge en moviment. @ca
toolkit label: agent col·lectiu director artístic de @ca
toolkit definition: Expressió que inclou una contribució d’un agent col·lectiu supervisant els artistes i els artesans que construeixen els decorats de les produccions d’imatge en moviment. @ca
label: er kollektiv agent, som er artdirector af @da
definition: Relaterer en kollektiv agent til et udtryk, som omfatter en kollektiv agents bidrag ved at føre tilsyn med kunstnere og håndværkere, som bygger kulisser til levende billedproduktioner. @da
toolkit label: kollektiv agent, som er artdirector af @da
toolkit definition: Udtryk, som omfatter en kollektiv agents bidrag ved at føre tilsyn med kunstnere og håndværkere, som bygger kulisser til levende billedproduktioner. @da
label: filmikunstnik (kollektiiv) väljenduses @et
definition: Seostab kollektiivi väljendusega, millesse kollektiiv on andnud panuse, juhendades kunstnikke ja oskustöölisi, kes valmistavad filmi tootmise jaoks dekoratsioonid ja rekvisiidid. @et
toolkit label: filmikunstnik (kollektiiv) väljenduses @et
toolkit definition: Väljendus, millesse kollektiiv on andnud panuse, juhendades kunstnikke ja oskustöölisi, kes valmistavad filmi tootmise jaoks dekoratsioonid ja rekvisiidid. @et
label: ist gemeinschaftlicher Akteur als Art Director von @de
definition: Setzt einen gemeinschaftlichen Akteur in Beziehung zu einer Expression, zu der ein gemeinschaftlicher Akteur beiträgt, indem er Künstlerinnen/Künstler und Kunsthandwerkerinnen/Kunsthandwerker betreut, die Sets für Bewegtbildproduktionen aufbauen. @de
toolkit label: Gemeinschaftlicher Akteur als Art Director von @de
toolkit definition: Eine Expression, zu der ein gemeinschaftlicher Akteur beiträgt, indem er Künstlerinnen/Künstler und Kunsthandwerkerinnen/Kunsthandwerker betreut, die Sets für Bewegtbildproduktionen aufbauen. @de
label: művészeti vezető kollektív ágense a következőnek: @hu
definition: Hozzákapcsol egy kollektív ágenst egy kifejezési formához, amely magában foglalja egy kollektív ágens közreműködését, amely mozgókép-produkciókhoz díszletépítő művészeket és mesterembereket felügyel. @hu
toolkit label: művészeti vezető kollektív ágense: @hu
toolkit definition: Egy kifejezési forma, amely magában foglalja egy kollektív ágens közreműködését, amely mozgókép-produkciókhoz díszletépítő művészeket és mesterembereket felügyel. @hu
label: è direttore artistico agente collettivo di @it
definition: Correla un agente collettivo a un'espressione che comprende un contributo di un agente collettivo nella supervisione di artisti e artigiani che costruiscono scenografie per produzioni di immagini in movimento. @it
toolkit label: direttore artistico agente collettivo di @it
toolkit definition: Espressione che comprende un contributo di un agente collettivo nella supervisione di artisti e artigiani che costruiscono scenografie per produzioni di immagini in movimento. @it
label: είναι καλλιτεχνικός διευθυντής συλλογικός φορέας του @el
toolkit label: καλλιτεχνικός διευθυντής συλλογικός φορέας του @el
label: est un agent collectif directeur artistique de @fr
definition: Met un agent collectif en relation avec une expression qui intègre une contribution de la part d’un agent collectif consistant à superviser les artistes et les artisans qui construisent les décors pour des productions d’images animées. @fr
toolkit label: agent collectif directeur artistique de @fr
toolkit definition: Expression qui intègre une contribution de la part d’un agent collectif consistant à superviser les artistes et les artisans qui construisent les décors pour des productions d’images animées. @fr
label: ir galvenais mākslinieks (grupa) @lv
definition: Sasaista grupu ar izteiksmi, kas ietver grupas ieguldījumu, uzraugot māksliniekus un meistarus, kuri darbojas kustīgu attēlu veidošanā. @lv
toolkit label: ir galvenais mākslinieks (grupa) @lv
toolkit definition: Izteiksme, kas ietver grupas ieguldījumu, uzraugot māksliniekus un meistarus, kuri darbojas kustīgu attēlu veidošanā. @lv
label: 是……的艺术总监集体行为者 @zh-hans
definition: 将一个集体行为者与包括监督为动态图像制作建造布景的艺术家和艺人的一个集体行为者的贡献的一种内容表达关联起来。 @zh-hans
toolkit label: ……的艺术总监集体行为者 @zh-hans
toolkit definition: 包括监督为动态图像制作建造布景的艺术家和艺人的一个集体行为者的贡献的一种内容表达 @zh-hans
label: sanat yönetmeni kolektif temsilcisidir @tr
definition: Kolektif bir temsilciyi, hareketli görüntü prodüksiyonları için setler oluşturan, denetleyen sanatçılardan ve zanaatkarlardan oluşan kolektif bir temsilcinin katkısını içeren bir anlatımla ilişkilendirir. @tr
toolkit label: sanat yönetmeni kolektif temsilcisi @tr
toolkit definition: Hareketli görüntü prodüksiyonları için setler inşa eden sanatçılar ve zanaatkarlardan oluşan kolektif bir temsilcinin katkısını içeren bir anlatım. @tr
has subproperty: lavastaja (yhteisö) ekspressiossa
has subproperty: lavastaja (suku) ekspressiossa
has subproperty: P50750

lavastaja (yhteisö) ekspressiossa
status: Published
label: is art director corporate body of @en
lexical alias: artDirectorCorporateBodyOf.en
definition: Relates a corporate body to an expression that includes a contribution by a corporate body of overseeing artists and craftspeople who build sets for moving image productions. @en
toolkit label: art director corporate body of @en
toolkit definition: An expression that includes a contribution by a corporate body of overseeing artists and craftspeople who build sets for moving image productions. @en
type: Property
domain: C10005
has element type: 2
sub property of: esitykseen osallinen yhteisö ekspressiossa
sub property of: lavastaja (yhteistoimija) ekspressiossa
definition: Liittää yhteisön ekspressioon, jonka tekemisessä yhteisö on osallisena valvomalla taiteilijoita ja käsityöläisiä, jotka rakentavat lavasteita elokuvatuotantoihin.
toolkit label: lavastaja (yhteisö) ekspressiossa
toolkit definition: Ekspressio, jonka tekemisessä yhteisö on osallisena valvomalla taiteilijoita ja käsityöläisiä, jotka rakentavat lavasteita elokuvatuotantoihin.
label: er scenograf for (korporasjon) @no
definition: Relaterer en korporasjon til et uttrykk som inkluderer et bidrag fra en korporasjon i form av å lede kunstnerne og håndverkerne som bygger kulissene for spillefilmproduksjoner. @no
toolkit label: scenograf for (korporasjon) @no
toolkit definition: Et uttrykk som inkluderer et bidrag fra en korporasjon i form av å lede kunstnerne og håndverkerne som bygger kulissene for spillefilmproduksjoner. @no
label: is artdirector-corporatie van @nl
definition: Relateert een corporatie aan een expressie die omvat een bijdrage door een corporatie door toezicht houden op kunstenaars en ambachtslieden die decors bouwen voor bewegend beeld-producties. @nl
toolkit label: artdirector-corporatie van @nl
toolkit definition: Een expressie die omvat een bijdrage door een corporatie door toezicht houden op kunstenaars en ambachtslieden die decors bouwen voor bewegend beeld-producties. @nl
label: هي هيئة مسئولة عن الإخراج الفني لـ @ar
definition: يربط هيئة بتعبيرة تتضمن إسهام هيئة بالإشراف على الفنيين والحرفيين الذين يبنون مواقع لإنتاج الأفلام. @ar
toolkit label: هيئة مسئولة عن الإخراج الفني @ar
toolkit definition: تعبيرة تتضمن إسهام هيئة بالإشراف على الفنيين والحرفيين الذين يبنون مواقع لإنتاج الأفلام. @ar
label: és entitat corporativa directora artística de @ca
definition: Relaciona una entitat corporativa amb una expressió que inclou una contribució d’una entitat corporativa supervisant els artistes i els artesans que construeixen els decorats de les produccions d’imatge en moviment. @ca
toolkit label: entitat corporativa directora artística de @ca
toolkit definition: Expressió que inclou una contribució d’una entitat corporativa supervisant els artistes i els artesans que construeixen els decorats de les produccions d’imatge en moviment. @ca
label: er korporation, som er artdirector af @da
definition: Relaterer en korporation til et udtryk, som omfatter en korporations bidrag ved at føre tilsyn med kunstnere og håndværkere, som bygger kulisser til levende billedproduktioner. @da
toolkit label: korporation, som er artdirector af @da
toolkit definition: Udtryk, som omfatter en korporations bidrag ved at føre tilsyn med kunstnere og håndværkere, som bygger kulisser til levende billedproduktioner. @da
label: filmikunstnik (asutus) väljenduses @et
definition: Seostab asutuse väljendusega, millesse asutus on andnud panuse, juhendades kunstnikke ja oskustöölisi, kes valmistavad filmi tootmise jaoks dekoratsioonid ja rekvisiidid. @et
toolkit label: filmikunstnik (asutus) väljenduses @et
toolkit definition: Väljendus, millesse asutus on andnud panuse, juhendades kunstnikke ja oskustöölisi, kes valmistavad filmi tootmise jaoks dekoratsioonid ja rekvisiidid. @et
label: ist Körperschaft als Art Director von @de
definition: Setzt eine Körperschaft in Beziehung zu einer Expression, zu der eine Körperschaft beiträgt, indem sie Künstlerinnen/Künstler und Kunsthandwerkerinnen/Kunsthandwerker betreut, die Sets für Bewegtbildproduktionen aufbauen. @de
toolkit label: Körperschaft als Art Director von @de
toolkit definition: Eine Expression, zu der eine Körperschaft beiträgt, indem sie Künstlerinnen/Künstler und Kunsthandwerkerinnen/Kunsthandwerker betreut, die Sets für Bewegtbildproduktionen aufbauen. @de
label: művészeti vezető testülete a következőnek: @hu
definition: Hozzákapcsol egy testületet egy kifejezési formához, amely magában foglalja egy testület közreműködését, amely mozgókép-produkciókhoz díszletépítő művészeket és mesterembereket felügyel. @hu
toolkit label: művészeti vezető testülete: @hu
toolkit definition: Egy kifejezési forma, amely magában foglalja egy testület közreműködését, amely mozgókép-produkciókhoz díszletépítő művészeket és mesterembereket felügyel. @hu
label: è direttore artistico ente di @it
definition: Correla un ente a un'espressione che include un contributo di un ente nella supervisione di artisti e artigiani che costruiscono scenografie per produzioni di immagini in movimento. @it
toolkit label: direttore artistico ente di @it
toolkit definition: Espressione che include un contributo di un ente nella supervisione di artisti e artigiani che costruiscono scenografie per produzioni di immagini in movimento. @it
label: είναι καλλιτεχνικός διευθυντής συλλογικό όργανο του @el
toolkit label: καλλιτεχνικός διευθυντής συλλογικό όργανο του @el
label: est une collectivité directrice artistique de @fr
definition: Met une collectivité en relation avec une expression qui intègre une contribution de la part d’une collectivité consistant à superviser les artistes et les artisans qui construisent les décors pour des productions d’images animées. @fr
toolkit label: collectivité directrice artistique de @fr
toolkit definition: Expression qui intègre une contribution de la part d’une collectivité consistant à superviser les artistes et les artisans qui construisent les décors pour des productions d’images animées. @fr
label: ir galvenais mākslinieks (institūcija) @lv
definition: Sasaista institūciju ar izteiksmi, kas ietver institūcijas ieguldījumu, uzraugot māksliniekus un meistarus, kuri darbojas kustīgu attēlu veidošanā. @lv
toolkit label: ir galvenais mākslinieks (institūcija) @lv
toolkit definition: Izteiksme, kas ietver institūcijas ieguldījumu, uzraugot māksliniekus un meistarus, kuri darbojas kustīgu attēlu veidošanā. @lv
label: 是……的艺术总监团体 @zh-hans
definition: 将一个团体与包括监督为动态图像制作建造布景的艺术家和艺人的一个团体的贡献的一种内容表达关联起来。 @zh-hans
toolkit label: ……的艺术总监团体 @zh-hans
toolkit definition: 包括监督为动态图像制作建造布景的艺术家和艺人的一个团体的贡献的一种内容表达 @zh-hans
label: sanat yönetmeni tüzel kişisidir @tr
definition: Bir tüzel kişiyi, hareketli görüntü prodüksiyonları için setler inşa eden, nezaret eden sanatçılar ve zanaatkârlardan oluşan bir tüzel kişinin katkısını içeren bir anlatımla ilişkilendirir. @tr
toolkit label: sanat yönetmeni tüzel kişisi @tr
toolkit definition: Hareketli görüntü prodüksiyonları için setler kuran, denetleyen sanatçılardan ve zanaatkârlardan oluşan tüzel bir kişinin katkısını içeren bir anlatım. @tr
has subproperty: P50901

lavastaja (suku) ekspressiossa
status: Published
label: is art director family of @en
lexical alias: artDirectorFamilyOf.en
definition: Relates a family to an expression that includes a contribution by a family of overseeing artists and craftspeople who build sets for moving image productions. @en
toolkit label: art director family of @en
toolkit definition: An expression that includes a contribution by a family of overseeing artists and craftspeople who build sets for moving image productions. @en
type: Property
domain: C10008
has element type: 2
sub property of: esitykseen osallinen suku ekspressiossa
sub property of: lavastaja (yhteistoimija) ekspressiossa
definition: Liittää suvun ekspressioon, jonka tekemisessä suku on osallisena valvomalla taiteilijoita ja käsityöläisiä, jotka rakentavat lavasteita elokuvatuotantoihin.
toolkit label: lavastaja (suku) ekspressiossa
toolkit definition: Ekspressio, jonka tekemisessä suku on osallisena valvomalla taiteilijoita ja käsityöläisiä, jotka rakentavat lavasteita elokuvatuotantoihin.
label: er scenograf for (familie) @no
definition: Relaterer en familie til et uttrykk som inkluderer et bidrag fra en familie i form av å lede kunstnerne og håndverkerne som bygger kulissene for spillefilmproduksjoner. @no
toolkit label: scenograf for (familie) @no
toolkit definition: Et uttrykk som inkluderer et bidrag fra en familie i form av å lede kunstnerne og håndverkerne som bygger kulissene for spillefilmproduksjoner. @no
label: is artdirector-familie van @nl
definition: Relateert een familie aan een expressie die omvat een bijdrage door een familie door toezicht houden op kunstenaars en ambachtslieden die decors bouwen voor bewegend beeld-producties. @nl
toolkit label: artdirector-familie van @nl
toolkit definition: Een expressie die omvat een bijdrage door een familie door toezicht houden op kunstenaars en ambachtslieden die decors bouwen voor bewegend beeld-producties. @nl
label: هي عائلة مسئولة عن الإخراج الفني لـ @ar
definition: يربط عائلة بتعبيرة تتضمن إسهام عائلة بالإشراف على الفنيين والحرفيين الذين يبنون مواقع لإنتاج الأفلام. @ar
toolkit label: عائلة مسئولة عن الإخراج الفني @ar
toolkit definition: تعبيرة تتضمن إسهام عائلة بالإشراف على الفنيين والحرفيين الذين يبنون مواقع لإنتاج الأفلام. @ar
label: és família directora artística de @ca
definition: Relaciona una família amb una expressió que inclou una contribució d’una família supervisant els artistes i els artesans que construeixen els decorats de les produccions d’imatge en moviment. @ca
toolkit label: família directora artística de @ca
toolkit definition: Expressió que inclou una contribució d’una família supervisant els artistes i els artesans que construeixen els decorats de les produccions d’imatge en moviment. @ca
label: er familie, som er artdirector af @da
definition: Relaterer en familie til et udtryk, som omfatter en families bidrag ved at føre tilsyn med kunstnere og håndværkere, som bygger kulisser til levende billedproduktioner. @da
toolkit label: familie, som er artdirector af @da
toolkit definition: Udtryk, som omfatter en families bidrag ved at føre tilsyn med kunstnere og håndværkere, som bygger kulisser til levende billedproduktioner. @da
label: filmikunstnik (perekond) väljenduses @et
definition: Seostab perekonna väljendusega, millesse perekond on andnud panuse, juhendades kunstnikke ja oskustöölisi, kes valmistavad filmi tootmise jaoks dekoratsioonid ja rekvisiidid. @et
toolkit label: filmikunstnik (perekond) väljenduses @et
toolkit definition: Väljendus, millesse perekond on andnud panuse, juhendades kunstnikke ja oskustöölisi, kes valmistavad filmi tootmise jaoks dekoratsioonid ja rekvisiidid. @et
label: ist Familie als Art Director von @de
definition: Setzt eine Familie in Beziehung zu einer Expression, zu der eine Familie beiträgt, indem sie Künstlerinnen/Künstler und Kunsthandwerkerinnen/Kunsthandwerker betreut, die Sets für Bewegtbildproduktionen aufbauen. @de
toolkit label: Familie als Art Director von @de
toolkit definition: Eine Expression, zu der eine Familie beiträgt, indem sie Künstlerinnen/Künstler und Kunsthandwerkerinnen/Kunsthandwerker betreut, die Sets für Bewegtbildproduktionen aufbauen. @de
label: művészeti vezető családja a következőnek: @hu
definition: Hozzákapcsol egy családot egy kifejezési formához, amely magában foglalja egy család közreműködését, amely mozgókép-produkciókhoz díszletépítő művészeket és mesterembereket felügyel. @hu
toolkit label: művészeti vezető családja: @hu
toolkit definition: Egy kifejezési forma, amely magában foglalja egy család közreműködését, amely mozgókép-produkciókhoz díszletépítő művészeket és mesterembereket felügyel. @hu
label: è direttore artistico famiglia di @it
definition: Correla una famiglia a un'espressione che comprende un contributo di una famiglia nella supervisione di artisti e artigiani che costruiscono scenografie per produzioni di immagini in movimento. @it
toolkit label: direttore artistico famiglia di @it
toolkit definition: Espressione che comprende un contributo di una famiglia nella supervisione di artisti e artigiani che costruiscono scenografie per produzioni di immagini in movimento. @it
label: είναι καλλιτεχνικός διευθυντής οικογένεια του @el
toolkit label: καλλιτεχνικός διευθυντής οικογένεια του @el
label: est une famille directrice artistique de @fr
definition: Met une famille en relation avec une expression qui intègre une contribution de la part d’une famille consistant à superviser les artistes et les artisans qui construisent les décors pour des productions d’images animées. @fr
toolkit label: famille directrice artistique de @fr
toolkit definition: Expression qui intègre une contribution de la part d’une famille consistant à superviser les artistes et les artisans qui construisent les décors pour des productions d’images animées. @fr
label: ir galvenais mākslinieks (dzimta/ģimene) @lv
definition: Sasaista dzimtu/ģimeni ar izteiksmi, kas ietver dzimtas/ģimenes ieguldījumu, uzraugot māksliniekus un meistarus, kuri darbojas kustīgu attēlu veidošanā. @lv
toolkit label: ir galvenais mākslinieks (dzimta/ģimene) @lv
toolkit definition: Izteiksme, kas ietver dzimtas/ģimenes ieguldījumu, uzraugot māksliniekus un meistarus, kuri darbojas kustīgu attēlu veidošanā. @lv
label: 是……的艺术总监家族 @zh-hans
definition: 将一个家族与包括监督为动态图像制作建造布景的艺术家和艺人的一个家族的贡献的一种内容表达关联起来。 @zh-hans
toolkit label: ……的艺术总监家族 @zh-hans
toolkit definition: 包括监督为动态图像制作建造布景的艺术家和艺人的一个家族的贡献的一种内容表达 @zh-hans
label: sanat yönetmeni ailesidir @tr
definition: Bir aileyi, hareketli görüntü prodüksiyonları için setler inşa eden, nezaret eden sanatçılar ve zanaatkârlardan oluşan bir ailenin katkısını içeren bir anlatımla ilişkilendirir. @tr
toolkit label: sanat yönetmeni ailesi @tr
toolkit definition: Hareketli görüntü prodüksiyonları için setler inşa eden sanatçılar ve zanaatkarlardan oluşan bir ailenin katkısını içeren bir anlatım. @tr
has subproperty: P51052

lavastaja (henkilö) ekspressiossa
status: Published
label: is art director person of @en
lexical alias: artDirectorPersonOf.en
definition: Relates a person to an expression that includes a contribution by a person of overseeing artists and craftspeople who build sets for moving image productions. @en
toolkit label: art director person of @en
toolkit definition: An expression that includes a contribution by a person of overseeing artists and craftspeople who build sets for moving image productions. @en
type: Property
domain: C10004
has element type: 2
sub property of: esitykseen osallinen henkilö ekspressiossa
sub property of: lavastaja (toimija) ekspressiossa
definition: Liittää henkilön ekspressioon, jonka tekemisessä henkilö on osallisena valvomalla taiteilijoita ja käsityöläisiä, jotka rakentavat lavasteita elokuvatuotantoihin.
toolkit label: lavastaja (henkilö) ekspressiossa
toolkit definition: Ekspressio, jonka tekemisessä henkilö on osallisena valvomalla taiteilijoita ja käsityöläisiä, jotka rakentavat lavasteita elokuvatuotantoihin.
label: er scenograf for (person) @no
definition: Relaterer en person til et uttrykk som inkluderer et bidrag fra en person i form av å lede kunstnerne og håndverkerne som bygger kulissene for spillefilmproduksjoner. @no
toolkit label: scenograf for (person) @no
toolkit definition: Et uttrykk som inkluderer et bidrag fra en person i form av å lede kunstnerne og håndverkerne som bygger kulissene for spillefilmproduksjoner. @no
label: is artdirector-persoon van @nl
definition: Relateert een persoon aan een expressie die omvat een bijdrage door een persoon door toezicht houden op kunstenaars en ambachtslieden die decors bouwen voor bewegend beeld-producties. @nl
toolkit label: artdirector-persoon van @nl
toolkit definition: Een expressie die omvat een bijdrage door een persoon door toezicht houden op kunstenaars en ambachtslieden die decors bouwen voor bewegend beeld-producties. @nl
label: هو شخص مخرج فني لـ @ar
definition: يربط شخصا بتعبيرة تتضمن إسهام شخص بالإشراف على الفنيين والحرفيين الذين يبنون مواقع لإنتاج الأفلام. @ar
toolkit label: شخص مخرج فني @ar
toolkit definition: تعبيرة تتضمن إسهام شخص بالإشراف على الفنيين والحرفيين الذين يبنون مواقع لإنتاج الأفلام. @ar
label: és persona directora artística de @ca
definition: Relaciona una persona amb una expressió que inclou una contribució d’una persona supervisant els artistes i els artesans que construeixen els decorats de les produccions d’imatge en moviment. @ca
toolkit label: persona directora artística de @ca
toolkit definition: Expressió que inclou una contribució d’una persona supervisant els artistes i els artesans que construeixen els decorats de les produccions d’imatge en moviment. @ca
label: er person, som er artdirector af @da
definition: Relaterer en person til et udtryk, som omfatter en persons bidrag ved at føre tilsyn med kunstnere og håndværkere, som bygger kulisser til levende billedproduktioner. @da
toolkit label: person, som er artdirector af @da
toolkit definition: Udtryk, som omfatter en persons bidrag ved at føre tilsyn med kunstnere og håndværkere, som bygger kulisser til levende billedproduktioner. @da
label: filmikunstnik (isik) väljenduses @et
definition: Seostab isiku väljendusega, millesse isik on andnud panuse, juhendades kunstnikke ja oskustöölisi, kes valmistavad filmi tootmise jaoks dekoratsioonid ja rekvisiidid. @et
toolkit label: filmikunstnik (isik) väljenduses @et
toolkit definition: Väljendus, millesse isik on andnud panuse, juhendades kunstnikke ja oskustöölisi, kes valmistavad filmi tootmise jaoks dekoratsioonid ja rekvisiidid. @et
label: ist Person als Art Director von @de
definition: Setzt eine Person in Beziehung zu einer Expression, zu der eine Person beiträgt, indem sie Künstlerinnen/Künstler und Kunsthandwerkerinnen/Kunsthandwerker betreut, die Sets für Bewegtbildproduktionen aufbauen. @de
toolkit label: Person als Art Director von @de
toolkit definition: Eine Expression, zu der eine Person beiträgt, indem sie Künstlerinnen/Künstler und Kunsthandwerkerinnen/Kunsthandwerker betreut, die Sets für Bewegtbildproduktionen aufbauen. @de
label: művészeti vezető személye a következő: @hu
definition: Hozzákapcsol egy személyt egy kifejezési formához, amely magában foglalja egy személy közreműködését, aki mozgókép-produkciókhoz díszletépítő művészeket és mesterembereket felügyel. @hu
toolkit label: művészeti vezető személye a következő: @hu
toolkit definition: Egy kifejezési forma, amely magában foglalja egy személy közreműködését, aki mozgókép-produkciókhoz díszletépítő művészeket és mesterembereket felügyel. @hu
label: è direttore artistico persona di @it
definition: Correla una persona a un'espressione che comprende un contributo di una persona nella supervisione di artisti e artigiani che costruiscono scenografie per produzioni di immagini in movimento. @it
toolkit label: direttore artistico persona di @it
toolkit definition: Espressione che comprende un contributo di una persona nella supervisione di artisti e artigiani che costruiscono scenografie per produzioni di immagini in movimento. @it
label: είναι καλλιτεχνικός διευθυντής φυσικό πρόσωπο του @el
toolkit label: καλλιτεχνικός διευθυντής φυσικό πρόσωπο του @el
label: est une personne directrice artistique de @fr
definition: Met une personne en relation avec une expression qui intègre une contribution de la part d’une personne consistant à superviser les artistes et les artisans qui construisent les décors pour des productions d’images animées. @fr
toolkit label: personne directrice artistique de @fr
toolkit definition: Expression qui intègre une contribution de la part d’une personne consistant à superviser les artistes et les artisans qui construisent les décors pour des productions d’images animées. @fr
label: ir galvenais mākslinieks (persona) @lv
definition: Sasaista personu ar izteiksmi, kas ietver personas ieguldījumu, uzraugot māksliniekus un meistarus, kuri darbojas kustīgu attēlu veidošanā. @lv
toolkit label: ir galvenais mākslinieks (persona) @lv
toolkit definition: Izteiksme, kas ietver personas ieguldījumu, uzraugot māksliniekus un meistarus, kuri darbojas kustīgu attēlu veidošanā. @lv
label: 是……的艺术总监个人 @zh-hans
definition: 将一个个人与包括监督为动态图像制作建造布景的艺术家和艺人的一个个人的贡献的一种内容表达关联起来。 @zh-hans
toolkit label: ……的艺术总监个人 @zh-hans
toolkit definition: 包括监督为动态图像制作建造布景的艺术家和艺人的一个个人的贡献的一种内容表达 @zh-hans
label: sanat yönetmeni kişisidir @tr
definition: Bir kişiyi, hareketli görüntü prodüksiyonları için setler inşa eden sanatçıları ve zanaatkarları denetleyen bir kişinin katkısını içeren bir anlatımla ilişkilendirir. @tr
toolkit label: sanat yönetmeni @tr
toolkit definition: Hareketli görüntü prodüksiyonları için setler inşa eden sanatçılar ve zanaatkarlardan oluşan bir kişinin katkısını içeren bir anlatım. @tr
has subproperty: P50599

taiteilija (toimija) teoksessa
status: Published
label: is artist agent of @en
definition: Relates an agent to a work that involves a responsibility of an agent for conceiving, and often implementing, an original graphic design, drawing, painting, etc. @en
type: Property
domain: C10002
sub property of: teoksen tekijä (toimija) teoksessa
lexical alias: artistAgentOf.en
label: est un agent artiste de @fr
definition: Met un agent en relation avec une œuvre qui comporte une responsabilité de la part d’un agent consistant à concevoir et souvent à réaliser un graphisme, une peinture, un dessin, etc. original. @fr
toolkit label: agent artiste de @fr
toolkit definition: Œuvre qui comporte une responsabilité de la part d’un agent consistant à concevoir et souvent à réaliser un graphisme, une peinture, un dessin, etc. original. @fr
toolkit label: artist agent of @en
toolkit definition: A work that involves a responsibility of an agent for conceiving, and often implementing, an original graphic design, drawing, painting, etc. @en
instruction number: 18.5
label: είναι καλλιτέχνης φορέας του @el
definition: Συνδέει έναν φορέα υπεύθυνο για τη δημιουργία ενός έργου μέσω της σύλληψης και συχνά της εφαρμογής ενός πρωτότυπου γραφικού σχεδίου, σκίτσου, πίνακα ζωγραφικής κ.λπ., με ένα έργο. @el
toolkit label: καλλιτέχνης φορέας του @el
toolkit definition: Ένα έργο που περιλαμβάνει την ευθύνη της δημιουργίας μέσω της σύλληψης και συχνά μέσω της εφαρμογής ενός πρωτότυπου γραφικού σχεδίου, σκίτσου, πίνακα ζωγραφικής κ.λπ. @el
definition: Setzt einen Akteur in Beziehung zu einem Werk, bei dem ein Akteur für die Konzeption und oft auch Umsetzung einer originalen grafischen Gestaltung, einer Zeichnung oder eines Gemäldes und so weiter verantwortlich ist. @de
toolkit label: Akteur als Künstlerin/Künstler von @de
toolkit definition: Ein Werk, bei dem ein Akteur für die Konzeption und oft auch Umsetzung einer originalen grafischen Gestaltung, einer Zeichnung oder eines Gemäldes und so weiter verantwortlich ist. @de
label: er agent, som er kunstner af @da
definition: Relaterer en agent til et værk, som involverer en agents ansvar for at udtænke, og ofte udføre, et originalt grafisk design, en original tegning, et originalt maleri etc. @da
toolkit label: agent, som er kunstner af @da
toolkit definition: Værk, som involverer en agents ansvar for at udtænke, og ofte udføre, et originalt grafisk design, en original tegning, et originalt maleri etc. @da
label: és agent artista de @ca
definition: Relaciona un agent amb una obra que implica una responsabilitat d’un agent concebent, i sovint realitzant, un disseny gràfic, un dibuix, una pintura, etc. original. @ca
toolkit label: agent artista de @ca
toolkit definition: Obra que implica una responsabilitat d’un agent concebent, i sovint realitzant, un disseny gràfic, un dibuix, una pintura, etc. original. @ca
definition: Liittää toimijan teokseen, jossa toimija on vastuussa alkuperäisen graafisen suunnitelman, piirroksen, maalauksen tms. luomisesta.
toolkit label: taiteilija (toimija) teoksessa
toolkit definition: Teos, jossa toimija on vastuussa alkuperäisen graafisen suunnitelman, piirroksen, maalauksen tms. luomisesta.
toolkit label: kunstner for (agent) @no
toolkit definition: Et verk som involverer ansvar for en agent i form av å skape, og ofte implementere, original grafisk design, tegning, maleri, etc. @no
label: ist Akteur als Künstlerin/Künstler von @de
has element type: 2
label: művész ágense a következőnek: @hu
definition: Hozzákapcsol egy ágenst egy műhöz, amelyhez hozzátartozik egy ágens felelőssége egy eredeti grafikai terv, rajz, festmény stb. elgondolásáért és gyakran kivitelezéséért is. @hu
toolkit label: művész ágense: @hu
toolkit definition: Egy mű, amelyhez hozzátartozik egy ágens felelőssége egy eredeti grafikai terv, rajz, festmény stb. elgondolásáért és gyakran kivitelezéséért is. @hu
alternative label: artist of @en
alternative label: taiteilijana teoksessa
label: er kunstner for (agent) @no
definition: Relaterer en agent til et verk som involverer ansvar for en agent i form av å skape, og ofte implementere, original grafisk design, tegning, maleri, etc. @no
alternative label: kunstner for @no
label: is kunstenaar-actor van @nl
definition: Relateert een actor aan een werk dat met zich meebrengt een verantwoordelijkheid van een actor voor bedenken, en vaak uitvoeren, van een oorspronkelijk grafisch ontwerp, tekening, schilderij etc. @nl
toolkit label: kunstenaar-actor van @nl
toolkit definition: Een werk dat met zich meebrengt een verantwoordelijkheid van een actor voor bedenken, en vaak uitvoeren, van een oorspronkelijk grafisch ontwerp, tekening, schilderij etc. @nl
label: هو وكيل فنان لـ @ar
definition: يربط وكيلا بعمل يترتب عليه مسئولية وكيل عن وضع تصور لتصميم جرافيكي، أو لرسم، أو للوحة زيتية أصلية، إلخ، وغالبا تنفيذه. @ar
alternative label: فنان @ar
toolkit label: وكيل فنان @ar
toolkit definition: عمل يترتب عليه مسئولية وكيل عن وضع تصور لتصميم جرافيكي، أو لرسم، أو للوحة زيتية أصلية، إلخ وغالبا تنفيذه. @ar
alternative label: artista de @ca
alternative label: kunstner af @da
label: kunstnik (tegija) teoses @et
definition: Seostab tegija teosega, mis sisaldab tegija vastutust originaalse graafilise kujunduse, joonistuse, maali vms kavandamise ja sageli ka teostamise eest. @et
alternative label: kunstnik teoses @et
toolkit label: kunstnik (tegija) teoses @et
toolkit definition: Teos, mis sisaldab tegija vastutust originaalse graafilise kujunduse, joonistuse, maali vms kavandamise ja sageli ka teostamise eest. @et
alternative label: művésze: @hu
label: è artista agente di @it
definition: Correla un agente a un'opera che implica una responsabilità di un agente per la concezione, e spesso per lo sviluppo, di un progetto grafico, disegno, dipinto, etc. originale. @it
alternative label: artista di @it
toolkit label: artista agente di @it
toolkit definition: Opera che implica una responsabilità di un agente per la concezione, e spesso per lo sviluppo, di un progetto grafico, disegno, dipinto, etc. originale. @it
alternative label: καλλιτέχνης του @el
alternative label: artiste de @fr
label: ir mākslinieks (aģents) @lv
definition: Sasaista aģentu ar darbu, kas ietver aģenta atbildību par oriģinālu estampa, zīmējuma, gleznas u.tml. radīšanu un īstenošanu. @lv
toolkit label: ir mākslinieks (aģents) @lv
toolkit definition: Darbs, kas ietver aģenta atbildību par oriģinālu estampa, zīmējuma, gleznas u.tml. radīšanu un īstenošanu. @lv
alternative label: Künstler von @de
alternative label: ……的美术家 @zh-hans
toolkit label: ……的美术家行为者 @zh-hans
toolkit definition: 涉及构思并经常是完成原创图形设计、绘图、绘画等的一个行为者的责任的一种作品 @zh-hans
toolkit label: sanatçı temsilcisi @tr
toolkit definition: Özgün bir grafik tasarım, çizim, resim vb. tasarlamak ve sıklıkla uygulamak için bir temsilcinin sorumluluğunu içeren bir çalışma. @tr
has subproperty: taiteilija (yhteistoimija) teoksessa

taiteilija (yhteistoimija) teoksessa
status: Published
label: is artist collective agent of @en
lexical alias: artistCollectiveAgentOf.en
definition: Relates a collective agent to a work that involves a responsibility of a collective agent for conceiving, and often implementing, an original graphic design, drawing, painting, etc. @en
toolkit label: artist collective agent of @en
toolkit definition: A work that involves a responsibility of a collective agent for conceiving, and often implementing, an original graphic design, drawing, painting, etc. @en
type: Property
domain: C10011
has element type: 2
sub property of: teoksen tekijä (yhteistoimija) teoksessa
sub property of: taiteilija (toimija) teoksessa
definition: Liittää yhteistoimijan teokseen, jossa yhteistoimija on vastuussa alkuperäisen graafisen suunnitelman, piirroksen, maalauksen tms. luomisesta.
toolkit label: taiteilija (yhteistoimija) teoksessa
toolkit definition: Teos, jossa yhteistoimija on vastuussa alkuperäisen graafisen suunnitelman, piirroksen, maalauksen tms. luomisesta.
label: er kunstner av (kollektiv agent) @no
definition: Relaterer en kollektiv agent til et verk som involverer et ansvar for en kollektiv agent i form av å skape, og ofte implementere, et originalt grafisk design, en tegning, et maleri etc. @no
toolkit label: kunstner av (kollektiv agent) @no
toolkit definition: Et verk som involverer et ansvar for en kollektiv agent i form av å skape, og ofte implementere, et originalt grafisk design, en tegning, et maleri etc. @no
label: is kunstenaar-collectieve actor van @nl
definition: Relateert een collectieve actor aan een werk dat met zich meebrengt een verantwoordelijkheid van een collectieve actor voor bedenken, en vaak uitvoeren, van een oorspronkelijk grafisch ontwerp, tekening, schilderij etc. @nl
toolkit label: kunstenaar-collectieve actor van @nl
toolkit definition: Een werk dat met zich meebrengt een verantwoordelijkheid van een collectieve actor voor bedenken, en vaak uitvoeren, van een oorspronkelijk grafisch ontwerp, tekening, schilderij etc. @nl
label: هو وكيل جماعي فنان لـ @ar
definition: يربط وكيلا جماعيا بعمل يترتب عليه مسئولية وكيل جماعي عن وضع تصور لتصميم جرافيكي، أو لرسم، أو للوحة زيتية أصلية، إلخ وغالبا تنفيذها. @ar
toolkit label: وكيل جماعي فنان @ar
toolkit definition: عمل يترتب عليه مسئولية وكيل جماعي عن وضع تصور لتصميم جرافيكي، أو لرسم، أو للوحة زيتية أصلية، إلخ وغالبا تنفيذها. @ar
label: és agent col·lectiu artista de @ca
definition: Relaciona un agent col·lectiu amb una obra que implica una responsabilitat d’un agent col·lectiu concebent, i sovint realitzant, un disseny gràfic, un dibuix, una pintura, original etc. @ca
toolkit label: agent col·lectiu artista de @ca
toolkit definition: Obra que implica una responsabilitat d’un agent col·lectiu concebent, i sovint realitzant, un disseny gràfic, un dibuix, una pintura, original etc. @ca
label: er kollektiv agent, som er kunstner af @da
definition: Relaterer en kollektiv agent til et værk, som involverer en kollektiv agents ansvar for at udtænke, og ofte udføre, et originalt grafisk design, en original tegning, et originalt maleri etc. @da
toolkit label: kollektiv agent, som er kunstner af @da
toolkit definition: Værk, som involverer en kollektiv agents ansvar for at udtænke, og ofte udføre, et originalt grafisk design, en original tegning, et originalt maleri etc. @da
label: kunstnik (kollektiiv) teoses @et
definition: Seostab kollektiivi teosega, mis sisaldab kollektiivi vastutust originaalse graafilise kujunduse, joonistuse, maali vms kavandamise ja sageli ka teostamise eest. @et
toolkit label: kunstnik (kollektiiv) teoses @et
toolkit definition: Teos, mis sisaldab kollektiivi vastutust originaalse graafilise kujunduse, joonistuse, maali vms kavandamise ja sageli ka teostamise eest. @et
label: ist gemeinschaftlicher Akteur als Künstlerin/Künstler von @de
definition: Setzt einen gemeinschaftlichen Akteur in Beziehung zu einem Werk, bei dem ein gemeinschaftlicher Akteur für die Konzeption und oft auch Umsetzung einer originalen grafischen Gestaltung, einer Zeichnung oder eines Gemäldes und so weiter verantwortlich ist. @de
toolkit label: Gemeinschaftlicher Akteur als Künstlerin/Künstler von @de
toolkit definition: Ein Werk, bei dem ein gemeinschaftlicher Akteur für die Konzeption und oft auch Umsetzung einer originalen grafischen Gestaltung, einer Zeichnung oder eines Gemäldes und so weiter verantwortlich ist. @de
label: művész kollektív ágense a következőnek: @hu
definition: Hozzákapcsol egy kollektív ágenst egy műhöz, amelyhez hozzátartozik egy kollektv ágens felelőssége egy eredeti grafikai terv, rajz, festmény stb. elgondolásáért és gyakran kivitelezéséért is. @hu
toolkit label: művész kollektív ágense: @hu
toolkit definition: Egy mű, amelyhez hozzátartozik egy kollektv ágens felelőssége egy eredeti grafikai terv, rajz, festmény stb. elgondolásáért és gyakran kivitelezéséért is. @hu
label: è artista agente collettivo di @it
definition: Correla un agente collettivo a un'opera che implica una responsabilità di un agente collettivo per la concezione, e spesso per lo sviluppo, di un progetto grafico, disegno, dipinto, etc. originale. @it
toolkit label: artista agente collettivo di @it
toolkit definition: Opera che implica una responsabilità di un agente collettivo per la concezione, e spesso per lo sviluppo, di un progetto grafico, disegno, dipinto, etc. originale. @it
label: είναι καλλιτέχνης συλλογικός φορέας του @el
toolkit label: καλλιτέχνης συλλογικός φορέας του @el
label: est un agent collectif artiste de @fr
definition: Met un agent collectif en relation avec une œuvre qui comporte une responsabilité de la part d’un agent collectif consistant à concevoir et souvent à réaliser un graphisme, une peinture, un dessin, etc. original. @fr
toolkit label: agent collectif artiste de @fr
toolkit definition: Œuvre qui comporte une responsabilité de la part d’un agent collectif consistant à concevoir et souvent à réaliser un graphisme, une peinture, un dessin, etc. original. @fr
label: ir mākslinieks (grupa) @lv
definition: Sasaista grupu ar darbu, kas ietver grupas atbildību par oriģinālu estampa, zīmējuma, gleznas u.tml. radīšanu un īstenošanu. @lv
toolkit label: ir mākslinieks (grupa) @lv
toolkit definition: Darbs, kas ietver grupas atbildību par oriģinālu estampa, zīmējuma, gleznas u.tml. radīšanu un īstenošanu. @lv
label: 是……的美术家集体行为者 @zh-hans
definition: 将一个集体行为者与涉及构思并经常是完成原创图形设计、绘图、绘画等的一个集体行为者的责任的一种作品关联起来。 @zh-hans
toolkit label: ……的美术家集体行为者 @zh-hans
toolkit definition: 涉及构思并经常是完成原创图形设计、绘图、绘画等的一个集体行为者的责任的一种作品 @zh-hans
label: sanatçı kolektif temsilcidir @tr
definition: Kolektif bir temsilciyi, orijinal bir grafik tasarım, çizim, resim vb. tasarlamak ve sıklıkla uygulamakla görevli kolektif temsilcinin sorumluluğunu içeren bir eser ile ilişkilendirir. @tr
toolkit label: sanatçı kolektif temsilcisi @tr
toolkit definition: Orijinal bir grafik tasarım, çizim, resim vb. tasarlamak ve sıklıkla uygulamakla görevli kolektif temsilcinin sorumluluğunu içeren bir eser.. @tr
has subproperty: taiteilija (yhteisö) teoksessa
has subproperty: taiteilija (suku) teoksessa
has subproperty: kirjataiteilija (yhteistoimija) teoksessa
has subproperty: kalligrafi (yhteistoimija) teoksessa
has subproperty: kuvanveistäjä (yhteistoimija) teoksessa
has subproperty: P50691

taiteilija (yhteisö) teoksessa
status: Published
label: is artist corporate body of @en
lexical alias: artistCorporateBodyOf.en
definition: Relates a corporate body to a work that involves a responsibility of a corporate body for conceiving, and often implementing, an original graphic design, drawing, painting, etc. @en
toolkit label: artist corporate body of @en
toolkit definition: A work that involves a responsibility of a corporate body for conceiving, and often implementing, an original graphic design, drawing, painting, etc. @en
type: Property
domain: C10005
has element type: 2
sub property of: teoksen tekijä (yhteisö) teoksessa
sub property of: taiteilija (yhteistoimija) teoksessa
definition: Liittää yhteisön teokseen, jossa yhteisö on vastuussa alkuperäisen graafisen suunnitelman, piirroksen, maalauksen tms. luomisesta.
toolkit label: taiteilija (yhteisö) teoksessa
toolkit definition: Teos, jossa yhteisö on vastuussa alkuperäisen graafisen suunnitelman, piirroksen, maalauksen tms. luomisesta.
label: er kunstner av (korporasjon) @no
definition: Relaterer en korporasjon til et verk som involverer et ansvar for en korporasjon i form av å skape, og ofte implementere, et originalt grafisk design, en tegning, et maleri etc. @no
toolkit label: kunstner av (korporasjon) @no
toolkit definition: Et verk som involverer et ansvar for en korporasjon i form av å skape, og ofte implementere, et originalt grafisk design, en tegning, et maleri etc. @no
label: is kunstenaar-corporatie van @nl
definition: Relateert een corporatie aan een werk dat met zich meebrengt een verantwoordelijkheid van een corporatie voor bedenken, en vaak uitvoeren, van een oorspronkelijk grafisch ontwerp, tekening, schilderij etc. @nl
toolkit label: kunstenaar-corporatie van @nl
toolkit definition: Een werk dat met zich meebrengt een verantwoordelijkheid van een corporatie voor bedenken, en vaak uitvoeren, van een oorspronkelijk grafisch ontwerp, tekening, schilderij etc. @nl
label: هي هيئة فنانة لـ @ar
definition: يربط هيئة بعمل يترتب عليه مسئولية هيئة عن وضع تصور لتصميم جرافيكي، أو لرسم، أو للوحة زيتية أصلية، إلخ وغالبا تنفيذها. @ar
toolkit label: هيئة فنانة @ar
toolkit definition: عمل يترتب عليه مسئولية هيئة عن وضع تصور لتصميم جرافيكي، أو لرسم، أو للوحة زيتية أصلية، إلخ وغالبا تنفيذها. @ar
label: és entitat corporativa artista de @ca
definition: Relaciona una entitat corporativa amb una obra que implica una responsabilitat d’una entitat corporativa concebent, i sovint realitzant, un disseny gràfic, un dibuix, una pintura, original etc. @ca
toolkit label: entitat corporativa artista de @ca
toolkit definition: Obra que implica una responsabilitat d’una entitat corporativa concebent, i sovint realitzant, un disseny gràfic, un dibuix, una pintura, original etc. @ca
label: er korporation, som er kunstner af @da
definition: Relaterer en korporation til et værk, som involverer en korporations ansvar for at udtænke, og ofte udføre, et originalt grafisk design, en original tegning, et originalt maleri etc. @da
toolkit label: korporation, som er kunstner af @da
toolkit definition: Værk, som involverer en korporations ansvar for at udtænke, og ofte udføre, et originalt grafisk design, en original tegning, et originalt maleri etc. @da
label: kunstnik (asutus) teoses @et
definition: Seostab asutuse teosega, mis sisaldab asutuse vastutust originaalse graafilise kujunduse, joonistuse, maali vms kavandamise ja sageli ka teostamise eest. @et
toolkit label: kunstnik (asutus) teoses @et
toolkit definition: Teos, mis sisaldab asutuse vastutust originaalse graafilise kujunduse, joonistuse, maali vms kavandamise ja sageli ka teostamise eest. @et
label: ist Körperschaft als Künstlerin/Künstler von @de
definition: Setzt eine Körperschaft in Beziehung zu einem Werk, bei dem eine Körperschaft für die Konzeption und oft auch Umsetzung einer originalen grafischen Gestaltung, einer Zeichnung oder eines Gemäldes und so weiter verantwortlich ist. @de
toolkit label: Körperschaft als Künstlerin/Künstler von @de
toolkit definition: Ein Werk, bei dem eine Körperschaft für die Konzeption und oft auch Umsetzung einer originalen grafischen Gestaltung, einer Zeichnung oder eines Gemäldes und so weiter verantwortlich ist. @de
label: művész testülete a következőnek: @hu
definition: Hozzákapcsol egy testületet egy műhöz, amelyhez hozzátartozik egy testület felelőssége egy eredeti grafikai terv, rajz, festmény stb. elgondolásáért és gyakran kivitelezéséért is. @hu
toolkit label: művész testülete: @hu
toolkit definition: Egy mű, amelyhez hozzátartozik egy testület felelőssége egy eredeti grafikai terv, rajz, festmény stb. elgondolásáért és gyakran kivitelezéséért is. @hu
label: è artista ente di @it
definition: Correla un ente a un'opera che implica una responsabilità di un enteper la concezione, e spesso per lo sviluppo, di un progetto grafico, disegno, dipinto, etc. originale. @it
toolkit label: artista ente di @it
toolkit definition: Opera che implica una responsabilità di un ente per la concezione, e spesso per lo sviluppo, di un progetto grafico, disegno, dipinto, etc. originale. @it
label: είναι καλλιτέχνης συλλογικό όργανο του @el
toolkit label: καλλιτέχνης συλλογικό όργανο του @el
label: est une collectivité artiste de @fr
definition: Met une collectivité en relation avec une œuvre qui comporte une responsabilité de la part d’une collectivité consistant à concevoir et souvent à réaliser un graphisme, une peinture, un dessin, etc. original. @fr
toolkit label: collectivité artiste de @fr
toolkit definition: Œuvre qui comporte une responsabilité de la part d’une collectivité consistant à concevoir et souvent à réaliser un graphisme, une peinture, un dessin, etc. original. @fr
label: ir mākslinieks (institūcija) @lv
definition: Sasaista institūciju ar darbu, kas ietver institūcijas atbildību par oriģinālu estampa, zīmējuma, gleznas u.tml. radīšanu un īstenošanu. @lv
toolkit label: ir mākslinieks (institūcija) @lv
toolkit definition: Darbs, kas ietver institūcijas atbildību par oriģinālu estampa, zīmējuma, gleznas u.tml. radīšanu un īstenošanu. @lv
label: 是……的美术家团体 @zh-hans
definition: 将一个团体与涉及构思并经常是完成原创图形设计、绘图、绘画等的一个团体的责任的一种作品关联起来。 @zh-hans
toolkit label: ……的美术家团体 @zh-hans
toolkit definition: 涉及构思并经常是完成原创图形设计、绘图、绘画等的一个团体的责任的一种作品 @zh-hans
label: sanatçı tüzel kişisidir @tr
definition: Bir tüzel kişiyi, orijinal bir grafik tasarım, çizim, resim vb. tasarlama ve sıklıkla uygulama sorumluluğunu içeren bir eserle ilişkilendirir. @tr
toolkit label: sanatçi tüzel kişisi @tr
toolkit definition: Özgün bir grafik tasarım, çizim, resim vb. tasarlamak ve sıklıkla uygulamak için bir tüzel kişinin sorumluluğunu içeren bir eser. @tr
has subproperty: kirjataiteilija (yhteisö) teoksessa
has subproperty: kalligrafi (yhteisö) teoksessa
has subproperty: kuvanveistäjä (yhteisö) teoksessa
has subproperty: P50842

taiteilija (suku) teoksessa
status: Published
label: is artist family of @en
lexical alias: artistFamilyOf.en
definition: Relates a family to a work that involves a responsibility of a family for conceiving, and often implementing, an original graphic design, drawing, painting, etc. @en
toolkit label: artist family of @en
toolkit definition: A work that involves a responsibility of a family for conceiving, and often implementing, an original graphic design, drawing, painting, etc. @en
type: Property
domain: C10008
has element type: 2
sub property of: teoksen tekijä (suku) teoksessa
sub property of: taiteilija (yhteistoimija) teoksessa
definition: Liittää suvun teokseen, jossa suku on vastuussa alkuperäisen graafisen suunnitelman, piirroksen, maalauksen tms. luomisesta.
toolkit label: taiteilija (suku) teoksessa
toolkit definition: Teos, jossa suku on vastuussa alkuperäisen graafisen suunnitelman, piirroksen, maalauksen tms. luomisesta.
label: er kunstner av (familie) @no
definition: Relaterer en familie til et verk som involverer et ansvar for en familie i form av å skape, og ofte implementere, et originalt grafisk design, en tegning, et maleri etc. @no
toolkit label: kunstner av (familie) @no
toolkit definition: Et verk som involverer et ansvar for en familie i form av å skape, og ofte implementere, et originalt grafisk design, en tegning, et maleri etc. @no
label: is kunstenaar-familie van @nl
definition: Relateert een familie aan een werk dat met zich meebrengt een verantwoordelijkheid van een familie voor bedenken, en vaak uitvoeren, van een oorspronkelijk grafisch ontwerp, tekening, schilderij etc. @nl
toolkit label: kunstenaar-familie van @nl
toolkit definition: Een werk dat met zich meebrengt een verantwoordelijkheid van een familie voor bedenken, en vaak uitvoeren, van een oorspronkelijk grafisch ontwerp, tekening, schilderij etc. @nl
label: هي عائلة فنانة لـ @ar
definition: يربط عائلة بعمل يترتب عليه مسئولية عائلة عن وضع تصور لتصميم جرافيكي، أو لرسم، أو للوحة زيتية أصلية، إلخ وغالبا تنفيذها. @ar
toolkit label: عائلة فنانة @ar
toolkit definition: عمل يترتب عليه مسئولية عائلة عن وضع تصور لتصميم جرافيكي، أو لرسم، أو للوحة زيتية أصلية، إلخ وغالبا تنفيذها. @ar
label: és família artista de @ca
definition: Relaciona una família amb una obra que implica una responsabilitat d’una família concebent, i sovint realitzant, un disseny gràfic, un dibuix, una pintura, etc. original. @ca
toolkit label: família artista de @ca
toolkit definition: Obra que implica una responsabilitat d’una família concebent, i sovint realitzant, un disseny gràfic, un dibuix, una pintura, etc. original. @ca
label: er familie, som er kunstner af @da
definition: Relaterer en familie til et værk, som involverer en families ansvar for at udtænke, og ofte udføre, et originalt grafisk design, en original tegning, et originalt maleri etc. @da
toolkit label: familie, som er kunstner af @da
toolkit definition: Værk, som involverer en families ansvar for at udtænke, og ofte udføre, et originalt grafisk design, en original tegning, et originalt maleri etc. @da
label: kunstnik (perekond) teoses @et
definition: Seostab perekonna teosega, mis sisaldab perekonna vastutust originaalse graafilise kujunduse, joonistuse, maali vms kavandamise ja sageli ka teostamise eest. @et
toolkit label: kunstnik (perekond) teoses @et
toolkit definition: Teos, mis sisaldab perekonna vastutust originaalse graafilise kujunduse, joonistuse, maali vms kavandamise ja sageli ka teostamise eest. @et
label: ist Familie als Künstlerin/Künstler von @de
definition: Setzt eine Familie in Beziehung zu einem Werk, bei dem eine Familie für die Konzeption und oft auch Umsetzung einer originalen grafischen Gestaltung, einer Zeichnung oder eines Gemäldes und so weiter verantwortlich ist. @de
toolkit label: Familie als Künstlerin/Künstler von @de
toolkit definition: Ein Werk, bei dem eine Familie für die Konzeption und oft auch Umsetzung einer originalen grafischen Gestaltung, einer Zeichnung oder eines Gemäldes und so weiter verantwortlich ist. @de
label: művész családja a következőnek: @hu
definition: Hozzákapcsol egy családot egy műhöz, amelyhez hozzátartozik egy család felelőssége egy eredeti grafikai terv, rajz, festmény stb. elgondolásáért és gyakran kivitelezéséért is. @hu
toolkit label: művész családja: @hu
toolkit definition: Egy mű, amelyhez hozzátartozik egy család felelőssége egy eredeti grafikai terv, rajz, festmény stb. elgondolásáért és gyakran kivitelezéséért is. @hu
label: è artista famiglia di @it
definition: Correla una famiglia a un'opera che implica una responsabilità di una famiglia per la concezione, e spesso per lo sviluppo, di un progetto grafico, disegno, dipinto, etc. originale. @it
toolkit label: artista famiglia di @it
toolkit definition: Opera che implica una responsabilità di una famiglia per la concezione, e spesso per lo sviluppo, di un progetto grafico, disegno, dipinto, etc. originale. @it
label: είναι καλλιτέχνης οικογένεια του @el
toolkit label: καλλιτέχνης οικογένεια του @el
label: est une famille artiste de @fr
definition: Met une famille en relation avec une œuvre qui comporte une responsabilité de la part d’une famille consistant à concevoir et souvent à réaliser un graphisme, une peinture, un dessin, etc. original. @fr
toolkit label: famille artiste de @fr
toolkit definition: Œuvre qui comporte une responsabilité de la part d’une famille consistant à concevoir et souvent à réaliser un graphisme, une peinture, un dessin, etc. original. @fr
label: ir mākslinieks (dzimta/ģimene) @lv
definition: Sasaista dzimtu/ģimeni ar darbu, kas ietver dzimtas/ģimenes atbildību par oriģinālu estampa, zīmējuma, gleznas u.tml. radīšanu un īstenošanu. @lv
toolkit label: ir mākslinieks (dzimta/ģimene) @lv
toolkit definition: Darbs, kas ietver dzimtas/ģimenes atbildību par oriģinālu estampa, zīmējuma, gleznas u.tml. radīšanu un īstenošanu. @lv
label: 是……的美术家家族 @zh-hans
definition: 将一个家族与涉及构思并经常是完成原创图形设计、绘图、绘画等的一个家族的责任的一种作品关联起来。 @zh-hans
toolkit label: ……的美术家家族 @zh-hans
toolkit definition: 涉及构思并经常是完成原创图形设计、绘图、绘画等的一个家族的责任的一种作品 @zh-hans
label: sanatçı ailesidir @tr
definition: Bir aileyi, bir ailenin özgün bir grafik tasarım, çizim, resim vb. tasarlama ve sıklıkla uygulama sorumluluğunu içeren bir eserle ilişkilendirir. @tr
toolkit label: sanatçı ailesi @tr
toolkit definition: Özgün bir grafik tasarım, çizim, resim vb. tasarlamak ve sıklıkla uygulamak için bir ailenin sorumluluğunu içeren bir çalışma. @tr
has subproperty: kirjataiteilija (suku) teoksessa
has subproperty: kalligrafi (suku) teoksessa
has subproperty: kuvanveistäjä (suku) teoksessa
has subproperty: P50993

taiteilija (henkilö) teoksessa
status: Published
label: is artist person of @en
lexical alias: artistPersonOf.en
definition: Relates a person to a work that involves a responsibility of a person for conceiving, and often implementing, an original graphic design, drawing, painting, etc. @en
toolkit label: artist person of @en
toolkit definition: A work that involves a responsibility of a person for conceiving, and often implementing, an original graphic design, drawing, painting, etc. @en
type: Property
domain: C10004
has element type: 2
sub property of: teoksen tekijä (henkilö) teoksessa
sub property of: taiteilija (toimija) teoksessa
definition: Liittää henkilön teokseen, jossa henkilö on vastuussa alkuperäisen graafisen suunnitelman, piirroksen, maalauksen tms. luomisesta.
toolkit label: taiteilija (henkilö) teoksessa
toolkit definition: Teos, jossa henkilö on vastuussa alkuperäisen graafisen suunnitelman, piirroksen, maalauksen tms. luomisesta.
label: er kunstner av (person) @no
definition: Relaterer en person til et verk som involverer et ansvar for en person i form av å skape, og ofte implementere, et originalt grafisk design, en tegning, et maleri etc. @no
toolkit label: kunstner av (person) @no
toolkit definition: Et verk som involverer et ansvar for en person i form av å skape, og ofte implementere, et originalt grafisk design, en tegning, et maleri etc. @no
label: is kunstenaar-persoon van @nl
definition: Relateert een persoon aan een werk dat met zich meebrengt een verantwoordelijkheid van een persoon voor bedenken, en vaak uitvoeren, van een oorspronkelijk grafisch ontwerp, tekening, schilderij etc. @nl
toolkit label: kunstenaar-persoon van @nl
toolkit definition: Een werk dat met zich meebrengt een verantwoordelijkheid van een persoon voor bedenken, en vaak uitvoeren, van een oorspronkelijk grafisch ontwerp, tekening, schilderij etc. @nl
label: هو شخص فنان لـ @ar
definition: يربط شخصا بعمل يترتب عليه مسئولية شخص عن وضع تصور لتصميم جرافيكي، أو لرسم، أو للوحة زيتية أصلية، إلخ وغالبا تنفيذه. @ar
toolkit label: شخص فنان @ar
toolkit definition: عمل يترتب عليه مسئولية شخص عن وضع تصور لتصميم جرافيكي، أو لرسم، أو للوحة زيتية أصلية، إلخ وغالبا تنفيذها. @ar
label: és persona artista de @ca
definition: Relaciona una persona amb una obra que implica una responsabilitat d’una persona concebent, i sovint realitzant, un disseny gràfic, un dibuix, una pintura, original etc. @ca
toolkit label: persona artista de @ca
toolkit definition: Obra que implica una responsabilitat d’una persona concebent, i sovint realitzant, un disseny gràfic, un dibuix, una pintura, original etc. @ca
label: er person, som er kunstner af @da
definition: Relaterer en person til et værk, som involverer en persons ansvar for at udtænke, og ofte udføre, et originalt grafisk design, en original tegning, et originalt maleri etc. @da
toolkit label: person, som er kunstner af @da
toolkit definition: Værk, som involverer en persons ansvar for at udtænke, og ofte udføre, et originalt grafisk design, en original tegning, et originalt maleri etc. @da
label: kunstnik (isik) teoses @et
definition: Seostab isiku teosega, mis sisaldab isiku vastutust originaalse graafilise kujunduse, joonistuse, maali vms kavandamise ja sageli ka teostamise eest. @et
toolkit label: kunstnik (isik) teoses @et
toolkit definition: Teos, mis sisaldab isiku vastutust originaalse graafilise kujunduse, joonistuse, maali vms kavandamise ja sageli ka teostamise eest. @et
label: ist Person als Künstlerin/Künstler von @de
definition: Setzt eine Person in Beziehung zu einem Werk, bei dem eine Person für die Konzeption und oft auch Umsetzung einer originalen grafischen Gestaltung, einer Zeichnung oder eines Gemäldes und so weiter verantwortlich ist. @de
toolkit label: Person als Künstlerin/Künstler von @de
toolkit definition: Ein Werk, bei dem eine Person für die Konzeption und oft auch Umsetzung einer originalen grafischen Gestaltung, einer Zeichnung oder eines Gemäldes und so weiter verantwortlich ist. @de
label: művész személye a következőnek: @hu
definition: Hozzákapcsol egy személyt egy műhöz, amelyhez hozzátartozik egy személy felelőssége egy eredeti grafikai terv, rajz, festmény stb. elgondolásáért és gyakran kivitelezéséért is. @hu
toolkit label: művész személye: @hu
toolkit definition: Egy mű, amelyhez hozzátartozik egy személy felelőssége egy eredeti grafikai terv, rajz, festmény stb. elgondolásáért és gyakran kivitelezéséért is. @hu
label: è artista persona di @it
definition: Correla una persona a un'opera che implica una responsabilità di una persona per la concezione, e spesso per lo sviluppo, di un progetto grafico, disegno, dipinto, etc. originale. @it
toolkit label: artista persona di @it
toolkit definition: Opera che implica una responsabilità di una persona per la concezione, e spesso per lo sviluppo, di un progetto grafico, disegno, dipinto, etc. originale. @it
label: είναι καλλιτέχνης φυσικό πρόσωπο του @el
toolkit label: καλλιτέχνης φυσικό πρόσωπο του @el
label: est une personne artiste de @fr
definition: Met une personne en relation avec une œuvre qui comporte une responsabilité de la part d’une personne consistant à concevoir et souvent à réaliser un graphisme, une peinture, un dessin, etc. original. @fr
toolkit label: personne artiste de @fr
toolkit definition: Œuvre qui comporte une responsabilité de la part d’une personne consistant à concevoir et souvent à réaliser un graphisme, une peinture, un dessin, etc. original. @fr
label: ir mākslinieks (persona) @lv
definition: Sasaista personu ar darbu, kas ietver personas atbildību par oriģinālu estampa, zīmējuma, gleznas u.tml. radīšanu un īstenošanu. @lv
toolkit label: ir mākslinieks (persona) @lv
toolkit definition: Darbs, kas ietver personas atbildību par oriģinālu estampa, zīmējuma, gleznas u.tml. radīšanu un īstenošanu. @lv
label: 是……的美术家个人 @zh-hans
definition: 将一个个人与涉及构思并经常是完成原创图形设计、绘图、绘画等的一个个人的责任的一种作品关联起来。 @zh-hans
toolkit label: ……的美术家个人 @zh-hans
toolkit definition: 涉及构思并经常是完成原创图形设计、绘图、绘画等的一个个人的责任的一种作品 @zh-hans
label: sanatçı kişisidir @tr
definition: Bir kişiyi, özgün bir grafik tasarım, çizim, resim vb. tasarlama ve sıklıkla uygulama sorumluluğunu içeren bir eserle ilişkilendirir. @tr
toolkit label: sanatçı @tr
toolkit definition: Özgün bir grafik tasarım, çizim, resim vb. tasarlamak ve sıklıkla uygulamak için bir kişinin sorumluluğunu içeren bir çalışma. @tr
has subproperty: kirjataiteilija (henkilö) teoksessa
has subproperty: kalligrafi (henkilö) teoksessa
has subproperty: kuvanveistäjä (henkilö) teoksessa
has subproperty: P50540

toimijan antama nomen
status: Published
type: Property
label: is assigner agent of @en
lexical alias: assignerAgentOf.en
domain: C10002
toolkit label: assigner agent of @en
definition: Relates an agent to a nomen that is assigned to an entity by an agent. @en
toolkit definition: A nomen that is assigned to an entity by an agent. @en
sub property of: toimijaan liittyvä nomen
has element type: 2
definition: Liittää toimijan nomeniin, jonka toimija on antanut entiteetille.
toolkit label: toimijan antama nomen
toolkit definition: Nomen, jonka toimija on antanut entiteetille.
label: er angivende agent for @no
definition: Relaterer en agent til et nomen som er angitt til en entitet av en agent. @no
toolkit label: angivende agent for @no
toolkit definition: Et nomen som er angitt til en entitet av en agent. @no
label: is toekenner-actor van @nl
definition: Relateert een actor aan een nomen dat toegekend is aan een entiteit door een actor. @nl
toolkit label: toekenner-actor van @nl
toolkit definition: Een nomen dat toegekend is aan een entiteit door een actor. @nl
label: هو وكيل مُخصِّص لـ @ar
definition: يربط وكيلا بتسمية خصصها وكيل لكيان. @ar
toolkit label: وكيل مُخصِّص @ar
toolkit definition: تسمية خصصها وكيل لكيان. @ar
label: és agent assignador de @ca
definition: Relaciona un agent amb un nomen que és assignat a una entitat per un agent. @ca
toolkit label: agent assignador de @ca
toolkit definition: Nomen que és assignat a una entitat per un agent. @ca
label: er agent, som er angiver af @da
definition: Relaterer en agent til et nomen, som er angivet til en entitet af en agent. @da
toolkit label: agent, som er angiver af @da
toolkit definition: Nomen, som er angivet til en entitet af en agent. @da
label: tegija määratud nomen @et
definition: Seostab tegija nomen'iga, mille tegija on määranud olemile. @et
toolkit label: tegija määratud nomen @et
toolkit definition: Nomen, mille tegija on määranud olemile. @et
label: ist Akteur als Zuweisende/Zuweisender von @de
definition: Setzt einen Akteur in Beziehung zu einem Nomen, das von einem Akteur einer Entität zugewiesen ist. @de
toolkit label: Akteur als Zuweisende/Zuweisender von @de
toolkit definition: Ein Nomen, das von einem Akteur einer Entität zugewiesen ist. @de
label: hozzárendelő ágense a következőnek: @hu
definition: hozzárendelő ágense: @hu
toolkit label: Hozzákapcsol egy ágenst egy nomenhez, amelyet egy ágens rendel hozzá egy entitáshoz. @hu
toolkit definition: Egy nomen, amelyet egy ágens rendel hozzá egy entitáshoz. @hu
label: è assegnatore agente di @it
definition: Correla un agente a un nomen assegnato a un'entità da un agente. @it
toolkit label: assegnatore agente di @it
toolkit definition: Nomen assegnato a un'entità da un agente. @it
label: είναι εκχωρητής φορέας του @el
toolkit label: εκχωρητής φορέας του @el
label: est un agent attributeur de @fr
definition: Met un agent en relation avec un nomen qui est attribué à une entité par un agent. @fr
toolkit label: agent attributeur de @fr
toolkit definition: Nomen qui est attribué à une entité par un agent. @fr
label: ir nomena piešķīrējs (aģents) @lv
toolkit label: ir nomena piešķīrējs (aģents) @lv
definition: Sasaista aģentu ar nomenu, kuru entītei piešķīris aģents. @lv
toolkit definition: Nomens, kuru entītei piešķīris aģents @lv
label: 是……的分配者行为者 @zh-hans
toolkit label: ……的分配者行为者 @zh-hans
definition: 将一个行为者与被一个行为者分配给一个实体的一个命名关联起来。 @zh-hans
toolkit definition: 被一个行为者分配给一个实体的一个命名 @zh-hans
label: atayan temsilcisidir @tr
toolkit label: atayan temsilci @tr
definition: Bir temsilciyi, temsilci tarafından varlığa atanan isimle ilişkilendirir. @tr
toolkit definition: Bir temsilci tarafından bir varlığa atanan bir isim @tr
has subproperty: yhteistoimijan antama nomen
has subproperty: henkilön antama nomen
has subproperty: P50396

yhteistoimijan antama nomen
status: Published
type: Property
label: is assigner collective agent of @en
lexical alias: assignerCollectiveAgentOf.en
domain: C10011
toolkit label: assigner collective agent of @en
sub property of: yhteistoimijaan liittyvä nomen
definition: Relates a collective agent to a nomen that is assigned to an entity by a collective agent. @en
toolkit definition: A nomen that is assigned to an entity by a collective agent. @en
sub property of: toimijan antama nomen
has element type: 2
definition: Liittää yhteistoimijan nomeniin, jonka yhteistoimija on antanut entiteetille.
toolkit label: yhteistoimijan antama nomen
toolkit definition: Nomen, jonka yhteistoimija on antanut entiteetille.
label: er angivende kollektiv agent for @no
definition: Relaterer en kollektiv agent til et nomen som er angitt til en entitet av en kollektiv agent. @no
toolkit label: angivende kollektiv agent for @no
toolkit definition: Et nomen som er angitt til en entitet av en kollektiv agent. @no
label: is toekenner-collectieve actor van @nl
definition: Relateert een collectieve actor aan een nomen dat toegekend is aan een entiteit door een collectieve actor. @nl
toolkit label: toekenner-collectieve actor van @nl
toolkit definition: Een nomen dat toegekend is aan een entiteit door een collectieve actor. @nl
label: هو وكيل جماعي مخصص لـ @ar
definition: يربط وكيلا جماعيا بتسمية خصصها وكيل جماعي لكيان. @ar
toolkit label: وكيل جماعي مُخصِّص @ar
toolkit definition: تسمية خصصها وكيل جماعي لكيان . @ar
label: és agent col·lectiu assignador de @ca
definition: Relaciona un agent col·lectiu amb un nomen que és assignat a una entitat per un agent col·lectiu. @ca
toolkit label: agent col·lectiu assignador de @ca
toolkit definition: Nomen que és assignat a una entitat per un agent col·lectiu. @ca
label: er kollektiv agent, som er angiver af @da
definition: Relaterer en kollektiv agent til et nomen, som er angivet til en entitet af en kollektiv agent. @da
toolkit label: kollektiv agent, som er angiver af @da
toolkit definition: Nomen, som er angivet til en entitet af en kollektiv agent. @da
label: kollektiivi määratud nomen @et
definition: Seostab kollektiivi nomen'iga, mille kollektiiv on määranud olemile. @et
toolkit label: kollektiivi määratud nomen @et
toolkit definition: Nomen, mille kollektiiv on määranud olemile. @et
label: ist gemeinschaftlicher Akteur als Zuweisende/Zuweisender von @de
definition: Setzt einen gemeinschaftlichen Akteur in Beziehung zu einem Nomen, das von einem gemeinschaftlichen Akteur einer Entität zugewiesen ist. @de
toolkit label: Gemeinschaftlicher Akteur als Zuweisende/Zuweisender von @de
toolkit definition: Ein Nomen, das von einem gemeinschaftlichen Akteur einer Entität zugewiesen ist. @de
label: hozzárendelő kollektív ágense a következőnek: @hu
definition: hozzárendelő kollektív ágense: @hu
toolkit label: Hozzákapcsol egy kollektív ágenst egy nomenhez, amelyet egy kollektív ágens rendel hozzá egy entitáshoz. @hu
toolkit definition: Egy nomen, amelyet egy kollektív ágens rendel hozzá egy entitáshoz. @hu
label: è assegnatore agente collettivo di @it
definition: Correla un agente collettivo a un nomen assegnato a un'entità da un agente collettivo. @it
toolkit label: assegnatore agente collettivo di @it
toolkit definition: Nomen assegnato a un'entità da un agente collettivo. @it
label: είναι εκχωρητής συλλογικός φορέας του @el
toolkit label: εκχωρητής συλλογικός φορέας του @el
label: est un agent collectif attributeur de @fr
definition: Met un agent collectif en relation avec un nomen qui est attribué à une entité par un agent collectif. @fr
toolkit label: agent collectif attributeur de @fr
toolkit definition: Nomen qui est attribué à une entité par un agent collectif. @fr
label: ir nomena piešķīrējs (grupa) @lv
toolkit label: ir nomena piešķīrējs (grupa) @lv
definition: Sasaista grupu ar nomenu, kuru entītei piešķir grupa. @lv
toolkit definition: Nomens, kuru entītei piešķir grupa @lv
label: 是……的分配者集体行为者 @zh-hans
toolkit label: ……的分配者集体行为者 @zh-hans
definition: 将一个集体行为者与被一个集体行为者分配给一个实体的一个命名关联起来。 @zh-hans
toolkit definition: 被一个集体行为者分配给一个实体的一个命名 @zh-hans
label: atayan kolektif temsilcisidir @tr
toolkit label: atayan kolektif temsilci @tr
definition: Kolektif bir temsilciyi, bir varlığa bir kolektif temsilci tarafından atanan bir isimle ilişkilendirir. @tr
toolkit definition: Bir kolektif temsilci tarafından bir varlığa atanan bir isim @tr
has subproperty: yhteisön antama nomen
has subproperty: suvun antama nomen
has subproperty: P50397

yhteisön antama nomen
status: Published
type: Property
label: is assigner corporate body of @en
lexical alias: assignerCorporateBodyOf.en
domain: C10005
toolkit label: assigner corporate body of @en
sub property of: yhteisöön liittyvä nomen
definition: Relates a corporate body to a nomen that is assigned to an entity by a corporate body. @en
toolkit definition: A nomen that is assigned to an entity by a corporate body. @en
sub property of: yhteistoimijan antama nomen
has element type: 2
definition: Liittää yhteisön nomeniin, jonka yhteisö on antanut entiteetille.
toolkit label: yhteisön antama nomen
toolkit definition: Nomen, jonka yhteisö on antanut entiteetille.
label: er angivende korporasjon for @no
definition: Relaterer en korporasjon til et nomen som er angitt til en entitet av en korporasjon. @no
toolkit label: angivende korporasjon for @no
toolkit definition: Et nomen som er angitt til en entitet av en korporasjon. @no
label: is toekenner-corporatie van @nl
definition: Relateert een corporatie aan een nomen dat toegekend is aan een entiteit door een corporatie. @nl
toolkit label: toekenner-corporatie van @nl
toolkit definition: Een nomen dat toegekend is aan een entiteit door een corporatie. @nl
label: هي هيئة مُخصِّصة لـ @ar
definition: يربط هيئة بتسمية خصصتها هيئة لكيان. @ar
toolkit label: هيئة مُخصِّصة @ar
toolkit definition: تسمية خصصتها هيئة لكيان. @ar
label: és entitat corporativa assignadora de @ca
definition: Relaciona una entitat corporativa amb un nomen que és assignat a una entitat per una entitat corporativa. @ca
toolkit label: entitat corporativa assignadora de @ca
toolkit definition: Nomen que és assignat a una entitat per una entitat corporativa. @ca
label: er korporation, som er angiver af @da
definition: Relaterer en korporation til et nomen, som er angivet til en entitet af en korporation. @da
toolkit label: korporation, som er angiver af @da
toolkit definition: Nomen, som er angivet til en entitet af en korporation. @da
label: asutuse määratud nomen @et
definition: Seostab asutuse nomen'iga, mille asutus on määranud olemile. @et
toolkit label: asutuse määratud nomen @et
toolkit definition: Nomen, mille asutus on määranud olemile. @et
label: ist Körperschaft als Zuweisende/Zuweisender von @de
definition: Setzt eine Körperschaft in Beziehung zu einem Nomen, das von einer Körperschaft einer Entität zugewiesen ist. @de
toolkit label: Körperschaft als Zuweisende/Zuweisender von @de
toolkit definition: Ein Nomen, das von einer Körperschaft einer Entität zugewiesen ist. @de
label: hozzárendelő testülete a következőnek: @hu
definition: hozzárendelő testülete: @hu
toolkit label: Hozzákapcsol egy testületet egy nomenhez, amelyet egy testület rendel hozzá egy entitáshoz. @hu
toolkit definition: Egy nomen, amelyet egy testület rendel hozzá egy entitáshoz. @hu
label: è assegnatore ente di @it
definition: Correla un ente a un nomen assegnato a un'entità da un ente. @it
toolkit label: assegnatore ente di @it
toolkit definition: Nomen assegnato a un'entità da un ente. @it
label: είναι εκχωρητής συλλογικό όργανο του @el
toolkit label: εκχωρητής συλλογικό όργανο του @el
label: est une collectivité attributrice de @fr
definition: Met une collectivité en relation avec un nomen qui est attribué à une entité par une collectivité. @fr
toolkit label: collectivité attributrice de @fr
toolkit definition: Nomen qui est attribué à une entité par une collectivité. @fr
label: ir nomena piešķīrējs (institūcija) @lv
toolkit label: ir nomena piešķīrējs (institūcija) @lv
definition: Sasaista institūciju ar nomenu, kuru entītei piešķir institūcija. @lv
toolkit definition: Nomens, kuru entītei piešķir institūcija. @lv
label: 是……的分配者团体 @zh-hans
toolkit label: ……的分配者团体 @zh-hans
definition: 将一个团体与被一个团体分配给一个实体的一个命名关联起来。 @zh-hans
toolkit definition: 被一个团体分配给一个实体的一个命名 @zh-hans
label: atayan tüzel kişisidir @tr
toolkit label: atayan tüzel kişi @tr
definition: Bir tüzel kişiyi, bir varlığa bir tüzel kişi tarafından atanan bir isimle ilişkilendirir. @tr
toolkit definition: Bir tüzel kişi tarafından bir varlığa atanan bir isim @tr
has subproperty: P50398

suvun antama nomen
status: Published
type: Property
label: is assigner family of @en
lexical alias: assignerFamilyOf.en
domain: C10008
toolkit label: assigner family of @en
sub property of: sukuun liittyvä nomen
definition: Relates a family to a nomen that is assigned to an entity by a family. @en
toolkit definition: A nomen that is assigned to an entity by a family. @en
sub property of: yhteistoimijan antama nomen
has element type: 2
definition: Liittää suvun nomeniin, jonka suku on antanut entiteetille.
toolkit label: suvun antama nomen
toolkit definition: Nomen, jonka suku on antanut entiteetille.
label: er angivende familie for @no
definition: Relaterer en familie til et nomen som er angitt til en entitet av en familie. @no
toolkit label: angivende familie for @no
toolkit definition: Et nomen som er angitt til en entitet av en familie. @no
label: is toekenner-familie van @nl
definition: Relateert een familie aan een nomen dat toegekend is aan een entiteit door een familie. @nl
toolkit label: toekenner-familie van @nl
toolkit definition: Een nomen dat toegekend is aan een entiteit door een familie. @nl
label: هي عائلة مُخصِّصة لـ @ar
definition: يربط عائلة بتسمية خصصتها عائلة لكيان. @ar
toolkit label: عائلة مُخصِّصة @ar
toolkit definition: تسمية خصصتها عائلة لكيان. @ar
label: és família assignadora de @ca
definition: Relaciona una família amb un nomen que és assignat a una entitat per una família. @ca
toolkit label: família assignadora de @ca
toolkit definition: Nomen que és assignat a una entitat per una família. @ca
label: er familie, som er angiver af @da
definition: Relaterer en familie til et nomen, som er angivet til en entitet af en familie. @da
toolkit label: familie, som er angiver af @da
toolkit definition: Nomen, som er angivet til en entitet af en familie. @da
label: perekonna määratud nomen @et
definition: Seostab perekonna nomen'iga, mille perekond on määranud olemile. @et
toolkit label: perekonna määratud nomen @et
toolkit definition: Nomen, mille perekond on määranud olemile. @et
label: ist Familie als Zuweisende/Zuweisender von @de
definition: Setzt eine Familie in Beziehung zu einem Nomen, das von einer Familie einer Entität zugewiesen ist. @de
toolkit label: Familie als Zuweisende/Zuweisender von @de
toolkit definition: Ein Nomen, das von einer Familie einer Entität zugewiesen ist. @de
label: hozzárendelő családja a következőnek: @hu
definition: hozzárendelő családja a következőnek @hu
toolkit label: Hozzákapcsol egy családot egy nomenhez, amelyet egy család rendel hozzá egy entitáshoz. @hu
toolkit definition: Egy nomen, amelyet egy család rendel hozzá egy entitáshoz. @hu
label: è assegnatore famiglia di @it
definition: Correla una famiglia a un nomen assegnato a un'entità da una famiglia. @it
toolkit label: assegnatore famiglia di @it
toolkit definition: Nomen assegnato a un'entità da una famiglia. @it
label: είναι εκχωρητής οικογένεια του @el
toolkit label: εκχωρητής οικογένεια του @el
label: est une famille attributrice de @fr
definition: Met une famille en relation avec un nomen qui est attribué à une entité par une famille. @fr
toolkit label: famille attributrice de @fr
toolkit definition: Nomen qui est attribué à une entité par une famille. @fr
label: ir nomena piešķīrējs (dzimta/ģimene) @lv
toolkit label: ir nomena piešķīrējs (dzimta/ģimene) @lv
definition: Sasaista dzimtu/ģimeni ar nomenu, kuru entītei piešķir dzimta/ģimene. @lv
toolkit definition: Nomens, kuru entītei piešķir dzimta/ģimene. @lv
label: 是……的分配者家族 @zh-hans
toolkit label: ……的分配者家族 @zh-hans
definition: 将一个行为者与被一个家族分配给一个实体的一个命名关联起来。 @zh-hans
toolkit definition: 被一个家族分配给一个实体的一个命名 @zh-hans
label: atayan ailesidir @tr
toolkit label: atayan aile @tr
definition: Bir aileyi, bir varlığa bir aile tarafından atanan bir isimle ilişkilendirir. @tr
toolkit definition: Bir aile tarafından bir varlığa atanan bir isim @tr
has subproperty: P50399

henkilön antama nomen
status: Published
type: Property
label: is assigner person of @en
lexical alias: assignerPersonOf.en
domain: C10004
toolkit label: assigner person of @en
sub property of: henkilöön liittyvä nomen
definition: Relates a person to a nomen that is assigned to an entity by a person. @en
toolkit definition: A nomen that is assigned to an entity by a person. @en
sub property of: toimijan antama nomen
has element type: 2
definition: Liittää henkilön nomeniin, jonka henkilö on antanut entiteetille.
toolkit label: henkilön antama nomen
toolkit definition: Nomen, jonka henkilö on antanut entiteetille.
label: er angivende person for @no
definition: Relaterer en person til et nomen som er angitt til en entitet av en person. @no
toolkit label: angivende person for @no
toolkit definition: Et nomen som er angitt til en entitet av en person. @no
label: is toekenner-persoon van @nl
definition: Relateert een persoon aan een nomen dat toegekend is aan een entiteit door een persoon. @nl
toolkit label: toekenner-persoon van @nl
toolkit definition: Een nomen dat toegekend is aan een entiteit door een persoon. @nl
label: هو شخص مُخصِّص لـ @ar
definition: يربط شخصا بتسمية خصصها شخص لكيان. @ar
toolkit label: شخص مُخصِّص @ar
toolkit definition: تسمية خصصها شخص لكيان. @ar
label: és persona assignadora de @ca
definition: Relaciona una persona amb un nomen que és assignat a una entitat per una persona. @ca
toolkit label: persona assignadora de @ca
toolkit definition: Nomen que és assignat a una entitat per una persona. @ca
label: er person, som er angiver af @da
definition: Relaterer en person til et nomen, som er angivet til en entitet af en person. @da
toolkit label: person, som er angiver af @da
toolkit definition: Nomen, som er angivet til en entitet af en person. @da
label: isiku määratud nomen @et
definition: Seostab isiku nomen'iga, mille isik on määranud olemile. @et
toolkit label: isiku määratud nomen @et
toolkit definition: Nomen, mille isik on määranud olemile. @et
label: ist Person als Zuweisende/Zuweisender von @de
definition: Setzt eine Person in Beziehung zu einem Nomen, das von einer Person einer Entität zugewiesen ist. @de
toolkit label: Person als Zuweisende/Zuweisender von @de
toolkit definition: Ein Nomen, das von einer Person einer Entität zugewiesen ist. @de
label: hozzárendelő személye a következőnek: @hu
definition: hozzárendelő személye a következőnek @hu
toolkit label: Hozzákapcsol egy személyt egy nomenhez, amelyet egy személy rendel hozzá egy entitáshoz. @hu
toolkit definition: Egy nomen, amelyet egy személy rendel hozzá egy entitáshoz. @hu
label: è assegnatore persona di @it
definition: Correla una persona a un nomen assegnato a un'entità da una persona. @it
toolkit label: assegnatore persona di @it
toolkit definition: Nomen assegnato a un'entità da una persona. @it
label: είναι εκχωρητής φυσικό πρόσωπο του @el
toolkit label: εκχωρητής φυσικό πρόσωπο του @el
label: est une personne attributrice de @fr
definition: Met une personne en relation avec un nomen qui est attribué à une entité par une personne. @fr
toolkit label: personne attributrice de @fr
toolkit definition: Nomen qui est attribué à une entité par une personne. @fr
label: ir nomena piešķīrējs (persona) @lv
toolkit label: ir nomena piešķīrējs (persona) @lv
definition: Sasaista personu ar nomenu, kuru entītei piešķir persona. @lv
toolkit definition: Nomens, kuru entītei piešķir persona. @lv
label: 是……的分配者个人 @zh-hans
toolkit label: ……的分配者个人 @zh-hans
definition: 有将一个个人与被一个个人分配给一个实体的一个命名关联起来。 @zh-hans
toolkit definition: 被一个个人分配给一个实体的一个命名 @zh-hans
label: atayan akişisidir @tr
toolkit label: atayan kişi @tr
definition: Bir kişiyi, bir varlığa bir kişi tarafından atanan bir isimle ilişkilendirir. @tr
toolkit definition: Bir kişi tarafından bir varlığa atanan bir isim @tr
has subproperty: P50400

assistentti
status: Published
type: Property
label: has assistant @en
lexical alias: assistant.en
definition: Relates a person to a person who is a colleague who helps another person. @en
domain: C10004
toolkit label: assistant @en
toolkit definition: A person who is a colleague who helps another person. @en
instruction number: 29.5
sub property of: kollega
label: έχει βοηθό @el
definition: Συνδέει ένα φυσικό πρόσωπο με έναν συνάδελφο, ο οποίος παρέχει βοήθεια σε ένα άλλο φυσικό πρόσωπο. @el
toolkit label: βοηθός @el
toolkit definition: Ένας συνάδελφος που παρέχει βοήθεια σε ένα άλλο φυσικό πρόσωπο. @el
definition: Setzt eine Person in Beziehung zu einer Kollegin/einem Kollegen (Person), die/der eine andere Person unterstützt. @de
toolkit label: Assistentin/Assistent @de
toolkit definition: Eine Kollegin/Ein Kollege (Person), die/der eine andere Person unterstützt. @de
label: har assistent @da
definition: Relaterer en person til er person, der er en kollega, som hjælper en anden person. @da
toolkit label: assistent @da
toolkit definition: Person, der er en kollega, som hjælper en anden person. @da
label: té com a ajudant @ca
definition: Relaciona una persona amb una persona que és un col·lega que ajuda una altra persona. @ca
toolkit label: ajudant @ca
toolkit definition: Persona que és un col·lega que ajuda una altra persona. @ca
definition: Liittää henkilön henkilöön, joka on kollega, joka avustaa toista henkilöä.
toolkit label: assistentti
toolkit definition: Henkilö, joka on kollega, joka avustaa toista henkilöä.
toolkit definition: En kollega som hjelper en annen person. @no
label: hat Assistentin/Assistenten @de
label: a pour adjoint @fr
definition: Met une personne en relation avec une personne qui est un collègue aidant une autre personne. @fr
toolkit label: adjoint @fr
toolkit definition: Personne qui est un collègue aidant une autre personne. @fr
has element type: 2
label: asszisztense a következő: @hu
definition: Hozzákapcsol egy személyt egy kolléga személyhez, aki egy másik személynek segít. @hu
toolkit label: asszisztens: @hu
toolkit definition: Egy kolléga személy, aki egy másik személynek segít. @hu
definition: Relaterer en person til en kollega som hjelper en annen person. @no
label: heeft assistent @nl
definition: Relateert een persoon aan een persoon die is een collega die een andere persoon helpt. @nl
toolkit definition: Een persoon die is een collega die een andere persoon helpt. @nl
label: له مساعد @ar
definition: يربط شخصا بزميل يساعد شخصًا آخر. @ar
toolkit label: مساعد @ar
toolkit definition: زميل يساعد شخصًا آخر. @ar
label: assistent @et
definition: Seostab isiku kolleegiga, kes abistab teist isikut. @et
toolkit definition: Kolleeg, kes abistab teist isikut. @et
label: ha come assitente @it
definition: Correla una persona a un collega che aiuta un'altra persona. @it
toolkit label: assistente @it
toolkit definition: Collega che aiuta un'altar persona. @it
label: asistents @lv
definition: Sasaista personu ar personu, kurš ir kolēģis, kurš palīdz citai personai. @lv
toolkit label: asistents @lv
toolkit definition: Kolēģis, kurš palīdz citai personai. @lv
label: 有助理 @zh-hans
definition: 将一个个人与作为帮助另一个个人的同事的一个个人关联起来。 @zh-hans
toolkit label: 助理 @zh-hans
toolkit definition: 作为帮助另一个个人的同事的一个个人 @zh-hans
label: asistan ile ilişkilidir @tr
definition: Bir kişiyi, başka bir kişiye yardım eden bir meslektaş olan bir kişiyle ilişkilendirir. @tr
toolkit label: asistan @tr
toolkit definition: Başka bir kişiye yardım eden bir meslektaş olan kişi. @tr
has subproperty: P50275

assistentti henkilölle
status: Published
type: Property
label: is assistant to @en
lexical alias: assistantTo.en
definition: Relates a person to a person who is a colleague who is helped by another person. @en
domain: C10004
toolkit label: assistant to @en
toolkit definition: A person who is a colleague who is helped by another person. @en
instruction number: 29.5
sub property of: kollega
label: είναι βοηθός σε @el
definition: Συνδέει ένα φυσικό πρόσωπο με έναν συνάδελφο, ο οποίος δέχεται βοήθεια από ένα άλλο φυσικό πρόσωπο. @el
toolkit label: βοηθός σε @el
toolkit definition: Ένας συνάδελφος που δέχεται βοήθεια από ένα άλλο φυσικό πρόσωπο. @el
definition: Setzt eine Person in Beziehung zu einer Kollegin/einem Kollegen (Person), die/der von einer anderen Person unterstützt wird. @de
toolkit label: Assistentin/Assistent von @de
toolkit definition: Eine Kollegin/Ein Kollege (Person), die/der von einer anderen Person unterstützt wird. @de
label: er assistent for @da
definition: Relaterer en person til en person, der er en kollega, som ´får hjælp af en anden person. @da
toolkit label: assistent for @da
toolkit definition: Person, der er en kollega, som får hjælp av en anden person. @da
label: és ajudant de @ca
definition: Relaciona una persona amb una persona que és un col·lega que és ajudat per una altra persona. @ca
toolkit label: ajudant de @ca
toolkit definition: Persona que és un col·lega que és ajudat per una altra persona. @ca
definition: Liittää henkilön henkilöön, joka on kollega, jota toinen henkilö avustaa.
toolkit label: assistentti henkilölle
toolkit definition: Henkilö, joka on kollega, jota toinen henkilö avustaa.
toolkit label: assistent til @no
toolkit definition: En kollega som får hjelp av en annen person. @no
label: ist Assistentin/Assistent von @de
label: est un adjoint de @fr
definition: Met une personne en relation avec une personne qui est un collègue recevant l’aide d’une autre personne. @fr
toolkit label: adjoint de @fr
toolkit definition: Personne qui est un collègue recevant l’aide d’une autre personne. @fr
has element type: 2
label: asszisztense a következőnek: @hu
definition: Hozzákapcsol egy személyt egy kolléga személyhez, akit egy másik személy segít. @hu
toolkit label: asszisztense: @hu
toolkit definition: Egy kolléga személy, akit egy másik személy segít. @hu
label: er assistent til @no
definition: Relaterer en person til en kollega som får hjelp av en annen person. @no
label: is assistent van @nl
definition: Relateert een persoon aan een persoon die is een collega die geholpen wordt door een andere persoon. @nl
toolkit label: assistent van @nl
toolkit definition: Een persoon die is een collega die geholpen wordt door een andere persoon. @nl
label: هو مساعد لـ @ar
definition: يربط شخصا بزميل تلقى مساعدة من شخص آخر. @ar
toolkit label: مساعد لـ @ar
toolkit definition: زميل تلقى مساعدة من شخص آخر. @ar
label: assistent kolleegile @et
definition: Seostab isiku kolleegiga, keda abistab teine isik. @et
toolkit label: assistent kolleegile @et
toolkit definition: Kolleeg, keda abistab teine isik. @et
label: è assistente di @it
definition: Correla una persona a un collega che è aiutatato da un'altra persona. @it
toolkit label: assistente di @it
toolkit definition: Collega che è aiutatato da un'altra persona. @it
label: ir asistējis @lv
definition: Sasaista personu ar personu, kurš ir kolēģis, kuram palīdz cita persona. @lv
toolkit label: asistējis @lv
toolkit definition: Kolēģis, kuram palīdz cita persona. @lv
label: 是……的助理 @zh-hans
definition: 将一个个人与作为另一个个人帮助的同事的一个个人关联起来。 @zh-hans
toolkit label: ……的助理 @zh-hans
toolkit definition: 作为另一个个人帮助的同事的一个个人 @zh-hans
label: asistanıdır @tr
definition: Bir kişiyi, başka bir kişinin yardım ettiği bir meslektaş olan bir kişiyle ilişkilendirir. @tr
toolkit label: asistan @tr
toolkit definition: Başka bir kişinin yardım ettiği bir meslektaş olan kişi. @tr
has subproperty: P50276

ääniteknikko (toimija) ekspressiossa
status: Published
type: Property
label: is audio engineer agent of @en
lexical alias: audioEngineerAgentOf.en
definition: Relates an agent to an expression that includes a contribution by an agent of managing the technical aspects of sound during the processes of recording, mixing, and reproduction. @en
domain: C10002
toolkit label: audio engineer agent of @en
toolkit definition: An expression that includes a contribution by an agent of managing the technical aspects of sound during the processes of recording, mixing, and reproduction. @en
instruction number: 18.5
sub property of: esitykseen osallinen toimija ekspressiossa
label: είναι μηχανικός ήχου φορέας του @el
definition: Συνδέει έναν φορέα με μια έκφραση ενός έργου που ενσωματώνει τη συνεισφορά της διαχείρισης των τεχνικών πτυχών του ήχου κατά τις διαδικασίες της ηχογράφησης, της μίξης και της αναπαραγωγής στο ακουστικό περιεχόμενο. @el
toolkit label: μηχανικός ήχου φορέας του @el
toolkit definition: Μια έκφραση ενός έργου που ενσωματώνει τη συνεισφορά της διαχείρισης των τεχνικών πτυχών του ήχου κατά τις διαδικασίες της ηχογράφησης, της μίξης και της αναπαραγωγής στο ακουστικό περιεχόμενο. @el
definition: Setzt einen Akteur in Beziehung zu einer Expression, zu der ein Akteur beiträgt, indem er die technischen Aspekte für den Ton während der Aufnahme, des Misch-Verfahrens und der Vervielfältigung handhabt. @de
toolkit label: Akteur als Tontechnikerin/Tontechniker von @de
toolkit definition: Eine Expression, zu der ein Akteur beiträgt, indem er die technischen Aspekte für den Ton während der Aufnahme, des Misch-Verfahrens und der Vervielfältigung handhabt. @de
label: er agent, som er lydtekniker af @da
definition: Relaterer en agent til et udtryk, som omfatter en agents bidrag ved at håndtere de tekniske lydaspekter under indspilning, mixning og reproduktion. @da
toolkit label: agent, som er lydtekniker af @da
toolkit definition: Udtryk, som omfatter en agents bidrag ved at håndtere de tekniske lydaspekter under indspilning, mixning og reproduktion. @da
label: és agent enginyer d’àudio de @ca
definition: Relaciona un agent amb una expressió que inclou una contribució d’un agent gestionant els aspectes tècnics del so durant els processos d’enregistrament, mescla i reproducció. @ca
toolkit label: agent enginyer d’àudio de @ca
toolkit definition: Expressió que inclou una contribució d’un agent gestionant els aspectes tècnics del so durant els processos d’enregistrament, mescla i reproducció. @ca
definition: Liittää toimijan teoksen ekspressioon, joka sisältää äänisisällön teknisten ominaisuuksien valvomisen äänityksen, miksauksen ja toiston aikana.
toolkit label: ääniteknikko (toimija) ekspressiossa
toolkit definition: Ekspressio, jonka tekemiseen toimija osallistuu huolehtimalla äänen teknisistä näkökohdista äänitys-, miksaus- ja äänentoistoprosessien aikana.
toolkit label: lydtekniker for (agent) @no
toolkit definition: Et uttrykk som inkluderer et bidrag fra en agent i form av å styre de tekniske aspektene ved lyd under innspilling, miksing og gjengivelse. @no
label: ist Akteur als Tontechnikerin/Tontechniker von @de
label: est un agent ingénieur du son de @fr
definition: Met un agent en relation avec une expression qui intègre une contribution de la part d’un agent consistant à gérer les aspects techniques du son durant les processus d’enregistrement, de mixage et de reproduction. @fr
toolkit label: agent ingénieur du son de @fr
toolkit definition: Expression qui intègre une contribution de la part d’un agent consistant à gérer les aspects techniques du son durant les processus d’enregistrement, de mixage et de reproduction. @fr
has element type: 2
label: hangmester ágense a következőnek: @hu
definition: Hozzákapcsol egy ágenst egy kifejezési formához, amely magában foglalja egy ágens közreműködését a hang technikai vonatkozásainak kezelésében a rögzítés, a keverés és a sokszorosítás folyamatában. @hu
toolkit label: hangmester ágense: @hu
toolkit definition: Egy kifejezési forma, amely magában foglalja egy ágens közreműködését a hang technikai vonatkozásainak kezelésében a rögzítés, a keverés és a sokszorosítás folyamatában. @hu
alternative label: audio engineer of @en
alternative label: ääniteknikkona ekspressiossa
label: er lydtekniker for (agent) @no
definition: Relaterer en agent til et uttrykk som inkluderer et bidrag fra en agent i form av å styre de tekniske aspektene ved lyd under innspilling, miksing og gjengivelse. @no
alternative label: lydtekniker for @no
label: is geluidstechnicus-actor van @nl
definition: Relateert een actor aan een expressie die omvat een bijdrage door een actor door beheren van de technische aspecten van geluid gedurende de procedures van opname, mixen en reproductie. @nl
toolkit label: geluidstechnicus-actor van @nl
toolkit definition: Een expressie die omvat een bijdrage door een actor door beheren van de technische aspecten van geluid gedurende de procedures van opname, mixen en reproductie. @nl
label: هو وكيل مهندس صوت لـ @ar
definition: يربط وكيلا بتعبيرة تتضمن إسهام وكيل في إدارة الجوانب الفنية للصوت أثناء عمليات التسجيل والمزج والاستنساخ. @ar
alternative label: مهندس صوت @ar
toolkit label: وكيل مهندس صوتيات @ar
toolkit definition: تعبيرة تتضمن إسهام وكيل في إدارة الجوانب الفنية للصوت أثناء عمليات التسجيل والمزج والاستنساخ. @ar
alternative label: enginyer d’àudio de @ca
alternative label: lydtekniker af @da
label: heliinsener (tegija) väljenduses @et
definition: Seostab tegija väljendusega, millesse tegija on andnud panuse, tegeldes heli tehniliste aspektidega salvestamise, miksimise ja taasesituse protsesside ajal. @et
alternative label: heliinsener väljenduses @et
toolkit label: heliinsener (tegija) väljenduses @et
toolkit definition: Väljendus, millesse tegija on andnud panuse, tegeldes heli tehniliste aspektidega salvestamise, miksimise ja taasesituse protsesside ajal. @et
alternative label: hangmestere: @hu
label: è ingegnere audio agente di @it
definition: Correla un agente a un'espressione che implica la responsabilità di un agente nel gestire gli aspetti tecnici del suono durante i processi di registrazione, missaggio e riproduzione. @it
alternative label: ingegnere dell'audio di @it
toolkit label: ingegnere dell'audio agente di @it
toolkit definition: Espressione che implica la responsabilità di un agente nel gestire gli aspetti tecnici del suono durante i processi di registrazione, missaggio e riproduzione. @it
alternative label: μηχανικός ήχου του @el
alternative label: ingénieur du son de @fr
label: ir skaņu inženieris (aģents) @lv
definition: Sasaista aģentu ar izteiksmi, kas ietver aģenta ieguldījumu, pārvaldot skaņas tehnisko aspektu ierakstīšanas, miksēšanas un pavairošanas laikā. @lv
toolkit label: ir skaņu inženieris (aģents) @lv
toolkit definition: Izteiksme, kas ietver aģenta ieguldījumu, pārvaldot skaņas tehnisko aspektu ierakstīšanas, miksēšanas un pavairošanas laikā. @lv
alternative label: Tontechniker von @de
alternative label: ……的音频工程师 @zh-hans
toolkit label: ……的音频工程师行为者 @zh-hans
toolkit definition: 包括声音的录制、合成和复制过程技术方面管理的一个行为者的贡献的一种内容表达 @zh-hans
toolkit label: ses mühendisi temsilcisi @tr
toolkit definition: Kayıt, miksaj ve reprodüksiyon süreçlerinde sesin teknik yönlerini yöneten bir temsilcinin katkısını içeren bir anlatım. @tr
has subproperty: ääniteknikko (yhteistoimija) ekspressiossa

ääniteknikko (yhteistoimija) ekspressiossa
status: Published
label: is audio engineer collective agent of @en
lexical alias: audioEngineerCollectiveAgentOf.en
definition: Relates a collective agent to an expression that includes a contribution by a collective agent of managing the technical aspects of sound during the processes of recording, mixing, and reproduction. @en
toolkit label: audio engineer collective agent of @en
toolkit definition: An expression that includes a contribution by a collective agent of managing the technical aspects of sound during the processes of recording, mixing, and reproduction. @en
type: Property
domain: C10011
has element type: 2
sub property of: esitykseen osallinen yhteistoimija ekspressiossa
sub property of: ääniteknikko (toimija) ekspressiossa
definition: Liittää yhteistoimijan ekspressioon, jossa yhteistoimija on osallisena ekspression tekemisessä huolehtimalla äänen teknisistä näkökohdista äänitys-, miksaus- ja äänentoistoprosessien aikana.
toolkit label: ääniteknikko (yhteistoimija) ekspressiossa
toolkit definition: Ekspressio, jossa yhteistoimija on osallisena ekspression tekemisessä huolehtimalla äänen teknisistä näkökohdista äänitys-, miksaus- ja äänentoistoprosessien aikana.
label: er lydtekniker for (kollektiv agent) @no
definition: Relaterer en kollektiv agent til et uttrykk som inkluderer et bidrag fra en kollektiv agent i form av å styre de tekniske aspektene ved lyd under innspilling, miksing og gjengivelse. @no
toolkit label: lydtekniker for (kollektiv agent) @no
toolkit definition: Et uttrykk som inkluderer et bidrag fra en kollektiv agent i form av å styre de tekniske aspektene ved lyd under innspilling, miksing og gjengivelse. @no
label: is geluidstechnicus-collectieve actor van @nl
definition: Relateert een collectieve actor aan een expressie die omvat een bijdrage door een collectieve actor door beheren van de technische aspecten van geluid gedurende de procedures van opname, mixen en reproductie. @nl
toolkit label: geluidstechnicus-collectieve actor van @nl
toolkit definition: Een expressie die omvat een bijdrage door een collectieve actor door beheren van de technische aspecten van geluid gedurende de procedures van opname, mixen en reproductie. @nl
label: هو وكيل جماعي مهندس صوت لـ @ar
definition: يربط وكيلا جماعيا بتعبيرة تتضمن إسهام وكيل جماعي في إدارة الجوانب الفنية للصوت أثناء عمليات التسجيل والمزج والاستنساخ. @ar
toolkit label: وكيل جماعي مهندس صوت @ar
toolkit definition: تعبيرة تتضمن إسهام وكيل جماعي في إدارة الجوانب الفنية للصوت أثناء عمليات التسجيل والمزج والاستنساخ. @ar
label: és agent col·lectiu enginyer d’àudio de @ca
definition: Relaciona un agent col·lectiu amb una expressió que inclou una contribució d’un agent col·lectiu gestionant els aspectes tècnics del so durant els processos d’enregistrament, mescla i reproducció. @ca
toolkit label: agent col·lectiu enginyer d’àudio de @ca
toolkit definition: Expressió que inclou una contribució d’un agent col·lectiu gestionant els aspectes tècnics del so durant els processos d’enregistrament, mescla i reproducció. @ca
label: er kollektiv agent, som er lydtekniker af @da
definition: Relaterer en kollektiv agent til et udtryk, som omfatter en kollektiv agents bidrag ved at håndtere de tekniske lydaspekter under indspilning, mixning og reproduktion. @da
toolkit label: kollektiv agent, som er lydtekniker af @da
toolkit definition: Udtryk, som omfatter en kollektiv agents bidrag ved at håndtere de tekniske lydaspekter under indspilning, mixning og reproduktion. @da
label: heliinsener (kollektiiv) väljenduses @et
definition: Seostab kollektiivi väljendusega, millesse kollektiiv on andnud panuse, tegeldes heli tehniliste aspektidega salvestamise, miksimise ja taasesituse protsesside ajal. @et
toolkit label: heliinsener (kollektiiv) väljenduses @et
toolkit definition: Väljendus, millesse kollektiiv on andnud panuse, tegeldes heli tehniliste aspektidega salvestamise, miksimise ja taasesituse protsesside ajal. @et
label: ist gemeinschaftlicher Akteur als Tontechnikerin/Tontechniker von @de
definition: Setzt einen gemeinschaftlichen Akteur in Beziehung zu einer Expression, zu der ein gemeinschaftlicher Akteur beiträgt, indem er die technischen Aspekte für den Ton während der Aufnahme, des Misch-Verfahrens und der Vervielfältigung handhabt. @de
toolkit label: Gemeinschaftlicher Akteur als Tontechnikerin/Tontechniker von @de
toolkit definition: Eine Expression, zu der ein gemeinschaftlicher Akteur beiträgt, indem er die technischen Aspekte für den Ton während der Aufnahme, des Misch-Verfahrens und der Vervielfältigung handhabt. @de
label: hangmester kollektív ágense a következőnek: @hu
definition: Hozzákapcsol egy kollektív ágenst egy kifejezési formához, amely magában foglalja egy kollektív ágens közreműködését a hang technikai vonatkozásainak kezelésében a rögzítés, a keverés és a sokszorosítás folyamatában. @hu
toolkit label: hangmester kollektív ágense: @hu
toolkit definition: Egy kifejezési forma, amely magában foglalja egy kollektív ágens közreműködését a hang technikai vonatkozásainak kezelésében a rögzítés, a keverés és a sokszorosítás folyamatában. @hu
label: è ingegnere del suono agente collettivo di @it
definition: Correla un agente collettivo a un'espressione che comprende un contributo di un agente collettivo nella gestione degli aspetti tecnici del suono durante i processi di registrazione, missaggio e riproduzione. @it
toolkit label: ingegnere del suono agente collettivo di @it
toolkit definition: Espressione che comprende un contributo di un agente collettivo nella gestione degli aspetti tecnici del suono durante i processi di registrazione, missaggio e riproduzione. @it
label: είναι μηχανικός ήχου συλλογικός φορέας του @el
toolkit label: μηχανικός ήχου συλλογικός φορέας του @el
label: est un agent collectif ingénieur du son de @fr
definition: Met un agent collectif en relation avec une expression qui intègre une contribution de la part d’un agent collectif consistant à gérer les aspects techniques du son durant les processus d’enregistrement, de mixage et de reproduction. @fr
toolkit label: agent collectif ingénieur du son de @fr
toolkit definition: Expression qui intègre une contribution de la part d’un agent collectif consistant à gérer les aspects techniques du son durant les processus d’enregistrement, de mixage et de reproduction. @fr
label: ir skaņu inženieris (grupa) @lv
definition: Sasaista grupu ar izteiksmi, kas ietver grupas ieguldījumu, pārvaldot skaņas tehnisko aspektu ierakstīšanas, miksēšanas un pavairošanas laikā. @lv
toolkit label: ir skaņu inženieris (grupa) @lv
toolkit definition: Izteiksme, kas ietver grupas ieguldījumu, pārvaldot skaņas tehnisko aspektu ierakstīšanas, miksēšanas un pavairošanas laikā. @lv
label: 是……的音频工程师集体行为者 @zh-hans
definition: 将一个集体行为者与包括声音的录制、合成和复制过程技术方面管理的一个集体行为者的贡献的一种内容表达关联起来。 @zh-hans
toolkit label: ……的音频工程师集体行为者 @zh-hans
toolkit definition: 包括声音的录制、合成和复制过程技术方面管理的一个集体行为者的贡献的一种内容表达 @zh-hans
label: ses mühendisi kolektif temsilcisidir @tr
definition: Kolektif bir temsilciyi, kayıt, miksaj ve yeniden üretim süreçleri sırasında sesin teknik yönlerini yönetmeye kolektif bir temsilcinin katkısını içeren bir anlatım ile ilişkilendirir. @tr
toolkit label: ses mühendisi kolektif temsilcisi @tr
toolkit definition: Kayıt, miksaj ve yeniden üretim süreçleri sırasında sesin teknik yönlerini yöneten kolektif bir temsilcinin katkısını içeren bir anlatım. @tr
has subproperty: ääniteknikko (yhteisö) ekspressiossa
has subproperty: ääniteknikko (suku) ekspressiossa
has subproperty: miksaaja (yhteistoimija) ekspressiossa
has subproperty: äänittäjä (yhteistoimija) ekspressiossa
has subproperty: P50746

ääniteknikko (yhteisö) ekspressiossa
status: Published
label: is audio engineer corporate body of @en
lexical alias: audioEngineerCorporateBodyOf.en
definition: Relates a corporate body to an expression that includes a contribution by a corporate body of managing the technical aspects of sound during the processes of recording, mixing, and reproduction. @en
toolkit label: audio engineer corporate body of @en
toolkit definition: An expression that includes a contribution by a corporate body of managing the technical aspects of sound during the processes of recording, mixing, and reproduction. @en
type: Property
domain: C10005
has element type: 2
sub property of: esitykseen osallinen yhteisö ekspressiossa
sub property of: ääniteknikko (yhteistoimija) ekspressiossa
definition: Liittää yhteisön ekspressioon, jossa yhteisö on osallisena ekspression tekemisessä huolehtimalla äänen teknisistä näkökohdista äänitys-, miksaus- ja äänentoistoprosessien aikana.
toolkit label: ääniteknikko (yhteisö) ekspressiossa
toolkit definition: Ekspressio, jossa yhteisö on osallisena ekspression tekemisessä huolehtimalla äänen teknisistä näkökohdista äänitys-, miksaus- ja äänentoistoprosessien aikana.
label: er lydtekniker for (korporasjon) @no
definition: Relaterer en korporasjon til et uttrykk som inkluderer et bidrag fra en korporasjon i form av å styre de tekniske aspektene ved lyd under innspilling, miksing og gjengivelse. @no
toolkit label: lydtekniker for (korporasjon) @no
toolkit definition: Et uttrykk som inkluderer et bidrag fra en korporasjon i form av å styre de tekniske aspektene ved lyd under innspilling, miksing og gjengivelse. @no
label: is geluidstechnicus-corporatie van @nl
definition: Relateert een corporatie aan een expressie die omvat een bijdrage door een corporatie door beheren van de technische aspecten van geluid gedurende de procedures van opname, mixen en reproductie. @nl
toolkit label: geluidstechnicus-corporatie van @nl
toolkit definition: Een expressie die omvat een bijdrage door een corporatie door beheren van de technische aspecten van geluid gedurende de procedures van opname, mixen en reproductie. @nl
label: هي هيئة مهندسة للصوت لـ @ar
definition: يربط هيئة بتعبيرة تتضمن إسهام هيئة في إدارة الجوانب الفنية للصوت أثناء عمليات التسجيل والمزج والاستنساخ. @ar
toolkit label: هيئة مسئولة عن هندسة الصوت @ar
toolkit definition: تعبيرة تتضمن إسهام هيئة في إدارة الجوانب الفنية للصوت أثناء عمليات التسجيل والمزج والاستنساخ. @ar
label: és entitat corporativa enginyera d’àudio de @ca
definition: Relaciona una entitat corporativa amb una expressió que inclou una contribució d’una entitat corporativa gestionant els aspectes tècnics del so durant els processos d’enregistrament, mescla i reproducció. @ca
toolkit label: entitat corporativa enginyera d’àudio de @ca
toolkit definition: Expressió que inclou una contribució d’una entitat corporativa gestionant els aspectes tècnics del so durant els processos d’enregistrament, mescla i reproducció. @ca
label: er korporation, som er lydtekniker af @da
definition: Relaterer en korporation til et udtryk, som omfatter en korporations bidrag ved at håndtere de tekniske lydaspekter under indspilning, mixning og reproduktion. @da
toolkit label: korporation, som er lydtekniker af @da
toolkit definition: Udtryk, som omfatter en korporations bidrag ved at håndtere de tekniske lydaspekter under indspilning, mixning og reproduktion. @da
label: heliinsener (asutus) väljenduses @et
definition: Seostab asutuse väljendusega, millesse asutus on andnud panuse, tegeldes heli tehniliste aspektidega salvestamise, miksimise ja taasesituse protsesside ajal. @et
toolkit label: heliinsener (asutus) väljenduses @et
toolkit definition: Väljendus, millesse asutus on andnud panuse, tegeldes heli tehniliste aspektidega salvestamise, miksimise ja taasesituse protsesside ajal. @et
label: ist Körperschaft als Tontechnikerin/Tontechniker von @de
definition: Setzt eine Körperschaft in Beziehung zu einer Expression, zu der eine Körperschaft beiträgt, indem sie die technischen Aspekte für den Ton während der Aufnahme, des Misch-Verfahrens und der Vervielfältigung handhabt. @de
toolkit label: Körperschaft als Tontechnikerin/Tontechniker von @de
toolkit definition: Eine Expression, zu der eine Körperschaft beiträgt, indem sie die technischen Aspekte für den Ton während der Aufnahme, des Misch-Verfahrens und der Vervielfältigung handhabt. @de
label: hangmester testülete a következőnek: @hu
definition: Hozzákapcsol egy testületet egy kifejezési formához, amely magában foglalja egy testület közreműködését a hang technikai vonatkozásainak kezelésében a rögzítés, a keverés és a sokszorosítás folyamatában. @hu
toolkit label: hangmester testülete: @hu
toolkit definition: Egy kifejezési forma, amely magában foglalja egy testület közreműködését a hang technikai vonatkozásainak kezelésében a rögzítés, a keverés és a sokszorosítás folyamatában. @hu
label: è ingegnere del suono ente di @it
definition: Correla un ente a un'espressione che include un contributo di un ente nella gestione degli aspetti tecnici del suono durante i processi di registrazione, missaggio e riproduzione. @it
toolkit label: ingegnere del suono ente di @it
toolkit definition: Espressione che include un contributo di un ente nella gestione degli aspetti tecnici del suono durante i processi di registrazione, missaggio e riproduzione. @it
label: είναι μηχανικός ήχου συλλογικό όργανο του @el
toolkit label: μηχανικός ήχου συλλογικό όργανο του @el
label: est une collectivité ingénieure du son de @fr
definition: Met une collectivité en relation avec une expression qui intègre une contribution de la part d’une collectivité consistant à gérer les aspects techniques du son durant les processus d’enregistrement, de mixage et de reproduction. @fr
toolkit label: collectivité ingénieure du son de @fr
toolkit definition: Expression qui intègre une contribution de la part d’une collectivité consistant à gérer les aspects techniques du son durant les processus d’enregistrement, de mixage et de reproduction. @fr
label: ir skaņu inženieris (institūcija) @lv
definition: Sasaista institūciju ar izteiksmi, kas ietver institūcijas ieguldījumu, pārvaldot skaņas tehnisko aspektu ierakstīšanas, miksēšanas un pavairošanas laikā. @lv
toolkit label: ir skaņu inženieris (institūcija) @lv
toolkit definition: Izteiksme, kas ietver institūcijas ieguldījumu, pārvaldot skaņas tehnisko aspektu ierakstīšanas, miksēšanas un pavairošanas laikā. @lv
label: 是……的音频工程师团体 @zh-hans
definition: 将一个团体与包括声音的录制、合成和复制过程技术方面管理的一个团体的贡献的一种内容表达关联起来。 @zh-hans
toolkit label: ……的音频工程师团体 @zh-hans
toolkit definition: 包括声音的录制、合成和复制过程技术方面管理的一个团体的贡献的一种内容表达 @zh-hans
label: ses mühendisi tüzel kişisidir @tr
definition: Bir tüzel kişiyi, kayıt, miksaj ve yeniden üretim süreçlerinde sesin teknik yönlerini yönetme konusunda bir tüzel kişinin yaptığı katkıyı içeren bir anlatımla ilişkilendirir. @tr
toolkit label: ses mühendisi tüzel kişisi @tr
toolkit definition: Kayıt, miksaj ve reprodüksiyon süreçlerinde sesin teknik yönlerini yöneten tüzel bir kişinin katkısını içeren bir anlatım. @tr
has subproperty: miksaaja (yhteisö) ekspressiossa
has subproperty: äänittäjä (yhteisö) ekspressiossa
has subproperty: P50897

ääniteknikko (suku) ekspressiossa
status: Published
label: is audio engineer family of @en
lexical alias: audioEngineerFamilyOf.en
definition: Relates a family to an expression that includes a contribution by a family of managing the technical aspects of sound during the processes of recording, mixing, and reproduction. @en
toolkit label: audio engineer family of @en
toolkit definition: An expression that includes a contribution by a family of managing the technical aspects of sound during the processes of recording, mixing, and reproduction. @en
type: Property
domain: C10008
has element type: 2
sub property of: esitykseen osallinen suku ekspressiossa
sub property of: ääniteknikko (yhteistoimija) ekspressiossa
definition: Liittää suvun ekspressioon, jossa suku on osallisena ekspression tekemisessä huolehtimalla äänen teknisistä näkökohdista äänitys-, miksaus- ja äänentoistoprosessien aikana.
toolkit label: ääniteknikko (suku) ekspressiossa
toolkit definition: Ekspressio, jossa suku on osallisena ekspression tekemisessä huolehtimalla äänen teknisistä näkökohdista äänitys-, miksaus- ja äänentoistoprosessien aikana.
label: er lydtekniker for (familie) @no
definition: Relaterer en familie til et uttrykk som inkluderer et bidrag fra en familie i form av å styre de tekniske aspektene ved lyd under innspilling, miksing og gjengivelse. @no
toolkit label: lydtekniker for (familie) @no
toolkit definition: Et uttrykk som inkluderer et bidrag fra en familie i form av å styre de tekniske aspektene ved lyd under innspilling, miksing og gjengivelse. @no
label: is geluidstechnicus-familie van @nl
definition: Relateert een familie aan een expressie die omvat een bijdrage door een familie door beheren van de technische aspecten van geluid gedurende de procedures van opname, mixen en reproductie. @nl
toolkit label: geluidstechnicus-familie van @nl
toolkit definition: Een expressie die omvat een bijdrage door een familie door beheren van de technische aspecten van geluid gedurende de procedures van opname, mixen en reproductie. @nl
label: هي عائلة مهندسة للصوت لـ @ar
definition: يربط عائلة بتعبيرة تتضمن إسهام عائلة في إدارة الجوانب الفنية للصوت أثناء عمليات التسجيل والمزج والاستنساخ. @ar
toolkit label: عائلة مهندسة للصوت @ar
toolkit definition: تعبيرة تتضمن إسهام عائلة في إدارة الجوانب الفنية للصوت أثناء عمليات التسجيل والمزج والاستنساخ. @ar
label: és família enginyera d’àudio de @ca
definition: Relaciona una família amb una expressió que inclou una contribució d’una família gestionant els aspectes tècnics del so durant els processos d’enregistrament, mescla i reproducció. @ca
toolkit label: família enginyera d’àudio de @ca
toolkit definition: Expressió que inclou una contribució d’una família gestionant els aspectes tècnics del so durant els processos d’enregistrament, mescla i reproducció. @ca
label: er familie, som er lydtekniker af @da
definition: Relaterer en familie til et udtryk, som omfatter en families bidrag ved at håndtere de tekniske lydaspekter under indspilning, mixning og reproduktion. @da
toolkit label: familie, som er lydtekniker af @da
toolkit definition: Udtryk, som omfatter en families bidrag ved at håndtere de tekniske lydaspekter under indspilning, mixning og reproduktion. @da
label: heliinsener (perekond) väljenduses @et
definition: Seostab perekonna väljendusega, millesse perekond on andnud panuse, tegeldes heli tehniliste aspektidega salvestamise, miksimise ja taasesituse protsesside ajal. @et
toolkit label: heliinsener (perekond) väljenduses @et
toolkit definition: Väljendus, millesse perekond on andnud panuse, tegeldes heli tehniliste aspektidega salvestamise, miksimise ja taasesituse protsesside ajal. @et
label: ist Familie als Tontechnikerin/Tontechniker von @de
definition: Setzt eine Familie in Beziehung zu einer Expression, zu der eine Familie beiträgt, indem sie die technischen Aspekte für den Ton während der Aufnahme, des Misch-Verfahrens und der Vervielfältigung handhabt. @de
toolkit label: Familie als Tontechnikerin/Tontechniker von @de
toolkit definition: Eine Expression, zu der eine Familie beiträgt, indem sie die technischen Aspekte für den Ton während der Aufnahme, des Misch-Verfahrens und der Vervielfältigung handhabt. @de
label: hangmester családja a következőnek: @hu
definition: Hozzákapcsol egy családot egy kifejezési formához, amely magában foglalja egy család közreműködését a hang technikai vonatkozásainak kezelésében a rögzítés, a keverés és a sokszorosítás folyamatában. @hu
toolkit label: hangmester családja: @hu
toolkit definition: Egy kifejezési forma, amely magában foglalja egy család közreműködését a hang technikai vonatkozásainak kezelésében a rögzítés, a keverés és a sokszorosítás folyamatában. @hu
label: è ingegnere del suono famiglia di @it
definition: Correla una famiglia a un'espressione che comprende un contributo di una famiglia per la gestione degli aspetti tecnici del suono durante i processi di registrazione, missaggio e riproduzione. @it
toolkit label: ingegnere del suono famiglia di @it
toolkit definition: Espressione che comprende un contributo di una famiglia nella gestione degli aspetti tecnici del suono durante i processi di registrazione, missaggio e riproduzione. @it
label: είναι μηχανικός ήχου οικογένεια του @el
toolkit label: μηχανικός ήχου οικογένεια του @el
label: est une famille ingénieure du son de @fr
definition: Met une famille en relation avec une expression qui intègre une contribution de la part d’une famille consistant à gérer les aspects techniques du son durant les processus d’enregistrement, de mixage et de reproduction. @fr
toolkit label: famille ingénieure du son de @fr
toolkit definition: Expression qui intègre une contribution de la part d’une famille consistant à gérer les aspects techniques du son durant les processus d’enregistrement, de mixage et de reproduction. @fr
label: ir skaņu inženieris (dzimta/ģimene) @lv
definition: Sasaista dzimtu/ģimeni ar izteiksmi, kas ietver dzimtas/ģimenes ieguldījumu, pārvaldot skaņas tehnisko aspektu ierakstīšanas, miksēšanas un pavairošanas laikā. @lv
toolkit label: ir skaņu inženieris (dzimta/ģimene) @lv
toolkit definition: Izteiksme, kas ietver dzimtas/ģimenes ieguldījumu, pārvaldot skaņas tehnisko aspektu ierakstīšanas, miksēšanas un pavairošanas laikā. @lv
label: 是……的音频工程师家族 @zh-hans
definition: 将一个家族与包括声音的录制、合成和复制过程技术方面管理的一个家族的贡献的一种内容表达关联起来。 @zh-hans
toolkit label: ……的音频工程师家族 @zh-hans
toolkit definition: 包括声音的录制、合成和复制过程技术方面管理的一个家族的贡献的一种内容表达 @zh-hans
label: ses mühendisi ailesidir @tr
definition: Bir aileyi, bir ailenin kayıt, miksaj ve yeniden üretim süreçleri sırasında sesin teknik yönlerini yönetmeye yaptığı katkıyı içeren bir anlatımla ilişkilendirir. @tr
toolkit label: ses mühendisi ailesi @tr
toolkit definition: Kayıt, miksaj ve reprodüksiyon süreçlerinde sesin teknik yönlerini yöneten bir ailenin katkısını içeren bir anlatım. @tr
has subproperty: miksaaja (suku) ekspressiossa
has subproperty: äänittäjä (suku) ekspressiossa
has subproperty: P51048

ääniteknikko (henkilö) ekspressiossa
status: Published
label: is audio engineer person of @en
lexical alias: audioEngineerPersonOf.en
definition: Relates a person to an expression that includes a contribution by a person of managing the technical aspects of sound during the processes of recording, mixing, and reproduction. @en
toolkit label: audio engineer person of @en
toolkit definition: An expression that includes a contribution by a person of managing the technical aspects of sound during the processes of recording, mixing, and reproduction. @en
type: Property
domain: C10004
has element type: 2
sub property of: esitykseen osallinen henkilö ekspressiossa
sub property of: ääniteknikko (toimija) ekspressiossa
definition: Liittää henkilön ekspressioon, jossa henkilö on osallisena ekspression tekemisessä huolehtimalla äänen teknisistä näkökohdista äänitys-, miksaus- ja äänentoistoprosessien aikana.
toolkit label: ääniteknikko (henkilö) ekspressiossa
toolkit definition: Ekspressio, jossa henkilö on osallisena ekspression tekemisessä huolehtimalla äänen teknisistä näkökohdista äänitys-, miksaus- ja äänentoistoprosessien aikana.
label: er lydtekniker for (person) @no
definition: Relaterer en person til et uttrykk som inkluderer et bidrag fra en person i form av å styre de tekniske aspektene ved lyd under innspilling, miksing og gjengivelse. @no
toolkit label: lydtekniker for (person) @no
toolkit definition: Et uttrykk som inkluderer et bidrag fra en person i form av å styre de tekniske aspektene ved lyd under innspilling, miksing og gjengivelse. @no
label: is geluidstechnicus-persoon van @nl
definition: Relateert een persoon aan een expressie die omvat een bijdrage door een persoon door beheren van de technische aspecten van geluid gedurende de procedures van opname, mixen en reproductie. @nl
toolkit label: geluidstechnicus-persoon van @nl
toolkit definition: Een expressie die omvat een bijdrage door een persoon door beheren van de technische aspecten van geluid gedurende de procedures van opname, mixen en reproductie. @nl
label: هو شخص مهندس صوت لـ @ar
definition: يربط شخصا بتعبيرة تتضمن إسهام شخص في إدارة الجوانب الفنية للصوت أثناء عمليات التسجيل، والمزج، والاستنساخ. @ar
toolkit label: شخص مهندس صوت @ar
toolkit definition: تعبيرة تتضمن إسهام شخص في إدارة الجوانب الفنية للصوت أثناء عمليات التسجيل والمزج والاستنساخ. @ar
label: és persona enginyera d’àudio de @ca
definition: Relaciona una persona amb una expressió que inclou una contribució d’una persona gestionant els aspectes tècnics del so durant els processos d’enregistrament, mescla i reproducció. @ca
toolkit label: persona enginyera d’àudio de @ca
toolkit definition: Expressió que inclou una contribució d’una persona gestionant els aspectes tècnics del so durant els processos d’enregistrament, mescla i reproducció. @ca
label: er person, som er lydtekniker af @da
definition: Relaterer en person til et udtryk, som omfatter en persons bidrag ved at håndtere de tekniske lydaspekter under indspilning, mixning og reproduktion. @da
toolkit label: person, som er lydtekniker af @da
toolkit definition: Udtryk, som omfatter en persons bidrag ved at håndtere de tekniske lydaspekter under indspilning, mixning og reproduktion. @da
label: heliinsener (isik) väljenduses @et
definition: Seostab isiku väljendusega, millesse isik on andnud panuse, tegeldes heli tehniliste aspektidega salvestamise, miksimise ja taasesituse protsesside ajal. @et
toolkit label: heliinsener (isik) väljenduses @et
toolkit definition: Väljendus, millesse isik on andnud panuse, tegeldes heli tehniliste aspektidega salvestamise, miksimise ja taasesituse protsesside ajal. @et
label: ist Person als Tontechnikerin/Tontechniker von @de
definition: Setzt eine Person in Beziehung zu einer Expression, zu der eine Person beiträgt, indem sie die technischen Aspekte für den Ton während der Aufnahme, des Misch-Verfahrens und der Vervielfältigung handhabt. @de
toolkit label: Person als Tontechnikerin/Tontechniker von @de
toolkit definition: Eine Expression, zu der eine Person beiträgt, indem sie die technischen Aspekte für den Ton während der Aufnahme, des Misch-Verfahrens und der Vervielfältigung handhabt. @de
label: hangmester személye a következőnek: @hu
definition: Hozzákapcsol egy személyt egy kifejezési formához, amely magában foglalja egy személy közreműködését a hang technikai vonatkozásainak kezelésében a rögzítés, a keverés és a sokszorosítás folyamatában. @hu
toolkit label: hangmester személye: @hu
toolkit definition: Egy kifejezési forma, amely magában foglalja egy személy közreműködését a hang technikai vonatkozásainak kezelésében a rögzítés, a keverés és a sokszorosítás folyamatában. @hu
label: è ingegnere del suono persona di @it
definition: Correla una persona a un'espressione che comprende un contributo di una persona nella gestione degli aspetti tecnici del suono durante i processi di registrazione, missaggio e riproduzione. @it
toolkit label: ingegnere del suono persona di @it
toolkit definition: Espressione che comprende un contributo di una persona nella gestione degli aspetti tecnici del suono durante i processi di registrazione, missaggio e riproduzione. @it
label: είναι μηχανικός ήχου φυσικό πρόσωπο του @el
toolkit label: μηχανικός ήχου φυσικό πρόσωπο του @el
label: est une personne ingénieure du son de @fr
definition: Met une personne en relation avec une expression qui intègre une contribution de la part d’une personne consistant à gérer les aspects techniques du son durant les processus d’enregistrement, de mixage et de reproduction. @fr
toolkit label: personne ingénieure du son de @fr
toolkit definition: Expression qui intègre une contribution de la part d’une personne consistant à gérer les aspects techniques du son durant les processus d’enregistrement, de mixage et de reproduction. @fr
label: ir skaņu inženieris (persona) @lv
definition: Sasaista personu ar izteiksmi, kas ietver personas ieguldījumu, pārvaldot skaņas tehnisko aspektu ierakstīšanas, miksēšanas un pavairošanas laikā. @lv
toolkit label: ir skaņu inženieris (persona) @lv
toolkit definition: Izteiksme, kas ietver personas ieguldījumu, pārvaldot skaņas tehnisko aspektu ierakstīšanas, miksēšanas un pavairošanas laikā. @lv
label: 是……的音频工程师个人 @zh-hans
definition: 将一个个人与包括声音的录制、合成和复制过程技术方面管理的一个个人的贡献的一种内容表达关联起来。 @zh-hans
toolkit label: ……的音频工程师个人 @zh-hans
toolkit definition: 包括声音的录制、合成和复制过程技术方面管理的一个个人的贡献的一种内容表达 @zh-hans
label: ses mühendisi kişisidir @tr
definition: Bir kişiyi, kayıt, miksaj ve çoğaltma süreçlerinde sesin teknik yönlerini yöneten bir kişinin katkısını içeren bir anlatımla ilişkilendirir. @tr
toolkit label: ses mühendisi @tr
toolkit definition: Kayıt, miksaj ve reprodüksiyon süreçlerinde sesin teknik yönlerini yöneten bir kişinin katkısını içeren bir anlatım. @tr
has subproperty: miksaaja (henkilö) ekspressiossa
has subproperty: äänittäjä (henkilö) ekspressiossa
has subproperty: P50595

äänituottaja (toimija) teoksessa
status: Published
type: Property
label: is audio producer agent of @en
lexical alias: audioProducerAgentOf.en
definition: Relates an agent to a work that involves a responsibility of an agent for managing most of the business aspects of an audio recording. @en
domain: C10002
toolkit label: audio producer agent of @en
toolkit definition: A work that involves a responsibility of an agent for managing most of the business aspects of an audio recording. @en
instruction number: 18.5
sub property of: tuottaja (toimija) teoksessa
label: είναι παραγωγός ήχου φορέας του @el
definition: Συνδέει έναν φορέα με ένα έργο που περιλαμβάνει την ευθύνη για τις περισσότερες επιχειρηματικές πτυχές μιας ηχογράφησης. @el
toolkit label: παραγωγός ήχου φορέας του @el
toolkit definition: Ένα έργο που περιλαμβάνει την ευθύνη για τις περισσότερες επιχειρηματικές πτυχές μιας ηχογράφησης. @el
definition: Setzt einen Akteur in Beziehung zu einem Werk, bei dem ein Akteur für die meisten geschäftlichen Aspekte einer Audioaufnahme verantwortlich ist. @de
toolkit label: Akteur als Produzentin/Produzent einer Tonaufnahme von @de
toolkit definition: Ein Werk, bei dem ein Akteur für die meisten geschäftlichen Aspekte einer Audioaufnahme verantwortlich ist. @de
label: er agent, som er lydproducer af @da
definition: Relaterer en agent til et værk, som involverer en agents ansvar for at håndtere de fleste forretningsmæssige aspekter af en lydoptagelse. @da
toolkit label: agent, som er lydproducer af @da
toolkit definition: Værk, som involverer en agents ansvar for at håndtere de fleste forretningsmæssige aspekter af en lydoptagelse. @da
label: és agent productor d’àudio de @ca
definition: Relaciona un agent amb una obra que implica una responsabilitat d’un agent en la gestió de la majoria dels aspectes comercials d’un enregistrament àudio. @ca
toolkit label: agent productor d’àudio de @ca
toolkit definition: Obra que implica una responsabilitat d’un agent en la gestió de la majoria dels aspectes comercials d’un enregistrament àudio. @ca
definition: Liittää toimijan teokseen, jossa toimija on vastuussa useimpien äänitteen liiketoiminnallisten tehtävien hoitamisesta.
toolkit label: äänituottaja (toimija) teoksessa
toolkit definition: Teos, jossa toimija on vastuussa useimpien äänitteen liiketoiminnallisten tehtävien hoitamisesta.
toolkit label: lydprodusent for (agent) @no
toolkit definition: Et verk som involverer ansvar for en agent for å styre de fleste forretningsmessige aspektene ved et lydopptak. @no
label: ist Akteur als Produzentin/Produzent einer Tonaufnahme von @de
label: est un agent producteur audio de @fr
definition: Met un agent en relation avec une œuvre qui comporte une responsabilité de la part d’un agent consistant à gérer la majeure partie des aspects commerciaux d’un enregistrement audio. @fr
toolkit label: agent producteur audio de @fr
toolkit definition: Œuvre qui comporte une responsabilité de la part d’un agent consistant à gérer la majeure partie des aspects commerciaux d’un enregistrement audio. @fr
has element type: 2
label: audio-producer ágense a következőnek: @hu
definition: Hozzákapcsol egy ágenst egy műhöz, amelyhez hozzátartozik egy ágens felelőssége egy audiofelvétel legtöbb üzleti vonatkozásának menedzseléséért. @hu
toolkit label: audio-producer ágense: @hu
toolkit definition: Egy mű, amelyhez hozzátartozik egy ágens felelőssége egy audiofelvétel legtöbb üzleti vonatkozásának menedzseléséért. @hu
alternative label: audio producer of @en
alternative label: tuottajana äänitteessä
label: er lydprodusent for (agent) @no
definition: Relaterer en agent til et verk som involverer ansvar for en agent for å styre de fleste forretningsmessige aspektene ved et lydopptak. @no
alternative label: lydprodusent for @no
label: is geluidsproducent-actor van @nl
definition: Relateert een actor aan een werk dat met zich meebrengt een verantwoordelijkheid van een actor voor het merendeel van de zakelijke aspecten van de productie van een geluidsopname. @nl
toolkit label: geluidsproducent-actor van @nl
toolkit definition: Een werk dat met zich meebrengt een verantwoordelijkheid van een actor voor het merendeel van de zakelijke aspecten van de productie van een geluidsopname. @nl
label: هو وكيل منتج مواد صوتية لـ @ar
definition: يربط وكيلا بعمل يترتب عليه مسئولية وكيل لإدارة معظم جوانب الأعمال التجارية للتسجيل الصوتي. @ar
alternative label: منتج مواد صوتية @ar
toolkit label: وكيل منتج مواد صوتية @ar
toolkit definition: عمل يترتب عليه مسئولية وكيل لإدارة معظم جوانب الأعمال التجارية للتسجيل الصوتي. @ar
alternative label: productor d’àudio de @ca
alternative label: lydproducer af @da
label: audioprodutsent (tegija) teoses @et
definition: Seostab tegija teosega, mis sisaldab tegija vastutust helisalvestuse enamiku äriliste aspektide korraldamise eest. @et
alternative label: audioprodutsent teoses @et
toolkit label: audioprodutsent (tegija) teoses @et
toolkit definition: Teos, mis sisaldab tegija vastutust helisalvestuse enamiku äriliste aspektide korraldamise eest. @et
alternative label: audio-producere: @hu
label: è produttore audio agente di @it
definition: Correla un agente a un'opera che implica la responsabilità di un agente nel gestire gli aspetti tecnici del suono durante i processi di registrazione, missaggio e riproduzione. @it
alternative label: produttore audio di @it
toolkit label: produttore audio agente di @it
toolkit definition: Opera che implica la responsabilità di un agente nel gestire gli aspetti tecnici del suono durante i processi di registrazione, missaggio e riproduzione. @it
alternative label: παραγωγός ήχου του @el
alternative label: producteur audio de @fr
label: ir skaņu ierakstu producents (aģents) @lv
definition: Sasaista aģentu ar darbu, kas ietver aģenta atbildību par lielāko daļu skaņu ieraksta biznesa aspektiem. @lv
toolkit label: ir skaņu ierakstu producents (aģents) @lv
toolkit definition: Darbs, kas ietver aģenta atbildību par lielāko daļu skaņu ieraksta biznesa aspektiem. @lv
alternative label: Produzent einer Tonaufnahme von @de
alternative label: ……的音频制作者 @zh-hans
toolkit label: ……的音频制作者行为者 @zh-hans
toolkit definition: 涉及音频录制工作大多数方面商业运作之管理的一个行为者的责任的一种作品 @zh-hans
toolkit label: ses yapımcısı temsilci @tr
toolkit definition: Bir ses kaydının ticari yönlerinin çoğunu yönetmek için bir temsilcinin sorumluluğunu içeren bir eser. @tr
has subproperty: äänituottaja (yhteistoimija) teoksessa

äänituottaja (yhteistoimija) teoksessa
status: Published
label: is audio producer collective agent of @en
lexical alias: audioProducerCollectiveAgentOf.en
definition: Relates a collective agent to a work that involves a responsibility of a collective agent for managing most of the business aspects of an audio recording. @en
toolkit label: audio producer collective agent of @en
toolkit definition: A work that involves a responsibility of a collective agent for managing most of the business aspects of an audio recording. @en
type: Property
domain: C10011
has element type: 2
sub property of: tuottaja (yhteistoimija) teoksessa
sub property of: äänituottaja (toimija) teoksessa
definition: Liittää yhteistoimijan teokseen, jossa yhteistoimija on vastuussa useimpien äänitteen liiketoiminnallisten tehtävien hoitamisesta.
toolkit label: äänituottaja (yhteistoimija) teoksessa
toolkit definition: Teos, jossa yhteistoimija on vastuussa useimpien äänitteen liiketoiminnallisten tehtävien hoitamisesta.
label: er lydprodusent for (kollektiv agent) @no
definition: Relaterer en kollektiv agent til et verk som involverer et ansvar for en kollektiv agent i form av å håndtere de fleste forretningsmessige aspektene ved et lydopptak. @no
toolkit label: lydprodusent for (kollektiv agent) @no
toolkit definition: Et verk som involverer et ansvar for en kollektiv agent i form av å håndtere de fleste forretningsmessige aspektene ved et lydopptak. @no
label: is geluidsproducent-collectieve actor van @nl
definition: Relateert een collectieve actor aan een werk dat met zich meebrengt een verantwoordelijkheid van een collectieve actor voor het merendeel van de zakelijke aspecten van de productie van een geluidsopname. @nl
toolkit label: geluidsproducent-collectieve actor van @nl
toolkit definition: Een werk dat met zich meebrengt een verantwoordelijkheid van een collectieve actor voor het merendeel van de zakelijke aspecten van de productie van een geluidsopname. @nl
label: هو وكيل جماعي منتج مواد صوتية لـ @ar
definition: يربط وكيلا جماعيا بعمل يترتب عليه مسئولية وكيل جماعي عن إدارة معظم جوانب الأعمال التجارية للتسجيل الصوتي. @ar
toolkit label: وكيل جماعي منتج مواد صوتية @ar
toolkit definition: عمل يترتب عليه مسئولية وكيل جماعي عن إدارة معظم جوانب الأعمال التجارية للتسجيل الصوتي. @ar
label: és agent col·lectiu productor d’àudio de @ca
definition: Relaciona un agent col·lectiu amb una obra que implica una responsabilitat d’un agent col·lectiu en la gestió de la majoria dels aspectes comercials d’un enregistrament àudio. @ca
toolkit label: agent col·lectiu productor d’àudio de @ca
toolkit definition: Obra que implica una responsabilitat d’un agent col·lectiu en la gestió de la majoria dels aspectes comercials d’un enregistrament àudio. @ca
label: er kollektiv agent, som er lydproducer af @da
definition: Relaterer en kollektiv agent til et værk, som involverer en kollektiv agents ansvar for at håndtere de fleste forretningsmæssige aspekter af en lydoptagelse. @da
toolkit label: kollektiv agent, som er lydproducer af @da
toolkit definition: Værk, som involverer en kollektiv agents ansvar for at håndtere de fleste forretningsmæssige aspekter af en lydoptagelse. @da
label: audioprodutsent (kollektiiv) teoses @et
definition: Seostab kollektiivi teosega, mis sisaldab kollektiivi vastutust helisalvestuse enamiku äriliste aspektide korraldamise eest. @et
toolkit label: audioprodutsent (kollektiiv) teoses @et
toolkit definition: Teos, mis sisaldab kollektiivi vastutust helisalvestuse enamiku äriliste aspektide korraldamise eest. @et
label: ist gemeinschaftlicher Akteur als Produzentin/Produzent einer Tonaufnahme von @de
definition: Setzt einen gemeinschaftlichen Akteur in Beziehung zu einem Werk, bei dem ein gemeinschaftlicher Akteur für die meisten geschäftlichen Aspekte einer Audioaufnahme verantwortlich ist. @de
toolkit label: Gemeinschaftlicher Akteur als Produzent einer Tonaufnahme von @de
toolkit definition: Ein Werk, bei dem ein gemeinschaftlicher Akteur für die meisten geschäftlichen Aspekte einer Audioaufnahme verantwortlich ist. @de
label: audio-producer kollektív ágense a következőnek: @hu
definition: Hozzákapcsol egy kollektív ágenst egy műhöz, amelyhez hozzátartozik egy kollektív ágens felelőssége egy audiofelvétel legtöbb üzleti vonatkozásának menedzseléséért. @hu
toolkit label: audio-producer kollektív ágense: @hu
toolkit definition: Egy mű, amelyhez hozzátartozik egy kollektív ágens felelőssége egy audiofelvétel legtöbb üzleti vonatkozásának menedzseléséért. @hu
label: è produttore audio agente collettivo di @it
definition: Correla un agente collettivo a un'opera che implica una responsabilità di un agente collettivo nella gestione della maggior parte degli aspetti commerciali di una registrazione audio. @it
toolkit label: produttore audio agente collettivo di @it
toolkit definition: Opera che implica una responsabilità di un agente collettivo nella gestione della maggior parte degli aspetti commerciali di una registrazione audio. @it
label: είναι παραγωγός ήχου συλλογικός φορέας του @el
toolkit label: παραγωγός ήχου συλλογικός φορέας του @el
label: est un agent collectif producteur audio de @fr
definition: Met un agent collectif en relation avec une œuvre qui comporte une responsabilité de la part d’un agent collectif consistant à gérer la majeure partie des aspects commerciaux d’un enregistrement audio. @fr
toolkit label: agent collectif producteur audio de @fr
toolkit definition: Œuvre qui comporte une responsabilité de la part d’un agent collectif consistant à gérer la majeure partie des aspects commerciaux d’un enregistrement audio. @fr
label: ir skaņu ierakstu producents (grupa) @lv
definition: Sasaista grupu ar darbu, kas ietver grupas atbildību par lielāko daļu skaņu ieraksta biznesa aspektiem. @lv
toolkit label: ir skaņu ierakstu producents (grupa) @lv
toolkit definition: Darbs, kas ietver grupas atbildību par lielāko daļu skaņu ieraksta biznesa aspektiem. @lv
label: 是……的音频制作者集体行为者 @zh-hans
definition: 将一个集体行为者与涉及音频录制工作大多数方面之管理的一个集体行为者的责任的一种作品关联起来。 @zh-hans
toolkit label: ……的音频制作者集体行为者 @zh-hans
toolkit definition: 涉及音频录制工作大多数方面之管理的一个集体行为者的责任的一种作品 @zh-hans
label: ses yapımcısı kolektif temsilcisidir @tr
definition: Kolektif bir temsilciyi, bir ses kaydının ticari yönlerinin çoğunu yönetmek için kollektif bir temsilcinin sorumluluğunu içeren bir eserle ilişkilendirir. @tr
toolkit label: ses yapımcısı kolektif temsilci @tr
toolkit definition: Bir ses kaydının ticari yönlerinin çoğunu yönetmek için kollektif bir temsilcinin sorumluluğunu içeren bir eser. @tr
has subproperty: äänituottaja (yhteisö) teoksessa
has subproperty: äänituottaja (suku) teoksessa
has subproperty: P50698

äänituottaja (yhteisö) teoksessa
status: Published
label: is audio producer corporate body of @en
lexical alias: audioProducerCorporateBodyOf.en
definition: Relates a corporate body to a work that involves a responsibility of a corporate body for managing most of the business aspects of an audio recording. @en
toolkit label: audio producer corporate body of @en
toolkit definition: A work that involves a responsibility of a corporate body for managing most of the business aspects of an audio recording. @en
type: Property
domain: C10005
has element type: 2
sub property of: tuottaja (yhteisö) teoksessa
sub property of: äänituottaja (yhteistoimija) teoksessa
definition: Liittää yhteisön teokseen, jossa yhteisö on vastuussa useimpien äänitteen liiketoiminnallisten tehtävien hoitamisesta.
toolkit label: äänituottaja (yhteisö) teoksessa
toolkit definition: Teos, jossa yhteisö on vastuussa useimpien äänitteen liiketoiminnallisten tehtävien hoitamisesta.
label: er lydprodusent for (korporasjon) @no
definition: Relaterer en korporasjon til et verk som involverer et ansvar for en korporasjon i form av å håndtere de fleste forretningsmessige aspektene ved et lydopptak. @no
toolkit label: lydprodusent for (korporasjon) @no
toolkit definition: Et verk som involverer et ansvar for en korporasjon i form av å håndtere de fleste forretningsmessige aspektene ved et lydopptak. @no
label: is geluidsproducent-corporatie van @nl
definition: Relateert een corporatie aan een werk dat met zich meebrengt een verantwoordelijkheid van een corporatie voor het merendeel van de zakelijke aspecten van de productie van een geluidsopname. @nl
toolkit label: geluidsproducent-corporatie van @nl
toolkit definition: Een werk dat met zich meebrengt een verantwoordelijkheid van een corporatie voor het merendeel van de zakelijke aspecten van de productie van een geluidsopname. @nl
label: هي هيئة منتجة مواد صوتية لـ @ar
definition: يربط هيئة بعمل يترتب عليه مسئولية هيئة عن إدارة معظم جوانب الأعمال التجارية للتسجيل الصوتي. @ar
toolkit label: هيئة منتجة مواد صوتية @ar
toolkit definition: عمل يترتب عليه مسئولية هيئة عن إدارة معظم جوانب الأعمال التجارية للتسجيل الصوتي. @ar
label: és entitat corporativa productora d’àudio de @ca
definition: Relaciona una entitat corporativa amb una obra que implica una responsabilitat d’una entitat corporativa en la gestió de la majoria dels aspectes comercials d’un enregistrament àudio. @ca
toolkit label: entitat corporativa productora d’àudio de @ca
toolkit definition: Obra que implica una responsabilitat d’una entitat corporativa en la gestió de la majoria dels aspectes comercials d’un enregistrament àudio. @ca
label: er korporation, som er lydproducer af @da
definition: Relaterer en korporation til et værk, som involverer en korporations ansvar for at håndtere de fleste forretningsmæssige aspekter af en lydoptagelse. @da
toolkit label: korporation, som er lydproducer af @da
toolkit definition: Værk, som involverer en korporations ansvar for at håndtere de fleste forretningsmæssige aspekter af en lydoptagelse. @da
label: audioprodutsent (asutus) teoses @et
definition: Seostab asutuse teosega, mis sisaldab asutuse vastutust helisalvestuse enamiku äriliste aspektide korraldamise eest. @et
toolkit label: audioprodutsent (asutus) teoses @et
toolkit definition: Teos, mis sisaldab asutuse vastutust helisalvestuse enamiku äriliste aspektide korraldamise eest. @et
label: ist Körperschaft als Produzentin/Produzent einer Tonaufnahme von @de
definition: Setzt eine Körperschaft in Beziehung zu einem Werk, bei dem eine Körperschaft für die meisten geschäftlichen Aspekte einer Audioaufnahme verantwortlich ist. @de
toolkit label: Körperschaft als Produzentin/Produzent einer Tonaufnahme von @de
toolkit definition: Ein Werk, bei dem eine Körperschaft für die meisten geschäftlichen Aspekte einer Audioaufnahme verantwortlich ist. @de
label: audio-producer testülete a következőnek: @hu
definition: Hozzákapcsol egy testületet egy műhöz, amelyhez hozzátartozik egy testület felelőssége egy audiofelvétel legtöbb üzleti vonatkozásának menedzseléséért. @hu
toolkit label: audio-producer testülete: @hu
toolkit definition: Egy mű, amelyhez hozzátartozik egy testület felelőssége egy audiofelvétel legtöbb üzleti vonatkozásának menedzseléséért. @hu
label: è produttore audio ente di @it
definition: Correla un ente a un'opera che implica una responsabilità di un ente per la gestione della maggior parte degli aspetti commerciali di una registrazione audio. @it
toolkit label: produttore audio ente di @it
toolkit definition: Opera che implica una responsabilità di un ente per la gestione della maggior parte degli aspetti commerciali di una registrazione audio. @it
label: είναι παραγωγός ήχου συλλογικό όργανο του @el
toolkit label: παραγωγός ήχου συλλογικό όργανο του @el
label: est une collectivité productrice audio de @fr
definition: Met une collectivité en relation avec une œuvre qui comporte une responsabilité de la part d’une collectivité consistant à gérer la majeure partie des aspects commerciaux d’un enregistrement audio. @fr
toolkit label: collectivité productrice audio de @fr
toolkit definition: Œuvre qui comporte une responsabilité de la part d’une collectivité consistant à gérer la majeure partie des aspects commerciaux d’un enregistrement audio. @fr
label: ir skaņu ierakstu producents (institūcija) @lv
definition: Sasaista institūciju ar darbu, kas ietver institūcijas atbildību par lielāko daļu skaņu ieraksta biznesa aspektiem. @lv
toolkit label: ir skaņu ierakstu producents (institūcija) @lv
toolkit definition: Darbs, kas ietver institūcijas atbildību par lielāko daļu skaņu ieraksta biznesa aspektiem. @lv
label: 是……的音频制作者团体 @zh-hans
definition: 将一个团体与涉及音频录制工作大多数方面之管理的一个团体的责任的一种作品关联起来。 @zh-hans
toolkit label: ……的音频制作者团体 @zh-hans
toolkit definition: 涉及音频录制工作大多数方面之管理的一个团体的责任的一种作品 @zh-hans
label: ses yapımcısı tüzel kişisidir @tr
definition: Bir tüzel kişiyi, bir ses kaydının ticari yönlerinin çoğunu yönetmek için bir tüzel kişinin sorumluluğunu içeren bir eserle ilişkilendirir. @tr
toolkit label: Ses yapımcısı tüzel kişi @tr
toolkit definition: Bir ses kaydının ticari yönlerinin çoğunu yönetmek için bir tüzel kişinin sorumluluğunu içeren bir eser. @tr
has subproperty: P50849

äänituottaja (suku) teoksessa
status: Published
label: is audio producer family of @en
lexical alias: audioProducerFamilyOf.en
definition: Relates a family to a work that involves a responsibility of a family for managing most of the business aspects of an audio recording. @en
toolkit label: audio producer family of @en
toolkit definition: A work that involves a responsibility of a family for managing most of the business aspects of an audio recording. @en
type: Property
domain: C10008
has element type: 2
sub property of: tuottaja (suku) teoksessa
sub property of: äänituottaja (yhteistoimija) teoksessa
definition: Liittää suvun teokseen, jossa suku on vastuussa useimpien äänitteen liiketoiminnallisten tehtävien hoitamisesta.
toolkit label: äänituottaja (suku) teoksessa
toolkit definition: Teos, jossa suku on vastuussa useimpien äänitteen liiketoiminnallisten tehtävien hoitamisesta.
label: er lydprodusent for (familie) @no
definition: Relaterer en familie til et verk som involverer et ansvar for en familie i form av å håndtere de fleste forretningsmessige aspektene ved et lydopptak. @no
toolkit label: lydprodusent for (familie) @no
toolkit definition: Et verk som involverer et ansvar for en familie i form av å håndtere de fleste forretningsmessige aspektene ved et lydopptak. @no
label: is geluidsproducent-familie van @nl
definition: Relateert een familie aan een werk dat met zich meebrengt een verantwoordelijkheid van een familie voor het merendeel van de zakelijke aspecten van de productie van een geluidsopname. @nl
toolkit label: geluidsproducent-familie van @nl
toolkit definition: Een werk dat met zich meebrengt een verantwoordelijkheid van een familie voor het merendeel van de zakelijke aspecten van de productie van een geluidsopname. @nl
label: هي عائلة منتجة مواد صوتية لـ @ar
definition: يربط عائلة بعمل يترتب عليه مسئولية عائلة عن إدارة معظم جوانب الأعمال التجارية لتسجيل الصوتي. @ar
toolkit label: عائلة منتجة مواد صوتية @ar
toolkit definition: عمل يترتب عليه مسئولية عائلة عن إدارة معظم جوانب الأعمال التجارية لتسجيل الصوتي. @ar
label: és família productora d’àudio de @ca
definition: Relaciona una família amb una obra que implica una responsabilitat d’una família en la gestió de la majoria dels aspectes comercials d’un enregistrament àudio. @ca
toolkit label: família productora d’àudio de @ca
toolkit definition: Obra que implica una responsabilitat d’una família en la gestió de la majoria dels aspectes comercials d’un enregistrament àudio. @ca
label: er familie, som er lydproducer af @da
definition: Relaterer en familie til et værk, som involverer en families ansvar for at håndtere de fleste forretningsmæssige aspekter af en lydoptagelse. @da
toolkit label: familie, som er lydproducer af @da
toolkit definition: Værk, som involverer en families ansvar for at håndtere de fleste forretningsmæssige aspekter af en lydoptagelse. @da
label: audioprodutsent (perekond) teoses @et
definition: Seostab perekonna teosega, mis sisaldab perekonna vastutust helisalvestuse enamiku äriliste aspektide korraldamise eest. @et
toolkit label: audioprodutsent (perekond) teoses @et
toolkit definition: Teos, mis sisaldab perekonna vastutust helisalvestuse enamiku äriliste aspektide korraldamise eest. @et
label: ist Familie als Produzentin/Produzent einer Tonaufnahme von @de
definition: Setzt eine Familie in Beziehung zu einem Werk, bei dem eine Familie für die meisten geschäftlichen Aspekte einer Audioaufnahme verantwortlich ist. @de
toolkit label: Familie als Produzentin/Produzent einer Tonaufnahme von @de
toolkit definition: Ein Werk, bei dem eine Familie für die meisten geschäftlichen Aspekte einer Audioaufnahme verantwortlich ist. @de
label: audio-producer családja a következőnek: @hu
definition: Hozzákapcsol egy családot egy műhöz, amelyhez hozzátartozik egy család felelőssége egy audiofelvétel legtöbb üzleti vonatkozásának menedzseléséért. @hu
toolkit label: audio-producer családja: @hu
toolkit definition: Egy mű, amelyhez hozzátartozik egy család felelőssége egy audiofelvétel legtöbb üzleti vonatkozásának menedzseléséért. @hu
label: è produttore audio famiglia di @it
definition: Correla una famiglia a un'opera che implica una responsabilità di una famiglia per la gestione della maggior parte degli aspetti commerciali di una registrazione audio. @it
toolkit label: produttore audio famiglia di @it
toolkit definition: Opera che implica una responsabilità di una famiglia per la gestione della maggior parte degli aspetti commerciali di una registrazione audio. @it
label: είναι παραγωγός ήχου οικογένεια του @el
toolkit label: παραγωγός ήχου οικογένεια του @el
label: est une famille productrice audio de @fr
definition: Met une famille en relation avec une œuvre qui comporte une responsabilité de la part d’une famille consistant à gérer la majeure partie des aspects commerciaux d’un enregistrement audio. @fr
toolkit label: famille productrice audio de @fr
toolkit definition: Œuvre qui comporte une responsabilité de la part d’une famille consistant à gérer la majeure partie des aspects commerciaux d’un enregistrement audio. @fr
label: ir skaņu ierakstu producents (dzimta/ģimene) @lv
definition: Sasaista dzimtu/ģimeni ar darbu, kas ietver dzimtas/ģimenes atbildību par lielāko daļu skaņu ieraksta biznesa aspektiem. @lv
toolkit label: ir skaņu ierakstu producents (dzimta/ģimene) @lv
toolkit definition: Darbs, kas ietver dzimtas/ģimenes atbildību par lielāko daļu skaņu ieraksta biznesa aspektiem. @lv
label: 是……的音频制作者家族 @zh-hans
definition: 将一个家族与涉及音频录制工作大多数方面之管理的一个家族的责任的一种作品关联起来。 @zh-hans
toolkit label: ……的音频制作者家族 @zh-hans
toolkit definition: 涉及音频录制工作大多数方面之管理的一个家族的责任的一种作品 @zh-hans
label: ses yapımcısı ailesidir @tr
definition: Bir aileyi, bir ses kaydının çoğu iş yönünü yönetme sorumluluğunu içeren bir eserle ilişkilendirir. @tr
toolkit label: ses yapımcısı aile @tr
toolkit definition: Bir ses kaydının ticari yönlerinin çoğunu yönetmek için bir ailenin sorumluluğunu içeren bir eser. @tr
has subproperty: P51000

äänituottaja (henkilö) teoksessa
status: Published
label: is audio producer person of @en
lexical alias: audioProducerPersonOf.en
definition: Relates a person to a work that involves a responsibility of a person for managing most of the business aspects of an audio recording. @en
toolkit label: audio producer person of @en
toolkit definition: A work that involves a responsibility of a person for managing most of the business aspects of an audio recording. @en
type: Property
domain: C10004
has element type: 2
sub property of: tuottaja (henkilö) teoksessa
sub property of: äänituottaja (toimija) teoksessa
definition: Liittää henkilön teokseen, jossa henkilö on vastuussa useimpien äänitteen liiketoiminnallisten tehtävien hoitamisesta.
toolkit label: äänituottaja (henkilö) teoksessa
toolkit definition: Teos, jossa henkilö on vastuussa useimpien äänitteen liiketoiminnallisten tehtävien hoitamisesta.
label: er lydprodusent for (person) @no
definition: Relaterer en person til et verk som involverer et ansvar for en person i form av å håndtere de fleste forretningsmessige aspektene ved et lydopptak. @no
toolkit label: lydprodusent for (person) @no
toolkit definition: Et verk som involverer et ansvar for en person i form av å håndtere de fleste forretningsmessige aspektene ved et lydopptak. @no
label: is geluidsproducent-persoon van @nl
definition: Relateert een persoon aan een werk dat met zich meebrengt een verantwoordelijkheid van een persoon voor het merendeel van de zakelijke aspecten van de productie van een geluidsopname. @nl
toolkit label: geluidsproducent-persoon van @nl
toolkit definition: Een werk dat met zich meebrengt een verantwoordelijkheid van een persoon voor het merendeel van de zakelijke aspecten van de productie van een geluidsopname. @nl
label: هو شخص منتج مواد صوتية لـ @ar
definition: يربط شخصا بعمل يترتب عليه مسئولية شخص عن إدارة معظم جوانب الأعمال التجارية للتسجيل الصوتي. @ar
toolkit label: شخص منتج مواد صوتية @ar
toolkit definition: عمل يترتب عليه مسئولية شخص عن إدارة معظم جوانب الأعمال التجارية للتسجيل الصوتي. @ar
label: és persona productora d’àudio de @ca
definition: Relaciona una persona amb una obra que implica una responsabilitat d’una persona en la gestió de la majoria dels aspectes comercials d’un enregistrament àudio. @ca
toolkit label: persona productora d’àudio de @ca
toolkit definition: Obra que implica una responsabilitat d’una persona en la gestió de la majoria dels aspectes comercials d’un enregistrament àudio. @ca
label: er person, som er lydproducer af @da
definition: Relaterer en person til et værk, som involverer en persons ansvar for at håndtere de fleste forretningsmæssige aspekter af en lydoptagelse. @da
toolkit label: person, som er lydproducer af @da
toolkit definition: Værk, som involverer en persons ansvar for at håndtere de fleste forretningsmæssige aspekter af en lydoptagelse. @da
label: audioprodutsent (isik) teoses @et
definition: Seostab isiku teosega, mis sisaldab isiku vastutust helisalvestuse enamiku äriliste aspektide korraldamise eest. @et
toolkit label: audioprodutsent (isik) teoses @et
toolkit definition: Teos, mis sisaldab isiku vastutust helisalvestuse enamiku äriliste aspektide korraldamise eest. @et
label: ist Person als Produzentin/Produzent einer Tonaufnahme von @de
definition: Setzt eine Person in Beziehung zu einem Werk, bei dem eine Person für die meisten geschäftlichen Aspekte einer Audioaufnahme verantwortlich ist. @de
toolkit label: Person als Produzentin/Produzent einer Tonaufnahme von @de
toolkit definition: Ein Werk, bei dem eine Person für die meisten geschäftlichen Aspekte einer Audioaufnahme verantwortlich ist. @de
label: audio-producer személye a következőnek: @hu
definition: Hozzákapcsol egy személyt egy műhöz, amelyhez hozzátartozik egy személy felelőssége egy audiofelvétel legtöbb üzleti vonatkozásának menedzseléséért. @hu
toolkit label: audio-producer személye: @hu
toolkit definition: Egy mű, amelyhez hozzátartozik egy személy felelőssége egy audiofelvétel legtöbb üzleti vonatkozásának menedzseléséért. @hu
label: è produttore audio persona di @it
definition: Correla una persona a un'opera che implica una responsabilità di una persona nella gestione della maggior parte degli aspetti commerciali di una registrazione audio. @it
toolkit label: produttore audio persona di @it
toolkit definition: Opera che implica una responsabilità di una persona per la gestione della maggior parte degli aspetti commerciali di una registrazione audio. @it
label: είναι παραγωγός ήχου φυσικό πρόσωπο του @el
toolkit label: παραγωγός ήχου φυσικό πρόσωπο του @el
label: est une personne productrice audio de @fr
definition: Met une personne en relation avec une œuvre qui comporte une responsabilité de la part d’une personne consistant à gérer la majeure partie des aspects commerciaux d’un enregistrement audio. @fr
toolkit label: personne productrice audio de @fr
toolkit definition: Œuvre qui comporte une responsabilité de la part d’une personne consistant à gérer la majeure partie des aspects commerciaux d’un enregistrement audio. @fr
label: ir skaņu ierakstu producents (persona) @lv
definition: Sasaista personu ar darbu, kas ietver personas atbildību par lielāko daļu skaņu ieraksta biznesa aspektiem. @lv
toolkit label: ir skaņu ierakstu producents (persona) @lv
toolkit definition: Darbs, kas ietver personas atbildību par lielāko daļu skaņu ieraksta biznesa aspektiem. @lv
label: 是……的音频制作者个人 @zh-hans
definition: 将一个个人与涉及音频录制工作大多数方面之管理的一个个人的责任的一种作品关联起来。 @zh-hans
toolkit label: ……的音频制作者个人 @zh-hans
toolkit definition: 涉及音频录制工作大多数方面之管理的一个个人的责任的一种作品 @zh-hans
label: ses yapımcısı kişisidir @tr
definition: Bir kişiyi, bir ses kaydının ticari yönlerinin çoğunu yönetmek için bir kişinin sorumluluğunu içeren bir eserle ilişkilendirir. @tr
toolkit label: Ses yapımcısı @tr
toolkit definition: Bir ses kaydının ticari yönlerinin çoğunu yönetmek için bir kişinin sorumluluğunu içeren bir eser. @tr
has subproperty: P50547

kirjoittaja (toimija) teoksessa
status: Published
label: is author agent of @en
definition: Relates an agent to a work that involves a responsibility of an agent for creating a textual work. @en
type: Property
domain: C10002
sub property of: teoksen tekijä (toimija) teoksessa
lexical alias: authorAgentOf.en
label: est un agent auteur de @fr
definition: Met un agent en relation avec une œuvre qui comporte une responsabilité de la part d’un agent consistant à créer une œuvre textuelle. @fr
toolkit label: agent auteur de @fr
toolkit definition: Œuvre qui comporte une responsabilité de la part d’un agent consistant à créer une œuvre textuelle. @fr
toolkit label: author agent of @en
toolkit definition: A work that involves a responsibility of an agent for creating a textual work. @en
instruction number: 18.5
label: είναι συγγραφέας φορέας του @el
definition: Συνδέει έναν φορέα υπεύθυνο για τη δημιουργία ενός έργου κυρίως κειμενικού περιεχομένου, ανεξάρτητα από τον τύπο του μέσου μετάδοσης ή το γένος/είδος, με ένα έργο. @el
toolkit label: συγγραφέας φορέας του @el
toolkit definition: Ένα έργο το οποίο είναι κυρίως κειμενικό ως προς το περιεχόμενο, ανεξάρτητα από τον τύπο του μέσου μετάδοσης ή το γένος/είδος [και] το οποίο περιλαμβάνει την ευθύνη της δημιουργίας του. @el
definition: Setzt einen Akteur in Beziehung zu einem Werk, bei dem ein Akteur für die Schaffung eines textlichen Werks verantwortlich ist. @de
toolkit label: Akteur als Verfasserin/Verfasser von @de
toolkit definition: Ein Werk, bei dem ein Akteur für die Schaffung eines textlichen Werks verantwortlich ist. @de
label: er agent, som er forfatter af @da
definition: Relaterer en agent til et værk, som involverer en agents ansvar for at skabe et tekstværk. @da
toolkit label: agent, som er forfatter af @da
toolkit definition: Værk, som involverer en agents ansvar for at skabe et tekstværk. @da
label: és agent autor de @ca
definition: Relaciona un agent amb una obra que implica una responsabilitat d’un agent en la creació d’una obra textual. @ca
toolkit label: agent autor de @ca
toolkit definition: Obra que implica una responsabilitat d’un agent en la creació d’una obra textual. @ca
definition: Liittää toimijan tekstiteokseen, jonka luomisesta toimija on vastuussa.
toolkit label: kirjoittaja (toimija) teoksessa
toolkit definition: Tekstiteos, jonka luomisesta toimija on vastuussa.
toolkit label: forfatter av (agent) @no
toolkit definition: Et verk som involverer ansvar for en agent i form av å skape et tekstlig verk. @no
label: ist Akteur als Verfasserin/Verfasser von @de
has element type: 2
label: szerző ágense a következőnek: @hu
definition: Hozzákapcsol egy ágenst egy műhöz, amelyhez hozzátartozik egy ágens felelőssége egy szöveges mű létrehozásáért. @hu
toolkit label: szerző ágense: @hu
toolkit definition: Egy mű, amelyhez hozzátartozik egy ágens felelőssége egy szöveges mű létrehozásáért. @hu
alternative label: author of @en
alternative label: kirjoittajana teoksessa
label: er forfatter av (agent) @no
definition: Relaterer en agent til et verk som involverer ansvar for en agent i form av å skape et tekstlig verk. @no
alternative label: forfatter av @no
label: is auteur-actor van @nl
definition: Relateert een actor aan een werk dat met zich meebrengt een verantwoordelijkheid van een actor voor het creëren van een tekstwerk. @nl
toolkit label: auteur-actor van @nl
toolkit definition: Een werk dat met zich meebrengt een verantwoordelijkheid van een actor voor het creëren van een tekstwerk. @nl
label: هو وكيل مؤلف لـ @ar
definition: يربط وكيلا بعمل يترتب عليه مسئولية وكيل عن إنشاء عمل نصي. @ar
alternative label: مؤلف @ar
toolkit label: وكيل مؤلف @ar
toolkit definition: عمل يترتب عليه مسئولية وكيل عن إنشاء عمل نصي. @ar
alternative label: autor de @ca
alternative label: forfatter af @da
label: tekstteose autor (tegija) teoses @et
definition: Seostab tegija teosega, mis sisaldab tegija vastutust tekstteose loomise eest. @et
alternative label: tekstteose autor teoses @et
alternative label: autor teoses @et
toolkit label: tekstteose autor (tegija) teoses @et
toolkit definition: Teos, mis sisaldab tegija vastutust tekstteose loomise eest. @et
alternative label: szerzője: @hu
label: è autore agente di @it
definition: Correla un agente a un'opera che implica la responsabilità di un agente per la creazione di un'opera testuale. @it
alternative label: autore di @it
toolkit label: autore agente di @it
toolkit definition: Opera che implica la responsabilità di un agente per la creazione di un'opera testuale. @it
alternative label: συγγραφέας του @el
alternative label: auteur de @fr
label: ir autors (aģents) @lv
definition: Sasaista aģentu ar darbu, kas ietver aģenta atbildību par tekstuāla darba radīšanu. @lv
toolkit label: ir autors (aģents) @lv
toolkit definition: Darbs, kas ietver aģenta atbildību par tekstuāla darba radīšanu. @lv
alternative label: Verfasser von @de
toolkit label: ……的著者行为者 @zh-hans
toolkit definition: 涉及创作一种文字作品的一个行为者的责任的一种作品 @zh-hans
toolkit label: yazar temsilcisi @tr
toolkit definition: Metinsel bir çalışma oluşturmak için bir temsilcinin sorumluluğunu içeren bir eser. @tr
has subproperty: kirjoittaja (yhteistoimija) teoksessa

kirjoittaja (yhteistoimija) teoksessa
status: Published
label: is author collective agent of @en
lexical alias: authorCollectiveAgentOf.en
definition: Relates a collective agent to a work that involves a responsibility of a collective agent for creating a textual work. @en
toolkit label: author collective agent of @en
toolkit definition: A work that involves a responsibility of a collective agent for creating a textual work. @en
type: Property
domain: C10011
has element type: 2
sub property of: teoksen tekijä (yhteistoimija) teoksessa
sub property of: kirjoittaja (toimija) teoksessa
definition: Liittää yhteistoimijan tekstiteokseen, jonka luomisesta yhteistoimija on vastuussa.
toolkit label: kirjoittaja (yhteistoimija) teoksessa
toolkit definition: Tekstiteos, jonka luomisesta yhteistoimija on vastuussa.
label: er forfatter av (kollektiv agent) @no
definition: Relaterer en kollektiv agent til et verk som involverer et ansvar for en kollektiv agent i form av å skape et tekstlig verk. @no
toolkit label: forfatter av (kollektiv agent) @no
toolkit definition: Et verk som involverer et ansvar for en kollektiv agent i form av å skape et tekstlig verk. @no
label: is auteur-collectieve actor van @nl
definition: Relateert een collectieve actor aan een werk met zich meebrengt een verantwoordelijkheid van een collectieve actor voor creëren van een tekstwerk. @nl
toolkit label: auteur-collectieve actor van @nl
toolkit definition: Een werk met zich meebrengt een verantwoordelijkheid van een collectieve actor voor creëren van een tekstwerk. @nl
label: هو وكيل جماعي مؤلف لـ @ar
definition: يربط وكيلا جماعيا بعمل يترتب عليه مسئولية وكيل جماعي عن إنشاء عمل نصي. @ar
toolkit label: وكيل جماعي مؤلف @ar
toolkit definition: عمل يترتب عليه مسئولية وكيل جماعي عن إنشاء عمل نصي. @ar
label: és agent col·lectiu autor de @ca
definition: Relaciona un agent col·lectiu amb una obra que implica una responsabilitat d’un agent col·lectiu en la creació d’una obra textual. @ca
toolkit label: agent col·lectiu autor de @ca
toolkit definition: Obra que implica una responsabilitat d’un agent col·lectiu en la creació d’una obra textual. @ca
label: er kollektiv agent, som er forfatter af @da
definition: Relaterer en kollektiv agent til et værk, som involverer en kollektiv agents ansvar for at skabe et tekstværk. @da
toolkit label: kollektiv agent, som er forfatter af @da
toolkit definition: Værk, som involverer en kollektiv agents ansvar for at skabe et tekstværk. @da
label: ist gemeinschaftlicher Akteur als Verfasserin/Verfasser von @de
definition: Setzt einen gemeinschaftlichen Akteur in Beziehung zu einem Werk, bei dem ein gemeinschaftlicher Akteur für die Schaffung eines textlichen Werks verantwortlich ist. @de
toolkit label: Gemeinschaftlicher Akteur als Verfasserin/Verfasser von @de
toolkit definition: Ein Werk, bei dem ein gemeinschaftlicher Akteur für die Schaffung eines textlichen Werks verantwortlich ist. @de
label: szerző kollektív ágense a következőnek: @hu
definition: Hozzákapcsol egy kollektív ágenst egy műhöz, amelyhez hozzátartozik egy kollektív ágens felelőssége egy szöveges mű létrehozásáért. @hu
toolkit label: szerző kollektív ágense: @hu
toolkit definition: Egy mű, amelyhez hozzátartozik egy kollektív ágens felelőssége egy szöveges mű létrehozásáért. @hu
label: è autore agente collettivo di @it
definition: Correla un agente collettivo a un'opera che implica una responsabilità di un agente collettivo per la creazione di un'opera testuale. @it
toolkit label: autore agente collettivo di @it
toolkit definition: Opera che implica una responsabilità di un agente collettivo per la creazione di un'opera testuale. @it
label: είναι συγγραφέας συλλογικός φορέας του @el
toolkit label: συγγραφέας συλλογικός φορέας του @el
label: est un agent collectif auteur de @fr
definition: Met un agent collectif en relation avec une œuvre qui comporte une responsabilité de la part d’un agent collectif consistant à créer une œuvre textuelle. @fr
toolkit label: agent collectif auteur de @fr
toolkit definition: Œuvre qui comporte une responsabilité de la part d’un agent collectif consistant à créer une œuvre textuelle. @fr
label: ir autors (grupa) @lv
definition: Sasaista grupu ar darbu, kas ietver grupas atbildību par tekstuāla darba radīšanu. @lv
toolkit label: ir autors (grupa) @lv
toolkit definition: Darbs, kas ietver grupas atbildību par tekstuāla darba radīšanu. @lv
label: 是……的著者集体行为者 @zh-hans
definition: 将一个行为者与涉及创作一种文字作品的一个集体行为者的责任的一种作品关联起来。 @zh-hans
toolkit label: ……的著者集体行为者 @zh-hans
toolkit definition: 涉及创作一种文字作品的一个集体行为者的责任的一种作品 @zh-hans
label: yazar kolektif temsilcisidir @tr
definition: Kolektif bir temsilciyi, bir metinsel çalışma yapmakla görevli kolektif temsilcinin sorumluluğunu içeren bir eser ile ilişkilendirir. @tr
toolkit label: yazar kolektif temsilcisi @tr
toolkit definition: Bir metinsel çalışma yapmakla görevli kolektif temsilcinin sorumluluğunu içeren bir eser. @tr
has subproperty: kirjoittaja (yhteisö) teoksessa
has subproperty: kirjoittaja (suku) teoksessa
has subproperty: libretisti (yhteistoimija) teoksessa
has subproperty: sanoittaja (yhteistoimija) teoksessa
has subproperty: kokousten raportoija (yhteistoimija) teoksessa
has subproperty: käsikirjoittaja (yhteistoimija) teoksessa
has subproperty: P50692

kirjoittaja (yhteisö) teoksessa
status: Published
label: is author corporate body of @en
lexical alias: authorCorporateBodyOf.en
definition: Relates a corporate body to a work that involves a responsibility of a corporate body for creating a textual work. @en
toolkit label: author corporate body of @en
toolkit definition: A work that involves a responsibility of a corporate body for creating a textual work. @en
type: Property
domain: C10005
has element type: 2
sub property of: teoksen tekijä (yhteisö) teoksessa
sub property of: kirjoittaja (yhteistoimija) teoksessa
definition: Liittää yhteisön tekstiteokseen, jonka luomisesta yhteisö on vastuussa.
toolkit label: kirjoittaja (yhteisö) teoksessa
toolkit definition: Tekstiteos, jonka luomisesta yhteisö on vastuussa.
label: er forfatter av (korporasjon) @no
definition: Relaterer en korporasjon til et verk som involverer et ansvar for en korporasjon i form av å skape et tekstlig verk. @no
toolkit label: forfatter av (korporasjon) @no
toolkit definition: Et verk som involverer et ansvar for en korporasjon i form av å skape et tekstlig verk. @no
label: is auteur-corporatie van @nl
definition: Relateert een corporatie aan een werk met zich meebrengt een verantwoordelijkheid van een corporatie voor creëren van een tekstwerk. @nl
toolkit label: auteur-corporatie van @nl
toolkit definition: Een werk met zich meebrengt een verantwoordelijkheid van een corporatie voor creëren van een tekstwerk. @nl
label: هي هيئة مؤلفة لـ @ar
definition: يربط هيئة بعمل يترتب عليه مسئولية هيئة عن إنشاء عمل نصي. @ar
toolkit label: هيئة مؤلفة @ar
toolkit definition: عمل يترتب عليه مسئولية هيئة عن إنشاء عمل نصي. @ar
label: és entitat corporativa autora de @ca
definition: Relaciona una entitat corporativa amb una obra que implica una responsabilitat d’una entitat corporativa en la creació d’una obra textual. @ca
toolkit label: entitat corporativa autora de @ca
toolkit definition: Obra que implica una responsabilitat d’una entitat corporativa en la creació d’una obra textual. @ca
label: er korporation, som er forfatter af @da
definition: Relaterer en korporation til et værk, som involverer en korporations ansvar for at skabe et tekstværk. @da
toolkit label: korporation, som er forfatter af @da
toolkit definition: Korporation til et værk, som involverer en korporations ansvar for at skabe et tekstværk. @da
label: ist Körperschaft als Verfasserin/Verfasser von @de
definition: Setzt eine Körperschaft in Beziehung zu einem Werk, bei dem eine Körperschaft für die Schaffung eines textlichen Werks verantwortlich ist. @de
toolkit label: Körperschaft als Verfasserin/Verfasser von @de
toolkit definition: Ein Werk, bei dem eine Körperschaft für die Schaffung eines textlichen Werks verantwortlich ist. @de
label: szerző testülete a következőnek: @hu
definition: Hozzákapcsol egy testületet egy műhöz, amelyhez hozzátartozik egy testület felelőssége egy szöveges mű létrehozásáért. @hu
toolkit label: szerző testülete: @hu
toolkit definition: Egy mű, amelyhez hozzátartozik egy testület felelőssége egy szöveges mű létrehozásáért. @hu
label: è autore ente di @it
definition: Correla un ente a un'opera che implica una responsabilità di un ente per la creazione di un'opera testuale. @it
toolkit label: autore ente di @it
toolkit definition: Opera che implica una responsabilità di un ente per la creazione di un'opera testuale. @it
label: είναι συγγραφέας συλλογικό όργανο του @el
toolkit label: συγγραφέας συλλογικό όργανο του @el
label: est une collectivité autrice de @fr
definition: Met une collectivité en relation avec une œuvre qui comporte une responsabilité de la part d’une collectivité consistant à créer une œuvre textuelle. @fr
toolkit label: collectivité autrice de @fr
toolkit definition: Œuvre qui comporte une responsabilité de la part d’une collectivité consistant à créer une œuvre textuelle. @fr
label: ir autors (institūcija) @lv
definition: Sasaista institūciju ar darbu, kas ietver institūcijas atbildību par tekstuāla darba radīšanu. @lv
toolkit label: ir autors (institūcija) @lv
toolkit definition: Darbs, kas ietver institūcijas atbildību par tekstuāla darba radīšanu. @lv
label: 是……的著者团体 @zh-hans
definition: 将一个团体与涉及创作一种文字作品的一个团体的责任的一种作品关联起来。 @zh-hans
toolkit label: ……的著者团体 @zh-hans
toolkit definition: 涉及创作一种文字作品的一个团体的责任的一种作品 @zh-hans
label: yazar tüzel kişisidir @tr
definition: Bir tüzel kişiyi, metinsel bir eser yaratmak için bir tüzel kişinin sorumluluğunu içeren bir eserle ilişkilendirir. @tr
toolkit label: Yazar tüzel kişisi @tr
toolkit definition: Metinsel bir çalışma yaratmak için bir tüzel kişinin sorumluluğunu içeren bir eser. @tr
has subproperty: libretisti (yhteisö) teoksessa
has subproperty: sanoittaja (yhteisö) teoksessa
has subproperty: kokousten raportoija (yhteisö) teoksessa
has subproperty: käsikirjoittaja (yhteisö) teoksessa
has subproperty: P50843

kirjoittaja (suku) teoksessa
status: Published
label: is author family of @en
lexical alias: authorFamilyOf.en
definition: Relates a family to a work that involves a responsibility of a family for creating a textual work. @en
toolkit label: author family of @en
toolkit definition: A work that involves a responsibility of a family for creating a textual work. @en
type: Property
domain: C10008
has element type: 2
sub property of: teoksen tekijä (suku) teoksessa
sub property of: kirjoittaja (yhteistoimija) teoksessa
definition: Liittää suvun tekstiteokseen, jonka luomisesta suku on vastuussa.
toolkit label: kirjoittaja (suku) teoksessa
toolkit definition: Tekstiteos, jonka luomisesta suku on vastuussa.
label: er forfatter av (familie) @no
definition: Relaterer en familie til et verk som involverer et ansvar for en familie i form av å skape et tekstlig verk. @no
toolkit label: forfatter av (familie) @no
toolkit definition: Et verk som involverer et ansvar for en familie i form av å skape et tekstlig verk. @no
label: is auteur-familie van @nl
definition: Relateert een familie aan een werk met zich meebrengt een verantwoordelijkheid van een familie voor creëren van een tekstwerk. @nl
toolkit label: auteur-familie van @nl
toolkit definition: Een werk met zich meebrengt een verantwoordelijkheid van een familie voor creëren van een tekstwerk. @nl
label: هي عائلة مؤلفة لـ @ar
definition: يربط عائلة بعمل يترتب عليه مسئولية عائلة عن إنشاء عمل نصي. @ar
toolkit label: عائلة مؤلفة @ar
toolkit definition: عمل يترتب عليه مسئولية عائلة عن إنشاء عمل نصي. @ar
label: és família autora de @ca
definition: Relaciona una família amb una obra que implica una responsabilitat d’una família en la creació d’una obra textual. @ca
toolkit label: família autora de @ca
toolkit definition: Obra que implica una responsabilitat d’una família en la creació d’una obra textual. @ca
label: er familie, som er forfatter af @da
definition: Relaterer en familie til et værk, som involverer en families ansvar for at skabe et tekstværk. @da
toolkit label: familie, som er forfatter af @da
toolkit definition: Værk, som involverer en families ansvar for at skabe et tekstværk. @da
label: tekstteose autor (perekond) teoses @et
definition: Seostab perekonna teosega, mis sisaldab perekonna vastutust teose loomise eest. @et
toolkit label: tekstteose autor (perekond) teoses @et
toolkit definition: Teos, mis sisaldab perekonna vastutust teose loomise eest. @et
label: ist Familie als Verfasserin/Verfasser von @de
definition: Setzt eine Familie in Beziehung zu einem Werk, bei dem eine Familie für die Schaffung eines textlichen Werks verantwortlich ist. @de
toolkit label: Familie als Verfasserin/Verfasser von @de
toolkit definition: Ein Werk, bei dem eine Familie für die Schaffung eines textlichen Werks verantwortlich ist. @de
label: szerző családja a következőnek: @hu
definition: Hozzákapcsol egy családot egy műhöz, amelyhez hozzátartozik egy család felelőssége egy szöveges mű létrehozásáért. @hu
toolkit label: szerző családja: @hu
toolkit definition: Egy mű, amelyhez hozzátartozik egy család felelőssége egy szöveges mű létrehozásáért. @hu
label: è autore famiglia di @it
definition: Correla una famiglia a un'opera che implica una responsabilità di una famiglia per la creazione di un'opera testuale. @it
toolkit label: autore famiglia di @it
toolkit definition: Opera che implica una responsabilità di una famiglia per la creazione di un'opera testuale. @it
label: είναι συγγραφέας οικογένεια του @el
toolkit label: συγγραφέας οικογένεια του @el
label: est une famille autrice de @fr
definition: Met une famille en relation avec une œuvre qui comporte une responsabilité de la part d’une famille consistant à créer une œuvre textuelle. @fr
toolkit label: famille autrice de @fr
toolkit definition: Œuvre qui comporte une responsabilité de la part d’une famille consistant à créer une œuvre textuelle. @fr
label: ir autors (dzimta/ģimene) @lv
definition: Sasaista dzimtu/ģimeni ar darbu, kas ietver dzimtas/ģimenes atbildību par tekstuāla darba radīšanu. @lv
toolkit label: ir autors (dzimta/ģimene) @lv
toolkit definition: Darbs, kas ietver dzimtas/ģimenes atbildību par tekstuāla darba radīšanu. @lv
label: 是……的著者家族 @zh-hans
definition: 将一个家族与涉及创作一种文字作品的一个家族的责任的一种作品关联起来。 @zh-hans
toolkit label: ……的著者家族 @zh-hans
toolkit definition: 涉及创作一种文字作品的一个家族的责任的一种作品 @zh-hans
label: yazar ailesidir @tr
definition: Bir aileyi, metinsel bir çalışma oluşturmak için bir ailenin sorumluluğunu içeren bir eserle ilişkilendirir. @tr
toolkit label: yazar ailesi @tr
toolkit definition: Metinsel bir çalışma oluşturmak için bir ailenin sorumluluğunu içeren bir eser. @tr
has subproperty: libretisti (suku) teoksessa
has subproperty: sanoittaja (suku) teoksessa
has subproperty: kokousten raportoija (suku) teoksessa
has subproperty: käsikirjoittaja (suku) teoksessa
has subproperty: P50994

toimijan auktorisoitu hakutieto
status: Published
type: Property
label: has authorized access point for agent @en
lexical alias: authorizedAccessPointForAgent.en
definition: Relates an agent to a nomen that is an access point for agent that is selected for preference in a specific vocabulary encoding scheme. @en
domain: C10002
toolkit label: authorized access point for agent @en
toolkit definition: A nomen that is an access point for agent that is selected for preference in a specific vocabulary encoding scheme. @en
sub property of: toimijan hakutieto
has element type: 3
sub property of: P00020
definition: Liittää toimijan nomeniin, joka on toimijan hakutieto, joka on valittu ensisijaiseksi tietyssä sanaston merkintäjärjestelmässä.
toolkit label: toimijan auktorisoitu hakutieto
toolkit definition: Nomen, joka on toimijan hakutieto, joka on valittu ensisijaiseksi tietyssä sanaston merkintäjärjestelmässä.
label: har autorisert søkeinngang for agent @no
definition: Relaterer en agent til en søkeinngang for agent som er valgt som preferanse i et bestemt kodeskjema for vokabular. @no
toolkit label: autorisert søkeinngang for agent @no
toolkit definition: En søkeinngang for agent som er valgt som preferanse i et bestemt kodeskjema for vokabular. @no
label: heeft geautoriseerde ingang voor actor @nl
definition: Relateert een actor aan een nomen dat is een ingang voor actor die bij voorkeur geselecteerd is in een specifiek vocabulair coderingssysteem. @nl
toolkit label: geautoriseerde ingang voor actor @nl
toolkit definition: Een nomen dat is een ingang voor actor die bij voorkeur geselecteerd is in een specifiek vocabulair coderingssysteem. @nl
label: له نقطة وصول مقننة لوكيل @ar
definition: يربط وكيلا بنقطة وصول للوكيل اختيرت للتفضيل في خطة ترميز مفردات محددة. @ar
toolkit label: نقطة وصول مقننة لوكيل @ar
toolkit definition: يربط الوكيل بنقطة وصول لوكيل تم اختيارها للتفضيل في خطة ترميز مفردات محددة. @ar
label: té com a punt d’accés autoritzat d’agent @ca
definition: Relaciona un agent amb un nomen que és un punt d’accés d’agent que se selecciona com a preferent en un esquema de codificació de vocabulari específic. @ca
toolkit label: punt d’accés autoritzat d’agent @ca
toolkit definition: Nomen que és un punt d’accés d’agent que se selecciona com a preferent en un esquema de codificació de vocabulari específic. @ca
label: har autoriseret søgeindgang for agent @da
definition: Relaterer en agent til et nomen, som er en søgeindgang for agent, som er valgt som præference i et specifikt vokabularkodningsskema. @da
toolkit label: autoriseret søgeindgang for agent @da
toolkit definition: Et nomen, som er en søgeindgang for agent, som er valgt som præference i et specifikt vokabularkodningsskema. @da
label: tegija normitud otsielement @et
definition: Seostab tegija tegija otsielemendiga, mis on valitud eelistatuks vastavas leksikaalses märkimissüsteemis. @et
toolkit label: tegija normitud otsielement @et
toolkit definition: Tegija otsielement, mis on valitud eelistatuks vastavas leksikaalses märkimissüsteemis. @et
label: hat normierten Sucheinstieg für einen Akteur @de
definition: Setzt einen Akteur in Beziehung zu einem Sucheinstieg für einen Akteur, der in einem bestimmten Vocabulary Encoding Scheme als Vorzugsform bestimmt wird. @de
toolkit label: Normierter Sucheinstieg für einen Akteur @de
toolkit definition: Ein Sucheinstieg für einen Akteur, der in einem bestimmten Vocabulary Encoding Scheme als Vorzugsform bestimmt wird. @de
label: autorizált hozzáférési pont ágenshez a következő: @hu
definition: Hozzákapcsol egy ágenst egy nomenhez, egy ágens hozzáférési pontjához, amelyet egy adott szótárkódolási sémából választanak ki előnyben részesítettként. @hu
toolkit label: autorizált hozzáférési pont ágenshez: @hu
toolkit definition: Egy nomen, egy ágens hozzáférési pontja, amelyet egy adott szótárkódolási sémából választanak ki előnyben részesítettként. @hu
label: ha come punto d'accesso autorizzato per agente @it
definition: Correla un agente a un punto d'accesso per agente selezionato come preferenza in uno specifico schema di codifica di vocabolario controllato. @it
toolkit label: punto d'accesso autorizzato per agente @it
toolkit definition: Punto d'accesso per agente selezionato come preferenza in uno specifico schema di codifica di vocabolario controllato. @it
label: έχει καθιερωμένο σημείο πρόσβασης για τον φορέα @el
toolkit label: καθιερωμένο σημείο πρόσβασης για τον φορέα @el
label: a pour point d’accès autorisé d’un agent @fr
definition: Met un agent en relation avec un nomen qui est un point d’accès d’un agent faisant l’objet d’un choix privilégié dans un schéma d’encodage de vocabulaire spécifique. @fr
toolkit label: point d’accès autorisé d’un agent @fr
toolkit definition: Nomen qui est un point d’accès d’un agent faisant l’objet d’un choix privilégié dans un schéma d’encodage de vocabulaire spécifique. @fr
label: aģenta autoritatīvā pamatforma @lv
definition: Sasaista aģentu ar nomenu, kas ir aģenta pamatforma, kas ir izvēle no konkrētas vārdnīcas. @lv
toolkit label: aģenta autoritatīvā pamatforma @lv
toolkit definition: Aģenta pamatforma, kas ir izvēle no konkrētas vārdnīcas. @lv
label: 有行为者的规范检索点 @zh-hans
definition: 将一个行为者与作为一个行为者的检索点、并在一个特定的词表编码体系中被首选的一个命名关联起来。 @zh-hans
toolkit label: 行为者的规范检索点 @zh-hans
toolkit definition: 作为一个行为者的检索点、并在一个特定的词表编码体系中被首选的一个命名 @zh-hans
label: temsilci için yetkili erişim noktası ile ilişkilidir @tr
definition: Bir temsilciyi, belirli bir kelime kodlama şemasında tercih için seçilen temsilci için bir erişim noktası olan bir isimle ilişkilendirir. @tr
toolkit label: temsilci için yetkili erişim noktası @tr
toolkit definition: Belirli bir kelime kodlama şeması içinde tercih için seçilen bir temsilcinin erişim noktası olan bir isim. @tr
has subproperty: yhteistoimijan auktorisoitu hakutieto
has subproperty: henkilön auktorisoitu hakutieto
has subproperty: P50403

yhteistoimijan auktorisoitu hakutieto
status: Published
type: Property
label: has authorized access point for collective agent @en
lexical alias: authorizedAccessPointForCollectiveAgent.en
definition: Relates a collective agent to a nomen that is an access point for collective agent that is selected for preference in a specific vocabulary encoding scheme. @en
domain: C10011
toolkit label: authorized access point for collective agent @en
toolkit definition: A nomen that is an access point for collective agent that is selected for preference in a specific vocabulary encoding scheme. @en
sub property of: yhteistoimijan hakutieto
sub property of: toimijan auktorisoitu hakutieto
has element type: 3
definition: Liittää yhteistoimijan nomeniin, joka on yhteistoimijan hakutieto, joka on valittu ensisijaiseksi tietyssä sanaston merkintäjärjestelmässä.
toolkit label: yhteistoimijan auktorisoitu hakutieto
toolkit definition: Nomen, joka on yhteistoimijan hakutieto, joka on valittu ensisijaiseksi tietyssä sanaston merkintäjärjestelmässä.
label: har autorisert søkeinngang for kollektiv agent @no
definition: Relaterer en kollektiv agent til en søkeinngang for kollektiv agent som er valgt som preferanse i et bestemt kodeskjema for vokabular. @no
toolkit label: autorisert søkeinngang for kollektiv agent @no
toolkit definition: En søkeinngang for kollektiv agent som er valgt som preferanse i et bestemt kodeskjema for vokabular. @no
label: heeft geautoriseerde ingang voor collectieve actor @nl
definition: Relateert een collectieve actor aan een nomen dat is een ingang voor collectieve actor die bij voorkeur geselecteerd is in een specifiek vocabulair coderingssysteem. @nl
toolkit label: geautoriseerde ingang voor collectieve actor @nl
toolkit definition: Een nomen dat is een ingang voor collectieve actor die bij voorkeur geselecteerd is in een specifiek vocabulair coderingssysteem. @nl
label: له نقطة وصول مقننة لوكيل جماعي @ar
definition: يربط وكيلا بنقطة وصول لوكيل جماعي اختيرت للتفضيل في خطة ترميز مفردات محددة. @ar
toolkit label: نقطة وصول مقننة لوكيل جماعي @ar
toolkit definition: نقطة وصول لوكيل جماعي تم تحديدها للتفضيل في خطة ترميز مفردات محددة. @ar
label: té com a punt d’accés autoritzat d’agent col·lectiu @ca
definition: Relaciona un agent col·lectiu amb un nomen que és punt d’accés d’agent col·lectiu que se selecciona com a preferent en un esquema de codificació de vocabulari específic. @ca
toolkit label: punt d’accés autoritzat d’agent col·lectiu @ca
toolkit definition: Nomen que és punt d’accés d’agent col·lectiu que se selecciona com a preferent en un esquema de codificació de vocabulari específic. @ca
label: har autoriseret søgeindgang for kollektiv agent @da
definition: Relaterer en kollektiv agent til et nomen for en søgeindgang for kollektiv agent, som er valgt som præference i et specifikt vokabularkodningsskema. @da
toolkit label: autoriseret søgeindgang for kollektiv agent @da
toolkit definition: Nomen, som er en søgeindgang for kollektiv agent, som er valgt som præference i et specifikt vokabularkodningsskema. @da
label: kollektiivi normitud otsielement @et
definition: Seostab kollektiivi kollektiivi otsielemendiga, mis on valitud eelistatuks vastavas leksikaalses märkimissüsteemis. @et
toolkit label: kollektiivi normitud otsielement @et
toolkit definition: Kollektiivi otsielement, mis on valitud eelistatuks vastavas leksikaalses märkimissüsteemis. @et
label: hat normierten Sucheinstieg für einen gemeinschaftlichen Akteur @de
definition: Setzt einen gemeinschaftlichen Akteur in Beziehung zu einem Sucheinstieg für einen gemeinschaftlichen Akteur, der in einem bestimmten Vocabulary Encoding Scheme als Vorzugsform bestimmt wird. @de
toolkit label: Normierter Sucheinstieg für einen gemeinschaftlichen Akteur @de
toolkit definition: Ein Sucheinstieg für einen gemeinschaftlichen Akteur, der in einem bestimmten Vocabulary Encoding Scheme als Vorzugsform bestimmt wird. @de
label: autorizált hozzáférési pont kollektív ágenshez a következő: @hu
definition: Hozzákapcsol egy kollektív ágenst egy nomenhez, egy kollektív ágens hozzáférési pontjához, amelyet egy adott szótárkódolási sémából választanak ki előnyben részesítettként. @hu
toolkit label: autorizált hozzáférési pont kollektív ágenshez: @hu
toolkit definition: Egy nomen, egy kollektív ágens hozzáférési pontja, amelyet egy adott szótárkódolási sémából választanak ki előnyben részesítettként. @hu
label: ha come punto d'accesso autorizzato per agente collettivo @it
definition: Correla un agente collettivo a un punto d'accesso per agente collettivo selezionato come preferenza in uno specifico schema di codifica di vocabolario controllato. @it
toolkit label: punto d'accesso autorizzato per agente collettivo @it
toolkit definition: Punto d'accesso per agente collettivo selezionato come preferenza in uno specifico schema di codifica di vocabolario controllato. @it
label: έχει καθιερωμένο σημείο πρόσβασης για τον συλλογικό φορέα @el
toolkit label: καθιερωμένο σημείο πρόσβασης για τον συλλογικό φορέα @el
label: a pour point d’accès autorisé d’un agent collectif @fr
definition: Met un agent collectif en relation avec un nomen qui est un point d’accès d’un agent collectif faisant l’objet d’un choix privilégié dans un schéma d’encodage de vocabulaire spécifique. @fr
toolkit label: point d’accès autorisé d’un agent collectif @fr
toolkit definition: Nomen qui est un point d’accès d’un agent collectif faisant l’objet d’un choix privilégié dans un schéma d’encodage de vocabulaire spécifique. @fr
label: grupas autoritatīvā pamatforma @lv
definition: Sasaista grupu ar nomenu, kas ir grupas pamatforma, kas ir izvēle no konkrētas vārdnīcas. @lv
toolkit label: grupas autoritatīvā pamatforma @lv
toolkit definition: Grupas pamatforma, kas ir izvēle no konkrētas vārdnīcas. @lv
label: 有集体行为者的规范检索点 @zh-hans
definition: 将一个集体行为者与作为一个集体行为者的检索点、并没有在一个特定的词表编码体系中被首选的一个命名关联起来。 @zh-hans
toolkit label: 集体行为者的规范检索点 @zh-hans
toolkit definition: 作为一个集体行为者的检索点、并没有在一个特定的词表编码体系中被首选的一个命名 @zh-hans
label: kolektif temsilci için yetkili erişim noktası ile ilişkilidir @tr
definition: Kolektif bir temsilciyi, belirli bir kelime dağarcığı kodlama şemasında tercih edilen kolektif temsilci için bir erişim noktası olan bir isimle ilişkilendirir. @tr
toolkit label: kolektif temsilci için yetkili erişim noktası @tr
toolkit definition: Belirli bir kelime kodlama şemasında tercih için seçilen kolektif temsilcinin bir erişim noktası olan bir isim. @tr
has subproperty: yhteisön auktorisoitu hakutieto
has subproperty: suvun auktorisoitu hakutieto
has subproperty: P50405

yhteisön auktorisoitu hakutieto
status: Published
type: Property
label: has authorized access point for corporate body @en
lexical alias: authorizedAccessPointForCorporateBody.en
definition: Relates a corporate body to a nomen that is an access point for corporate body that is selected for preference in a specific vocabulary encoding scheme. @en
domain: C10005
toolkit label: authorized access point for corporate body @en
toolkit definition: A nomen that is an access point for corporate body that is selected for preference in a specific vocabulary encoding scheme. @en
sub property of: yhteisön hakutieto
sub property of: yhteistoimijan auktorisoitu hakutieto
has element type: 3
definition: Liittää yhteisön nomeniin, joka on yhteisön hakutieto, joka on valittu ensisijaiseksi tietyssä sanaston merkintäjärjestelmässä.
toolkit label: yhteisön auktorisoitu hakutieto
toolkit definition: Nomen, joka on yhteisön hakutieto, joka on valittu ensisijaiseksi tietyssä sanaston merkintäjärjestelmässä.
label: har autorisert søkeinngang for korporasjon @no
definition: Relaterer en korporasjon til en søkeinngang for korporasjon som er valgt som preferanse i et bestemt kodeskjema for vokabular. @no
toolkit label: autorisert søkeinngang for korporasjon @no
toolkit definition: En søkeinngang for korporasjon som er valgt som preferanse i et bestemt kodeskjema for vokabular. @no
label: heeft geautoriseerde ingang voor corporatie @nl
definition: Relateert een corporatie aan een nomen dat is een ingang voor corporatie die bij voorkeur geselecteerd is in een specifiek vocabulair coderingssysteem. @nl
toolkit label: geautoriseerde ingang voor corporatie @nl
toolkit definition: Een nomen dat is een ingang voor corporatie die bij voorkeur geselecteerd is in een specifiek vocabulair coderingssysteem. @nl
label: لها نقطة وصول مقننة لهيئة @ar
definition: يربط هيئة بنقطة وصول لهيئة التي يتم اختيارها للتفضيل في خطة ترميز مفردات محددة. @ar
toolkit label: نقطة وصول مقننة لهيئة @ar
toolkit definition: نقطة وصول لهيئة يتم تحديدها للتفضيل في خطة ترميز مفردات محددة. @ar
label: té com a punt d’accés autoritzat d’entitat corporativa @ca
definition: Relaciona una entitat corporativa amb un nomen que és un punt d’accés d’entitat corporativa que se selecciona com a preferent en un esquema de codificació de vocabulari específic. @ca
toolkit label: punt d’accés autoritzat d’entitat corporativa @ca
toolkit definition: Nomen que és un punt d’accés d’entitat corporativa que se selecciona com a preferent en un esquema de codificació de vocabulari específic. @ca
label: har autoriseret søgeindgang for korporation @da
definition: Relaterer en korporation til et nomen, som er en søgeindgang for korporation, som er valgt som præference i et specifikt vokabularkodningsskema. @da
toolkit label: autoriseret søgeindgang for korporation @da
toolkit definition: Nomen, som er en søgeindgang for korporation, som er valgt som præference i et specifikt vokabularkodningsskema. @da
label: asutuse normitud otsielement @et
definition: Seostab asutuse asutuse otsielemendiga, mis on valitud eelistatuks vastavas leksikaalses märkimissüsteemis. @et
toolkit label: asutuse normitud otsielement @et
toolkit definition: Asutuse otsielement, mis on valitud eelistatuks vastavas leksikaalses märkimissüsteemis. @et
label: hat normierten Sucheinstieg für eine Körperschaft @de
definition: Setzt eine Körperschaft in Beziehung zu einem Sucheinstieg für eine Körperschaft, der in einem bestimmten Vocabulary Encoding Scheme als Vorzugsform bestimmt wird. @de
toolkit label: Normierter Sucheinstieg für eine Körperschaft @de
toolkit definition: Ein Sucheinstieg für eine Körperschaft, der in einem bestimmten Vocabulary Encoding Scheme als Vorzugsform bestimmt wird. @de
label: autorizált hozzáférési pont testülethez a következő: @hu
definition: Hozzákapcsol egy testületet egy nomenhez, egy testület hozzáférési pontjához, amelyet egy adott szótárkódolási sémából választanak ki előnyben részesítettként. @hu
toolkit label: autorizált hozzáférési pont testülethez: @hu
toolkit definition: Egy nomen, egy testület hozzáférési pontja, amelyet egy adott szótárkódolási sémából választanak ki előnyben részesítettként. @hu
label: ha come punto d'accesso autorizzato per ente @it
definition: Correla un ente a un punto d'accesso per ente selezionato come preferenza in uno specifico schema di codifica di vocabolario controllato. @it
toolkit label: punto d'accesso autorizzato per ente @it
toolkit definition: Punto d'accesso per ente selezionato come preferenza in uno specifico schema di codifica di vocabolario controllato. @it
label: έχει καθιερωμένο σημείο πρόσβασης για το συλλογικό όργανο @el
toolkit label: καθιερωμένο σημείο πρόσβασης για το συλλογικό όργανο @el
label: a pour point d’accès autorisé d’une collectivité @fr
definition: Met une collectivité en relation avec un nomen qui est un point d’accès d’une collectivité faisant l’objet d’un choix privilégié dans un schéma d’encodage de vocabulaire spécifique. @fr
toolkit label: point d’accès autorisé d’une collectivité @fr
toolkit definition: Nomen qui est un point d’accès d’une collectivité faisant l’objet d’un choix privilégié dans un schéma d’encodage de vocabulaire spécifique. @fr
label: institūcijas autoritatīvā pamatforma @lv
definition: Sasaista institūciju ar nomenu, kas ir institūcijas pamatforma, kas ir izvēle no konkrētas vārdnīcas. @lv
toolkit label: institūcijas autoritatīvā pamatforma @lv
toolkit definition: Institūcijas pamatforma, kas ir izvēle no konkrētas vārdnīcas. @lv
label: 有团体的规范检索点 @zh-hans
definition: 将一个团体与作为一个团体的检索点、并在一个特定的词表编码体系中被首选的一个命名关联起来。 @zh-hans
toolkit label: 团体的规范检索点 @zh-hans
toolkit definition: 作为一个团体的检索点、并在一个特定的词表编码体系中被首选的一个命名 @zh-hans
label: tüzel kişi için yetkili erişim noktası ile ilişkilidir @tr
definition: Bir tüzel kişiyi, belirli bir kelime kodlama şemasında tercih edilen tüzel kişi için bir erişim noktası olan bir isimle ilişkilendirir. @tr
toolkit label: tüzel kişi için yetkili erişim noktası @tr
toolkit definition: Belirli bir kelime kodlama şemasında tercih için seçilen bir tüzel kişinin bir erişim noktası olan bir isim. @tr
has subproperty: P50407

suvun auktorisoitu hakutieto
status: Published
type: Property
label: has authorized access point for family @en
lexical alias: authorizedAccessPointForFamily.en
definition: Relates a family to a nomen that is an access point for family that is selected for preference in a specific vocabulary encoding scheme. @en
domain: C10008
toolkit label: authorized access point for family @en
toolkit definition: A nomen that is an access point for family that is selected for preference in a specific vocabulary encoding scheme. @en
sub property of: suvun hakutieto
sub property of: yhteistoimijan auktorisoitu hakutieto
has element type: 3
definition: Liittää suvun nomeniin, joka on suvun hakutieto, joka on valittu ensisijaiseksi tietyssä sanaston merkintäjärjestelmässä.
toolkit label: suvun auktorisoitu hakutieto
toolkit definition: Nomen, joka on suvun hakutieto, joka on valittu ensisijaiseksi tietyssä sanaston merkintäjärjestelmässä.
label: har autorisert søkeinngang for familie @no
definition: Relaterer en familie til en søkeinngang for familie som er valgt som preferanse i et bestemt kodeskjema for vokabular. @no
toolkit label: autorisert søkeinngang for familie @no
toolkit definition: En søkeinngang for familie som er valgt som preferanse i et bestemt kodeskjema for vokabular. @no
label: heeft geautoriseerde ingang voor familie @nl
definition: Relateert een familie aan een nomen dat is een ingang voor familie die bij voorkeur geselecteerd is in een specifiek vocabulair coderingssysteem. @nl
toolkit label: geautoriseerde ingang voor familie @nl
toolkit definition: Een nomen dat is een ingang voor familie die bij voorkeur geselecteerd is in een specifiek vocabulair coderingssysteem. @nl
label: له نقطة وصول مقننة لعائلة @ar
definition: يربط عائلة بنقطة وصول لعائلة اختيرت للتفضيل في خطة ترميز مفردات محددة. @ar
toolkit label: نقطة وصول مقننة لعائلة @ar
toolkit definition: نقطة وصول لعائلة يتم تحديدها للتفضيل في خطة ترميز مفردات محددة. @ar
label: té com a punt d’accés autoritzat de família @ca
definition: Relaciona una família amb un nomen que és un punt d’accés de família que se selecciona com a preferent en un esquema de codificació de vocabulari específic. @ca
toolkit label: punt d’accés autoritzat de família @ca
toolkit definition: Nomen que és un punt d’accés de família que se selecciona com a preferent en un esquema de codificació de vocabulari específic. @ca
label: har autoriseret søgeindgang for familie @da
definition: Relaterer en familie til et nomen, som er en søgeindgang for familie, som er valgt som præference i et specifikt vokabularkodningsskema. @da
toolkit label: autoriseret søgeindgang for familie @da
toolkit definition: Nomen, som er en søgeindgang for familie, som er valgt som præference i et specifikt vokabularkodningsskema. @da
label: perekonna normitud otsielement @et
definition: Seostab perekonna perekonna otsielemendiga, mis on valitud eelistatuks vastavas leksikaalses märkimissüsteemis. @et
toolkit label: perekonna normitud otsielement @et
toolkit definition: Perekonna otsielement, mis on valitud eelistatuks vastavas leksikaalses märkimissüsteemis. @et
label: hat normierten Sucheinstieg für eine Familie @de
definition: Setzt eine Familie in Beziehung zu einem Sucheinstieg für eine Familie, der in einem bestimmten Vocabulary Encoding Scheme als Vorzugsform bestimmt wird. @de
toolkit label: Normierter Sucheinstieg für eine Familie @de
toolkit definition: Ein Sucheinstieg für eine Familie, der in einem bestimmten Vocabulary Encoding Scheme als Vorzugsform bestimmt wird. @de
label: autorizált hozzáférési pont családhoz a következő: @hu
definition: Hozzákapcsol egy családot egy nomenhez, egy család hozzáférési pontjához, amelyet egy adott szótárkódolási sémából választanak ki előnyben részesítettként. @hu
toolkit label: autorizált hozzáférési pont időtartamhoz: @hu
toolkit definition: Egy nomen, egy család hozzáférési pontja, amelyet egy adott szótárkódolási sémából választanak ki előnyben részesítettként. @hu
label: ha come punto d'accesso autorizzato per famiglia @it
definition: Correla una famiglia a un punto d'accesso per famiglia selezionato come preferenza in uno specifico schema di codifica di vocabolario controllato. @it
toolkit label: punto d'accesso autorizzato per famiglia @it
toolkit definition: Punto d'accesso per famiglia selezionato come preferenza in uno specifico schema di codifica di vocabolario controllato. @it
label: έχει καθιερωμένο σημείο πρόσβασης για την οικογένεια @el
toolkit label: καθιερωμένο σημείο πρόσβασης για την οικογένεια @el
label: a pour point d’accès autorisé d’une famille @fr
definition: Met une famille en relation avec un nomen qui est un point d’accès d’une famille faisant l’objet d’un choix privilégié dans un schéma d’encodage de vocabulaire spécifique. @fr
toolkit label: point d’accès autorisé d’une famille @fr
toolkit definition: Nomen qui est un point d’accès d’une famille faisant l’objet d’un choix privilégié dans un schéma d’encodage de vocabulaire spécifique. @fr
label: dzimtas/ģimenes autoritatīvā pamatforma @lv
definition: Sasaista dzimtu/ģimeni ar nomenu, kas ir dzimtas/ģimenes pamatforma, kas ir izvēle no konkrētas vārdnīcas. @lv
toolkit label: dzimtas/ģimenes autoritatīvā pamatforma @lv
toolkit definition: Dzimtas/ģimenes pamatforma, kas ir izvēle no konkrētas vārdnīcas. @lv
label: 有家族的规范检索点 @zh-hans
definition: 将一个家族与作为一个家族的检索点、并在一个特定的词表编码体系中被首选的一个命名关联起来。 @zh-hans
toolkit label: 家族的规范检索点 @zh-hans
toolkit definition: 作为一个家族的检索点、并在一个特定的词表编码体系中被首选的一个命名 @zh-hans
label: aile için yetkili erişim noktası ile ilişkilidir @tr
definition: Bir aileyi, belirli bir kelime kodlama şemasında tercih edilen aile için bir erişim noktası olan bir isimle ilişkilendirir. @tr
toolkit label: aile için yetkili erişim noktası @tr
toolkit definition: Belirli bir kelime kodlama şemasında tercih için seçilen bir ailenin erişim noktası olan bir isim. @tr
has subproperty: P50409

henkilön auktorisoitu hakutieto
status: Published
type: Property
label: has authorized access point for person @en
lexical alias: authorizedAccessPointForPerson.en
definition: Relates a person to a nomen that is an access point for person that is selected for preference in a specific vocabulary encoding scheme. @en
domain: C10004
toolkit label: authorized access point for person @en
toolkit definition: A nomen that is an access point for person that is selected for preference in a specific vocabulary encoding scheme. @en
sub property of: henkilön hakutieto
sub property of: toimijan auktorisoitu hakutieto
has element type: 3
definition: Liittää henkilön nomeniin, joka on henkilön hakutieto, joka on valittu ensisijaiseksi tietyssä sanaston merkintäjärjestelmässä.
toolkit label: henkilön auktorisoitu hakutieto
toolkit definition: Nomen, joka on henkilön hakutieto, joka on valittu ensisijaiseksi tietyssä sanaston merkintäjärjestelmässä.
label: har autorisert søkeinngang for person @no
definition: Relaterer en person til en søkeinngang for person som er valgt som preferanse i et bestemt kodeskjema for vokabular. @no
toolkit label: autorisert søkeinngang for person @no
toolkit definition: En søkeinngang for person som er valgt som preferanse i et bestemt kodeskjema for vokabular. @no
label: heeft geautoriseerde ingang voor persoon @nl
definition: Relateert een persoon aan een nomen dat is een ingang voor persoon die bij voorkeur geselecteerd is in een specifiek vocabulair coderingssysteem. @nl
toolkit label: geautoriseerde ingang voor persoon @nl
toolkit definition: Een nomen dat is een ingang voor persoon die bij voorkeur geselecteerd is in een specifiek vocabulair coderingssysteem. @nl
label: له نقطة وصول مقننة لشخص @ar
definition: يربط شخصا بنقطة وصول لشخص تم اختيارها للتفضيل في خطة ترميز مفردات محددة. @ar
toolkit label: نقطة وصول مقننة لشخص @ar
toolkit definition: نقطة وصول لشخص تم تحديدها للتفضيل في خطة ترميز مفردات محددة. @ar
label: té com a punt d’accés autoritzat de persona @ca
definition: Relaciona una persona amb un nomen que és un punt d’accés de persona que se selecciona com a preferent en un esquema de codificació de vocabulari específic. @ca
toolkit label: punt d’accés autoritzat de persona @ca
toolkit definition: Nomen que és un punt d’accés de persona que se selecciona com a preferent en un esquema de codificació de vocabulari específic. @ca
label: har autoriseret søgeindgang for person @da
definition: Relaterer en person til et nomen, som er en søgeindgang for person, som er valgt som præference i et specifikt vokabularkodningsskema. @da
toolkit label: autoriseret søgeindgang for person @da
toolkit definition: Nomen, som er en søgeindgang for person, som er valgt som præference i et specifikt vokabularkodningsskema. @da
label: isiku normitud otsielement @et
definition: Seostab isiku isiku otsielemendiga, mis on valitud eelistatuks vastavas leksikaalses märkimissüsteemis. @et
toolkit label: isiku normitud otsielement @et
toolkit definition: Isiku otsielement, mis on valitud eelistatuks vastavas leksikaalses märkimissüsteemis. @et
label: hat normierten Sucheinstieg für eine Person @de
definition: Setzt eine Person in Beziehung zu einem Sucheinstieg für eine Person, der in einem bestimmten Vocabulary Encoding Scheme als Vorzugsform bestimmt wird. @de
toolkit label: Normierter Sucheinstieg für eine Person @de
toolkit definition: Ein Sucheinstieg für eine Person, der in einem bestimmten Vocabulary Encoding Scheme als Vorzugsform bestimmt wird. @de
label: autorizált hozzáférési pont személyhez a következő: @hu
definition: Hozzákapcsol egy személyt egy nomenhez, egy személy hozzáférési pontjához, amelyet egy adott szótárkódolási sémából választanak ki előnyben részesítettként. @hu
toolkit label: autorizált hozzáférési pont személyhez: @hu
toolkit definition: Egy nomen, egy személy hozzáférési pontja, amelyet egy adott szótárkódolási sémából választanak ki előnyben részesítettként. @hu
label: ha come punto d'accesso autorizzato per persona @it
definition: Correla una persona a un punto d'accesso per persona selezionato come preferenza in uno specifico schema di codifica di vocabolario controllato. @it
toolkit label: punto d'accesso autorizzato per persona @it
toolkit definition: Punto d'accesso per persona selezionato come preferenza in uno specifico schema di codifica di vocabolario controllato. @it
label: έχει καθιερωμένο σημείο πρόσβασης για το φυσικό πρόσωπο @el
toolkit label: καθιερωμένο σημείο πρόσβασης για το φυσικό πρόσωπο @el
label: a pour point d’accès autorisé d’une personne @fr
definition: Met une personne en relation avec un nomen qui est un point d’accès d’une personne faisant l’objet d’un choix privilégié dans un schéma d’encodage de vocabulaire spécifique. @fr
toolkit label: point d’accès autorisé d’une personne @fr
toolkit definition: Nomen qui est un point d’accès d’une personne faisant l’objet d’un choix privilégié dans un schéma d’encodage de vocabulaire spécifique. @fr
label: personas autoritatīvā pamatforma @lv
definition: Sasaista personu ar nomenu, kas ir personas pamatforma, kas ir izvēle no konkrētas vārdnīcas. @lv
toolkit label: personas autoritatīvā pamatforma @lv
toolkit definition: Personas pamatforma, kas ir izvēle no konkrētas vārdnīcas. @lv
label: 有个人的规范检索点 @zh-hans
definition: 将一个个人与作为一个个人的检索点、并在一个特定的词表编码体系中被首选的一个命名关联起来。 @zh-hans
toolkit label: 个人的规范检索点 @zh-hans
toolkit definition: 作为一个个人的检索点、并在一个特定的词表编码体系中被首选的一个命名 @zh-hans
label: kişi için yetkili erişim noktası ile ilişkilidir @tr
definition: Bir kişiyi, belirli bir kelime kodlama şemasında tercih edilen kişi için bir erişim noktası olan bir isimle ilişkilendirir. @tr
toolkit label: kişi için yetkili erişim noktası @tr
toolkit definition: Belirli bir kelime kodlama şemasında tercih için seçilen kişinin erişim noktası olan bir isim. @tr
has subproperty: P50411

is author of expression of (Deprecated)
status: Deprecated
type: Property
has element type: 2
lexical alias: authorOfExpressionOf.en
has subproperty: oheisteksti
has subproperty: P50452

kirjoittaja (henkilö) teoksessa
status: Published
label: is author person of @en
lexical alias: authorPersonOf.en
definition: Relates a person to a work that involves a responsibility of a person for creating a textual work. @en
toolkit label: author person of @en
toolkit definition: A work that involves a responsibility of a person for creating a textual work. @en
type: Property
domain: C10004
has element type: 2
sub property of: teoksen tekijä (henkilö) teoksessa
sub property of: kirjoittaja (toimija) teoksessa
definition: Liittää henkilön teokseen, joka on tekstiteos, jonka luomisesta henkilö on vastuussa.
toolkit label: kirjoittaja (henkilö) teoksessa
toolkit definition: Teos, joka on tekstiteos, jonka luomisesta henkilö on vastuussa.
label: er forfatter av (person) @no
definition: Relaterer en person til et verk som involverer et ansvar for en person i form av å skape et tekstlig verk. @no
toolkit label: forfatter av (person) @no
toolkit definition: Et verk som involverer et ansvar for en person i form av å skape et tekstlig verk. @no
label: is auteur-persoon van @nl
definition: Relateert een persoon aan een werk met zich meebrengt een verantwoordelijkheid van een persoon voor creëren van een tekstwerk. @nl
toolkit label: auteur-persoon van @nl
toolkit definition: Een werk met zich meebrengt een verantwoordelijkheid van een persoon voor creëren van een tekstwerk. @nl
label: هو شخص مؤلف لـ @ar
definition: يربط شخصا بعمل يترتب عليه مسئولية شخص عن إنشاء عمل نصي. @ar
toolkit label: شخص مؤلف لـ @ar
toolkit definition: عمل يترتب عليه مسئولية شخص عن إنشاء عمل نصي. @ar
label: és persona autora de @ca
definition: Relaciona una persona amb una obra que implica una responsabilitat d’una persona en la creació d’una obra textual. @ca
toolkit label: persona autora de @ca
toolkit definition: Obra que implica una responsabilitat d’una persona en la creació d’una obra textual. @ca
label: er person, som er forfatter af @da
definition: Relaterer en person til et værk, som involverer en persons ansvar for at skabe et tekstværk. @da
toolkit label: person, som er forfatter af @da
toolkit definition: Værk, som involverer en persons ansvar for at skabe et tekstværk. @da
label: tekstteose autor (isik) teoses @et
definition: Seostab isiku teosega, mis sisaldab isiku vastutust tekstteose loomise eest. @et
toolkit label: tekstteose autor (isik) teoses @et
toolkit definition: Teos, mis sisaldab isiku vastutust tekstteose loomise eest. @et
label: ist Person als Verfasserin/Verfasser von @de
definition: Setzt eine Person in Beziehung zu einem Werk, bei dem eine Person für die Schaffung eines textlichen Werks verantwortlich ist. @de
toolkit label: Person als Verfasserin/Verfasser von @de
toolkit definition: Ein Werk, bei dem eine Person für die Schaffung eines textlichen Werks verantwortlich ist. @de
label: szerző személye a következőnek: @hu
definition: Hozzákapcsol egy személyt egy műhöz, amelyhez hozzátartozik egy személy felelőssége egy szöveges mű létrehozásáért. @hu
toolkit label: szerző személye: @hu
toolkit definition: Egy mű, amelyhez hozzátartozik egy személy felelőssége egy szöveges mű létrehozásáért. @hu
label: è autore persona di @it
definition: Correla una persona a un'opera che implica una responsabilità di una persona per la creazione di un'opera testuale. @it
toolkit label: autore persona di @it
toolkit definition: Opera che implica una responsabilità di una persona per la creazione di un'opera testuale. @it
label: είναι συγγραφέας φυσικό πρόσωπο του @el
toolkit label: συγγραφέας φυσικό πρόσωπο του @el
label: est une personne autrice de @fr
definition: Met une personne en relation avec une œuvre qui comporte une responsabilité de la part d’une personne consistant à créer une œuvre textuelle. @fr
toolkit label: personne autrice de @fr
toolkit definition: Œuvre qui comporte une responsabilité de la part d’une personne consistant à créer une œuvre textuelle. @fr
label: ir autors (persona) @lv
definition: Sasaista personu ar darbu, kas ietver personas atbildību par tekstuāla darba radīšanu. @lv
toolkit label: ir autors (persona) @lv
toolkit definition: Darbs, kas ietver personas atbildību par tekstuāla darba radīšanu. @lv
label: 是……的著者个人 @zh-hans
definition: 将一个个人与涉及创作一种文字作品的一个个人的责任的一种作品关联起来。 @zh-hans
toolkit label: ……的著者个人 @zh-hans
toolkit definition: 涉及创作一种文字作品的一个个人的责任的一种作品 @zh-hans
label: yazar kişisidir @tr
definition: Bir kişiyi, metinsel bir eser yaratma sorumluluğunu içeren bir eserle ilişkilendirir. @tr
toolkit label: yazar @tr
toolkit definition: Metinsel bir çalışma oluşturmak için bir kişinin sorumluluğunu içeren bir eser. @tr
has subproperty: libretisti (henkilö) teoksessa
has subproperty: sanoittaja (henkilö) teoksessa
has subproperty: kokousten raportoija (henkilö) teoksessa
has subproperty: käsikirjoittaja (henkilö) teoksessa
has subproperty: P50541

ystävä
status: Published
type: Property
label: has friend @en
lexical alias: friend.en
definition: Relates a person to a person who shares a bond of mutual affection or regard with another person. @en
domain: C10004
toolkit label: friend @en
toolkit definition: A person who shares a bond of mutual affection or regard with another person. @en
instruction number: 29.5
sub property of: henkilöön liittyvä henkilö
label: έχει φίλο @el
definition: Συνδέει ένα φυσικό πρόσωπο με ένα φυσικό πρόσωπο που μοιράζεται έναν δεσμό αμοιβαίας συμπάθειας ή εκτίμησης με ένα άλλο φυσικό πρόσωπο. @el
toolkit label: φίλος @el
toolkit definition: Ένα φυσικό πρόσωπο που μοιράζεται έναν δεσμό αμοιβαίας συμπάθειας ή εκτίμησης με ένα άλλο φυσικό πρόσωπο. @el
definition: Setzt eine Person in Beziehung zu einer Person, die eine gegenseitige Zuneigung oder Achtung mit einer anderen Person teilt. @de
toolkit label: Freundin/Freund @de
toolkit definition: Eine Person, die eine gegenseitige Zuneigung oder Achtung mit einer anderen Person teilt. @de
label: har ven @da
definition: Relaterer en person til en person, som deler et bånd af gensidig hengivenhed eller respekt med en anden person. @da
toolkit label: ven @da
toolkit definition: Person, som deler et bånd af gensidig hengivenhed eller respekt med en anden person. @da
label: té com a amic @ca
definition: Relaciona una persona amb una persona que comparteix un vincle d’afecte mutu o de respecte amb una altra persona. @ca
toolkit label: amic @ca
toolkit definition: Persona que comparteix un vincle d’afecte mutu o de respecte amb una altra persona. @ca
definition: Liittää henkilön henkilöön, jolla on molemminpuolinen kiintymys- tai kunnioitussuhde toiseen henkilöön.
toolkit label: ystävä
toolkit definition: Henkilö, jolla on molemminpuolinen kiintymys- tai kunnioitussuhde toiseen henkilöön.
toolkit label: venn @no
toolkit definition: En person som er i et gjensidig vennskapsforhold med en annen person. @no
label: hat Freundin/Freund @de
label: a pour ami @fr
definition: Met une personne en relation avec une personne qui partage des liens d’affection ou d’estime mutuelles avec une autre personne. @fr
toolkit label: ami @fr
toolkit definition: Personne qui partage des liens d’affection ou d’estime mutuelles avec une autre personne. @fr
has element type: 2
label: barátja a következő: @hu
definition: Hozzákapcsol egy személyt egy személyhez, aki a kölcsönös szeretet kötelékében osztozik vagy így tekint egy másik személyre. @hu
toolkit label: barát: @hu
toolkit definition: Egy személy, aki a kölcsönös szeretet kötelékében osztozik vagy így tekint egy másik személyre. @hu
label: har venn @no
definition: Relaterer en person til en person som er i et gjensidig vennskapsforhold med en annen person. @no
label: heeft vriend @nl
definition: Relateert een persoon aan een persoon die een band van wederzijdse affectie of respect deelt met een andere persoon. @nl
toolkit label: vriend @nl
toolkit definition: Een persoon die een band van wederzijdse affectie of respect deelt met een andere persoon. @nl
label: له صديق @ar
definition: يربط شخصا بشخص تجمعه مودة أو احترام متبادل مع شخص آخر. @ar
toolkit label: صديق @ar
toolkit definition: شخص تجمعه مودة أو احترام متبادل مع شخص آخر. @ar
label: sõber @et
definition: Seostab isiku isikuga, kes jagab teise isikuga vastastikust kiindumus- või austussuhet. @et
toolkit label: sõber @et
toolkit definition: Isik, kes jagab teise isikuga vastastikust kiindumus- või austussuhet. @et
label: ha come amico @it
definition: Correla una persona a una persona che condivide un legame di mutuo affetto con un'altra persona. @it
toolkit label: amico @it
toolkit definition: Persona che condivide un legame di mutuo affetto con un'altra persona. @it
label: draugs @lv
definition: Sasaista personu ar personu, kurai ir savstarpējas simpātijas vai cieņa pret citu personu. @lv
toolkit label: draugs @lv
toolkit definition: Persona, kurai ir savstarpējas simpātijas vai cieņa pret citu personu. @lv
label: 有朋友 @zh-hans
definition: 将一个个人与和另一个个人有共同感情或尊重的一个个人关联起来。 @zh-hans
toolkit label: 朋友 @zh-hans
toolkit definition: 和另一个个人有共同感情或尊重的一个个人 @zh-hans
label: arkadaş ile ilişkilidir @tr
definition: Bir kişiyi, başka bir kişiyle karşılıklı sevgi ya da saygı bağı paylaşan bir kişi ile ilişkilendirir. @tr
toolkit label: arkadaş @tr
toolkit definition: Başka bir kişiyle karşılıklı sevgi veya saygı bağı paylaşan kişi @tr
has subproperty: P50280

opiskelija
status: Published
type: Property
label: has enrolled student @en
lexical alias: enrolledStudent.en
definition: Relates a corporate body to a person who receives instruction at an educational institution. @en
domain: C10005
toolkit label: enrolled student @en
toolkit definition: A person who receives instruction at an educational institution. @en
instruction number: 29.5
sub property of: yhteisöön liittyvä henkilö
label: έχει εγγεγραμμένο φοιτητή @el
definition: Συνδέει ένα συλλογικό όργανο με ένα φυσικό πρόσωπο που λαμβάνει οδηγίες σε ένα εκπαιδευτικό ίδρυμα. @el
toolkit label: εγγεγραμμένος φοιτητής @el
toolkit definition: Ένα φυσικό πρόσωπο που λαμβάνει οδηγίες σε ένα εκπαιδευτικό ίδρυμα. @el
definition: Setzt eine Körperschaft in Beziehung zu einer Person, die in einer Bildungseinrichtung unterrichtet wird. @de
toolkit label: Immatrikulierte Studentin/Immatrikulierter Student @de
toolkit definition: Eine Person, die in einer Bildungseinrichtung unterrichtet wird. @de
label: har indskreven studerende @da
definition: Relaterer en korporation til en person, som modtager undervisning ved en uddannelsesinstitution. @da
toolkit label: indskreven student @da
toolkit definition: Person, som modtager undervisning ved en uddannelsesinstitution. @da
label: té com a estudiant matriculat @ca
definition: Relaciona una entitat corporativa amb una persona que rep instrucció en una institució educativa. @ca
toolkit label: estudiant matriculat @ca
toolkit definition: Persona que rep instrucció en una institució educativa. @ca
definition: Liittää yhteisön henkilöön, joka saa opetusta oppilaitoksessa.
toolkit label: opiskelija
toolkit definition: Henkilö, joka saa opetusta oppilaitoksessa.
toolkit label: innskrevet student @no
toolkit definition: En person som mottar opplæring ved en utdanningsinstitusjon. @no
label: hat immatrikulierte Studentin/immatrikulierten Studenten @de
label: a pour élève inscrit @fr
definition: Met une collectivité en relation avec une personne qui reçoit un enseignement dans un établissement d’enseignement. @fr
toolkit label: élève inscrit @fr
toolkit definition: Personne qui reçoit un enseignement dans un établissement d’enseignement. @fr
has element type: 2
label: beiratkozott tanulója a következő: @hu
definition: Hozzákapcsol egy testületet egy személyhez, aki egy oktatási intézményben oktatásban részesül. @hu
toolkit label: beiratkozott tanuló: @hu
toolkit definition: Egy személy, aki egy oktatási intézményben oktatásban részesül. @hu
label: har innskrevet student @no
definition: Relaterer en korporasjon til en person som mottar opplæring ved en utdanningsinstitusjon. @no
label: heeft ingeschreven student @nl
definition: Relateert een corporatie aan een persoon die instructie ontvangt aan een onderwijsinstelling. @nl
toolkit label: ingeschreven student @nl
toolkit definition: Een persoon die instructie ontvangt aan een onderwijsinstelling. @nl
label: له طالب مسجل @ar
definition: يربط هيئة بشخص يتلقى التعليم في مؤسسة تعليمية. @ar
toolkit label: طالب مُسجل @ar
toolkit definition: شخص يتلقى التعليم في مؤسسة تعليمية. @ar
label: registreeritud õppur @et
definition: Seostab asutuse isikuga, kes saab õpetust haridusasutuses. @et
toolkit label: registreeritud õppur @et
toolkit definition: Isik, kes saab õpetust haridusasutuses. @et
label: ha come studente iscritto @it
definition: Collega un ente a una persona che riceve istruzione presto un istituto scolastico. @it
toolkit label: studente iscritto @it
toolkit definition: Persona che riceve istruzione presto un istituto scolastico. @it
label: izglītojamais @lv
definition: Sasaista institūciju ar personu, kura ir reģistrēta izglītības iestādes izglītojamo sarakstā. @lv
toolkit label: izglītojamais @lv
toolkit definition: Persona, kura ir reģistrēta izglītības iestādes izglītojamo sarakstā. @lv
label: 有注册学生 @zh-hans
definition: 将一个个人与在一个教育机构里接受教学的一个个人关联起来。 @zh-hans
toolkit label: 注册学生 @zh-hans
toolkit definition: 在一个教育机构里接受教学的一个个人 @zh-hans
label: kayıtlı öğrenci ile ilişkilidir @tr
definition: Bir tüzel kişiyi, bir eğitim kurumunda eğitim gören bir kişi ile ilişkilendirir. @tr
toolkit label: kayıtlı öğrenci @tr
toolkit definition: Bir eğitim kurumunda eğitim alan kişi @tr
has subproperty: P50283

omistuskirjoituksen kirjoittaja kappaleessa
status: Published
label: is inscriber of @en
definition: Relates a person to an item that involves a responsibility for inscribing a text, such as a statement of dedication or gift. @en
type: Property
domain: C10004
sub property of: muokkaaja (henkilö) kappaleessa
lexical alias: inscriberOf.en
label: est un dédicateur d’un item de @fr
definition: Met une personne en relation avec un item qui comporte une responsabilité consistant à inscrire un texte tel qu’une dédicace ou une mention de don. @fr
toolkit label: dédicateur d’un item de @fr
toolkit definition: Item qui comporte une responsabilité consistant à inscrire un texte tel qu’une dédicace ou une mention de don. @fr
toolkit label: inscriber of @en
toolkit definition: An item that involves a responsibility for inscribing a text, such as a statement of dedication or gift. @en
instruction number: 18.5
label: είναι χαράκτης του @el
definition: Συνδέει ένα φυσικό πρόσωπο, το οποίο έχει γράψει μια αφιέρωση ή δήλωση δωρεάς σε ένα αντίτυπο, με ένα αντίτυπο. @el
toolkit label: χαράκτης του @el
toolkit definition: Ένα αντίτυπο που φέρει μια αφιέρωση ή δήλωση δωρεάς. @el
definition: Setzt eine Person in Beziehung zu einem Exemplar, das mit einer Verantwortung verbunden ist, eine Widmung oder einen Schenkungsvermerk in ein Exemplar zu schreiben. @de
toolkit label: Beschriftende Person von @de
toolkit definition: Ein Exemplar, das mit einer Verantwortung verbunden ist, eine Widmung oder einen Schenkungsvermerk in ein Exemplar zu schreiben. @de
label: er indskriver af @da
definition: Relaterer en person til et eksemplar, som involverer et ansvar for at indskrive en tekst, såsom en dedikation eller gavetilegnelse. @da
toolkit label: indskriver af @da
toolkit definition: Eksemplar, som involverer et ansvar for at indskrive en tekst, såsom en dedikation eller gavetilegnelse. @da
label: és inscriptor de @ca
definition: Relaciona una persona amb un ítem que implica una responsabilitat d’inscriure un text, com ara una menció de dedicatòria o de regal. @ca
toolkit label: inscriptor de @ca
toolkit definition: Ítem que implica una responsabilitat d’inscriure un text, com ara una menció de dedicatòria o de regal. @ca
definition: Liittää henkilön kappaleeseen, jossa henkilö on vastuussa tekstin, kuten omistuskirjoituksen tai lahjoitusmerkinnön, kirjoittamisesta.
toolkit label: omistuskirjoituksen kirjoittaja kappaleessa
toolkit definition: Kappale, jossa henkilö on vastuussa tekstin, kuten omistuskirjoituksen tai lahjoitusmerkinnön, kirjoittamisesta.
toolkit label: tilegner av @no
toolkit definition: Et eksemplar som involverer ansvar i form av å skrive inn en tekst, slik som en angivelse av dedikasjon eller gave. @no
label: ist beschriftende Person von @de
has element type: 2
label: beírója a következőnek: @hu
definition: Hozzákapcsol egy személyt egy példányhoz, amelyhez hozzátartozik a felelősség egy olyan bejegyzett szöveggel kapcsolatosan, mint egy dedikáció vagy egy ajándékozási nyilatkozat. @hu
toolkit label: beírója: @hu
toolkit definition: Egy példány, amelyhez hozzátartozik a felelősség egy olyan bejegyzett szöveggel kapcsolatosan, mint egy dedikáció vagy egy ajándékozási nyilatkozat. @hu
alternative label: omistuskirjoitus kappaleessa
label: er tilegner av @no
definition: Relaterer en person til et eksemplar som involverer ansvar i form av å skrive inn en tekst, slik som en angivelse av dedikasjon eller gave. @no
label: is opdrachtschrijver van @nl
definition: Relateert een persoon aan een item dat met zich meebrengt een verantwoordelijkheid voor inscriptie van een tekst, zoals een mededeling van opdracht of geschenk. @nl
toolkit label: opdrachtschrijver van @nl
toolkit definition: Een item dat met zich meebrengt een verantwoordelijkheid voor inscriptie van een tekst, zoals een vermelding van opdracht of geschenk. @nl
label: هو كاتب إهداء لـ @ar
definition: يربط شخصا بمفردة يترتب عليها مسئولية كتابة نص، مثل بيان الإهداء أو الهدية. @ar
toolkit label: كاتب إهداء @ar
toolkit definition: مفردة تنطوي على مسئولية كتابة نص، مثل بيان الإهداء أو الهدية. @ar
label: pühenduse kirjutaja eksemplaris @et
definition: Seostab isiku eksemplariga, mis sisaldab vastutust pühenduse või kinkimismärke kirjutamise eest. @et
toolkit label: pühenduse kirjutaja eksemplaris @et
toolkit definition: Eksemplar, mis sisaldab vastutust pühenduse või kinkimismärke kirjutamise eest. @et
label: è autore di dedica di @it
definition: Correla una persona a un item che implica la responsabilità di scrivere un testo, come una dichiarazione di dedica o omaggio. @it
toolkit label: autore di dedica di @it
toolkit definition: Item che implica la responsabilità di scrivere un testo, come una dichiarazione di dedica o omaggio. @it
alternative label: auteur d’un envoi de @fr
label: ir veltījuma ierakstītājs @lv
definition: Sasaista personu ar vienību, kas ietver personas atbildību par ierakstītu tekstu, piemēram, veltījuma vai dāvinājuma ierakstu. @lv
toolkit label: ir veltījuma ierakstītājs @lv
toolkit definition: Vienība, kas ietver personas atbildību par ierakstītu tekstu, piemēram, veltījuma vai dāvinājuma ierakstu. @lv
label: 是……的题写者 @zh-hans
definition: 将一个个人与涉及题写文字（诸如题献或赠与）的责任的单件关联起来。 @zh-hans
toolkit label: ……的题写者 @zh-hans
toolkit definition: 涉及题写文字（诸如题献或赠与）的责任的单件 @zh-hans
label: armağan notu yazarıdır @tr
definition: Bir kişiyi, ithaf beyanı veya hediye gibi bir metnin yazılması sorumluluğunu içeren bir kopyayla ilişkilendirir. @tr
toolkit label: armağan notu yazarıdır @tr
toolkit definition: İthaf veya hediye beyanı gibi bir metnin yazılması sorumluluğunu içeren bir kopya. @tr
has subproperty: P50125

johdantoteksti
status: Deprecated
label: is writer of introduction of (Deprecated) @en
definition: Relates an agent to an expression that includes a contribution of providing an introduction. (Deprecated) @en
type: Property
domain: C10002
sub property of: oheisteksti
lexical alias: writerOfIntroductionOf.en
label: est un auteur d’introduction de @fr
definition: Met un agent qui contribue à une expression d’une œuvre en fournissant une introduction à une œuvre originale en relation avec une expression. @fr
toolkit label: auteur d’introduction de @fr
toolkit definition: Expression d’une œuvre qui intègre une contribution consistant à fournir une introduction à une œuvre originale. @fr
toolkit label: writer of introduction of (Deprecated) @en
toolkit definition: An expression that includes a contribution of providing an introduction. (Deprecated) @en
instruction number: 18.5
label: είναι συγγραφέας της εισαγωγής του @el
definition: Συνδέει έναν φορέα, ο οποίος συνεισφέρει σε μια έκφραση ενός έργου παρέχοντας μια εισαγωγή στο πρωτότυπο έργο, με μια έκφραση. @el
toolkit label: συγγραφέας της εισαγωγής του @el
toolkit definition: Μια έκφραση ενός έργου που ενσωματώνει τη συνεισφορά της εισαγωγής σε ένα πρωτότυπο έργο. @el
definition: Setzt einen Akteur, der an einer Expression eines Werks mitwirkt, indem er eine Einleitung zum Originalwerk liefert, mit einer Expression in Beziehung. @de
toolkit label: Verfasser einer Einleitung von @de
toolkit definition: Eine Expression eines Werks, bei der ein Akteur eine Einleitung zum Originalwerk liefert. @de
label: er forfatter til introduktion til @da
definition: Relaterer en agent, der har bidraget til et udtryk af et værk ved at sørge for en indledning til et oprindeligt værk til et udtryk. @da
toolkit label: forfatter til introduktion til @da
toolkit definition: Udtryk af et værk der inkorporerer et bidrag ved at skrive en indlednig til et oprindeligt værk. @da
label: és escriptor d’una introducció de @ca
definition: Relaciona un agent, que contribueix a una expressió d’una obra proporcionant una introducció a una obra original, amb una expressió. @ca
toolkit label: escriptor d’una introducció de @ca
toolkit definition: Expressió d’una obra que incorpora una contribució que proporciona una introducció a una obra original. @ca
definition: Liittää toimijan teoksen ekspressioon, joka sisältää alkuperäiseen teokseen kirjoitetun johdannon.
toolkit label: johdantoteksti
toolkit definition: Teoksen ekspressio, joka sisältää alkuperäiseen teokseen kirjoitetun johdannon.
toolkit label: forfatter av innledning til @no
toolkit definition: Et uttrykk av et verk som omfatter et bidrag i form av å tilføre en innledning til originalverket. @no
label: ist Verfasser einer Einleitung von @de
has element type: 2
label: bevezetésének írója @hu
definition: Egy ágenst (személyt, családot vagy testületet), aki/amely egy mű kifejezési formájához hozzájárul azzal, hogy egy eredeti művet bevezetéssel lát el, hozzákapcsol egy kifejezési formához. @hu
toolkit label: bevezetés írója @hu
toolkit definition: Egy mű kifejezési formája, amely hozzájárulást testesít meg azzal, hogy egy egy eredeti művet bevezetéssel lát el. @hu
has subproperty: P50153

sitoja (toimija) kappaleessa
status: Published
label: is binder agent of @en
definition: Relates an agent to an item that involves a responsibility of an agent for binding. @en
type: Property
domain: C10002
sub property of: toimijaan liittyvä kappale
lexical alias: binderAgentOf.en
label: est un agent relieur de @fr
definition: Met un agent en relation avec un item qui comporte une responsabilité de la part d’un agent en ce qui concerne la reliure. @fr
toolkit label: agent relieur de @fr
toolkit definition: Item qui comporte une responsabilité de la part d’un agent en ce qui concerne la reliure. @fr
toolkit label: binder agent of @en
toolkit definition: An item that involves a responsibility of an agent for binding. @en
instruction number: 18.5
label: είναι βιβλιοδέτης φορέας του @el
definition: Συνδέει ένα φυσικό πρόσωπο, που βιβλιοδετεί ένα αντίτυπο, με ένα αντίτυπο. @el
toolkit label: βιβλιοδέτης φορέας του @el
toolkit definition: Ένα αντίτυπο που βιβλιοδετείται. @el
definition: Setzt einen Akteur in Beziehung zu einem Exemplar, bei dem ein Akteur für das Binden verantwortlich ist. @de
toolkit label: Akteur als Buchbinderin/Buchbinder von @de
toolkit definition: Ein Exemplar, bei dem ein Akteur für das Binden verantwortlich ist. @de
label: er agent, som er bogbinder af @da
definition: Relaterer en agent til et eksemplar, som involverer en agents ansvar for indbinding. @da
toolkit label: agent, som er bogbinder af @da
toolkit definition: Eksemplar, som involverer en agents ansvar for indbinding. @da
label: és agent enquadernador de @ca
definition: Relaciona un agent amb un ítem que implica una responsabilitat d’un agent en l’enquadernació. @ca
toolkit label: agent enquadernador de @ca
toolkit definition: Ítem que implica una responsabilitat d’un agent en l’enquadernació. @ca
definition: Liittää toimijan kappaleeseen, jonka sitomisesta toimija on vastuussa.
toolkit label: sitoja (toimija) kappaleessa
toolkit definition: Kappale, jonka sitomisesta toimija on vastuussa.
toolkit label: bokbinder av (agent) @no
toolkit definition: Et eksemplar som involverer ansvar for en agent i form av innbinding. @no
label: ist Akteur als Buchbinderin/Buchbinder von @de
has element type: 2
label: könyvkötő ágense a következőnek: @hu
definition: Hozzákapcsol egy ágenst egy példányhoz, amelyhez hozzátartozik egy ágens felelőssége a kötésért. @hu
toolkit label: könyvkötő ágense: @hu
toolkit definition: Egy példány, amelyhez hozzátartozik egy ágens felelőssége a kötésért. @hu
alternative label: binder of @en
alternative label: sitojana kappaleessa
label: er bokbinder av (agent) @no
definition: Relaterer en agent til et eksemplar som involverer ansvar for en agent i form av innbinding. @no
alternative label: bokbinder av @no
label: is binder-actor van @nl
definition: Relateert een actor aan een item dat met zich meebrengt een verantwoordelijkheid van een actor voor het binden. @nl
toolkit label: binder-actor van @nl
toolkit definition: Een item dat met zich meebrengt een verantwoordelijkheid van een actor voor het binden. @nl
label: هو وكيل مسئول عن التجليد @ar
definition: يربط وكيلا بمفردة تنطوي على مسئولية وكيل عن التجليد @ar
toolkit label: وكيل مسئول عن التجليد @ar
toolkit definition: مفردة يترتب عليها مسئولية وكيل عن التجليد @ar
alternative label: enquadernador de @ca
alternative label: bogbinder af @da
label: köitja (tegija) eksemplarile @et
definition: Seostab tegija eksemplariga, mis sisaldab tegija vastutust köitmise eest. @et
alternative label: köitja eksemplarile @et
toolkit label: köitja (tegija) eksemplarile @et
toolkit definition: Eksemplar, mis sisaldab tegija vastutust köitmise eest. @et
alternative label: könyvkötője: @hu
label: è rilegatore agente di @it
definition: Correla un agente a un item che implica una responsabilità di un agente per la rilegatura. @it
alternative label: rilegatore di @it
toolkit label: rilegatore agente di @it
toolkit definition: Item che implica una responsabilità di un agente per la rilegatura. @it
alternative label: βιβλιοδέτης του @el
alternative label: relieur de @fr
label: ir iesējējs (aģents) @lv
definition: Sasaista aģentu ar vienību, kas ietver aģenta atbildību par iesiešanu. @lv
toolkit label: ir iesējējs (aģents) @lv
toolkit definition: Vienība, kas ietver aģenta atbildību par iesiešanu. @lv
alternative label: مسئول عن تجليد @ar
alternative label: Buchbinder von @de
alternative label: ……的装订者 @zh-hans
toolkit label: ……的装订者行为者 @zh-hans
toolkit definition: 涉及一个装订行为者的责任的一个单件 @zh-hans
toolkit label: ciltleyici temsilci @tr
toolkit definition: Ciltleme için bir temsilcinin sorumluluğunu içeren bir kopya. @tr
has subproperty: sitoja (yhteistoimija) kappaleessa

sitoja (yhteistoimija) kappaleessa
status: Published
label: is binder collective agent of @en
lexical alias: binderCollectiveAgentOf.en
definition: Relates a collective agent to an item that involves a responsibility of a collective agent for binding. @en
toolkit label: binder collective agent of @en
toolkit definition: An item that involves a responsibility of a collective agent for binding. @en
type: Property
domain: C10011
has element type: 2
sub property of: yhteistoimijaan liittyvä kappale
sub property of: sitoja (toimija) kappaleessa
definition: Liittää yhteistoimijan kappaleeseen, jonka sitomisesta yhteistoimija on vastuussa.
toolkit label: sitoja (yhteistoimija) kappaleessa
toolkit definition: Kappale, jonka sitomisesta yhteistoimija on vastuussa.
label: er bokbinder for (kollektiv agent) @no
definition: Relaterer en kollektiv agent til et eksemplar som involverer et ansvar for en kollektiv agent i form av innbinding. @no
toolkit label: bokbinder for (kollektiv agent) @no
toolkit definition: Et eksemplar som involverer et ansvar for en kollektiv agent i form av innbinding. @no
label: is binder-collectieve actor van @nl
definition: Relateert een collectieve actor aan een item dat met zich meebrengt een verantwoordelijkheid van een collectieve actor voor het binden. @nl
toolkit label: binder-collectieve actor van @nl
toolkit definition: Een item dat met zich meebrengt een verantwoordelijkheid van een collectieve actor voor het binden. @nl
label: هو وكيل جماعي مسئول عن تجليد @ar
definition: يربط وكيلا جماعيا بمفردة تنطوي على مسئولية وكيل جماعي عن التجليد. @ar
toolkit label: وكيل جماعي مسئول عن تجليد @ar
toolkit definition: مفردة تنطوي على مسئولية وكيل جماعي عن التجليد. @ar
label: és agent col·lectiu enquadernador de @ca
definition: Relaciona un agent col·lectiu amb un ítem que implica una responsabilitat d’un agent col·lectiu en l’enquadernació. @ca
toolkit label: agent col·lectiu enquadernador de @ca
toolkit definition: Ítem que implica una responsabilitat d’un agent col·lectiu en l’enquadernació. @ca
label: er kollektiv agent, som er bogbinder af @da
definition: Relaterer en kollektiv agent til et eksemplar, som involverer en kollektiv agents ansvar for indbinding. @da
toolkit label: kollektiv agent, som er bogbinder af @da
toolkit definition: Eksemplar, som involverer en kollektiv agents ansvar for indbinding. @da
label: köitja (kollektiiv) eksemplarile @et
definition: Seostab kollektiivi eksemplariga, mis sisaldab kollektiivi vastutust köitmise eest. @et
toolkit label: köitja (kollektiiv) eksemplarile @et
toolkit definition: Eksemplar, mis sisaldab kollektiivi vastutust köitmise eest. @et
label: ist gemeinschaftlicher Akteur als Buchbinderin/Buchbinder von @de
definition: Setzt einen gemeinschaftlichen Akteur in Beziehung zu einem Exemplar, bei dem ein gemeinschaftlicher Akteur für das Binden verantwortlich ist. @de
toolkit label: Gemeinschaftlicher Akteur als Buchbinderin/Buchbinder von @de
toolkit definition: Ein Exemplar, bei dem ein gemeinschaftlicher Akteur für das Binden verantwortlich ist. @de
label: könyvkötő kollektív ágense a következőnek: @hu
definition: Hozzákapcsol egy kollektív ágenst egy példányhoz, amelyhez hozzátartozik egy kollektív ágens felelőssége a kötésért. @hu
toolkit label: könyvkötő kollektív ágense: @hu
toolkit definition: Egy példány, amelyhez hozzátartozik egy kollektív ágens felelőssége a kötésért. @hu
label: è rilegatore agente collettivo di @it
definition: Correla un agente collettivo a un item che implica la responsabilità di un agente collettivo per la rilegatura. @it
toolkit label: rilegatore agente collettivo di @it
toolkit definition: Item che implica la responsabilità di un agente collettivo per la rilegatura. @it
label: είναι βιβλιοδέτης συλλογικός φορέας του @el
toolkit label: βιβλιοδέτης συλλογικός φορέας του @el
label: est un agent collectif relieur de @fr
definition: Met un agent collectif en relation avec un item qui comporte une responsabilité de la part d’un agent collectif en ce qui concerne la reliure. @fr
toolkit label: agent collectif relieur de @fr
toolkit definition: Item qui comporte une responsabilité de la part d’un agent collectif en ce qui concerne la reliure. @fr
label: ir iesējējs (grupa) @lv
definition: Sasaista grupu ar vienību, kas ietver grupas atbildību par iesiešanu. @lv
toolkit label: ir iesējējs (grupa) @lv
toolkit definition: Vienība, kas ietver grupas atbildību par iesiešanu. @lv
label: 是……的装订者集体行为者 @zh-hans
definition: 将一个集体行为者与涉及一个装订集体行为者的责任的一个单件关联起来。 @zh-hans
toolkit label: ……的装订者集体行为者 @zh-hans
toolkit definition: 涉及一个装订集体行为者的责任的一个单件 @zh-hans
label: ciltleyici kolektif temsilcisidir @tr
definition: Kolektif bir temsilciyi, ciltemeyle görevli bir kolektif temsilcinin sorumluluğunu içeren bir kopya ile ilişkilendirir. @tr
toolkit label: ciltleyici kolektif temsilcisi @tr
toolkit definition: Ciltleme için kolektif bir temsilcinin sorumluluğunu içeren bir kopya. @tr
has subproperty: sitoja (yhteisö) kappaleessa
has subproperty: sitoja (suku) kappaleessa
has subproperty: P50779

sitoja (yhteisö) kappaleessa
status: Published
label: is binder corporate body of @en
lexical alias: binderCorporateBodyOf.en
definition: Relates a corporate body to an item that involves a responsibility of a corporate body for binding. @en
toolkit label: binder corporate body of @en
toolkit definition: An item that involves a responsibility of a corporate body for binding. @en
type: Property
domain: C10005
has element type: 2
sub property of: yhteisöön liittyvä kappale
sub property of: sitoja (yhteistoimija) kappaleessa
definition: Liittää yhteisön kappaleeseen, jonka sitomisesta yhteisö on vastuussa.
toolkit label: sitoja (yhteisö) kappaleessa
toolkit definition: Kappale, jonka sitomisesta yhteisö on vastuussa.
label: er bokbinder for (korporasjon) @no
definition: Relaterer en korporasjon til et eksemplar som involverer et ansvar for en korporasjon i form av innbinding. @no
toolkit label: bokbinder for (korporasjon) @no
toolkit definition: Et eksemplar som involverer et ansvar for en korporasjon i form av innbinding. @no
label: is binder-corporatie van @nl
definition: Relateert een corporatie aan een item dat met zich meebrengt een verantwoordelijkheid van een corporatie voor het binden. @nl
toolkit label: binder-corporatie van @nl
toolkit definition: Een item dat met zich meebrengt een verantwoordelijkheid van een corporatie voor het binden. @nl
label: هي هيئة مسئولة عن تجليد @ar
definition: يربط هيئة بمفردة تنطوي على مسئولية هيئة عن التجليد. @ar
toolkit label: هيئة مسئولة عن تجليد @ar
toolkit definition: مفردة تنطوي على مسئولية هيئة عن التجليد. @ar
label: és entitat corporativa enquadernadora de @ca
definition: Relaciona una entitat corporativa amb un ítem que implica una responsabilitat d’una entitat corporativa en l’enquadernació. @ca
toolkit label: entitat corporativa enquadernadora de @ca
toolkit definition: Ítem que implica una responsabilitat d’una entitat corporativa en l’enquadernació. @ca
label: er korporation, som er bogbinder af @da
definition: Relaterer en korporation til et eksemplar, som involverer en korporations ansvar for indbinding. @da
toolkit label: korporation, som er bogbinder af @da
toolkit definition: Eksemplar, som involverer en korporations ansvar for indbinding. @da
label: köitja (asutus) eksemplarile @et
definition: Seostab asutuse eksemplariga, mis sisaldab asutuse vastutust köitmise eest. @et
toolkit label: köitja (asutus) eksemplarile @et
toolkit definition: Eksemplar, mis sisaldab asutuse vastutust köitmise eest. @et
label: ist Körperschaft als Buchbinderin/Buchbinder von @de
definition: Setzt eine Körperschaft in Beziehung zu einem Exemplar, bei dem eine Körperschaft für das Binden verantwortlich ist. @de
toolkit label: Körperschaft als Buchbinderin/Buchbinder von @de
toolkit definition: Ein Exemplar, bei dem eine Körperschaft für das Binden verantwortlich ist. @de
label: könyvkötő testülete a következőnek: @hu
definition: Hozzákapcsol egy testületet egy példányhoz, amelyhez hozzátartozik egy testület felelőssége a kötésért. @hu
toolkit label: könyvkötő testülete: @hu
toolkit definition: Egy példány, amelyhez hozzátartozik egy testület felelőssége a kötésért. @hu
label: è rilegatore ente di @it
definition: Correla un ente a un item che implica una responsabilità di un ente per la rilegatura. @it
toolkit label: rilegatore ente di @it
toolkit definition: Item che implica una responsabilità di un ente per la rilegatura. @it
label: είναι βιβλιοδέτης συλλογικό όργανο του @el
toolkit label: βιβλιοδέτης συλλογικό όργανο του @el
label: est une collectivité relieuse de @fr
definition: Met une collectivité en relation avec un item qui comporte une responsabilité de la part d’une collectivité en ce qui concerne la reliure. @fr
toolkit label: collectivité relieuse de @fr
toolkit definition: Item qui comporte une responsabilité de la part d’une collectivité en ce qui concerne la reliure. @fr
label: ir iesējējs (institūcija) @lv
definition: Sasaista institūciju ar vienību, kas ietver institūcijas atbildību par iesiešanu. @lv
toolkit label: ir iesējējs (institūcija) @lv
toolkit definition: Vienība, kas ietver institūcijas atbildību par iesiešanu. @lv
label: 是……的装订者团体 @zh-hans
definition: 将一个单件与涉及一个装订团体的责任的一个单件关联起来。 @zh-hans
toolkit label: ……的装订者团体 @zh-hans
toolkit definition: 涉及一个装订团体的责任的一个单件 @zh-hans
label: ciltleyici tüzel kişisidir @tr
definition: Bir tüzel kişiyi, bir tüzel kişiliğin ciltleme sorumluluğunu içeren bir kopyayla ilişkilendirir. @tr
toolkit label: ciltleyici tüzel kişi @tr
toolkit definition: Ciltleme için tüzel bir kişinin sorumluluğunu içeren bir kopya. @tr
has subproperty: P50930

sitoja (suku) kappaleessa
status: Published
label: is binder family of @en
lexical alias: binderFamilyOf.en
definition: Relates a family to an item that involves a responsibility of a family for binding. @en
toolkit label: binder family of @en
toolkit definition: An item that involves a responsibility of a family for binding. @en
type: Property
domain: C10008
has element type: 2
sub property of: sukuun liittyvä kappale
sub property of: sitoja (yhteistoimija) kappaleessa
definition: Liittää suvun kappaleeseen, jonka sitomisesta suku on vastuussa.
toolkit label: sitoja (suku) kappaleessa
toolkit definition: Kappale, jonka sitomisesta suku on vastuussa.
label: er bokbinder for (familie) @no
definition: Relaterer en familie til et eksemplar som involverer et ansvar for en familie i form av innbinding. @no
toolkit label: bokbinder for (familie) @no
toolkit definition: Et eksemplar som involverer et ansvar for en familie i form av innbinding. @no
label: is binder-familie van @nl
definition: Relateert een familie aan een item dat met zich meebrengt een verantwoordelijkheid van een familie voor het binden. @nl
toolkit label: binder-familie van @nl
toolkit definition: Een item dat met zich meebrengt een verantwoordelijkheid van een familie voor het binden. @nl
label: هي عائلة مسئولة عن التجليد @ar
definition: يربط عائلة بمفردة تنطوي على مسئولية عائلة عن التجليد. @ar
toolkit label: عائلة مسئولة عن التجليد @ar
toolkit definition: مفردة تنطوي على مسئولية عائلة عن التجليد. @ar
label: és família enquadernadora de @ca
definition: Relaciona una família amb un ítem que implica una responsabilitat d’una família en l’enquadernació. @ca
toolkit label: família enquadernadora de @ca
toolkit definition: Ítem que implica una responsabilitat d’una família en l’enquadernació. @ca
label: er familie, som er bogbinder af @da
definition: Relaterer en familie til et eksemplar, som involverer en families ansvar for indbinding. @da
toolkit label: familie, som er bogbinder af @da
toolkit definition: Eksemplar, som involverer en families ansvar for indbinding. @da
label: köitja (perekond) eksemplarile @et
definition: Seostab perekonna eksemplariga, mis sisaldab perekonna vastutust köitmise eest. @et
toolkit label: köitja (perekond) eksemplarile @et
toolkit definition: Eksemplar, mis sisaldab perekonna vastutust köitmise eest. @et
label: ist Familie als Buchbinderin/Buchbinder von @de
definition: Setzt eine Familie in Beziehung zu einem Exemplar, bei dem eine Familie für das Binden verantwortlich ist. @de
toolkit label: Familie als Buchbinderin/Buchbinder von @de
toolkit definition: Ein Exemplar, bei dem eine Familie für das Binden verantwortlich ist. @de
label: könyvkötő családja a következőnek: @hu
definition: Hozzákapcsol egy családot egy példányhoz, amelyhez hozzátartozik egy család felelőssége a kötésért. @hu
toolkit label: könyvkötő családja: @hu
toolkit definition: Egy példány, amelyhez hozzátartozik egy család felelőssége a kötésért. @hu
label: è rilegatore famiglia di @it
definition: Correla una famiglia a un item che implica una responsabilità di una famiglia per la rilegatura. @it
toolkit label: rilegatore famiglia di @it
toolkit definition: Item che implica una responsabilità di una famiglia per la rilegatura. @it
label: είναι βιβλιοδέτης οικογένεια του @el
definition: Συνδέει μια οικογένεια με ένα αντίτυπο που περιλαμβάνει την ευθύνη μιας οικογένειας για τη βιβλιοδεσία. @el
toolkit label: βιβλιοδέτης οικογένεια του @el
label: est une famille relieuse de @fr
definition: Met une famille en relation avec un item qui comporte une responsabilité de la part d’une famille en ce qui concerne la reliure. @fr
toolkit label: famille relieuse de @fr
toolkit definition: Item qui comporte une responsabilité de la part d’une famille en ce qui concerne la reliure. @fr
label: ir iesējējs (dzimta/ģimene) @lv
definition: Sasaista dzimtu/ģimeni ar vienību, kas ietver dzimtas/ģimenes atbildību par iesiešanu. @lv
toolkit label: ir iesējējs (dzimta/ģimene) @lv
toolkit definition: Vienība, kas ietver dzimtas/ģimenes atbildību par iesiešanu. @lv
label: 是……的装订者家族 @zh-hans
definition: 将一个家族与涉及一个装订家族的责任的一个单件关联起来。 @zh-hans
toolkit label: ……的装订者家族 @zh-hans
toolkit definition: 涉及一个装订家族的责任的一个单件 @zh-hans
label: ciltleyici ailesidir @tr
definition: Bir aileyi, bir ailenin bağlanma sorumluluğunu içeren bir kopyayla ilişkilendirir. @tr
toolkit label: ciltleyici aile @tr
toolkit definition: Ciltleme için bir ailenin sorumluluğunu içeren bir kopya. @tr
has subproperty: P51081

sitoja (henkilö) kappaleessa
status: Published
label: is binder person of @en
lexical alias: binderPersonOf.en
definition: Relates a person to an item that involves a responsibility of a person for binding. @en
toolkit label: binder person of @en
toolkit definition: An item that involves a responsibility of a person for binding. @en
type: Property
domain: C10004
has element type: 2
sub property of: henkilöön liittyvä kappale
sub property of: sitoja (toimija) kappaleessa
definition: Liittää henkilön kappaleeseen, jonka sitomisesta henkilö on vastuussa.
toolkit label: sitoja (henkilö) kappaleessa
toolkit definition: Kappale, jonka sitomisesta henkilö on vastuussa.
label: er bokbinder for (person) @no
definition: Relaterer en person til et eksemplar som involverer et ansvar for en person i form av innbinding. @no
toolkit label: bokbinder for (person) @no
toolkit definition: Et eksemplar som involverer et ansvar for en person i form av innbinding. @no
label: is binder-persoon van @nl
definition: Relateert een persoon aan een item dat met zich meebrengt een verantwoordelijkheid van een persoon voor het binden. @nl
toolkit label: binder-persoon van @nl
toolkit definition: Een item dat met zich meebrengt een verantwoordelijkheid van een persoon voor het binden. @nl
label: هو شخص مسئول عن تجليد @ar
definition: يربط شخصا بمفردة تنطوي على مسئولية شخص عن التجليد. @ar
toolkit label: شخص مسئول عن تجليد @ar
toolkit definition: مفردة تنطوي على مسئولية شخص عن التجليد. @ar
label: és persona enquadernadora de @ca
definition: Relaciona una persona amb un ítem que implica una responsabilitat d’una persona en l’enquadernació. @ca
toolkit label: persona enquadernadora de @ca
toolkit definition: Ítem que implica una responsabilitat d’una persona en l’enquadernació. @ca
label: er person, som er bogbinder af @da
definition: Relaterer en person til et eksemplar, som involverer en persons ansvar for indbinding. @da
toolkit label: person, som er bogbinder af @da
toolkit definition: Eksemplar, som involverer en persons ansvar for indbinding. @da
label: köitja (isik) eksemplarile @et
definition: Seostab isiku eksemplariga, mis sisaldab isiku vastutust köitmise eest. @et
toolkit label: köitja (isik) eksemplarile @et
toolkit definition: Eksemplar, mis sisaldab isiku vastutust köitmise eest. @et
label: ist Person als Buchbinderin/Buchbinder von @de
definition: Setzt eine Person in Beziehung zu einem Exemplar, bei dem eine Person für das Binden verantwortlich ist. @de
toolkit label: Person als Buchbinderin/Buchbinder von @de
toolkit definition: Ein Exemplar, bei dem eine Person für das Binden verantwortlich ist. @de
label: könyvkötő személye a következőnek: @hu
definition: Hozzákapcsol egy személyt egy példányhoz, amelyhez hozzátartozik egy személy felelőssége a kötésért. @hu
toolkit label: könyvkötő személye: @hu
toolkit definition: Egy példány, amelyhez hozzátartozik egy személy felelőssége a kötésért. @hu
label: è rilegatore persona di @it
definition: Correla una persona a un item che implica una responsabilità di una persona nella rilegatura. @it
toolkit label: rilegatore persona di @it
toolkit definition: Item che implica una responsabilità di una persona nella rilegatura. @it
label: είναι βιβλιοδέτης φυσικό πρόσωπο του @el
toolkit label: βιβλιοδέτης φυσικό πρόσωπο του @el
label: est une personne relieuse de @fr
definition: Met une personne en relation avec un item qui comporte une responsabilité de la part d’une personne en ce qui concerne la reliure. @fr
toolkit label: personne relieuse de @fr
toolkit definition: Item qui comporte une responsabilité de la part d’une personne en ce qui concerne la reliure. @fr
label: ir iesējējs (persona) @lv
definition: Sasaista personu ar vienību, kas ietver personas atbildību par iesiešanu. @lv
toolkit label: ir iesējējs (persona) @lv
toolkit definition: Vienība, kas ietver personas atbildību par iesiešanu. @lv
label: 是……的装订者个人 @zh-hans
definition: 将一个个人与涉及一个装订个人的责任的一个单件关联起来。 @zh-hans
toolkit label: ……的装订者个人 @zh-hans
toolkit definition: 涉及一个装订个人的责任的一个单件 @zh-hans
label: ciltleyici kişisidir @tr
definition: Bir kişiyi, kişinin bağlayıcılık sorumluluğunu barındıran kopyayla ilişkilendirir. @tr
toolkit label: ciltleyici @tr
toolkit definition: Ciltleme için bir kişinin sorumluluğunu içeren bir kopya. @tr
has subproperty: P50628

tuomari teoksessa
status: Published
label: is judge of @en
definition: Relates a person to a work that involves a responsibility for hearing and decision on legal matters in court. @en
type: Property
domain: C10004
sub property of: teoksen tekijä (henkilö) teoksessa
lexical alias: judgeOf.en
label: est un juge de @fr
definition: Met une personne en relation avec une œuvre qui comporte une responsabilité consistant à entendre des causes juridiques et à rendre jugement dans un tribunal. @fr
toolkit label: juge de @fr
toolkit definition: Œuvre qui comporte une responsabilité consistant à entendre des causes juridiques et à rendre jugement dans un tribunal. @fr
toolkit label: judge of @en
toolkit definition: A work that involves a responsibility for hearing and decision on legal matters in court. @en
instruction number: 18.5
label: είναι κριτής του @el
definition: Συνδέει ένα φυσικό πρόσωπο, το οποίο ακούει και αποφασίζει αναφορικά με ζητήματα νομικής φύσης στο δικαστήριο, με ένα έργο. @el
toolkit label: κριτής του @el
toolkit definition: Ένα έργο που περιλαμβάνει την ευθύνη της ακρόασης και της λήψης απόφασης αναφορικά με ζητήματα νομικής φύσης στο δικαστήριο. @el
definition: Setzte eine Person in Beziehung zu einem Werk, bei dem eine Person dafür verantwortlich ist, sich bei Gericht juristische Angelegenheiten anzuhören und darüber zu entscheiden. @de
toolkit label: Richterin/Richter von @de
toolkit definition: Ein Werk, bei dem eine Person dafür verantwortlich ist, sich bei Gericht juristische Angelegenheiten anzuhören und darüber zu entscheiden. @de
label: er dommer af @da
definition: Relaterer en person til et værk, som involverer et ansvar for at høre og afgøre juridiske anliggender i retten. @da
toolkit label: dommer af @da
toolkit definition: Værk, som involverer et ansvar for at høre og afgøre juridiske anliggender i retten. @da
label: és jutge de @ca
definition: Relaciona una persona amb una obra que implica una responsabilitat d’escolta i decisió en les causes jurídiques en un tribunal. @ca
toolkit label: jutge de @ca
toolkit definition: Obra que implica una responsabilitat d’escolta i decisió en les causes jurídiques en un tribunal. @ca
definition: Liittää henkilön teokseen, jossa henkilö on vastuussa oikeusasioiden kuulemisesta ja päättämisestä tuomioistuimessa.
toolkit label: tuomari teoksessa
toolkit definition: Teos, jossa henkilö on vastuussa oikeusasioiden kuulemisesta ja päättämisestä tuomioistuimessa.
toolkit label: dommer over @no
toolkit definition: Et verk som involverer ansvar i form av å høre og ta avgjørelser i saker i en rettsinstans. @no
label: ist Richterin/Richter von @de
has element type: 2
label: bírája a következőnek: @hu
definition: Hozzákapcsol egy személyt egy műhöz, amelyhez hozzátartozik a felelősség bírósági jogi ügyek tárgyalásával és döntésével kapcsolatban. @hu
toolkit label: bírája: @hu
toolkit definition: Egy mű, amelyhez hozzátartozik a felelősség bírósági jogi ügyek tárgyalásával és döntésével kapcsolatban. @hu
label: er dommer over @no
definition: Relaterer en person til et verk som involverer ansvar i form av å høre og ta avgjørelser i saker i en rettsinstans. @no
label: is rechter van @nl
definition: Relateert een persoon aan een werk dat met zich meebrengt een verantwoordelijkheid voor horen en besluiten over wettelijke zaken in rechtbank. @nl
toolkit label: rechter van @nl
toolkit definition: Een werk dat met zich meebrengt een verantwoordelijkheid voor horen en besluiten over wettelijke zaken in rechtbank. @nl
label: هو قاضٍ لـ @ar
definition: يربط الشخص بعمل يترتب عليه مسئولية الاستماع إلى المسائل القانونية في محكمة والبت فيها. @ar
toolkit label: قاض @ar
toolkit definition: عمل يترتب عليه مسئولية الاستماع إلى المسائل القانونية في محكمة والبت فيها. @ar
label: kohtunik teoses @et
definition: Seostab isiku teosega, mis sisaldab vastutust õigusasjade ärakuulamise ja otsustamise eest kohtus. @et
toolkit label: kohtunik teoses @et
toolkit definition: Teos, mis sisaldab vastutust õigusasjade ärakuulamise ja otsustamise eest kohtus. @et
label: è giudice di @it
definition: Correla una persona a un'opera che implica la responsabilità di dibattere e di decidere su affari legali in un tribunale. @it
toolkit label: giudice di @it
toolkit definition: Opera che implica la responsabilità di dibattere e di decidere su affari legali in un tribunale. @it
label: ir tiesnesis @lv
definition: Sasaista personu ar darbu, kas ietver personas atbildību par lietas izskatīšanu un lēmumu pieņemšanu tiesā. @lv
toolkit label: ir tiesnesis @lv
toolkit definition: Darbs, kas ietver personas atbildību par lietas izskatīšanu un lēmumu pieņemšanu tiesā. @lv
label: 是……的法官 @zh-hans
definition: 将一个个人与涉及法院中关于法律事务审理和决定责任的一种作品关联起来。 @zh-hans
toolkit label: ……的法官 @zh-hans
toolkit definition: 涉及法院中关于法律事务审理和决定责任的一种作品 @zh-hans
label: yargıcıdır @tr
definition: Bir kişiyi, mahkemede hukuki konular hakkında duruşma ve karar verme sorumluluğu içeren eserle ilişkilendirir. @tr
toolkit label: yargıç @tr
toolkit definition: Hukuki konularda, mahkemede duruşma ve karar verme sorumluluğunu içeren bir çalışma. @tr
has subproperty: P50126

kirjataiteilija (toimija) teoksessa
status: Published
type: Property
label: is book artist agent of @en
lexical alias: bookArtistAgentOf.en
definition: Relates an agent to a work that involves a responsibility of an agent for exploiting the book form or altering its physical structure. @en
domain: C10002
label: est un agent artiste du livre de @fr
definition: Met un agent en relation avec une œuvre qui comporte une responsabilité de la part d’un agent consistant à exploiter la forme livre ou à modifier sa structure physique. @fr
toolkit label: agent artiste du livre de @fr
toolkit definition: Œuvre qui comporte une responsabilité de la part d’un agent consistant à exploiter la forme livre ou à modifier sa structure physique. @fr
toolkit label: book artist agent of @en
toolkit definition: A work that involves a responsibility of an agent for exploiting the book form or altering its physical structure. @en
instruction number: 18.5
sub property of: taiteilija (toimija) teoksessa
label: είναι βιβλίο του καλλιτέχνη φορέας του @el
definition: Συνδέει έναν καλλιτέχνη, υπεύθυνο για τη δημιουργία έργων τέχνης τα οποία αξιοποιούν τη μορφή του βιβλίου ή μεταβάλλουν τη φυσική του δομή ως μέρος του περιεχομένου, με ένα έργο. @el
toolkit label: βιβλίο του καλλιτέχνη φορέας του @el
toolkit definition: Ένα έργο που περιλαμβάνει την καλλιτεχνική ευθύνη για τη δημιουργία έργων τέχνης, τα οποία αξιοποιούν τη μορφή του βιβλίου ή μεταβάλλουν τη φυσική του δομή ως μέρος του περιεχομένου. @el
definition: Setzt einen Akteur in Beziehung zu einem Werk, bei dem ein Akteur für die Verwertung der Buchform oder für die Veränderung ihrer physischen Struktur verantwortlich ist. @de
toolkit label: Akteur als Buchkünstlerin/Buchkünstler von @de
toolkit definition: Ein Werk, bei dem ein Akteur für die Verwertung der Buchform oder für die Veränderung ihrer physischen Struktur verantwortlich ist. @de
label: er agent, som er bogkunstner af @da
definition: Relaterer en agent til et værk, som involverer en agents ansvar for at udnytte bogformen eller ændre dens fysiske struktur. @da
toolkit label: agent, som er bogkunstner af @da
toolkit definition: Værk, som involverer en agents ansvar for at udnytte bogformen eller ændre dens fysiske struktur. @da
label: és agent artista de llibre d’art de @ca
definition: Relaciona un agent amb una obra que implica una responsabilitat d’un agent en l’explotació de la forma llibre o en la modificació de la seva estructura física. @ca
toolkit label: agent artista de llibre d’art de @ca
toolkit definition: Obra que implica una responsabilitat d’un agent en l’explotació de la forma llibre o en la modificació de la seva estructura física. @ca
definition: Liittää toimijan teokseen, jossa toimija on vastuussa kirjan muodon hyödyntämisestä tai sen fyysisen rakenteen muuttamisesta.
toolkit label: kirjataiteilija (toimija) teoksessa
toolkit definition: Teos, jossa toimija on vastuussa kirjan muodon hyödyntämisestä tai sen fyysisen rakenteen muuttamisesta.
toolkit label: bokkunstner for (agent) @no
toolkit definition: Et verk som som involverer ansvar for en agent i form av å utnytte bokformen eller å gjøre endringer i dens fysiske struktur. @no
label: ist Akteur als Buchkünstlerin/Buchkünstler von @de
has element type: 2
label: könyvművész ágense a következőnek: @hu
definition: Hozzákapcsol egy ágenst egy műhöz, amelyhez hozzátartozik egy ágens felelőssége a könyvforma kiaknázásáért vagy fizikai szerkezetének megváltoztatásáért. @hu
toolkit label: könyvművész ágense: @hu
toolkit definition: Egy mű, amelyhez hozzátartozik egy ágens felelőssége a könyvforma kiaknázásáért vagy fizikai szerkezetének megváltoztatásáért. @hu
alternative label: book artist of @en
alternative label: kirjataiteilijana taideteoksessa
label: er bokkunstner for (agent) @no
definition: Relaterer en agent til et verk som som involverer ansvar for en agent i form av å utnytte bokformen eller å gjøre endringer i dens fysiske struktur. @no
alternative label: bokkunstner for @no
label: is boekkunstenaar-actor van @nl
definition: Relateert een actor aan een werk dat met zich meebrengt een verantwoordelijkheid van een actor voor het benutten van de vorm van het boek of veranderen van de fysieke structuur. @nl
toolkit label: boekkunstenaar-actor van @nl
toolkit definition: Een werk dat met zich meebrengt een verantwoordelijkheid van een actor voor het benutten van de vorm van het boek of veranderen van de fysieke structuur. @nl
label: هو وكيل رسام كتب لـ @ar
definition: يربط وكيلا بعمل يترتب عليه مسئولية وكيل عن استغلال شكل الكتاب أو تغيير بنيته المادية. @ar
alternative label: رسّام كتب صورة لـ @ar
toolkit label: وكيل رسّام كتب مصورة لــ @ar
toolkit definition: عمل يترتب عليه مسئولية وكيل عن استغلال شكل الكتاب أو تغيير بنيته المادية. @ar
alternative label: artista de llibre d’art de @ca
alternative label: bogkunstner af @da
label: raamatukunstnik (tegija) teoses @et
definition: Seostab tegija teosega, mis sisaldab tegija vastutust raamatu vormi rakendamise või selle füüsilise struktuuri muutmise eest. @et
alternative label: raamatukunstnik teoses @et
toolkit label: raamatukunstnik (tegija) teoses @et
toolkit definition: Teos, mis sisaldab tegija vastutust raamatu vormi rakendamise või selle füüsilise struktuuri muutmise eest. @et
alternative label: könyvművésze: @hu
label: è book artist di @it
definition: Correla un agente a un'opera che implica la responsabilità di un agente per la valorizzazione del formato del libro o l'alterazione della sua struttura fisica. @it
alternative label: grafico di @it
toolkit label: book artist di @it
toolkit definition: Opera che implica la responsabilità di un agente per la valorizzazione del formato del libro o l'alterazione della sua struttura fisica. @it
alternative label: βιβλίο του καλλιτέχνη του @el
alternative label: artiste du livre de @fr
label: ir grāmatu mākslinieks (aģents) @lv
definition: Sasaista aģentu ar darbu, kas ietver aģenta atbildību par grāmatas formas izmantošanu vai tās fiziskās struktūras pārveidošanu. @lv
toolkit label: ir grāmatu mākslinieks (aģents) @lv
toolkit definition: Darbs, kas ietver aģenta atbildību par grāmatas formas izmantošanu vai tās fiziskās struktūras pārveidošanu. @lv
alternative label: Buchkünstlerin/Buchkünstler von @de
alternative label: ……的图书美术家 @zh-hans
toolkit label: ……的图书美术家行为者 @zh-hans
toolkit definition: 涉及开发图书外形或改变其物理结构的一个行为者的责任的一种作品 @zh-hans
toolkit label: kitap sanatçısı temsilcisi @tr
toolkit definition: Kitap biçiminden yararlanmak veya fiziksel yapısını değiştirmek için bir temsilcinin sorumluluğunu içeren bir eser. @tr
has subproperty: kirjataiteilija (yhteistoimija) teoksessa

kirjataiteilija (yhteistoimija) teoksessa
status: Published
label: is book artist collective agent of @en
lexical alias: bookArtistCollectiveAgentOf.en
definition: Relates a collective agent to a work that involves a responsibility of a collective agent for exploiting the book form or altering its physical structure. @en
toolkit label: book artist collective agent of @en
toolkit definition: A work that involves a responsibility of a collective agent for exploiting the book form or altering its physical structure. @en
type: Property
domain: C10011
has element type: 2
sub property of: taiteilija (yhteistoimija) teoksessa
sub property of: kirjataiteilija (toimija) teoksessa
definition: Liittää yhteistoimijan teokseen, jossa yhteistoimija on vastuussa kirjan muodon hyödyntämisestä tai sen fyysisen rakenteen muuttamisesta.
toolkit label: kirjataiteilija (yhteistoimija) teoksessa
toolkit definition: Teos, jossa yhteistoimija on vastuussa kirjan muodon hyödyntämisestä tai sen fyysisen rakenteen muuttamisesta.
label: er bokkunstner for (kollektiv agent) @no
definition: Relaterer en kollektiv agent til et verk som involverer et ansvar for en kollektiv agent i form av å utnytte bokformatet eller endre dets fysiske struktur. @no
toolkit label: bokkunstner for (kollektiv agent) @no
toolkit definition: Et verk som involverer et ansvar for en kollektiv agent i form av å utnytte bokformatet eller endre dets fysiske struktur. @no
label: is boekkunstenaar-collectieve actor van @nl
definition: Relateert een collectieve actor aan een werk dat met zich meebrengt een verantwoordelijkheid van een collectieve actor voor het benutten van de vorm van het boek of veranderen van de fysieke structuur. @nl
toolkit label: boekkunstenaar-collectieve actor van @nl
toolkit definition: Een werk dat met zich meebrengt een verantwoordelijkheid van een collectieve actor voor het benutten van de vorm van het boek of veranderen van de fysieke structuur. @nl
label: هو وكيل جماعي رسام كتب مصورة لـ @ar
definition: يربط وكيلا جماعيا بعمل يترتب عليه مسئولية وكيل جماعي عن استغلال شكل الكتاب أو تغيير بنيته المادية. @ar
toolkit label: وكيل جماعي رسام كتب مصورة @ar
toolkit definition: عمل يترتب عليه مسئولية وكيل جماعي عن استغلال شكل الكتاب أو تغيير بنيته المادية. @ar
label: és agent col·lectiu artista de llibre d’art de @ca
definition: Relaciona un agent col·lectiu amb una obra que implica una responsabilitat d’un agent col·lectiu en l’explotació de la forma llibre o en la modificació de la seva estructura física. @ca
toolkit label: agent col·lectiu artista de llibre d’art de @ca
toolkit definition: Obra que implica una responsabilitat d’un agent col·lectiu en l’explotació de la forma llibre o en la modificació de la seva estructura física. @ca
label: er kollektiv agent, som er bogkunstner af @da
definition: Relaterer en kollektiv agent til et værk, som involverer en kollektiv agents ansvar for at udnytte bogformen eller ændre dens fysiske struktur. @da
toolkit label: kollektiv agent, som er bogkunstner af @da
toolkit definition: Værk, som involverer en kollektiv agents ansvar for at udnytte bogformen eller ændre dens fysiske struktur. @da
label: raamatukunstnik (kollektiiv) teoses @et
definition: Seostab kollektiivi teosega, mis sisaldab kollektiivi vastutust raamatu vormi rakendamise või selle füüsilise struktuuri muutmise eest. @et
toolkit label: raamatukunstnik (kollektiiv) teoses @et
toolkit definition: Teos, mis sisaldab kollektiivi vastutust raamatu vormi rakendamise või selle füüsilise struktuuri muutmise eest. @et
label: ist gemeinschaftlicher Akteur als Buchkünstlerin/Buchkünstler von @de
definition: Setzt einen gemeinschaftlichen Akteur in Beziehung zu einem Werk, bei dem ein gemeinschaftlicher Akteur für die Verwertung der Buchform oder für die Veränderung ihrer physischen Struktur verantwortlich ist. @de
toolkit label: Gemeinschaftlicher Akteur als Buchkünstlerin/Buchkünstler von @de
toolkit definition: Ein Werk, bei dem ein gemeinschaftlicher Akteur für die Verwertung der Buchform oder für die Veränderung ihrer physischen Struktur verantwortlich ist. @de
label: könyvművész kollektív ágense a következőnek: @hu
definition: Hozzákapcsol egy kollektív ágenst egy műhöz, amelyhez hozzátartozik egy kollektív ágens felelőssége a könyvforma kiaknázásáért vagy fizikai szerkezetének megváltoztatásáért. @hu
toolkit label: könyvművész kollektív ágense: @hu
toolkit definition: Egy mű, amelyhez hozzátartozik egy kollektív ágens felelőssége a könyvforma kiaknázásáért vagy fizikai szerkezetének megváltoztatásáért. @hu
label: è book artist agente collettivo di @it
definition: Correla un agente collettivo a un'opera che implica una responsabilità di un agente collettivo per la valorizzazione del formato del libro o l'alterazione della sua struttura fisica. @it
toolkit label: book artist agente collettivo di @it
toolkit definition: Opera che implica una responsabilità di un agente collettivo per la valorizzazione del formato del libro o l'alterazione della sua struttura fisica. @it
label: είναι βιβλίο του καλλιτέχνη συλλογικός φορέας του ? @el
toolkit label: βιβλίο του καλλιτέχνη συλλογικός φορέας του ? @el
label: est un agent collectif artiste du livre de @fr
definition: Met un agent collectif en relation avec une œuvre qui comporte une responsabilité de la part d’un agent collectif consistant à exploiter la forme livre ou à modifier sa structure physique. @fr
toolkit label: agent collectif artiste du livre de @fr
toolkit definition: Œuvre qui comporte une responsabilité de la part d’un agent collectif consistant à exploiter la forme livre ou à modifier sa structure physique. @fr
label: ir grāmatu mākslinieks (grupa) @lv
definition: Sasaista grupu ar darbu, kas ietver grupas atbildību par grāmatas formas izmantošanu vai tās fiziskās struktūras pārveidošanu. @lv
toolkit label: ir grāmatu mākslinieks (grupa) @lv
toolkit definition: Darbs, kas ietver grupas atbildību par grāmatas formas izmantošanu vai tās fiziskās struktūras pārveidošanu. @lv
label: 是……的图书美术家集体行为者 @zh-hans
definition: 将一个集体行为者与涉及开发图书外形或改变其物理结构的一个集体行为者的责任的一种作品关联起来。 @zh-hans
toolkit label: ……的图书美术家集体行为者 @zh-hans
toolkit definition: 涉及开发图书外形或改变其物理结构的一个集体行为者的责任的一种作品 @zh-hans
label: kitap sanatçısı kollektif temsilcisidir @tr
definition: Kollektif bir temsilciyi, kitap formunu kullanmak veya bu formun fiziksel yapısını değiştirmek için kolektif bir temsilcinin sorumluluğunu gerektiren bir eseri ilişkilendirir. @tr
toolkit label: kitap sanatçısı kollektif temsilcisi @tr
toolkit definition: Kitap biçiminden yararlanmak veya fiziksel yapısını değiştirmek için kollektif bir temsilcinin sorumluluğunu içeren bir eser. @tr
has subproperty: kirjataiteilija (yhteisö) teoksessa
has subproperty: kirjataiteilija (suku) teoksessa
has subproperty: P50695

kirjataiteilija (yhteisö) teoksessa
status: Published
label: is book artist corporate body of @en
lexical alias: bookArtistCorporateBodyOf.en
definition: Relates a corporate body to a work that involves a responsibility of a corporate body for exploiting the book form or altering its physical structure. @en
toolkit label: book artist corporate body of @en
toolkit definition: A work that involves a responsibility of a corporate body for exploiting the book form or altering its physical structure. @en
type: Property
domain: C10005
has element type: 2
sub property of: taiteilija (yhteisö) teoksessa
sub property of: kirjataiteilija (yhteistoimija) teoksessa
definition: Liittää yhteisön teokseen, jossa yhteisö on vastuussa kirjan muodon hyödyntämisestä tai sen fyysisen rakenteen muuttamisesta.
toolkit label: kirjataiteilija (yhteisö) teoksessa
toolkit definition: Teos, jossa yhteisö on vastuussa kirjan muodon hyödyntämisestä tai sen fyysisen rakenteen muuttamisesta.
label: er bokkunstner for (korporasjon) @no
definition: Relaterer en korporasjon til et verk som involverer et ansvar for en korporasjon i form av å utnytte bokformatet eller endre dets fysiske struktur. @no
toolkit label: bokkunstner for (korporasjon) @no
toolkit definition: Et verk som involverer et ansvar for en korporasjon i form av å utnytte bokformatet eller endre dets fysiske struktur. @no
label: is boekkunstenaar-corporatie van @nl
definition: Relateert een corporatie aan een werk dat met zich meebrengt een verantwoordelijkheid van een corporatie voor het benutten van de vorm van het boek of veranderen van de fysieke structuur. @nl
toolkit label: boekkunstenaar-corporatie van @nl
toolkit definition: Een werk dat met zich meebrengt een verantwoordelijkheid van een corporatie voor het benutten van de vorm van het boek of veranderen van de fysieke structuur. @nl
label: هي هيئة رسّامة كتب مصورة لـ @ar
definition: يربط هيئة بعمل يترتب عليه مسئولية هيئة عن استغلال شكل الكتاب أو تغيير بنيته المادية. @ar
toolkit label: هيئة رسامة كتب مصورة لـ @ar
toolkit definition: عمل يترتب عليه مسئولية هيئة عن استغلال شكل الكتاب أو تغيير بنيته المادية. @ar
label: és entitat corporativa artista de llibre d’art de @ca
definition: Relaciona una entitat corporativa amb una obra que implica una responsabilitat d’una entitat corporativa en l’explotació de la forma llibre o en la modificació de la seva estructura física. @ca
toolkit label: entitat corporativa artista de llibre d’art de @ca
toolkit definition: Obra que implica una responsabilitat d’una entitat corporativa en l’explotació de la forma llibre o en la modificació de la seva estructura física. @ca
label: er korporation, som er bogkunstner af @da
definition: Relaterer en korporation til et værk, som involverer en korporations ansvar for at udnytte bogformen eller ændre dens fysiske struktur. @da
toolkit label: korporation, som er bogkunstner af @da
toolkit definition: Værk, som involverer en korporations ansvar for at udnytte bogformen eller ændre dens fysiske struktur. @da
label: raamatukunstnik (asutus) teoses @et
definition: Seostab asutuse teosega, mis sisaldab asutuse vastutust raamatu vormi rakendamise või selle füüsilise struktuuri muutmise eest. @et
toolkit label: raamatukunstnik (asutus) teoses @et
toolkit definition: Teos, mis sisaldab asutuse vastutust raamatu vormi rakendamise või selle füüsilise struktuuri muutmise eest. @et
label: ist Körperschaft als Buchkünstlerin/Buchkünstler von @de
definition: Setzt eine Körperschaft in Beziehung zu einem Werk, bei dem eine Körperschaft für die Verwertung der Buchform oder für die Veränderung ihrer physischen Struktur verantwortlich ist. @de
toolkit label: Körperschaft als Buchkünstlerin/Buchkünstler von @de
toolkit definition: Ein Werk, bei dem eine Körperschaft für die Verwertung der Buchform oder für die Veränderung ihrer physischen Struktur verantwortlich ist. @de
label: könyvművész testülete a következőnek: @hu
definition: Hozzákapcsol egy testületet egy műhöz, amelyhez hozzátartozik egy testület felelőssége a könyvforma kiaknázásáért vagy fizikai szerkezetének megváltoztatásáért. @hu
toolkit label: könyvművész testülete: @hu
toolkit definition: Egy mű, amelyhez hozzátartozik egy testület felelőssége a könyvforma kiaknázásáért vagy fizikai szerkezetének megváltoztatásáért. @hu
label: è book artist ente di @it
definition: Correla un ente a un'opera che implica una responsabilità di un ente per la valorizzazione del formato del libro o l'alterazione della sua struttura fisica. @it
toolkit label: book artist ente di @it
toolkit definition: Opera che implica una responsabilità di un ente per la valorizzazione del formato del libro o l'alterazione della sua struttura fisica. @it
label: είναι βιβλίο του καλλιτέχνη συλλογικό όργανο του ? @el
toolkit label: βιβλίο του καλλιτέχνη συλλογικό όργανο του ? @el
label: est une collectivité artiste du livre de @fr
definition: Met une collectivité en relation avec une œuvre qui comporte une responsabilité de la part d’une collectivité consistant à exploiter la forme livre ou à modifier sa structure physique. @fr
toolkit label: collectivité artiste du livre de @fr
toolkit definition: Œuvre qui comporte une responsabilité de la part d’une collectivité consistant à exploiter la forme livre ou à modifier sa structure physique. @fr
label: ir grāmatu mākslinieks (institūcija) @lv
definition: Sasaista institūciju ar darbu, kas ietver institūcijas atbildību par grāmatas formas izmantošanu vai tās fiziskās struktūras pārveidošanu. @lv
toolkit label: ir grāmatu mākslinieks (institūcija) @lv
toolkit definition: Darbs, kas ietver institūcijas atbildību par grāmatas formas izmantošanu vai tās fiziskās struktūras pārveidošanu. @lv
label: 是……的图书美术家团体 @zh-hans
definition: 将一个团体与涉及开发图书外形或改变其物理结构的一个团体的责任的一种作品关联起来。 @zh-hans
toolkit label: ……的图书美术家团体 @zh-hans
toolkit definition: 涉及开发图书外形或改变其物理结构的一个团体的责任的一种作品 @zh-hans
label: kitap sanatçısı tüzel kişisidir @tr
definition: Bir tüzel kişiyi, kitap biçiminden yararlanma veya fiziksel yapısını değiştirme sorumluluğunu içeren bir eserle ilişkilendirir. @tr
toolkit label: kitap sanatçısı tüzel kişisi @tr
toolkit definition: Kitap biçiminden yararlanmak veya fiziksel yapısını değiştirmek için bir tüzel kişinin sorumluluğunu içeren bir eser. @tr
has subproperty: P50846

kirjataiteilija (suku) teoksessa
status: Published
label: is book artist family of @en
lexical alias: bookArtistFamilyOf.en
definition: Relates a family to a work that involves a responsibility of a family for exploiting the book form or altering its physical structure. @en
toolkit label: book artist family of @en
toolkit definition: A work that involves a responsibility of a family for exploiting the book form or altering its physical structure. @en
type: Property
domain: C10008
has element type: 2
sub property of: taiteilija (suku) teoksessa
sub property of: kirjataiteilija (yhteistoimija) teoksessa
definition: Liittää suvun teokseen, jossa suku on vastuussa kirjan muodon hyödyntämisestä tai sen fyysisen rakenteen muuttamisesta.
toolkit label: kirjataiteilija (suku) teoksessa
toolkit definition: Teos, jossa suku on vastuussa kirjan muodon hyödyntämisestä tai sen fyysisen rakenteen muuttamisesta.
label: er bokkunstner for (familie) @no
definition: Relaterer en familie til et verk som involverer et ansvar for en familie i form av å utnytte bokformatet eller endre dets fysiske struktur. @no
toolkit label: bokkunstner for (familie) @no
toolkit definition: Et verk som involverer et ansvar for en familie i form av å utnytte bokformatet eller endre dets fysiske struktur. @no
label: is boekkunstenaar-familie van @nl
definition: Relateert een familie aan een werk dat met zich meebrengt een verantwoordelijkheid van een familie voor het benutten van de vorm van het boek of veranderen van de fysieke structuur. @nl
toolkit label: boekkunstenaar-familie van @nl
toolkit definition: Een werk dat met zich meebrengt een verantwoordelijkheid van een familie voor het benutten van de vorm van het boek of veranderen van de fysieke structuur. @nl
label: هي عائلة رسّامة كتب مصورة لـ @ar
definition: يربط عائلة بعمل يترتب عليه مسئولية عائلة عن استغلال شكل الكتاب أو تغيير بنيته المادية. @ar
toolkit label: عائلة رسّامة كتب مصورة لـ @ar
toolkit definition: عمل يترتب عليه مسئولية عائلة عن استغلال شكل الكتاب أو تغيير بنيته المادية. @ar
label: és família artista de llibre d’art de @ca
definition: Relaciona una família amb una obra que implica una responsabilitat d’una família en l’explotació de la forma llibre o en la modificació de la seva estructura física. @ca
toolkit label: família artista de llibre d’art de @ca
toolkit definition: Obra que implica una responsabilitat d’una família en l’explotació de la forma llibre o en la modificació de la seva estructura física. @ca
label: er familie, som er bogkunstner af @da
definition: Relaterer en familie til et værk, som involverer en families ansvar for at udnytte bogformen eller ændre dens fysiske struktur. @da
toolkit label: familie, som er bogkunstner af @da
toolkit definition: Værk, som involverer en families ansvar for at udnytte bogformen eller ændre dens fysiske struktur. @da
label: raamatukunstnik (perekond) teoses @et
definition: Seostab perekonna teosega, mis sisaldab perekonna vastutust raamatu vormi rakendamise või selle füüsilise struktuuri muutmise eest. @et
toolkit label: raamatukunstnik (perekond) teoses @et
toolkit definition: Teos, mis sisaldab perekonna vastutust raamatu vormi rakendamise või selle füüsilise struktuuri muutmise eest. @et
label: ist Familie als Buchkünstlerin/Buchkünstler von @de
definition: Setzt eine Familie in Beziehung zu einem Werk, bei dem eine Familie für die Verwertung der Buchform oder für die Veränderung ihrer physischen Struktur verantwortlich ist. @de
toolkit label: Familie als Buchkünstlerin/Buchkünstler von @de
toolkit definition: Ein Werk, bei dem eine Familie für die Verwertung der Buchform oder für die Veränderung ihrer physischen Struktur verantwortlich ist. @de
label: könyvművész családja a következőnek: @hu
definition: Hozzákapcsol egy családot egy műhöz, amelyhez hozzátartozik egy család felelőssége a könyvforma kiaknázásáért vagy fizikai szerkezetének megváltoztatásáért. @hu
toolkit label: könyvművész családja: @hu
toolkit definition: Egy mű, amelyhez hozzátartozik egy család felelőssége a könyvforma kiaknázásáért vagy fizikai szerkezetének megváltoztatásáért. @hu
label: è book artist famiglia di @it
definition: Correla una famiglia a un'opera che implica una responsabilità di una famiglia per la valorizzazione del formato del libro o l'alterazione della sua struttura fisica. @it
toolkit label: book artist famiglia di @it
toolkit definition: Opera che implica una responsabilità di una famiglia per la valorizzazione del formato del libro o l'alterazione della sua struttura fisica. @it
label: είναι βιβλίο του καλλιτέχνη οικογένεια του ? @el
toolkit label: βιβλίο του καλλιτέχνη οικογένεια του ? @el
label: est une famille artiste du livre de @fr
definition: Met une famille en relation avec une œuvre qui comporte une responsabilité de la part d’une famille consistant à exploiter la forme livre ou à modifier sa structure physique. @fr
toolkit label: famille artiste du livre de @fr
toolkit definition: Œuvre qui comporte une responsabilité de la part d’une famille consistant à exploiter la forme livre ou à modifier sa structure physique. @fr
label: ir grāmatu mākslinieks (dzimta/ģimene) @lv
definition: Sasaista dzimtu/ģimeni ar darbu, kas ietver dzimtas/ģimenes atbildību par grāmatas formas izmantošanu vai tās fiziskās struktūras pārveidošanu. @lv
toolkit label: ir grāmatu mākslinieks (dzimta/ģimene) @lv
toolkit definition: Darbs, kas ietver dzimtas/ģimenes atbildību par grāmatas formas izmantošanu vai tās fiziskās struktūras pārveidošanu. @lv
label: 是……的图书美术家家族 @zh-hans
definition: 将一个家族与涉及开发图书外形或改变其物理结构的一个家族的责任的一种作品关联起来。 @zh-hans
toolkit label: ……的图书美术家家族 @zh-hans
toolkit definition: 涉及开发图书外形或改变其物理结构的一个家族的责任的一种作品 @zh-hans
label: kitap sanatçısı ailesidir @tr
definition: Bir aileyi, bir ailenin kitap biçiminden yararlanma veya fiziksel yapısını değiştirme sorumluluğunu içeren bir eserle ilişkilendirir. @tr
toolkit label: kitap sanatçısı ailesi @tr
toolkit definition: Kitap biçiminden yararlanmak veya fiziksel yapısını değiştirmek için bir ailenin sorumluluğunu içeren bir eser. @tr
has subproperty: P50997

kirjataiteilija (henkilö) teoksessa
status: Published
label: is book artist person of @en
lexical alias: bookArtistPersonOf.en
definition: Relates a person to a work that involves a responsibility of a person for exploiting the book form or altering its physical structure. @en
toolkit label: book artist person of @en
toolkit definition: A work that involves a responsibility of a person for exploiting the book form or altering its physical structure. @en
type: Property
domain: C10004
has element type: 2
sub property of: taiteilija (henkilö) teoksessa
sub property of: kirjataiteilija (toimija) teoksessa
definition: Liittää henkilön teokseen, jossa henkilö on vastuussa kirjan muodon hyödyntämisestä tai sen fyysisen rakenteen muuttamisesta.
toolkit label: kirjataiteilija (henkilö) teoksessa
toolkit definition: Teos, jossa henkilö on vastuussa kirjan muodon hyödyntämisestä tai sen fyysisen rakenteen muuttamisesta.
label: er bokkunstner for (person) @no
definition: Relaterer en person til et verk som involverer et ansvar for en person i form av å utnytte bokformatet eller endre dets fysiske struktur. @no
toolkit label: bokkunstner for (person) @no
toolkit definition: Et verk som involverer et ansvar for en person i form av å utnytte bokformatet eller endre dets fysiske struktur. @no
label: is boekkunstenaar-persoon van @nl
definition: Relateert een persoon aan een werk dat met zich meebrengt een verantwoordelijkheid van een persoon voor het benutten van de vorm van het boek of veranderen van de fysieke structuur. @nl
toolkit label: boekkunstenaar-persoon van @nl
toolkit definition: Een werk dat met zich meebrengt een verantwoordelijkheid van een persoon voor het benutten van de vorm van het boek of veranderen van de fysieke structuur. @nl
label: هو شخص رسام كتب مصورة لـ @ar
definition: يربط شخصا بعمل يترتب عليه مسئولية شخص عن استغلال شكل الكتاب أو تغيير بنيته المادية. @ar
toolkit label: شخص رسام كتب مصورة @ar
toolkit definition: عمل يترتب عليه مسئولية شخص عن استغلال شكل الكتاب أو تغيير بنيته المادية. @ar
label: és persona artista de llibre d’art de @ca
definition: Relaciona una persona amb una obra que implica una responsabilitat d’una persona en l’explotació de la forma llibre o en la modificació de la seva estructura física. @ca
toolkit label: persona artista de llibre d’art de @ca
toolkit definition: Obra que implica una responsabilitat d’una persona en l’explotació de la forma llibre o en la modificació de la seva estructura física. @ca
label: er person, som er bogkunstner af @da
definition: Relaterer en person til et værk, som involverer en persons ansvar for at udnytte bogformen eller ændre dens fysiske struktur. @da
toolkit label: person, som er bogkunstner af @da
toolkit definition: Værk, som involverer en persons ansvar for at udnytte bogformen eller ændre dens fysiske struktur. @da
label: raamatukunstnik (isik) teoses @et
definition: Seostab isiku teosega, mis sisaldab isiku vastutust raamatu vormi rakendamise või selle füüsilise struktuuri muutmise eest. @et
toolkit label: raamatukunstnik (isik) teoses @et
toolkit definition: Teos, mis sisaldab isiku vastutust raamatu vormi rakendamise või selle füüsilise struktuuri muutmise eest. @et
label: ist Person als Buchkünstlerin/Buchkünstler von @de
definition: Setzt eine Person in Beziehung zu einem Werk, bei dem eine Person für die Verwertung der Buchform oder für die Veränderung ihrer physischen Struktur verantwortlich ist. @de
toolkit label: Person als Buchkünstlerin/Buchkünstler von @de
toolkit definition: Ein Werk, bei dem eine Person für die Verwertung der Buchform oder für die Veränderung ihrer physischen Struktur verantwortlich ist. @de
label: könyvművész személye a következőnek: @hu
definition: Hozzákapcsol egy személyt egy műhöz, amelyhez hozzátartozik egy személy felelőssége a könyvforma kiaknázásáért vagy fizikai szerkezetének megváltoztatásáért. @hu
toolkit label: könyvművész személye: @hu
toolkit definition: Egy mű, amelyhez hozzátartozik egy személy felelőssége a könyvforma kiaknázásáért vagy fizikai szerkezetének megváltoztatásáért. @hu
label: è book artist persona di @it
definition: Correla una persona a un'opera che implica una responsabilità di una persona per la valorizzazione del formato del libro o l'alterazione della sua struttura fisica. @it
toolkit label: book artist persona di @it
toolkit definition: Opera che implica una responsabilità di una persona per la valorizzazione del formato del libro o l'alterazione della sua struttura fisica. @it
label: είναι βιβλίο του καλλιτέχνη φυσικό πρόσωπο του ? @el
toolkit label: βιβλίο του καλλιτέχνη φυσικό πρόσωπο του ? @el
label: est une personne artiste du livre de @fr
definition: Met une personne en relation avec une œuvre qui comporte une responsabilité de la part d’une personne consistant à exploiter la forme livre ou à modifier sa structure physique. @fr
toolkit label: personne artiste du livre de @fr
toolkit definition: Œuvre qui comporte une responsabilité de la part d’une personne consistant à exploiter la forme livre ou à modifier sa structure physique. @fr
label: ir grāmatu mākslinieks (persona) @lv
definition: Sasaista personu ar darbu, kas ietver personas atbildību par grāmatas formas izmantošanu vai tās fiziskās struktūras pārveidošanu. @lv
toolkit label: ir grāmatu mākslinieks (persona) @lv
toolkit definition: Darbs, kas ietver personas atbildību par grāmatas formas izmantošanu vai tās fiziskās struktūras pārveidošanu. @lv
label: 是……的图书美术家个人 @zh-hans
definition: 将一个个人与涉及开发图书外形或改变其物理结构的一个个人的责任的一种作品关联起来。 @zh-hans
toolkit label: ……的图书美术家个人 @zh-hans
toolkit definition: 涉及开发图书外形或改变其物理结构的一个个人的责任的一种作品 @zh-hans
label: kitap sanatçısı kişisidir @tr
definition: Bir kişiyi, kitabın biçimini kullanmak veya fiziksel yapısını değiştirmek için bir kişinin sorumluluğunu içeren bir eserle ilişkilendirir. @tr
toolkit label: kitap sanatçısı @tr
toolkit definition: Kitap biçiminden yararlanmak veya fiziksel yapısını değiştirmek için bir kişinin sorumluluğunu içeren bir eser. @tr
has subproperty: P50544

graafinen suunnittelija (toimija) manifestaatiossa
status: Published
label: is book designer agent of @en
definition: Relates an agent to a manifestation that involves a responsibility of an agent for the entire graphic design of a book, including arrangement of type and illustration, choice of materials, and process used. @en
type: Property
domain: C10002
lexical alias: bookDesignerAgentOf.en
label: est un agent maquettiste de livre de @fr
definition: Met un agent en relation avec une manifestation qui comporte une responsabilité de la part d’un agent en ce qui concerne toute la conception graphique d’un livre, y compris la composition typographique, l’arrangement des illustrations, le choix des matériaux et le procédé utilisé. @fr
toolkit label: agent maquettiste de livre de @fr
toolkit definition: Manifestation qui comporte une responsabilité de la part d’un agent en ce qui concerne toute la conception graphique d’un livre, y compris la composition typographique, l’arrangement des illustrations, le choix des matériaux et le procédé utilisé. @fr
toolkit label: book designer agent of @en
toolkit definition: A manifestation that involves a responsibility of an agent for the entire graphic design of a book, including arrangement of type and illustration, choice of materials, and process used. @en
instruction number: 18.5
label: είναι σχεδιαστής βιβλίου φορέας του @el
definition: Συνδέει έναν φορέα, ο οποίος εμπλέκεται στην κατασκευή μιας εκδήλωσης ως υπεύθυνος για τον συνολικό γραφικό σχεδιασμό ενός βιβλίου, περιλαμβανομένων της διάταξης των τυπογραφικών στοιχείων και της εικονογράφησης, της επιλογής των υλικών και της χρησιμοποιούμενης επεξεργασίας, με μια εκδήλωση. @el
toolkit label: σχεδιαστής βιβλίου φορέας του @el
toolkit definition: Μια εκδήλωση που κατασκευάζεται από έναν φορέα υπεύθυνο για τον συνολικό γραφικό σχεδιασμό ενός βιβλίου, περιλαμβανομένων της διάταξης των τυπογραφικών στοιχείων και της εικονογράφησης, της επιλογής των υλικών και της χρησιμοποιούμενης επεξεργασίας. @el
definition: Setzt einen Akteur in Beziehung zu einer Manifestation, bei der ein Akteur für das gesamte grafische Design eines Buchs, einschließlich Schriftbild, Bildgestaltung, Materialwahl und angewandter Verfahren, verantwortlich ist. @de
toolkit label: Akteur als Buchgestalterin/Buchgestalter von @de
toolkit definition: Eine Manifestation, bei der ein Akteur für das gesamte grafische Design eines Buchs, einschließlich Schriftbild, Bildgestaltung, Materialwahl und angewandter Verfahren, verantwortlich ist. @de
label: er agent, som er bogdesigner af @da
definition: Relaterer en agent til en manifestation, som involverer en agents ansvar for hele det grafiske design af en bog, inkl. opsætning af tekst og illustrationer, materialevalg og anvendt proces. @da
toolkit label: agent, som er bogdesigner af @da
toolkit definition: Manifestation, som involverer en agents ansvar for hele det grafiske design af en bog, inkl. opsætning af tekst og illustrationer, materialevalg og anvendt proces. @da
label: és agent dissenyador gràfic de @ca
definition: Relaciona un agent amb una manifestació que implica una responsabilitat d’un agent en tot el disseny gràfic d’un llibre, inclosa la composició tipogràfica i la il·lustració, la tria dels materials i el procés utilitzat. @ca
toolkit label: agent dissenyador gràfic de @ca
toolkit definition: Manifestació que implica una responsabilitat d’un agent en tot el disseny gràfic d’un llibre, inclosa la composició tipogràfica i la il·lustració, la tria dels materials i el procés utilitzat. @ca
definition: Liittää toimijan manifestaatioon, jossa toimija on vastuussa koko kirjan graafisesta suunnittelusta, taitosta, materiaalien valinnasta ja käytettävistä valmistusmenetelmistä.
toolkit label: graafinen suunnittelija (toimija) manifestaatiossa
toolkit definition: Manifestaatio, jossa toimija on vastuussa koko kirjan graafisesta suunnittelusta, taitosta, materiaalien valinnasta ja käytettävistä valmistusmenetelmistä.
toolkit label: bokdesigner for (agent) @no
toolkit definition: En manifestasjon som involverer ansvar for en agent for hele den grafiske utformingen av en bok, inkludert oppsett av skrifttype og illustrasjoner, valg av materialer og hvilke prosesser som brukes. @no
label: ist Akteur als Buchgestalterin/Buchgestalter von @de
has element type: 2
label: könyvtervező ágense a következőnek: @hu
definition: Hozzákapcsol egy ágenst egy megjelenési formához, amelyhez hozzátartozik egy ágens felelőssége egy könyv teljes grafikai tervezéséért, beleértve a nyomdai betűtípus és az illusztrációk elrendezését, az anyagválasztást és az alkalmazott eljárást. @hu
toolkit label: könyvtervező ágense: @hu
toolkit definition: Egy megjelenési forma, amelyhez hozzátartozik egy ágens felelőssége egy könyv teljes grafikai tervezéséért, beleértve a nyomdai betűtípus és az illusztrációk elrendezését, az anyagválasztást és az alkalmazott eljárást. @hu
alternative label: book designer of @en
alternative label: kirjan graafinen suunnittelu
label: er bokdesigner for (agent) @no
definition: Relaterer en agent til en manifestasjon som involverer ansvar for en agent for hele den grafiske utformingen av en bok, inkludert oppsett av skrifttype og illustrasjoner, valg av materialer og hvilke prosesser som brukes. @no
alternative label: bokdesigner for @no
label: is boekontwerper-actor van @nl
definition: Relateert een actor aan een manifestatie die met zich meebrengt een verantwoordelijkheid van een actor voor het complete grafische ontwerp van een boek, inclusief indeling van font en illustratie, keuze van materialen en gebruikte methode. @nl
toolkit label: boekontwerper-actor van @nl
toolkit definition: Een manifestatie die met zich meebrengt een verantwoordelijkheid van een actor voor het complete grafische ontwerp van een boek, inclusief indeling van font en illustratie, keuze van materialen en gebruikte methode. @nl
label: هو وكيل مصمم كتب لـ @ar
definition: يربط وكيلا بتجسيدة تنطوي على مسئولية وكيل عن التصميم الجرافيكي لكتاب بالكامل، ويشمل ذلك تنسيق الحروف، والإيضاحيات، واختيار المواد، والعمليات المستخدمة. @ar
alternative label: مصمم كتب @ar
toolkit label: وكيل مصمم كتاب @ar
toolkit definition: تجسيدة تنطوي على مسئولية وكيل عن التصميم الجرافيكي لكتاب بالكامل، ويشمل ذلك تنسيق الحروف، والإيضاحيات، واختيار المواد، والعمليات المستخدمة. @ar
alternative label: dissenyador gràfic de @ca
alternative label: bogdesigner af @da
label: raamatukujundaja (tegija) kehastuses @et
definition: Seostab tegija kehastusega, mis sisaldab tegija vastutust raamatu graafilise kujunduse eest, sealhulgas trükiteksti ja illustratsioonide paigutuse, materjalide valiku ja valmistamismenetluste eest. @et
alternative label: raamatukujundaja kehastuses @et
toolkit label: raamatukujundaja (tegija) kehastuses @et
toolkit definition: Kehastus, mis sisaldab tegija vastutust raamatu graafilise kujunduse eest, sealhulgas trükiteksti ja illustratsioonide paigutuse, materjalide valiku ja valmistamismenetluste eest. @et
alternative label: könyvtervezője: @hu
label: è agente designer di libro @it
definition: Correla un agente a una manifestazione che che implica una responsabilità di un agente nell'intera progettazione grafica di un libro, inclusa la disposizione dei caratteri e dell'illustrazione, la scelta dei materiali e il processo utilizzato. @it
alternative label: designer di libro @it
toolkit label: disegnatore di libro agente di @it
toolkit definition: Manifestazione che implica una responsabilità di un agente nell'intera progettazione grafica di un libro, inclusa la disposizione dei caratteri e dell'illustrazione, la scelta dei materiali e il processo utilizzato. @it
alternative label: σχεδιαστής βιβλίου του @el
alternative label: maquettiste de livre de @fr
label: ir grāmatas dizainers (aģents) @lv
definition: Sasaista aģentu ar manifestāciju, kas ietver aģenta atbildību par grāmatas grafisko dizainu, tajā skaitā par izkātojuma veidu un ilustrācijām, materiālu izvēli un izmantoto procesu. @lv
toolkit label: ir grāmatas dizainers (aģents) @lv
toolkit definition: Manifestācija, kas ietver aģenta atbildību par grāmatas grafisko dizainu, tajā skaitā par izkātojuma veidu un ilustrācijām, materiālu izvēli un izmantoto procesu. @lv
sub property of: manifestaation tekijä (toimija) manifestaatiossa
alternative label: Buchgestalter von @de
alternative label: ……的图书设计者 @zh-hans
toolkit label: ……的图书设计者行为者 @zh-hans
toolkit definition: 涉及一种图书的整体平面设计（包括字体和插图的设计、材料的选取和工艺流程的使用等）的一个行为者的责任的一种载体表现 @zh-hans
toolkit label: kitap tasarımcısı temsilcisi @tr
toolkit definition: Tip ve resim düzenlemesi, malzeme seçimi ve kullanılan süreç dahil bir kitabın tüm grafik tasarımından sorumlu temsilcinin sorumluluğunu içeren bir gösterim. @tr
has subproperty: graafinen suunnittelija (yhteistoimija) manifestaatiossa

graafinen suunnittelija (yhteistoimija) manifestaatiossa
status: Published
label: is book designer collective agent of @en
lexical alias: bookDesignerCollectiveAgentOf.en
definition: Relates a collective agent to a manifestation that involves a responsibility of a collective agent for the entire graphic design of a book, including arrangement of type and illustration, choice of materials, and process used. @en
toolkit label: book designer collective agent of @en
toolkit definition: A manifestation that involves a responsibility of a collective agent for the entire graphic design of a book, including arrangement of type and illustration, choice of materials, and process used. @en
type: Property
domain: C10011
has element type: 2
sub property of: graafinen suunnittelija (toimija) manifestaatiossa
definition: Liittää yhteistoimijan manifestaatioon, jossa yhteistoimija on vastuussa koko kirjan graafisesta suunnittelusta, taitosta, materiaalien valinnasta ja käytettävistä valmistusmenetelmistä.
toolkit label: graafinen suunnittelija (yhteistoimija) manifestaatiossa
toolkit definition: Manifestaatio, jossa yhteistoimija on vastuussa koko kirjan graafisesta suunnittelusta, taitosta, materiaalien valinnasta ja käytettävistä valmistusmenetelmistä.
label: er bokdesigner for (kollektiv agent) @no
definition: Relaterer en kollektiv agent til en manifestasjon som involverer et ansvar for en kollektiv agent i form av ansvar for hele den grafiske utformingen av en bok, inkludert oppsett av skrifttype og illustrasjoner, valg av materialer og hvilke prosesser som brukes. @no
toolkit label: bokdesigner for (kollektiv agent) @no
toolkit definition: En manifestasjon som involverer et ansvar for en kollektiv agent i form av ansvar for hele den grafiske utformingen av en bok, inkludert oppsett av skrifttype og illustrasjoner, valg av materialer og hvilke prosesser som brukes. @no
label: is boekontwerper-collectieve actor van @nl
definition: Relateert een collectieve actor aan een manifestatie die met zich meebrengt een verantwoordelijkheid van een collectieve actor voor het complete grafische ontwerp van een boek, inclusief indeling van font en illustratie, keuze van materialen en gebruikte methode. @nl
toolkit label: boekontwerper-collectieve actor van @nl
toolkit definition: Een manifestatie die met zich meebrengt een verantwoordelijkheid van een collectieve actor voor het complete grafische ontwerp van een boek, inclusief indeling van font en illustratie, keuze van materialen en gebruikte methode. @nl
label: هو وكيل جماعي مصمم كتب لـ @ar
definition: يربط وكيلا جماعيا بتجسيدة تنطوي على مسئولية وكيل جماعي عن التصميم الجرافيكي لكتاب بالكامل، ويشمل ذلك تنسيق الحروف، والإيضاحيات، واختيار المواد، والعمليات المستخدمة. @ar
toolkit label: وكيل جماعي مصمم كتب @ar
toolkit definition: تجسيدة تنطوي على مسئولية وكيل جماعي عن التصميم الجرافيكي لكتاب بالكامل، ويشمل ذلك تنسيق الحروف، والإيضاحيات، واختيار المواد، والعمليات المستخدمة. @ar
label: és agent col·lectiu dissenyador gràfic de @ca
definition: Relaciona un agent col·lectiu amb una manifestació que implica una responsabilitat d’un agent col·lectiu en tot el disseny gràfic d’un llibre, inclosa la composició tipogràfica i la il·lustració, la tria dels materials i el procés utilitzat. @ca
toolkit label: agent col·lectiu dissenyador gràfic de @ca
toolkit definition: Manifestació que implica una responsabilitat d’un agent col·lectiu en tot el disseny gràfic d’un llibre, inclosa la composició tipogràfica i la il·lustració, la tria dels materials i el procés utilitzat. @ca
label: er kollektiv agent, som er bogdesigner af @da
definition: Relaterer en kollektiv agent til en manifestation, som involverer en kollektiv agents ansvar for hele det grafiske design af en bog, inkl. opsætning af tekst og illustrationer, materialevalg og anvendt proces. @da
toolkit label: kollektiv agent, som er bogdesigner af @da
toolkit definition: Manifestation, som involverer en kollektiv agents ansvar for hele det grafiske design af en bog, inkl. opsætning af tekst og illustrationer, materialevalg og anvendt proces. @da
label: raamatukujundaja (kollektiiv) kehastuses @et
definition: Seostab kollektiivi kehastusega, mis sisaldab kollektiivi vastutust raamatu graafilise kujunduse eest, sealhulgas trükiteksti ja illustratsioonide paigutuse, materjalide valiku ja valmistamismenetluste eest. @et
toolkit label: raamatukujundaja (kollektiiv) kehastuses @et
toolkit definition: Kehastus, mis sisaldab kollektiivi vastutust raamatu graafilise kujunduse eest, sealhulgas trükiteksti ja illustratsioonide paigutuse, materjalide valiku ja valmistamismenetluste eest. @et
label: ist gemeinschaftlicher Akteur als Buchgestalterin/Buchgestalter von @de
definition: Setzt einen gemeinschaftlichen Akteur in Beziehung zu einer Manifestation, bei der ein gemeinschaftlicher Akteur für das gesamte grafische Design eines Buchs, einschließlich Schriftbild, Bildgestaltung, Materialwahl und angewandter Verfahren, verantwortlich ist. @de
toolkit label: Gemeinschaftlicher Akteur als Buchgestalterin/Buchgestalter von @de
toolkit definition: Eine Manifestation, bei der ein gemeinschaftlicher Akteur für das gesamte grafische Design eines Buchs, einschließlich Schriftbild, Bildgestaltung, Materialwahl und angewandter Verfahren, verantwortlich ist. @de
label: könyvtervező kollektív ágense a következőnek: @hu
definition: Hozzákapcsol egy kollektív ágenst egy megjelenési formához, amelyhez hozzátartozik egy kollektív ágens felelőssége egy könyv teljes grafikai tervezéséért, beleértve a nyomdai betűtípus és az illusztrációk elrendezését, az anyagválasztást és az alkalmazott eljárást. @hu
toolkit label: könyvtervező kollektív ágense: @hu
toolkit definition: Egy megjelenési forma, amelyhez hozzátartozik egy kollektív ágens felelőssége egy könyv teljes grafikai tervezéséért, beleértve a nyomdai betűtípus és az illusztrációk elrendezését, az anyagválasztást és az alkalmazott eljárást. @hu
label: è book designer agente collettivo di @it
definition: Correla un agente collettivo a una manifestazione che implica una responsabilità di un agente collettivo nell'intera progettazione grafica di un libro, inclusa la disposizione dei caratteri e dell'illustrazione, la scelta dei materiali e il processo utilizzato. @it
toolkit label: book designer agente collettivo di @it
toolkit definition: Manifestazione che implica una responsabilità di un agente collettivo nell'intera progettazione grafica di un libro, inclusa la disposizione dei caratteri e dell'illustrazione, la scelta dei materiali e il processo utilizzato. @it
label: είναι σχεδιαστής βιβλίου συλλογικός φορέας του @el
toolkit label: σχεδιαστής βιβλίου συλλογικός φορέας του @el
label: est un agent collectif maquettiste de livre de @fr
definition: Met un agent collectif en relation avec une manifestation qui comporte une responsabilité de la part d’un agent collectif en ce qui concerne toute la conception graphique d’un livre, y compris la composition typographique, l’arrangement des illustrations, le choix des matériaux et le procédé utilisé. @fr
toolkit label: agent collectif maquettiste de livre de @fr
toolkit definition: Manifestation qui comporte une responsabilité de la part d’un agent collectif en ce qui concerne toute la conception graphique d’un livre, y compris la composition typographique, l’arrangement des illustrations, le choix des matériaux et le procédé utilisé. @fr
label: ir grāmatas dizainers (grupa) @lv
definition: Sasaista grupu ar manifestāciju, kas ietver grupas atbildību par grāmatas grafisko dizainu, tajā skaitā par izkātojuma veidu un ilustrācijām, materiālu izvēli un izmantoto procesu. @lv
toolkit label: ir grāmatas dizainers (grupa) @lv
toolkit definition: Manifestācija, kas ietver grupas atbildību par grāmatas grafisko dizainu, tajā skaitā par izkātojuma veidu un ilustrācijām, materiālu izvēli un izmantoto procesu. @lv
sub property of: manifestaation tekijä (yhteistoimija) manifestaatiossa
label: 是……的图书设计者集体行为者 @zh-hans
definition: 将一个集体行为者与涉及一种图书的整体平面设计（包括字体和插图的设计、材料的选取和工艺流程的使用等）的一个集体行为者的责任的一种载体表现关联起来。 @zh-hans
toolkit label: ……的图书设计者集体行为者 @zh-hans
toolkit definition: 涉及一种图书的整体平面设计（包括字体和插图的设计、材料的选取和工艺流程的使用等）的一个集体行为者的责任的一种载体表现 @zh-hans
label: kitap tasarımcısı kolektif temsilcisidir @tr
definition: Kolektif bir temsilciyi, yazı ve çizim düzenlemesi, malzeme seçimi ve kullanılan süreç dahil olmak üzere bir kitabın tüm grafik tasarımı için kolektif bir temsilcinin sorumluluğunu içeren bir gösterimle ilişkilendirir. @tr
toolkit label: Kitap tasarımcısı kolektif temsilcisi @tr
toolkit definition: Şekil ve çizim düzenlemesi, malzeme seçimi ve kullanılan süreç dahil olmak üzere bir kitabın tüm grafik tasarımı için kolektif bir temilcinin sorumluluğunu içeren bir gösterim. @tr
has subproperty: graafinen suunnittelija (yhteisö) manifestaatiossa
has subproperty: graafinen suunnittelija (suku) manifestaatiossa
has subproperty: P50660

graafinen suunnittelija (yhteisö) manifestaatiossa
status: Published
label: is book designer corporate body of @en
lexical alias: bookDesignerCorporateBodyOf.en
definition: Relates a corporate body to a manifestation that involves a responsibility of a corporate body for the entire graphic design of a book, including arrangement of type and illustration, choice of materials, and process used. @en
toolkit label: book designer corporate body of @en
toolkit definition: A manifestation that involves a responsibility of a corporate body for the entire graphic design of a book, including arrangement of type and illustration, choice of materials, and process used. @en
type: Property
domain: C10005
has element type: 2
sub property of: graafinen suunnittelija (yhteistoimija) manifestaatiossa
definition: Liittää yhteisön manifestaatioon, jossa yhteisö on vastuussa koko kirjan graafisesta suunnittelusta, taitosta, materiaalien valinnasta ja käytettävistä valmistusmenetelmistä.
toolkit label: graafinen suunnittelija (yhteisö) manifestaatiossa
toolkit definition: Manifestaatio, jossa yhteisö on vastuussa koko kirjan graafisesta suunnittelusta, taitosta, materiaalien valinnasta ja käytettävistä valmistusmenetelmistä.
label: er bokdesigner for (korporasjon) @no
definition: Relaterer en korporasjon til en manifestasjon som involverer et ansvar for en korporasjon i form av ansvar for hele den grafiske utformingen av en bok, inkludert oppsett av skrifttype og illustrasjoner, valg av materialer og hvilke prosesser som brukes. @no
toolkit label: bokdesigner for (korporasjon) @no
toolkit definition: En manifestasjon som involverer et ansvar for en korporasjon i form av ansvar for hele den grafiske utformingen av en bok, inkludert oppsett av skrifttype og illustrasjoner, valg av materialer og hvilke prosesser som brukes. @no
label: is boekontwerper-corporatie van @nl
definition: Relateert een corporatie aan een manifestatie die met zich meebrengt een verantwoordelijkheid van een corporatie voor het complete grafische ontwerp van een boek, inclusief indeling van font en illustratie, keuze van materialen en gebruikte methode. @nl
toolkit label: boekontwerper-corporatie van @nl
toolkit definition: Een manifestatie die met zich meebrengt een verantwoordelijkheid van een corporatie voor het complete grafische ontwerp van een boek, inclusief indeling van font en illustratie, keuze van materialen en gebruikte methode. @nl
label: هي هيئة مسئولة عن تصميم كتب لـ @ar
definition: يربط هيئة بتجسيدة تنطوي على مسئولية هيئة عن التصميم الجرافيكي لكتاب بالكامل، ويشمل ذلك تنسيق الحروف، والإيضاحيات، واختيار المواد، والعمليات المستخدمة. @ar
toolkit label: هيئة مسئولة عن تصميم كتب @ar
toolkit definition: تجسيدة تنطوي على مسئولية هيئة عن التصميم الجرافيكي لكتاب بالكامل، ويشمل ذلك تنسيق الحروف، والإيضاحيات، واختيار المواد، والعمليات المستخدمة. @ar
label: és entitat corporativa dissenyadora gràfica de @ca
definition: Relaciona una entitat corporativa amb una manifestació que implica una responsabilitat d’una entitat corporativa en tot el disseny gràfic d’un llibre, inclosa la composició tipogràfica i la il·lustració, la tria dels materials i el procés utilitzat. @ca
toolkit label: entitat corporativa dissenyadora gràfica de @ca
toolkit definition: Manifestació que implica una responsabilitat d’una entitat corporativa en tot el disseny gràfic d’un llibre, inclosa la composició tipogràfica i la il·lustració, la tria dels materials i el procés utilitzat. @ca
label: er korporation, som er bogdesigner af @da
definition: Relaterer en korporation til en manifestation, som involverer en korporations ansvar for hele det grafiske design af en bog, inkl. opsætning af tekst og illustrationer, materialevalg og anvendt proces. @da
toolkit label: korporation, som er bogdesigner af @da
toolkit definition: Manifestation, som involverer en korporations ansvar for hele det grafiske design af en bog, inkl. opsætning af tekst og illustrationer, materialevalg og anvendt proces. @da
label: raamatukujundaja (asutus) kehastuses @et
definition: Seostab asutuse kehastusega, mis sisaldab asutuse vastutust raamatu graafilise kujunduse eest, sealhulgas trükiteksti ja illustratsioonide paigutuse, materjalide valiku ja valmistamismenetluste eest. @et
toolkit label: raamatukujundaja (asutus) kehastuses @et
toolkit definition: Kehastus, mis sisaldab asutuse vastutust raamatu graafilise kujunduse eest, sealhulgas trükiteksti ja illustratsioonide paigutuse, materjalide valiku ja valmistamismenetluste eest. @et
label: ist Körperschaft als Buchgestalterin/Buchgestalter von @de
definition: Setzt eine Körperschaft in Beziehung zu einer Manifestation, bei der eine Körperschaft für das gesamte grafische Design eines Buchs, einschließlich Schriftbild, Bildgestaltung, Materialwahl und angewandter Verfahren, verantwortlich ist. @de
toolkit label: Körperschaft als Buchgestalterin/Buchgestalter von @de
toolkit definition: Eine Manifestation, bei der eine Körperschaft für das gesamte grafische Design eines Buchs, einschließlich Schriftbild, Bildgestaltung, Materialwahl und angewandter Verfahren, verantwortlich ist. @de
label: könyvtervező testülete a következőnek: @hu
definition: Hozzákapcsol egy testületet egy megjelenési formához, amelyhez hozzátartozik egy testület felelőssége egy könyv teljes grafikai tervezéséért, beleértve a nyomdai betűtípus és az illusztrációk elrendezését, az anyagválasztást és az alkalmazott eljárást. @hu
toolkit label: könyvtervező testülete: @hu
toolkit definition: Egy megjelenési forma, amelyhez hozzátartozik egy testület felelőssége egy könyv teljes grafikai tervezéséért, beleértve a nyomdai betűtípus és az illusztrációk elrendezését, az anyagválasztást és az alkalmazott eljárást. @hu
label: è book designer ente di @it
definition: Correla un ente a una manifestazione che implica una responsabilità di un ente per l'intera progettazione grafica di un libro, inclusa la disposizione dei caratteri e dell'illustrazione, la scelta dei materiali e il processo utilizzato. @it
toolkit label: book designer ente di @it
toolkit definition: Manifestazione che implica una responsabilità di un ente per l'intera progettazione grafica di un libro, inclusa la disposizione dei caratteri e dell'illustrazione, la scelta dei materiali e il processo utilizzato. @it
label: είναι σχεδιαστής βιβλίου συλλογικό όργανο του @el
toolkit label: σχεδιαστής βιβλίου συλλογικό όργανο του @el
label: est une collectivité maquettiste de livre de @fr
definition: Met une collectivité en relation avec une manifestation qui comporte une responsabilité de la part d’une collectivité en ce qui concerne toute la conception graphique d’un livre, y compris la composition typographique, l’arrangement des illustrations, le choix des matériaux et le procédé utilisé. @fr
toolkit label: collectivité maquettiste de livre de @fr
toolkit definition: Manifestation qui comporte une responsabilité de la part d’une collectivité en ce qui concerne toute la conception graphique d’un livre, y compris la composition typographique, l’arrangement des illustrations, le choix des matériaux et le procédé utilisé. @fr
label: ir grāmatas dizainers (institūcija) @lv
definition: Sasaista institūciju ar manifestāciju, kas ietver institūcijas atbildību par grāmatas grafisko dizainu, tajā skaitā par izkātojuma veidu un ilustrācijām, materiālu izvēli un izmantoto procesu. @lv
toolkit label: ir grāmatas dizainers (institūcija) @lv
toolkit definition: Manifestācija, kas ietver institūcijas atbildību par grāmatas grafisko dizainu, tajā skaitā par izkātojuma veidu un ilustrācijām, materiālu izvēli un izmantoto procesu. @lv
sub property of: manifestaation tekijä (yhteisö) manifestaatiossa
label: 是……的图书设计者团体 @zh-hans
definition: 将一个团体与涉及一种图书的整体平面设计（包括字体和插图的设计、材料的选取和工艺流程的使用等）的一个团体的责任的一种载体表现关联起来。 @zh-hans
toolkit label: ……的图书设计者团体 @zh-hans
toolkit definition: 涉及一种图书的整体平面设计（包括字体和插图的设计、材料的选取和工艺流程的使用等）的一个团体的责任的一种载体表现 @zh-hans
label: kitap tasarımcısı tüzel kişisidir @tr
definition: Bir tüzel kişiyi, yazı ve illüstrasyon düzenlemesi, malzeme seçimi ve kullanılan süreç de dahil olmak üzere bir kitabın tüm grafik tasarımı için bir tüzel kişiliğin sorumluluğunu içeren bir gösterimle ilişkilendirir. @tr
toolkit label: kitap tasarımcısı tüzel kişisi @tr
toolkit definition: Yazı ve illüstrasyon düzenlemesi, malzeme seçimi ve kullanılan süreç de dahil olmak üzere bir kitabın tüm grafik tasarımı için tüzel bir kişinin sorumluluğunu içeren bir gösterim. @tr
has subproperty: P50811

graafinen suunnittelija (suku) manifestaatiossa
status: Published
label: is book designer family of @en
lexical alias: bookDesignerFamilyOf.en
definition: Relates a family to a manifestation that involves a responsibility of a family for the entire graphic design of a book, including arrangement of type and illustration, choice of materials, and process used. @en
toolkit label: book designer family of @en
toolkit definition: A manifestation that involves a responsibility of a family for the entire graphic design of a book, including arrangement of type and illustration, choice of materials, and process used. @en
type: Property
domain: C10008
has element type: 2
sub property of: graafinen suunnittelija (yhteistoimija) manifestaatiossa
definition: Liittää suvun manifestaatioon, jossa suku on vastuussa koko kirjan graafisesta suunnittelusta, taitosta, materiaalien valinnasta ja käytettävistä valmistusmenetelmistä.
toolkit label: graafinen suunnittelija (suku) manifestaatiossa
toolkit definition: Manifestaatio, jossa suku on vastuussa koko kirjan graafisesta suunnittelusta, taitosta, materiaalien valinnasta ja käytettävistä valmistusmenetelmistä.
label: er bokdesigner for (familie) @no
definition: Relaterer en familie til en manifestasjon som involverer et ansvar for en familie i form av ansvar for hele den grafiske utformingen av en bok, inkludert oppsett av skrifttype og illustrasjoner, valg av materialer og hvilke prosesser som brukes. @no
toolkit label: bokdesigner for (familie) @no
toolkit definition: En manifestasjon som involverer et ansvar for en familie i form av ansvar for hele den grafiske utformingen av en bok, inkludert oppsett av skrifttype og illustrasjoner, valg av materialer og hvilke prosesser som brukes. @no
label: is boekontwerper-familie van @nl
definition: Relateert een familie aan een manifestatie die met zich meebrengt een verantwoordelijkheid van een familie voor het complete grafische ontwerp van een boek, inclusief indeling van font en illustratie, keuze van materialen en gebruikte methode. @nl
toolkit label: boekontwerper-familie van @nl
toolkit definition: Een manifestatie die met zich meebrengt een verantwoordelijkheid van een familie voor het complete grafische ontwerp van een boek, inclusief indeling van font en illustratie, keuze van materialen en gebruikte methode. @nl
label: هي عائلة مسئولة عن تصميم كتب @ar
definition: يربط عائلة بتجسيدة تنطوي على مسئولية عائلة عن التصميم الجرافيكي لكتاب بالكامل، ويشمل ذلك تنسيق الحروف، والإيضاحيات، واختيار المواد، والعمليات المستخدمة. @ar
toolkit label: عائلة مصممة كتب @ar
toolkit definition: تجسيدة تنطوي على مسئولية عائلة عن التصميم الجرافيكي لكتاب بالكامل، ويشمل ذلك تنسيق الحروف، والإيضاحيات، واختيار المواد، والعمليات المستخدمة. @ar
label: és família dissenyadora gràfica de @ca
definition: Relaciona una família amb una manifestació que implica una responsabilitat d’una família en tot el disseny gràfic d’un llibre, inclosa la composició tipogràfica i la il·lustració, la tria dels materials i el procés utilitzat. @ca
toolkit label: família dissenyadora gràfica de @ca
toolkit definition: Manifestació que implica una responsabilitat d’una família en tot el disseny gràfic d’un llibre, inclosa la composició tipogràfica i la il·lustració, la tria dels materials i el procés utilitzat. @ca
label: er familie, som er bogdesigner af @da
definition: Relaterer en familie til en manifestation, som involverer en families ansvar for hele det grafiske design af en bog, inkl. opsætning af tekst og illustrationer, materialevalg og anvendt proces. @da
toolkit label: familie, som er bogdesigner af @da
toolkit definition: Manifestation, som involverer en families ansvar for hele det grafiske design af en bog, inkl. opsætning af tekst og illustrationer, materialevalg og anvendt proces. @da
label: raamatukujundaja (tegija) kehastuses @et
definition: Seostab perekonna kehastusega, mis sisaldab perekonna vastutust raamatu graafilise kujunduse eest, sealhulgas trükiteksti ja illustratsioonide paigutuse, materjalide valiku ja valmistamismenetluste eest. @et
toolkit label: raamatukujundaja (tegija) kehastuses @et
toolkit definition: Kehastus, mis sisaldab perekonna vastutust raamatu graafilise kujunduse eest, sealhulgas trükiteksti ja illustratsioonide paigutuse, materjalide valiku ja valmistamismenetluste eest. @et
label: ist Familie als Buchgestalterin/Buchgestalter von @de
definition: Setzt eine Familie in Beziehung zu einer Manifestation, bei der eine Familie für das gesamte grafische Design eines Buchs, einschließlich Schriftbild, Bildgestaltung, Materialwahl und angewandter Verfahren, verantwortlich ist. @de
toolkit label: Familie als Buchgestalterin/Buchgestalter von @de
toolkit definition: Eine Manifestation, bei der eine Familie für das gesamte grafische Design eines Buchs, einschließlich Schriftbild, Bildgestaltung, Materialwahl und angewandter Verfahren, verantwortlich ist. @de
label: könyvtervező családja a következőnek: @hu
definition: Hozzákapcsol egy családot egy megjelenési formához, amelyhez hozzátartozik egy család felelőssége egy könyv teljes grafikai tervezéséért, beleértve a nyomdai betűtípus és az illusztrációk elrendezését, az anyagválasztást és az alkalmazott eljárást. @hu
toolkit label: könyvtervező családja: @hu
toolkit definition: Egy megjelenési forma, melyhez hozzátartozik egy család felelőssége egy könyv teljes grafikai tervezéséért, beleértve a nyomdai betűtípus és az illusztrációk elrendezését, az anyagválasztást és az alkalmazott eljárást. @hu
label: è book designer famiglia di @it
definition: Correla una famiglia a una manifestazione che implica una responsabilità di una famiglia per l'intera progettazione grafica di un libro, inclusa la disposizione dei caratteri e dell'illustrazione, la scelta dei materiali e il processo utilizzato. @it
toolkit label: book designer famiglia di @it
toolkit definition: Manifestazione che implica una responsabilità di una famiglia per l'intera progettazione grafica di un libro, inclusa la disposizione dei caratteri e dell'illustrazione, la scelta dei materiali e il processo utilizzato. @it
label: είναι σχεδιαστής βιβλίου οικογένεια του @el
toolkit label: σχεδιαστής βιβλίου οικογένεια του @el
label: est une famille maquettiste de livre de @fr
definition: Met une famille en relation avec une manifestation qui comporte une responsabilité de la part d’une famille en ce qui concerne toute la conception graphique d’un livre, y compris la composition typographique, l’arrangement des illustrations, le choix des matériaux et le procédé utilisé. @fr
toolkit label: famille maquettiste de livre de @fr
toolkit definition: Manifestation qui comporte une responsabilité de la part d’une famille en ce qui concerne toute la conception graphique d’un livre, y compris la composition typographique, l’arrangement des illustrations, le choix des matériaux et le procédé utilisé. @fr
label: ir grāmatas dizainers (dzimta/ģimene) @lv
definition: Sasaista dzimtu/ģimeni ar manifestāciju, kas ietver dzimtas/ģimenes atbildību par grāmatas grafisko dizainu, tajā skaitā par izkātojuma veidu un ilustrācijām, materiālu izvēli un izmantoto procesu. @lv
toolkit label: ir grāmatas dizainers (dzimta/ģimene) @lv
toolkit definition: Manifestācija, kas ietver dzimtas/ģimenes atbildību par grāmatas grafisko dizainu, tajā skaitā par izkātojuma veidu un ilustrācijām, materiālu izvēli un izmantoto procesu. @lv
sub property of: manifestaation tekijä (suku) manifestaatiossa
label: 是……的图书设计者家族 @zh-hans
definition: 将一个家族与涉及一种图书的整体平面设计（包括字体和插图的设计、材料的选取和工艺流程的使用等）的一个家族的责任的一种载体表现关联起来。 @zh-hans
toolkit label: ……的图书设计者家族 @zh-hans
toolkit definition: 涉及一种图书的整体平面设计（包括字体和插图的设计、材料的选取和工艺流程的使用等）的一个家族的责任的一种载体表现 @zh-hans
label: kitap tasarımcısı ailesidir @tr
definition: Bir aileyi, ailenin yazı ve illüstrasyon düzenlemesi, malzeme seçimi ve kullanılan süreç dahil olmak üzere bir kitabın tüm grafik tasarımı sorumluluğunu içeren gösterimle ilişkilendirir. @tr
toolkit label: kitap tasarımcısı ailesi @tr
toolkit definition: Bir ailenin yazı ve illüstrasyon düzenlemesi, malzeme seçimi ve kullanılan süreç dahil olmak üzere bir kitabın tüm grafik tasarımı için sorumluluğunu içeren bir gösterim. @tr
has subproperty: P50962

graafinen suunnittelija (henkilö) manifestaatiossa
status: Published
label: is book designer person of @en
lexical alias: bookDesignerPersonOf.en
definition: Relates a person to a manifestation that involves a responsibility of a person for the entire graphic design of a book, including arrangement of type and illustration, choice of materials, and process used. @en
toolkit label: book designer person of @en
toolkit definition: A manifestation that involves a responsibility of a person for the entire graphic design of a book, including arrangement of type and illustration, choice of materials, and process used. @en
type: Property
domain: C10004
has element type: 2
sub property of: graafinen suunnittelija (toimija) manifestaatiossa
definition: Liittää henkilön manifestaatioon, jossa henkilö on vastuussa koko kirjan graafisesta suunnittelusta, taitosta, materiaalien valinnasta ja käytettävistä valmistusmenetelmistä.
toolkit label: graafinen suunnittelija (henkilö) manifestaatiossa
toolkit definition: Manifestaatio, jossa henkilö on vastuussa koko kirjan graafisesta suunnittelusta, taitosta, materiaalien valinnasta ja käytettävistä valmistusmenetelmistä.
label: er bokdesigner for (person) @no
definition: Relaterer en person til en manifestasjon som involverer et ansvar for en person i form av ansvar for hele den grafiske utformingen av en bok, inkludert oppsett av skrifttype og illustrasjoner, valg av materialer og hvilke prosesser som brukes. @no
toolkit label: bokdesigner for (person) @no
toolkit definition: En manifestasjon som involverer et ansvar for en person i form av ansvar for hele den grafiske utformingen av en bok, inkludert oppsett av skrifttype og illustrasjoner, valg av materialer og hvilke prosesser som brukes. @no
label: is boekontwerper-persoon van @nl
definition: Relateert een persoon aan een manifestatie die met zich meebrengt een verantwoordelijkheid van een persoon voor het complete grafische ontwerp van een boek, inclusief indeling van font en illustratie, keuze van materialen en gebruikte methode. @nl
toolkit label: boekontwerper-persoon van @nl
toolkit definition: Een manifestatie die met zich meebrengt een verantwoordelijkheid van een persoon voor het complete grafische ontwerp van een boek, inclusief indeling van font en illustratie, keuze van materialen en gebruikte methode. @nl
label: هو شخص مصمم كتب لـ @ar
definition: يربط شخصا بتجسيدة تنطوي على مسئولية شخص عن التصميم الجرافيكي لكتاب بالكامل، ويشمل ذلك تنسيق الحروف، والإيضاحيات، واختيار المواد، والعمليات المستخدمة. @ar
toolkit label: شخص مصمم كتب @ar
toolkit definition: تجسيدة تنطوي على مسئولية شخص عن التصميم الجرافيكي لكتاب بالكامل، ويشمل ذلك تنسيق الحروف، والإيضاحيات، واختيار المواد، والعمليات المستخدمة. @ar
label: és persona dissenyadora gràfica de @ca
definition: Relaciona una persona amb una manifestació que implica una responsabilitat d’una persona en tot el disseny gràfic d’un llibre, inclosa la composició tipogràfica i la il·lustració, la tria dels materials i el procés utilitzat. @ca
toolkit label: persona dissenyadora gràfica de @ca
toolkit definition: Manifestació que implica una responsabilitat d’una persona en tot el disseny gràfic d’un llibre, inclosa la composició tipogràfica i la il·lustració, la tria dels materials i el procés utilitzat. @ca
label: er person, som er bogdesigner af @da
definition: Relaterer en person til en manifestation, som involverer en persons ansvar for hele det grafiske design af en bog, inkl. opsætning af tekst og illustrationer, materialevalg og anvendt proces. @da
toolkit label: person, som er bogdesigner af @da
toolkit definition: Manifestation, som involverer en persons ansvar for hele det grafiske design af en bog, inkl. opsætning af tekst og illustrationer, materialevalg og anvendt proces. @da
label: raamatukujundaja (isik) kehastuses @et
definition: Seostab isiku kehastusega, mis sisaldab isiku vastutust raamatu graafilise kujunduse eest, sealhulgas trükiteksti ja illustratsioonide paigutuse, materjalide valiku ja valmistamismenetluste eest. @et
toolkit label: raamatukujundaja (isik) kehastuses @et
toolkit definition: Kehastus, mis sisaldab isiku vastutust raamatu graafilise kujunduse eest, sealhulgas trükiteksti ja illustratsioonide paigutuse, materjalide valiku ja valmistamismenetluste eest. @et
label: ist Person als Buchgestalterin/Buchgestalter von @de
definition: Setzt eine Person in Beziehung zu einer Manifestation, bei der eine Person für das gesamte grafische Design eines Buchs, einschließlich Schriftbild, Bildgestaltung, Materialwahl und angewandter Verfahren, verantwortlich ist. @de
toolkit label: Person als Buchgestalterin/Buchgestalter von @de
toolkit definition: Eine Manifestation, bei der eine Person für das gesamte grafische Design eines Buchs, einschließlich Schriftbild, Bildgestaltung, Materialwahl und angewandter Verfahren, verantwortlich ist. @de
label: könyvtervező személye a következőnek: @hu
definition: Hozzákapcsol egy személyt egy megjelenési formához, amelyhez hozzátartozik egy személy felelőssége egy könyv teljes grafikai tervezéséért, beleértve a nyomdai betűtípus és az illusztrációk elrendezését, az anyagválasztást és az alkalmazott eljárást. @hu
toolkit label: könyvtervező személye: @hu
toolkit definition: Egy megjelenési forma, amelyhez hozzátartozik egy személy felelőssége egy könyv teljes grafikai tervezéséért, beleértve a nyomdai betűtípus és az illusztrációk elrendezését, az anyagválasztást és az alkalmazott eljárást. @hu
label: è book designer persona di @it
definition: Correla una persona con una manifestazione che implica una responsabilità di una persona nell'intera progettazione grafica di un libro, inclusa la disposizione dei caratteri e dell'illustrazione, la scelta dei materiali e il processo utilizzato. @it
toolkit label: book designer persona di @it
toolkit definition: Manifestazione che implica una responsabilità di una persona nell'intera progettazione grafica di un libro, inclusa la disposizione dei caratteri e dell'illustrazione, la scelta dei materiali e il processo utilizzato. @it
label: είναι σχεδιαστής βιβλίου φυσικό πρόσωπο του @el
toolkit label: σχεδιαστής βιβλίου φυσικό πρόσωπο του @el
label: est une personne maquettiste de livre de @fr
definition: Met une personne en relation avec une manifestation qui comporte une responsabilité de la part d’une personne en ce qui concerne toute la conception graphique d’un livre, y compris la composition typographique, l’arrangement des illustrations, le choix des matériaux et le procédé utilisé. @fr
toolkit label: personne maquettiste de livre de @fr
toolkit definition: Manifestation qui comporte une responsabilité de la part d’une personne en ce qui concerne toute la conception graphique d’un livre, y compris la composition typographique, l’arrangement des illustrations, le choix des matériaux et le procédé utilisé. @fr
label: ir grāmatas dizainers (persona) @lv
definition: Sasaista personu ar manifestāciju, kas ietver personas atbildību par grāmatas grafisko dizainu, tajā skaitā par izkātojuma veidu un ilustrācijām, materiālu izvēli un izmantoto procesu. @lv
toolkit label: ir grāmatas dizainers (persona) @lv
toolkit definition: Manifestācija, kas ietver personas atbildību par grāmatas grafisko dizainu, tajā skaitā par izkātojuma veidu un ilustrācijām, materiālu izvēli un izmantoto procesu. @lv
sub property of: manifestaation tekijä (henkilö) manifestaatiossa
label: 是……的图书设计者个人 @zh-hans
definition: 将一个个人与涉及一种图书的整体平面设计（包括字体和插图的设计、材料的选取和工艺流程的使用等）的一个个人的责任的一种载体表现关联起来。 @zh-hans
toolkit label: ……的图书设计者个人 @zh-hans
toolkit definition: 涉及一种图书的整体平面设计（包括字体和插图的设计、材料的选取和工艺流程的使用等）的一个个人的责任的一种载体表现 @zh-hans
label: kitap tasarımcısı kişisidir @tr
definition: Bir kişiyi, kişinin yazı ve illüstrasyon düzenlemesi, malzeme seçimi ve kullanılan süreç dahil olmak üzere bir kitabın tüm grafik tasarımı sorumluluğunu içeren gösterimle ilişkilendirir. @tr
toolkit label: kitap tasarımcısı @tr
toolkit definition: Bir kişinin yazı ve illüstrasyon düzenlemesi, malzeme seçimi ve kullanılan süreç dahil olmak üzere bir kitabın tüm grafik tasarımı için sorumluluğunu içeren bir gösterim. @tr
has subproperty: P50509

pistekirjoituksen tekijä (toimija) manifestaatiossa
status: Published
label: is braille embosser agent of @en
definition: Relates an agent to a manifestation that involves a responsibility of an agent for embossing braille cells using a stylus, special embossing printer, or other device. @en
type: Property
domain: C10002
sub property of: valmistaja (toimija) manifestaatiossa
lexical alias: brailleEmbosserAgentOf.en
label: est un agent producteur braille de @fr
definition: Met un agent en relation avec une manifestation qui comporte une responsabilité de la part d’un agent consistant à embosser des cellules braille au moyen d’un poinçon, d’une imprimante spéciale ou d’un autre appareil. @fr
toolkit label: agent producteur braille de @fr
toolkit definition: Manifestation qui comporte une responsabilité de la part d’un agent consistant à embosser des cellules braille au moyen d’un poinçon, d’une imprimante spéciale ou d’un autre appareil. @fr
toolkit label: braille embosser agent of @en
toolkit definition: A manifestation that involves a responsibility of an agent for embossing braille cells using a stylus, special embossing printer, or other device. @en
instruction number: 18.5
label: είναι τυπογράφος μπράιγ φορέας του @el
definition: Συνδέει έναν φορέα, ο οποίος εμπλέκεται στην κατασκευή μιας εκδήλωσης κατασκευάζοντας μια ανάγλυφη εκτύπωση μπράιγ χρησιμοποιώντας έναν ειδικό εκτυπωτή ανάγλυφης εκτύπωσης ή άλλη συσκευή, με μια εκδήλωση. @el
toolkit label: τυπογράφος μπράιγ φορέας του @el
toolkit definition: Μια εκδήλωση που κατασκευάζεται από έναν φορέα υπεύθυνο για την ανάγλυφη εκτύπωση μπράιγ μέσω της χρήσης ενός ειδικού εκτυπωτή ανάγλυφης εκτύπωσης ή άλλης συσκευής. @el
definition: Setzt einen Akteur in Beziehung zu einer Manifestation, bei der ein Akteur für das Prägen von Braillezeichen verantwortlich ist, indem er einen Griffel, einen speziellen Brailledrucker oder ein anderes Gerät verwendet. @de
toolkit label: Akteur als Brailleschriftprägerin/Brailleschriftpräger von @de
toolkit definition: Eine Manifestation, bei der ein Akteur für das Prägen von Braillezeichen verantwortlich ist, indem er einen Griffel, einen speziellen Brailledrucker oder ein anderes Gerät verwendet. @de
label: er agent, som er punktskriftspræger af @da
definition: Relaterer en agent til en manifestation, som involverer en agents ansvar for at præge punktskriftsceller vha. en stift, særlig prægeprinter eller anden anordning. @da
toolkit label: agent, som er punktskriftspræger af @da
toolkit definition: Manifestation, som involverer en agents ansvar for at præge punktskriftsceller vha. en stift, særlig prægeprinter eller anden anordning. @da
label: és agent estampador braille de @ca
definition: Relaciona un agent amb una manifestació que implica una responsabilitat d’un agent en el repujat de punts braille amb un punxó, una impressora especial d’estampar o un altre mecanisme. @ca
toolkit label: agent estampador braille de @ca
toolkit definition: Manifestació que implica una responsabilitat d’un agent en el repujat de punts braille amb un punxó, una impressora especial d’estampar o un altre mecanisme. @ca
definition: Liittää toimijan manifestaatioon, jonka tekemisestä toimija on vastuussa tuottamalla pistekirjoitusmerkkejä piirtimen, erityistulostimen tai muun laitteen avulla.
toolkit label: pistekirjoituksen tekijä (toimija) manifestaatiossa
toolkit definition: Manifestaatio, jonka tekemisestä toimija on vastuussa tuottamalla pistekirjoitusmerkkejä piirtimen, erityistulostimen tai muun laitteen avulla.
toolkit label: punktskriftpreger for (agent) @no
toolkit definition: En manifestasjon som involverer ansvar for en agent i form av preging av brailleceller ved hjelp av pren, punktskriftmaskin eller annen innretning. @no
label: ist Akteur als Brailleschriftprägerin/Brailleschriftpräger von @de
has element type: 2
label: Braille-dombornyomó ágense a következőnek: @hu
definition: Hozzákapcsol egy ágenst egy megjelenési formához, amelyhez hozzátartozik egy ágens felelőssége braille-cellák dombornyomásáért íróvessző, speciális dombornyomtató vagy más eszköz használatával. @hu
toolkit label: Braille-dombornyomó ágense: @hu
toolkit definition: Egy megjelenési forma, amelyhez hozzátartozik egy ágens felelőssége braille-cellák dombornyomásáért íróvessző, speciális dombornyomtató vagy más eszköz használatával. @hu
alternative label: braille embosser of @en
alternative label: valmistajana pistekirjoituksessa
label: er punktskriftpreger for (agent) @no
definition: Relaterer en agent til en manifestasjon som involverer ansvar for en agent i form av preging av brailleceller ved hjelp av pren, punktskriftmaskin eller annen innretning. @no
alternative label: punktskriftpreger for @no
label: is brailleerder-actor van @nl
definition: Relateert een actor aan een manifestatie die met zich meebrengt een verantwoordelijkheid van een actor voor het pregen van braille cellen met gebruikmaking van een stylus, speciale preegdrukmachine of ander instrument. @nl
toolkit label: brailleerder-actor van @nl
toolkit definition: Een manifestatie die met zich meebrengt een verantwoordelijkheid van een actor voor het pregen van braille cellen met gebruikmaking van een stylus, speciale preegdrukmachine of ander instrument. @nl
label: هو وكيل نقّاش حروف برايل لـ @ar
definition: يربط وكيلا بتجسيدة تنطوي على مسئولية وكيل عن نقش حروف برايل باستخدام قلم أو طابعة خاصة للنقش أو أي أداة أخرى. @ar
alternative label: نقَّاش حروف برايل @ar
toolkit label: وكيل نقاش حروف برايل @ar
toolkit definition: تجسيدة تنطوي على مسئولية وكيل عن نقش حروف برايل باستخدام قلم أو طابعة خاصة للنقش أو أي أداة أخرى. @ar
alternative label: estampador braille de @ca
alternative label: braillepræger af @da
label: punktkirja kirjutaja (tegija) kehastuses @et
definition: Seostab tegija kehastusega, mis sisaldab tegija vastutust spetsiaalse kirjutusvahendi, punktkirjaprinteri või muu seadmega punktkirjamärkide tegemise eest. @et
alternative label: punktkirja kirjutaja kehastuses @et
toolkit label: punktkirja kirjutaja (tegija) kehastuses @et
toolkit definition: Kehastus, mis sisaldab tegija vastutust spetsiaalse kirjutusvahendi, punktkirjaprinteri või muu seadmega punktkirjamärkide tegemise eest. @et
alternative label: Braille-dombornyomója: @hu
label: è agente stampatore braille di @it
definition: Correla un agente a una manifestazione che implica la responsabilità di un agente per lo sbalzo di punti braille utilizzando uno stilo, una speciale stampante a sbalzo o altro dispositivo. @it
alternative label: stampatore braille di @it
toolkit label: stampatore braille agente di @it
toolkit definition: Manifestazione che implica la responsabilità di un agente per lo sbalzo di punti braille utilizzando uno stilo, una speciale stampante a sbalzo o altro dispositivo. @it
alternative label: τυπογράφος μπράιγ του @el
alternative label: producteur braille de @fr
label: ir iespiedējs Braila rakstā (aģents) @lv
definition: Sasaista aģentu ar manifestāciju, kas ietver aģenta atbildību par Braila raksta matricas iespiešanu, izmantojot irbuli, īpaša ciļņa iespieduma printeri vai citu ierīci. @lv
toolkit label: ir iespiedējs Braila rakstā (aģents) @lv
toolkit definition: Manifestācija, kas ietver aģenta atbildību par Braila raksta matricas iespiešanu, izmantojot irbuli, īpaša ciļņa iespieduma printeri vai citu ierīci. @lv
alternative label: Brailleschriftpräger von @de
alternative label: ……的布莱叶盲文点字制作者 @zh-hans
toolkit label: ……的布莱叶盲文点字制作者行为者 @zh-hans
toolkit definition: 涉及通过使用刻写针、专门的压纹机或其他设备压印布莱叶盲文的一个行为者的责任的一种载体表现 @zh-hans
toolkit label: braille kabartmacısı temsilcisi @tr
toolkit definition: Bir kalem, özel kabartma yazıcı veya başka bir cihaz kullanarak braille hücrelerini kabartmak için bir temsilcinin sorumluluğunu içeren bir gösterim. @tr
has subproperty: pistekirjoituksen tekijä (yhteistoimija) manifestaatiossa

pistekirjoituksen tekijä (yhteistoimija) manifestaatiossa
status: Published
label: is braille embosser collective agent of @en
lexical alias: brailleEmbosserCollectiveAgentOf.en
definition: Relates a collective agent to a manifestation that involves a responsibility of a collective agent for embossing braille cells using a stylus, special embossing printer, or other device. @en
toolkit label: braille embosser collective agent of @en
toolkit definition: A manifestation that involves a responsibility of a collective agent for embossing braille cells using a stylus, special embossing printer, or other device. @en
type: Property
domain: C10011
has element type: 2
sub property of: valmistaja (yhteistoimija) manifestaatiossa
sub property of: pistekirjoituksen tekijä (toimija) manifestaatiossa
definition: Liittää yhteistoimijan manifestaatioon, jonka tekemisestä yhteistoimija on vastuussa tuottamalla pistekirjoitusmerkkejä piirtimen, erityistulostimen tai muun laitteen avulla.
toolkit label: pistekirjoituksen tekijä (yhteistoimija) manifestaatiossa
toolkit definition: Manifestaatio, jonka tekemisestä yhteistoimija on vastuussa tuottamalla pistekirjoitusmerkkejä piirtimen, erityistulostimen tai muun laitteen avulla.
label: er punktskriftspreger for (kollektiv agent) @no
definition: Relaterer en kollektiv agent til en manifestasjon som involverer et ansvar for en kollektiv agent i form av å prege brailleceller ved hjelp av pren, punktskriftmaskin eller annen innretning. @no
toolkit label: punktskriftspreger for (kollektiv agent) @no
toolkit definition: En manifestasjon som involverer et ansvar for en kollektiv agent i form av å prege brailleceller ved hjelp av pren, punktskriftmaskin eller annen innretning. @no
label: is brailleerder-collectieve actor van @nl
definition: Relateert een collectieve actor aan een manifestatie die met zich meebrengt een verantwoordelijkheid van een collectieve actor voor het pregen van braille cellen met gebruikmaking van een stylus, speciale preegdrukmachine of ander instrument. @nl
toolkit label: brailleerder-collectieve actor van @nl
toolkit definition: Een manifestatie die met zich meebrengt een verantwoordelijkheid van een collectieve actor voor het pregen van braille cellen met gebruikmaking van een stylus, speciale preegdrukmachine of ander instrument. @nl
label: هو وكيل جماعي نقاش حروف بطريقة برايل لـ @ar
definition: يربط وكيلا جماعيا بتجسيدة تنطوي على مسئولية وكيل جماعي عن نقش خلايا برايل باستخدام قلم أو طابعة خاصة للنقش أو أي أداة أخرى. @ar
toolkit label: وكيل جماعي نقاش حروف بطريقة برايل @ar
toolkit definition: تجسيدة تنطوي على مسئولية وكيل جماعي عن نقش خلايا برايل باستخدام قلم أو طابعة خاصة للنقش أو أي أداة أخرى. @ar
label: és agent col·lectiu estampador braille de @ca
definition: Relaciona un agent col·lectiu amb una manifestació que implica una responsabilitat d’un agent col·lectiu en el repujat de punts braille amb un punxó, una impressora especial d’estampar o un altre mecanisme. @ca
toolkit label: agent col·lectiu estampador braille de @ca
toolkit definition: Manifestació que implica una responsabilitat d’un agent col·lectiu en el repujat de punts braille amb un punxó, una impressora especial d’estampar o un altre mecanisme. @ca
label: er kollektiv agent, som er punktskriftspræger af @da
definition: Relaterer en kollektiv agent til en manifestation, som involverer en kollektiv agents ansvar for at præge punktskriftsceller vha. en stift, særlig prægeprinter eller anden anordning. @da
toolkit label: kollektiv agent, som er punktskriftspræger af @da
toolkit definition: Manifestation, som involverer en kollektiv agents ansvar for at præge punktskriftsceller vha. en stift, særlig prægeprinter eller anden anordning. @da
label: punktkirja kirjutaja (kollektiiv) kehastuses @et
definition: Seostab kollektiivi kehastusega, mis sisaldab kollektiivi vastutust spetsiaalse kirjutusvahendi, punktkirjaprinteri või muu seadmega punktkirjamärkide tegemise eest. @et
toolkit label: punktkirja kirjutaja (kollektiiv) kehastuses @et
toolkit definition: Kehastus, mis sisaldab kollektiivi vastutust spetsiaalse kirjutusvahendi, punktkirjaprinteri või muu seadmega punktkirjamärkide tegemise eest. @et
label: ist gemeinschaftlicher Akteur als Brailleschriftprägerin/Brailleschriftpräger von @de
definition: Setzt einen gemeinschaftlichen Akteur in Beziehung zu einer Manifestation, bei der ein gemeinschaftlicher Akteur für das Prägen von Braillezeichen verantwortlich ist, indem er einen Griffel, einen speziellen Brailledrucker oder ein anderes Gerät verwendet. @de
toolkit label: Gemeinschaftlicher Akteur als Brailleschriftprägerin/Brailleschriftpräger von @de
toolkit definition: Eine Manifestation, bei der ein gemeinschaftlicher Akteur für das Prägen von Braillezeichen verantwortlich ist, indem er einen Griffel, einen speziellen Brailledrucker oder ein anderes Gerät verwendet. @de
label: Braille-dombornyomó kollektív ágense a következőnek: @hu
definition: Hozzákapcsol egy kollektív ágenst egy megjelenési formához, amelyhez hozzátartozik egy kollektív ágens felelőssége braille-cellák dombornyomásáért íróvessző, speciális dombornyomtató vagy más eszköz használatával. @hu
toolkit label: Braille-dombornyomó kollektív ágense: @hu
toolkit definition: Egy megjelenési forma, amelyhez hozzátartozik egy kollektív ágens felelőssége braille-cellák dombornyomásáért íróvessző, speciális dombornyomtató vagy más eszköz használatával. @hu
label: è stampatore braille agente collettivo di @it
definition: Correla un agente collettivo a una manifestazione che implica una responsabililtà di un agente collettivo per lo sbalzo di punti braille utilizzando uno stilo, una speciale stampante a sbalzo o altro dispositivo. @it
toolkit label: stampatore braille agente collettivo di @it
toolkit definition: Manifestazione che implica una responsabililtà di un agente collettivo per lo sbalzo di punti braille utilizzando uno stilo, una speciale stampante a sbalzo o altro dispositivo. @it
label: είναι μπράιγ τυπογράφος συλλογικός φορέας του @el
toolkit label: μπράιγ τυπογράφος συλλογικός φορέας του @el
label: est un agent collectif producteur braille de @fr
definition: Met un agent collectif en relation avec une manifestation qui comporte une responsabilité de la part d’un agent collectif consistant à embosser des cellules braille au moyen d’un poinçon, d’une imprimante spéciale ou d’un autre appareil. @fr
toolkit label: agent collectif producteur braille de @fr
toolkit definition: Manifestation qui comporte une responsabilité de la part d’un agent collectif consistant à embosser des cellules braille au moyen d’un poinçon, d’une imprimante spéciale ou d’un autre appareil. @fr
label: ir iespiedējs Braila rakstā (grupa) @lv
definition: Sasaista grupu ar manifestāciju, kas ietver grupas atbildību par Braila raksta matricas iespiešanu, izmantojot irbuli, īpaša ciļņa iespieduma printeri vai citu ierīci. @lv
toolkit label: ir iespiedējs Braila rakstā (grupa) @lv
toolkit definition: Manifestācija, kas ietver grupas atbildību par Braila raksta matricas iespiešanu, izmantojot irbuli, īpaša ciļņa iespieduma printeri vai citu ierīci. @lv
label: 是……的布莱叶盲文点字制作者集体行为者 @zh-hans
definition: 将一个集体行为者与涉及通过使用刻写针、专门的压纹机或其他设备压印布莱叶盲文的一个集体行为者的责任的一种载体表现关联起来。 @zh-hans
toolkit label: ……的布莱叶盲文点字制作者集体行为者 @zh-hans
toolkit definition: 涉及通过使用刻写针、专门的压纹机或其他设备压印布莱叶盲文的一个集体行为者的责任的一种载体表现 @zh-hans
label: braille kabartmacısı kolektif temsilcisidir @tr
definition: Kolektif bir temsilciyi bir kalem, özel kabartma yazıcısı veya başka bir cihaz kullanarak braille hücrelerini kabartmak için kolektif bir temsilcinin sorumluluğunu içeren bir gösterimle ilişkilendirir. @tr
toolkit label: braille kabartmacısı kolektif temsilcisi @tr
toolkit definition: Kalem, özel kabartma yazıcı veya başka bir cihaz kullanarak braille hücrelerini kabartmak için kolektif bir temsilcinin sorumluluğunu içeren bir gösterim. @tr
has subproperty: pistekirjoituksen tekijä (yhteisö) manifestaatiossa
has subproperty: pistekirjoituksen tekijä (suku) manifestaatiossa
has subproperty: P50649

pistekirjoituksen tekijä (yhteisö) manifestaatiossa
status: Published
label: is braille embosser corporate body of @en
lexical alias: brailleEmbosserCorporateBodyOf.en
definition: Relates a corporate body to a manifestation that involves a responsibility of a corporate body for embossing braille cells using a stylus, special embossing printer, or other device. @en
toolkit label: braille embosser corporate body of @en
toolkit definition: A manifestation that involves a responsibility of a corporate body for embossing braille cells using a stylus, special embossing printer, or other device. @en
type: Property
domain: C10005
has element type: 2
sub property of: valmistaja (yhteisö) manifestaatiossa
sub property of: pistekirjoituksen tekijä (yhteistoimija) manifestaatiossa
definition: Liittää yhteisön manifestaatioon, jonka tekemisestä yhteisö on vastuussa tuottamalla pistekirjoitusmerkkejä piirtimen, erityistulostimen tai muun laitteen avulla.
toolkit label: pistekirjoituksen tekijä (yhteisö) manifestaatiossa
toolkit definition: Manifestaatio, jonka tekemisestä yhteisö on vastuussa tuottamalla pistekirjoitusmerkkejä piirtimen, erityistulostimen tai muun laitteen avulla.
label: er punktskriftspreger for (korporasjon) @no
definition: Relaterer en korporasjon til en manifestasjon som involverer et ansvar for en korporasjon i form av å prege brailleceller ved hjelp av pren, punktskriftmaskin eller annen innretning. @no
toolkit label: punktskriftspreger for (korporasjon) @no
toolkit definition: En manifestasjon som involverer et ansvar for en korporasjon i form av å prege brailleceller ved hjelp av pren, punktskriftmaskin eller annen innretning. @no
label: is brailleerder-corporatie van @nl
definition: Relateert een corporatie aan een manifestatie die met zich meebrengt een verantwoordelijkheid van een corporatie voor het pregen van braille cellen met gebruikmaking van een stylus, speciale preegdrukmachine of ander instrument. @nl
toolkit label: brailleerder-corporatie van @nl
toolkit definition: Een manifestatie die met zich meebrengt een verantwoordelijkheid van een corporatie voor het pregen van braille cellen met gebruikmaking van een stylus, speciale preegdrukmachine of ander instrument. @nl
label: هيئة مسئولة عن نقش الحروف بطريقة برايل لـ @ar
definition: يربط هيئة بتجسيدة تنطوي على مسئولية هيئة عن نقش خلايا برايل باستخدام قلم أو طابعة خاصة للنقش أو أي أداة أخرى. @ar
toolkit label: هيئة مسئولة عن نقش الحروف بطريقة برايل @ar
toolkit definition: تجسيدة تنطوي على مسئولية هيئة عن نقش خلايا برايل باستخدام قلم أو طابعة خاصة للنقش أو أي أداة أخرى. @ar
label: és entitat corporativa estampadora braille de @ca
definition: Relaciona una entitat corporativa amb una manifestació que implica una responsabilitat d’una entitat corporativa en el repujat de punts braille amb un punxó, una impressora especial d’estampar o un altre mecanisme. @ca
toolkit label: entitat corporativa estampadora braille de @ca
toolkit definition: Manifestació que implica una responsabilitat d’una entitat corporativa en el repujat de punts braille amb un punxó, una impressora especial d’estampar o un altre mecanisme. @ca
label: er korporation, som er punktskriftspræger af @da
definition: Relaterer en korporation til en manifestation, som involverer en korporations ansvar for at præge punktskriftsceller vha. en stift, særlig prægeprinter eller anden anordning. @da
toolkit label: korporation, som er punktskriftspræger af @da
toolkit definition: Manifestation, som involverer en korporations ansvar for at præge punktskriftsceller vha. en stift, særlig prægeprinter eller anden anordning. @da
label: punktkirja kirjutaja (asutus) kehastuses @et
definition: Seostab asutuse kehastusega, mis sisaldab asutuse vastutust spetsiaalse kirjutusvahendi, punktkirjaprinteri või muu seadmega punktkirjamärkide tegemise eest. @et
toolkit label: punktkirja kirjutaja (asutus) kehastuses @et
toolkit definition: Kehastus, mis sisaldab asutuse vastutust spetsiaalse kirjutusvahendi, punktkirjaprinteri või muu seadmega punktkirjamärkide tegemise eest. @et
label: ist Körperschaft als Brailleschriftprägerin/Brailleschriftpräger von @de
definition: Setzt eine Körperschaft in Beziehung zu einer Manifestation, bei der eine Körperschaft für das Prägen von Braillezeichen verantwortlich ist, indem sie einen Griffel, einen speziellen Brailledrucker oder ein anderes Gerät verwendet. @de
toolkit label: Körperschaft als Brailleschriftprägerin/Brailleschriftpräger von @de
toolkit definition: Eine Manifestation, bei der eine Körperschaft für das Prägen von Braillezeichen verantwortlich ist, indem sie einen Griffel, einen speziellen Brailledrucker oder ein anderes Gerät verwendet. @de
label: Braille-dombornyomó testülete a következőnek: @hu
definition: Hozzákapcsol egy testületet egy megjelenési formához, amelyhez hozzátartozik egy testület felelőssége braille-cellák dombornyomásáért íróvessző, speciális dombornyomtató vagy más eszköz használatával. @hu
toolkit label: Braille-dombornyomó testülete: @hu
toolkit definition: Egy megjelenési forma, amelyhez hozzátartozik egy testület felelőssége braille-cellák dombornyomásáért íróvessző, speciális dombornyomtató vagy más eszköz használatával. @hu
label: è stampatore braille ente di @it
definition: Correla un ente a una manifestazione che implica una responsabilità di un ente per lo sbalzo di punti braille utilizzando uno stilo, una speciale stampante a sbalzo o altro dispositivo. @it
toolkit label: stampatore braille ente di @it
toolkit definition: Manifestazione che implica una responsabilità di un ente per lo sbalzo di punti braille utilizzando uno stilo, una speciale stampante a sbalzo o altro dispositivo. @it
label: είναι μπράιγ τυπογράφος συλλογικό όργανο του @el
toolkit label: μπράιγ τυπογράφος συλλογικό όργανο του @el
label: est une collectivité productrice braille de @fr
definition: Met une collectivité en relation avec une manifestation qui comporte une responsabilité de la part d’une collectivité consistant à embosser des cellules braille au moyen d’un poinçon, d’une imprimante spéciale ou d’un autre appareil. @fr
toolkit label: collectivité productrice braille de @fr
toolkit definition: Manifestation qui comporte une responsabilité de la part d’une collectivité consistant à embosser des cellules braille au moyen d’un poinçon, d’une imprimante spéciale ou d’un autre appareil. @fr
label: ir iespiedējs Braila rakstā (institūcija) @lv
definition: Sasaista institūciju ar manifestāciju, kas ietver institūcijas atbildību par Braila raksta matricas iespiešanu, izmantojot irbuli, īpaša ciļņa iespieduma printeri vai citu ierīci. @lv
toolkit label: ir iespiedējs Braila rakstā (institūcija) @lv
toolkit definition: Manifestācija, kas ietver institūcijas atbildību par Braila raksta matricas iespiešanu, izmantojot irbuli, īpaša ciļņa iespieduma printeri vai citu ierīci. @lv
label: 是……的布莱叶盲文点字制作者团体 @zh-hans
definition: 将一个团体与涉及通过使用刻写针、专门的压纹机或其他设备压印布莱叶盲文的一个团体的责任的一种载体表现关联起来。 @zh-hans
toolkit label: ……的布莱叶盲文点字制作者团体 @zh-hans
toolkit definition: 涉及通过使用刻写针、专门的压纹机或其他设备压印布莱叶盲文的一个团体的责任的一种载体表现 @zh-hans
label: braille kabartmacısı tüzel kişisidir @tr
definition: Bir tüzel kişiyi bir özel kalem, özel kabartma yazıcı veya başka bir cihaz kullanarak braille hücrelerini kabartma sorumluluğunu içeren bir gösterim ile ilişkilendirir. @tr
toolkit label: braille kabartmacısı tüzel kişisi @tr
toolkit definition: Kabartma kalem, özel kabartma yazıcı veya başka bir cihaz kullanarak braille hücrelerini kabartmak için tüzel bir kişinin sorumluluğunu içeren bir gösterim @tr
has subproperty: P50800

pistekirjoituksen tekijä (suku) manifestaatiossa
status: Published
label: is braille embosser family of @en
lexical alias: brailleEmbosserFamilyOf.en
definition: Relates a family to a manifestation that involves a responsibility of a family for embossing braille cells using a stylus, special embossing printer, or other device. @en
toolkit label: braille embosser family of @en
toolkit definition: A manifestation that involves a responsibility of a family for embossing braille cells using a stylus, special embossing printer, or other device. @en
type: Property
domain: C10008
has element type: 2
sub property of: valmistaja (suku) manifestaatiossa
sub property of: pistekirjoituksen tekijä (yhteistoimija) manifestaatiossa
definition: Liittää suvun manifestaatioon, jonka tekemisestä suku on vastuussa tuottamalla pistekirjoitusmerkkejä piirtimen, erityistulostimen tai muun laitteen avulla.
toolkit label: pistekirjoituksen tekijä (suku) manifestaatiossa
toolkit definition: Manifestaatio, jonka tekemisestä suku on vastuussa tuottamalla pistekirjoitusmerkkejä piirtimen, erityistulostimen tai muun laitteen avulla.
label: er punktskriftspreger for (familie) @no
definition: Relaterer en familie til en manifestasjon som involverer et ansvar for en familie i form av å prege brailleceller ved hjelp av pren, punktskriftmaskin eller annen innretning. @no
toolkit label: punktskriftspreger for (familie) @no
toolkit definition: En manifestasjon som involverer et ansvar for en familie i form av å prege brailleceller ved hjelp av pren, punktskriftmaskin eller annen innretning. @no
label: is brailleerder-familie van @nl
definition: Relateert een familie aan een manifestatie die met zich meebrengt een verantwoordelijkheid van een familie voor het pregen van braille cellen met gebruikmaking van een stylus, speciale preegdrukmachine of ander instrument. @nl
toolkit label: brailleerder-familie van @nl
toolkit definition: Een manifestatie die met zich meebrengt een verantwoordelijkheid van een familie voor het pregen van braille cellen met gebruikmaking van een stylus, speciale preegdrukmachine of ander instrument. @nl
label: هي عائلة مسئولة عن نقش الحروف بطريقة برايل لـ @ar
definition: يربط عائلة بتجسيدة تنطوي على مسئولية عائلة ععن نقش خلايا برايل باستخدام قلم أو طابعة خاصة للنقش أو أي أداة أخرى. @ar
toolkit label: عائلة مسئولة عن نقش الحروف بطريقة برايل @ar
toolkit definition: تجسيدة تنطوي على مسئولية عائلة عن نقش خلايا برايل باستخدام قلم أو طابعة خاصة للنقش أو أي أداة أخرى. @ar
label: és família estampadora braille de @ca
definition: Relaciona una família amb una manifestació que implica una responsabilitat d’una família en el repujat de punts braille amb un punxó, una impressora especial d’estampar o un altre mecanisme. @ca
toolkit label: família estampadora braille de @ca
toolkit definition: Manifestació que implica una responsabilitat d’una família en el repujat de punts braille amb un punxó, una impressora especial d’estampar o un altre mecanisme. @ca
label: er familie, som er punktskriftspræger af @da
definition: Relaterer en familie til en manifestation, som involverer en families ansvar for at præge punktskriftsceller vha. en stift, særlig prægeprinter eller anden anordning. @da
toolkit label: familie, som er punktskriftspræger af @da
toolkit definition: Manifestation, som involverer en families ansvar for at præge punktskriftsceller vha. en stift, særlig prægeprinter eller anden anordning. @da
label: punktkirja kirjutaja (perekond) kehastuses @et
definition: Seostab perekonna kehastusega, mis sisaldab perekonna vastutust spetsiaalse kirjutusvahendi, punktkirjaprinteri või muu seadmega punktkirjamärkide tegemise eest. @et
toolkit label: punktkirja kirjutaja (perekond) kehastuses @et
toolkit definition: Kehastus, mis sisaldab perekonna vastutust spetsiaalse kirjutusvahendi, punktkirjaprinteri või muu seadmega punktkirjamärkide tegemise eest. @et
label: ist Familie als Brailleschriftprägerin/Brailleschriftpräger von @de
definition: Setzt eine Familie in Beziehung zu einer Manifestation, bei der eine Familie für das Prägen von Braillezeichen verantwortlich ist, indem sie einen Griffel, einen speziellen Brailledrucker oder ein anderes Gerät verwendet. @de
toolkit label: Familie als Brailleschriftprägerin/Brailleschriftpräger von @de
toolkit definition: Eine Manifestation, bei der eine Familie für das Prägen von Braillezeichen verantwortlich ist, indem sie einen Griffel, einen speziellen Brailledrucker oder ein anderes Gerät verwendet. @de
label: Braille-dombornyomó családja a következőnek: @hu
definition: Hozzákapcsol egy családot egy megjelenési formához, amelyhez hozzátartozik egy család felelőssége braille-cellák dombornyomásáért íróvessző, speciális dombornyomtató vagy más eszköz használatával. @hu
toolkit label: Braille-dombornyomó családja: @hu
toolkit definition: Egy megjelenési forma, amelyhez hozzátartozik egy család felelőssége braille-cellák dombornyomásáért íróvessző, speciális dombornyomtató vagy más eszköz használatával. @hu
label: è stampatore braille famiglia di @it
definition: Correla una famiglia a una manifestazione che implica una responsabilità di una famiglia per lo sbalzo di punti braille utilizzando uno stilo, una speciale stampante a sbalzo o altro dispositivo. @it
toolkit label: stampatore braille famiglia di @it
toolkit definition: Manifestazione che implica una responsabilità di una famiglia per lo sbalzo di punti braille utilizzando uno stilo, una speciale stampante a sbalzo o altro dispositivo. @it
label: είναι μπράιγ τυπογράφος οικογένεια του @el
toolkit label: μπράιγ τυπογράφος οικογένεια του @el
label: est une famille productrice braille de @fr
definition: Met une famille en relation avec une manifestation qui comporte une responsabilité de la part d’une famille consistant à embosser des cellules braille au moyen d’un poinçon, d’une imprimante spéciale ou d’un autre appareil. @fr
toolkit label: famille productrice braille de @fr
toolkit definition: Manifestation qui comporte une responsabilité de la part d’une famille consistant à embosser des cellules braille au moyen d’un poinçon, d’une imprimante spéciale ou d’un autre appareil. @fr
label: ir iespiedējs Braila rakstā (dzimta/ģimene) @lv
definition: Sasaista dzimtu/ģimeni ar manifestāciju, kas ietver dzimtas/ģimenes atbildību par Braila raksta matricas iespiešanu, izmantojot irbuli, īpaša ciļņa iespieduma printeri vai citu ierīci. @lv
toolkit label: ir iespiedējs Braila rakstā (dzimta/ģimene) @lv
toolkit definition: Manifestācija, kas ietver dzimtas/ģimenes atbildību par Braila raksta matricas iespiešanu, izmantojot irbuli, īpaša ciļņa iespieduma printeri vai citu ierīci. @lv
label: 是……的布莱叶盲文点字制作者家族 @zh-hans
definition: 将一个家族与涉及通过使用刻写针、专门的压纹机或其他设备压印布莱叶盲文的一个家族的责任的一种载体表现关联起来。 @zh-hans
toolkit label: ……的布莱叶盲文点字制作者家族 @zh-hans
toolkit definition: 涉及通过使用刻写针、专门的压纹机或其他设备压印布莱叶盲文的一个家族的责任的一种载体表现 @zh-hans
label: braille kabartmacısı ailesidir @tr
definition: Bir aileyi, ailenin kalem, özel kabartma yazıcı veya başka bir cihaz kullanarak braille hücrelerini kabartma sorumluluğunu içeren gösterimle ilişkilendirir. @tr
toolkit label: braille kabartmacısı ailesi @tr
toolkit definition: Bir ailenin kalem, özel kabartma yazıcı veya başka bir cihaz kullanarak braille hücrelerini kabartma sorumluluğunu içeren bir gösterim. @tr
has subproperty: P50951

pistekirjoituksen tekijä (henkilö) manifestaatiossa
status: Published
label: is braille embosser person of @en
lexical alias: brailleEmbosserPersonOf.en
definition: Relates a person to a manifestation that involves a responsibility of a person for embossing braille cells using a stylus, special embossing printer, or other device. @en
toolkit label: braille embosser person of @en
toolkit definition: A manifestation that involves a responsibility of a person for embossing braille cells using a stylus, special embossing printer, or other device. @en
type: Property
domain: C10004
has element type: 2
sub property of: valmistaja (henkilö) manifestaatiossa
sub property of: pistekirjoituksen tekijä (toimija) manifestaatiossa
definition: Liittää henkilön manifestaatioon, jonka tekemisestä henkilö on vastuussa tuottamalla pistekirjoitusmerkkejä piirtimen, erityistulostimen tai muun laitteen avulla.
toolkit label: pistekirjoituksen tekijä (henkilö) manifestaatiossa
toolkit definition: Manifestaatio, jonka tekemisestä henkilö on vastuussa tuottamalla pistekirjoitusmerkkejä piirtimen, erityistulostimen tai muun laitteen avulla.
label: er punktskriftspreger for (person) @no
definition: Relaterer en person til en manifestasjon som involverer et ansvar for en person i form av å prege brailleceller ved hjelp av pren, punktskriftmaskin eller annen innretning. @no
toolkit label: punktskriftspreger for (person) @no
toolkit definition: En manifestasjon som involverer et ansvar for en person i form av å prege brailleceller ved hjelp av pren, punktskriftmaskin eller annen innretning. @no
label: is brailleerder-persoon van @nl
definition: Relateert een persoon aan een manifestatie die met zich meebrengt een verantwoordelijkheid van een persoon voor het pregen van braille cellen met gebruikmaking van een stylus, speciale preegdrukmachine of ander instrument. @nl
toolkit label: brailleerder-persoon van @nl
toolkit definition: Een manifestatie die met zich meebrengt een verantwoordelijkheid van een persoon voor het pregen van braille cellen met gebruikmaking van een stylus, speciale preegdrukmachine of ander instrument. @nl
label: هو شخص نقاش حروف بطريقة برايل @ar
definition: يربط شخصا بتجسيدة تنطوي على مسئولية شخص عن نقش خلايا برايل باستخدام قلم أو طابعة خاصة للنقش أو أي أداة أخرى. @ar
toolkit label: شخص نقاش حروف بطريقة برايل @ar
toolkit definition: تجسيدة تنطوي على مسئولية شخص عن نقش خلايا برايل باستخدام قلم أو طابعة خاصة للنقش أو أي أداة أخرى. @ar
label: és persona estampadora braille de @ca
definition: Relaciona una persona amb una manifestació que implica una responsabilitat d’una persona en el repujat de punts braille amb un punxó, una impressora especial d’estampar o un altre mecanisme. @ca
toolkit label: persona estampadora braille de @ca
toolkit definition: Manifestació que implica una responsabilitat d’una persona en el repujat de punts braille amb un punxó, una impressora especial d’estampar o un altre mecanisme. @ca
label: er person, som er punktskriftspræger af @da
definition: Relaterer en person til en manifestation, som involverer en persons ansvar for at præge punktskriftsceller vha. en stift, særlig prægeprinter eller anden anordning. @da
toolkit label: person, som er punktskriftspræger af @da
toolkit definition: Manifestation, som involverer en persons ansvar for at præge punktskriftsceller vha. en stift, særlig prægeprinter eller anden anordning. @da
label: punktkirja kirjutaja (isik) kehastuses @et
definition: Seostab isiku kehastusega, mis sisaldab isiku vastutust spetsiaalse kirjutusvahendi, punktkirjaprinteri või muu seadmega punktkirjamärkide tegemise eest. @et
toolkit label: punktkirja kirjutaja (isik) kehastuses @et
toolkit definition: Kehastus, mis sisaldab isiku vastutust spetsiaalse kirjutusvahendi, punktkirjaprinteri või muu seadmega punktkirjamärkide tegemise eest. @et
label: ist Person als Brailleschriftprägerin/Brailleschriftpräger von @de
definition: Setzt eine Person in Beziehung zu einer Manifestation, bei der eine Person für das Prägen von Braillezeichen verantwortlich ist, indem sie einen Griffel, einen speziellen Brailledrucker oder ein anderes Gerät verwendet. @de
toolkit label: Person als Brailleschriftprägerin/Brailleschriftpräger von @de
toolkit definition: Eine Manifestation, bei der eine Person für das Prägen von Braillezeichen verantwortlich ist, indem sie einen Griffel, einen speziellen Brailledrucker oder ein anderes Gerät verwendet. @de
label: Braille-dombornyomó személye a következőnek: @hu
definition: Hozzákapcsol egy személyt egy megjelenési formához, amelyhez hozzátartozik egy ágens felelőssége braille-cellák dombornyomásáért íróvessző, speciális dombornyomtató vagy más eszköz használatával. @hu
toolkit label: Braille-dombornyomó személye: @hu
toolkit definition: Egy megjelenési forma, amelyhez hozzátartozik egy ágens felelőssége braille-cellák dombornyomásáért íróvessző, speciális dombornyomtató vagy más eszköz használatával. @hu
label: è stampatore braille persona di @it
definition: Correla una persona a una manifestazione che implica una responsabililtà di una persona per lo sbalzo di punti braille utilizzando uno stilo, una speciale stampante a sbalzo o altro dispositivo. @it
toolkit label: stampatore braille persona di @it
toolkit definition: Manifestazione che implica una responsabililtà di una persona per lo sbalzo di punti braille utilizzando uno stilo, una speciale stampante a sbalzo o altro dispositivo. @it
label: είναι μπράιγ τυπογράφος φυσικό πρόσωπο του @el
toolkit label: μπράιγ τυπογράφος φυσικό πρόσωπο του @el
label: est une personne productrice braille de @fr
definition: Met une personne en relation avec une manifestation qui comporte une responsabilité de la part d’une personne consistant à embosser des cellules braille au moyen d’un poinçon, d’une imprimante spéciale ou d’un autre appareil. @fr
toolkit label: personne productrice braille de @fr
toolkit definition: Manifestation qui comporte une responsabilité de la part d’une personne consistant à embosser des cellules braille au moyen d’un poinçon, d’une imprimante spéciale ou d’un autre appareil. @fr
label: ir iespiedējs Braila rakstā (persona) @lv
definition: Sasaista personu ar manifestāciju, kas ietver personas atbildību par Braila raksta matricas iespiešanu, izmantojot irbuli, īpaša ciļņa iespieduma printeri vai citu ierīci. @lv
toolkit label: ir iespiedējs Braila rakstā (persona) @lv
toolkit definition: Manifestācija, kas ietver personas atbildību par Braila raksta matricas iespiešanu, izmantojot irbuli, īpaša ciļņa iespieduma printeri vai citu ierīci. @lv
label: 是……的布莱叶盲文点字制作者个人 @zh-hans
definition: 将一个个人与涉及用点字笔、特殊压印机或其他设备压印布莱叶盲文点字的一个个人的责任的一种载体表现关联起来。 @zh-hans
toolkit label: ……的布莱叶盲文点字制作者个人 @zh-hans
toolkit definition: 涉及用点字笔、特殊压印机或其他设备压印布莱叶盲文点字的一个个人的责任的一种载体表现 @zh-hans
label: braille kabartmacısı kişisidir @tr
definition: Bir kişiyi, kalem, özel kabartma yazıcı veya başka bir cihaz kullanarak braille hücrelerini kabartma sorumluluğunu içeren gösterimle ilişkilendirir. @tr
toolkit label: braille kabartmacısı @tr
toolkit definition: Bir kalem, özel kabartma yazıcı veya başka bir cihaz kullanarak braille hücrelerini kabartmak için bir kişinin sorumluluğunu içeren bir gösterim. @tr
has subproperty: P50498

lähetyksestä vastaava toimija manifestaatiossa
status: Published
label: is broadcaster agent of @en
definition: Relates an agent to a manifestation that involves a responsibility of an agent for broadcasting to an audience via radio, television, webcast, etc. @en
type: Property
domain: C10002
sub property of: kustantaja (toimija) manifestaatiossa
lexical alias: broadcasterAgentOf.en
label: est un agent diffuseur audiovisuel de @fr
definition: Met un agent en relation avec une manifestation qui comporte une responsabilité de la part d’un agent en ce qui concerne la diffusion à un public par la radio, la télévision, la webdiffusion, etc. @fr
toolkit label: agent diffuseur audiovisuel de @fr
toolkit definition: Manifestation qui comporte une responsabilité de la part d’un agent en ce qui concerne la diffusion à un public par la radio, la télévision, la webdiffusion, etc. @fr
toolkit label: broadcaster agent of @en
toolkit definition: A manifestation that involves a responsibility of an agent for broadcasting to an audience via radio, television, webcast, etc. @en
instruction number: 18.5
label: είναι ευρυεκπομπέας φορέας του @el
definition: Συνδέει έναν φορέα, ο οποίος εμπλέκεται στην εκπομπή μιας εκδήλωσης προς ένα ακροατήριο μέσω ραδιοφώνου, τηλεόρασης, web εκπομπής κ.λπ., με μια εκδήλωση. @el
toolkit label: ευρυεκπομπέας φορέας του @el
toolkit definition: Μια εκδήλωση που εκπέμπεται προς ένα ακροατήριο μέσω ραδιοφώνου, τηλεόρασης, web εκπομπής κ.λπ. . @el
definition: Setzt einen Akteur in Beziehung zu einer Manifestation, bei der ein Akteur für die Ausstrahlung über Hörfunk, Fernsehen oder Webcast und so weiter verantwortlich ist. @de
toolkit label: Akteur als Sender von @de
toolkit definition: Eine Manifestation, bei der ein Akteur für die Ausstrahlung über Hörfunk, Fernsehen oder Webcast und so weiter verantwortlich ist. @de
label: er agent, som er broadcaster af @da
definition: Relaterer en agent til en manifestation, som involverer en agents ansvar for at transmittere til et publikum via radio, tv, webcast etc. @da
toolkit label: agent, som er broadcaster af @da
toolkit definition: Manifestation, som involverer en agents ansvar for at transmittere til et publikum via radio, tv, webcast etc. @da
label: és agent difusor audiovisual de @ca
definition: Relaciona un agent amb una manifestació que implica una responsabilitat d’un agent per la difusió a uns destinataris mitjançant la ràdio, la televisió, el web, etc. @ca
toolkit label: agent difusor audiovisual de @ca
toolkit definition: Manifestació que implica una responsabilitat d’un agent per la difusió a uns destinataris mitjançant la ràdio, la televisió, el web, etc. @ca
definition: Liittää toimijan manifestaatioon, jossa toimija on vastuussa radio-, televisio-, suoratoisto- tms. lähetyksen toteuttamisesta yleisölle.
toolkit label: lähetyksestä vastaava toimija manifestaatiossa
toolkit definition: Manifestaatio, jossa toimija on vastuussa radio-, televisio-, suoratoisto- tms. lähetyksen toteuttamisesta yleisölle.
toolkit label: kringkaster av (agent) @no
toolkit definition: En manifestasjon som involverer ansvar for en agent i form av kringkasting til et publikum via radio, fjernsyn, webcast, etc. @no
label: ist Akteur als Sender von @de
has element type: 2
label: műsorszolgáltató ágense a következőnek: @hu
definition: Hozzákapcsol egy ágenst egy megjelenési formához, amelyhez hozzátartozik egy ágens felelőssége műsorszórásért, amely a közönség felé rádión, televízión, webes közvetítésen stb. keresztül történik. @hu
toolkit label: műsorszolgáltató ágense: @hu
toolkit definition: Egy megjelenési forma, amelyhez hozzátartozik egy ágens felelőssége műsorszórásért, amely a közönség felé rádión, televízión, webes közvetítésen stb. keresztül történik. @hu
alternative label: broadcaster of @en
alternative label: vastaavana lähetyksessä
label: er kringkaster av (agent) @no
definition: Relaterer en agent til en manifestasjon som involverer ansvar for en agent i form av kringkasting til et publikum via radio, fjernsyn, webcast, etc. @no
alternative label: kringkaster av @no
label: is uitzender-actor van @nl
definition: Relateert een actor aan een manifestatie die met zich meebrengt een verantwoordelijkheid van een actor voor uitzending naar een publiek via radio, televisie, webcast etc. @nl
toolkit label: uitzender-actor van @nl
toolkit definition: Een manifestatie die met zich meebrengt een verantwoordelijkheid van een actor voor uitzending naar een publiek via radio, televisie, webcast etc. @nl
label: هو وكيل مذيع لـ @ar
definition: يربط وكيلا بتجسيدة تنطوي على مسئولية وكيل عن البث إلى جمهور عبر الإذاعة والتلفزيون والإنترنت، الخ. @ar
alternative label: مذيع @ar
toolkit label: وكيل مذيع @ar
toolkit definition: تجسيدة تنطوي على مسئولية وكيل عن البث إلى جمهور عبر الإذاعة والتلفزيون والإنترنت، الخ. @ar
alternative label: entitat de difusió de @ca
alternative label: broadcaster af @da
label: leviedastaja (tegija) kehastuses @et
definition: Seostab tegija kehastusega, mis sisaldab tegija vastutust avalikkusele levitamise eest raadio, televisiooni, veebi vms kaudu. @et
alternative label: leviedastaja kehastuses @et
toolkit label: leviedastaja (tegija) kehastuses @et
toolkit definition: Kehastus, mis sisaldab tegija vastutust avalikkusele levitamise eest raadio, televisiooni, veebi vms kaudu. @et
alternative label: műsorszolgáltatója: @hu
label: è diffusore agente di @it
definition: Correla un agente a una manifestazione che implica una responsabilità di un agente nella trasmissione a un pubblico via radio, televisione, web, etc. @it
alternative label: diffusore di @it
toolkit label: diffusore agente di @it
toolkit definition: Manifestazione che implica una responsabilità di un agente nella trasmissione a un pubblico via radio, televisione, web, etc. @it
alternative label: ευρυεκπομπέας του @el
alternative label: εκφωνητής του @el
alternative label: diffuseur audiovisuel de @fr
label: ir raidorganizācija (aģents) @lv
definition: Sasaista aģentu ar manifestāciju, kas ietver aģenta atbildību par pārraidi, izmantojot radio, televīziju, tīmekļa apraidi u.tml. @lv
toolkit label: ir raidorganizācija (aģents) @lv
toolkit definition: Manifestācija, kas ietver aģenta atbildību par pārraidi, izmantojot radio, televīziju, tīmekļa apraidi u.tml. @lv
alternative label: Sender von @de
toolkit label: ……的广播者行为者 @zh-hans
toolkit definition: 涉及一个通过广播、电视、网路直播等向听众播音的一个行为者的责任的一种载体表现 @zh-hans
toolkit label: yayıncı temsilcisi @tr
toolkit definition: Bir temsilcinin radyo, televizyon, web yayını vb. yoluyla bir izleyici kitlesine yayın yapma sorumluluğunu içeren bir gösterim. @tr
has subproperty: lähetyksestä vastaava yhteistoimija manifestaatiossa

lähetyksestä vastaava yhteistoimija manifestaatiossa
status: Published
label: is broadcaster collective agent of @en
lexical alias: broadcasterCollectiveAgentOf.en
definition: Relates a collective agent to a manifestation that involves a responsibility of a collective agent for broadcasting to an audience via radio, television, webcast, etc. @en
toolkit label: broadcaster collective agent of @en
toolkit definition: A manifestation that involves a responsibility of a collective agent for broadcasting to an audience via radio, television, webcast, etc. @en
type: Property
domain: C10011
has element type: 2
sub property of: kustantaja (yhteistoimija) manifestaatiossa
sub property of: lähetyksestä vastaava toimija manifestaatiossa
definition: Liittää yhteistoimijan manifestaatioon, jossa yhteistoimija on vastuussaa radio-, televisio-, suoratoisto- tms. lähetyksen toteuttamisesta yleisölle.
toolkit label: lähetyksestä vastaava yhteistoimija manifestaatiossa
toolkit definition: Manifestaatio, jossa yhteistoimija on vastuussaa radio-, televisio-, suoratoisto- tms. lähetyksen toteuttamisesta yleisölle.
label: er kringkaster av (kollektiv agent) @no
definition: Relaterer en kollektiv agent til en manifestasjon som involverer et ansvar for en kollektiv agent i form av kringkasting til et publikum via radio, fjernsyn, webkast etc. @no
toolkit label: kringkaster av (kollektiv agent) @no
toolkit definition: En manifestasjon som involverer et ansvar for en kollektiv agent i form av kringkasting til et publikum via radio, fjernsyn, webkast etc. @no
label: is uitzender-collectieve actor van @nl
definition: Relateert een collectieve actor aan een manifestatie die met zich meebrengt een verantwoordelijkheid van een collectieve actor voor uitzending naar een publiek via radio, televisie, webcast etc. @nl
toolkit label: uitzender-collectieve actor van @nl
toolkit definition: Een manifestatie die met zich meebrengt een verantwoordelijkheid van een collectieve actor voor uitzending naar een publiek via radio, televisie, webcast etc. @nl
label: هو وكيل جماعي مذيع لـ @ar
definition: يربط وكيلا جماعيا بتجسيدة تنطوي على مسئولية وكيل جماعي عن البث إلى جمهور عبر الإذاعة والتلفزيون والإنترنت، الخ. @ar
toolkit label: وكيل جماعي مذيع @ar
toolkit definition: تجسيدة تنطوي على مسئولية وكيل جماعي عن البث إلى جمهور عبر الإذاعة والتلفزيون والإنترنت، الخ. @ar
label: és agent col·lectiu difusor audiovisual de @ca
definition: Relaciona un agent col·lectiu amb una manifestació que implica una responsabilitat d’un agent col·lectiu en la difusió a uns destinataris mitjançant la ràdio, la televisió, el web, etc. @ca
toolkit label: agent col·lectiu difusor audiovisual de @ca
toolkit definition: Manifestació que implica una responsabilitat d’un agent col·lectiu en la difusió a uns destinataris mitjançant la ràdio, la televisió, el web, etc. @ca
label: er kollektiv agent, som er broadcaster af @da
definition: Relaterer en kollektiv agent til en manifestation, som involverer en kollektiv agents ansvar for at transmittere til et publikum via radio, tv, webcast etc. @da
toolkit label: kollektiv agent, som er broadcaster af @da
toolkit definition: Manifestation, som involverer en kollektiv agents ansvar for at transmittere til et publikum via radio, tv, webcast etc. @da
label: leviedastaja (kollektiiv) kehastuses @et
definition: Seostab kollektiivi kehastusega, mis sisaldab kollektiivi vastutust avalikkusele levitamise eest raadio, televisiooni, veebi vms kaudu. @et
toolkit label: leviedastaja (kollektiiv) kehastuses @et
toolkit definition: Kehastus, mis sisaldab kollektiivi vastutust avalikkusele levitamise eest raadio, televisiooni, veebi vms kaudu. @et
label: ist gemeinschaftlicher Akteur als Sender von @de
definition: Setzt einen gemeinschaftlichen Akteur in Beziehung zu einer Manifestation, bei der ein gemeinschaftlicher Akteur für die Ausstrahlung über Hörfunk, Fernsehen oder Webcast und so weiter verantwortlich ist. @de
toolkit label: Gemeinschaftlicher Akteur als Sender von @de
toolkit definition: Eine Manifestation, bei der ein gemeinschaftlicher Akteur für die Ausstrahlung über Hörfunk, Fernsehen oder Webcast und so weiter verantwortlich ist. @de
label: műsorszolgáltató kollektív ágense a következőnek: @hu
definition: Hozzákapcsol egy kollektív ágenst egy megjelenési formához, amelyhez hozzátartozik egy kollektív ágens felelőssége műsorszórásért, amely a közönség felé rádión, televízión, webes közvetítésen stb. keresztül történik. @hu
toolkit label: műsorszolgáltató kollektív ágense: @hu
toolkit definition: Egy megjelenési forma, amelyhez hozzátartozik egy kollektív ágens felelőssége műsorszórásért, amely a közönség felé rádión, televízión, webes közvetítésen stb. keresztül történik. @hu
label: è emittente agente collettivo di @it
definition: Correla un agente collettivo a una manifestazione che implica una responsabilità di un agente collettivo nella trasmissione a un pubblico via radio, televisione, web, etc. @it
toolkit label: emittente agente collettivo di @it
toolkit definition: Manifestazione che implica una responsabilità di un agente collettivo nella trasmissione a un pubblico via radio, televisione, web, etc. @it
label: είναι ευρυεκπομπέας συλλογικός φορέας του @el
toolkit label: ευρυεκπομπέας συλλογικός φορέας του @el
label: est un agent collectif diffuseur audiovisuel de @fr
definition: Met un agent collectif en relation avec une manifestation qui comporte une responsabilité de la part d’un agent collectif en ce qui concerne la diffusion à un public par la radio, la télévision, la webdiffusion, etc. @fr
toolkit label: agent collectif diffuseur audiovisuel de @fr
toolkit definition: Manifestation qui comporte une responsabilité de la part d’un agent collectif en ce qui concerne la diffusion à un public par la radio, la télévision, la webdiffusion, etc. @fr
label: ir raidorganizācija (grupa) @lv
definition: Sasaista grupu ar manifestāciju, kas ietver grupas atbildību par pārraidi, izmantojot radio, televīziju, tīmekļa apraidi u.tml. @lv
toolkit label: ir raidorganizācija (grupa) @lv
toolkit definition: Manifestācija, kas ietver grupas atbildību par pārraidi, izmantojot radio, televīziju, tīmekļa apraidi u.tml. @lv
label: 是……的广播者集体行为者 @zh-hans
definition: 将一个集体行为者与涉及一个通过广播、电视、网路直播等向听众播音的一个集体行为者的责任的一种载体表现关联起来。 @zh-hans
toolkit label: ……的广播者集体行为者 @zh-hans
toolkit definition: 涉及一个通过广播、电视、网路直播等向听众播音的一个集体行为者的责任的一种载体表现 @zh-hans
label: yayıncı kolektif temsilcisidir @tr
definition: Kolektif bir temsilciyi, radyo, televizyon, web yayını vb. yoluyla bir izleyici kitlesine yayın yapma sorumluluğunu içeren bir gösterimle ilişkilendirir. @tr
toolkit label: yayıncı kolektif temsilcisi @tr
toolkit definition: Bir kitleye radyo, televizyon, web yayını vb. yoluyla yayın yapmak için kolektif bir temsilcinin sorumluluğunu içeren bir gösterim. @tr
has subproperty: lähetyksestä vastaava yhteisö manifestaatiossa
has subproperty: lähetyksestä vastaava suku manifestaatiossa
has subproperty: P50644

lähetyksestä vastaava yhteisö manifestaatiossa
status: Published
label: is broadcaster corporate body of @en
lexical alias: broadcasterCorporateBodyOf.en
definition: Relates a corporate body to a manifestation that involves a responsibility of a corporate body for broadcasting to an audience via radio, television, webcast, etc. @en
toolkit label: broadcaster corporate body of @en
toolkit definition: A manifestation that involves a responsibility of a corporate body for broadcasting to an audience via radio, television, webcast, etc. @en
type: Property
domain: C10005
has element type: 2
sub property of: kustantaja (yhteisö) manifestaatiossa
sub property of: lähetyksestä vastaava yhteistoimija manifestaatiossa
definition: Liittää yhteisön manifestaatioon, jossa yhteisö on vastuussa radio-, televisio-, suoratoisto- tms. lähetyksen toteuttamisesta yleisölle.
toolkit label: lähetyksestä vastaava yhteisö manifestaatiossa
toolkit definition: Manifestaatio, jossa yhteisö on vastuussa radio-, televisio-, suoratoisto- tms. lähetyksen toteuttamisesta yleisölle.
label: er kringkaster av (korporasjon) @no
definition: Relaterer en korporasjon til en manifestasjon som involverer et ansvar for en korporasjon i form av kringkasting til et publikum via radio, fjernsyn, webkast etc. @no
toolkit label: kringkaster av (korporasjon) @no
toolkit definition: En manifestasjon som involverer et ansvar for en korporasjon i form av kringkasting til et publikum via radio, fjernsyn, webkast etc. @no
label: is uitzender-corporatie van @nl
definition: Relateert een corporatie aan een manifestatie die met zich meebrengt een verantwoordelijkheid van een corporatie voor uitzending naar een publiek via radio, televisie, webcast etc. @nl
toolkit label: uitzender-corporatie van @nl
toolkit definition: Een manifestatie die met zich meebrengt een verantwoordelijkheid van een corporatie voor uitzending naar een publiek via radio, televisie, webcast etc. @nl
label: هي هيئة مسئولة عن الإذاعة لـ @ar
definition: يربط هيئة بتجسيدة تنطوي على مسئولية هيئة عن البث إلى جمهور عبر الإذاعة والتلفزيون والإنترنت، الخ. @ar
toolkit label: هيئة مسئولة عن الإذاعة @ar
toolkit definition: تجسيدة تنطوي على مسئولية هيئة عن البث إلى جمهور عبر الإذاعة والتلفزيون والإنترنت، الخ. @ar
label: és entitat corporativa difusora audiovisual de @ca
definition: Relaciona una entitat corporativa amb una manifestació que implica una responsabilitat d’una entitat corporativa en la difusió a uns destinataris mitjançant la ràdio, la televisió, el web, etc. @ca
toolkit label: entitat corporativa difusora audiovisual de @ca
toolkit definition: Manifestació que implica una responsabilitat d’una entitat corporativa en la difusió a uns destinataris mitjançant la ràdio, la televisió, el web, etc. @ca
label: er korporation, som er broadcaster af @da
definition: Relaterer en korporation til en manifestation, som involverer en korporations ansvar for at transmittere til et publikum via radio, tv, webcast etc. @da
toolkit label: korporation, som er broadcaster af @da
toolkit definition: Manifestation, som involverer en korporations ansvar for at transmittere til et publikum via radio, tv, webcast etc. @da
label: leviedastaja (asutus) kehastuses @et
definition: Seostab asutuse kehastusega, mis sisaldab asutuse vastutust avalikkusele levitamise eest raadio, televisiooni, veebi vms kaudu. @et
toolkit label: leviedastaja (asutus) kehastuses @et
toolkit definition: Kehastus, mis sisaldab asutuse vastutust avalikkusele levitamise eest raadio, televisiooni, veebi vms kaudu. @et
label: ist Körperschaft als Sender von @de
definition: Setzt eine Körperschaft in Beziehung zu einer Manifestation, bei der eine Körperschaft für die Ausstrahlung über Hörfunk, Fernsehen oder Webcast und so weiter verantwortlich ist. @de
toolkit label: Körperschaft als Sender von @de
toolkit definition: Eine Manifestation, bei der eine Körperschaft für die Ausstrahlung über Hörfunk, Fernsehen oder Webcast und so weiter verantwortlich ist. @de
label: műsorszolgáltató testülete a következőnek: @hu
definition: Hozzákapcsol egy testületet egy megjelenési formához, amelyhez hozzátartozik egy testület felelőssége műsorszórásért, amely a közönség felé rádión, televízión, webes közvetítésen stb. keresztül történik. @hu
toolkit label: műsorszolgáltató testülete: @hu
toolkit definition: Egy megjelenési forma, amelyhez hozzátartozik egy testület felelőssége műsorszórásért, amely a közönség felé rádión, televízión, webes közvetítésen stb. keresztül történik. @hu
label: è emittente ente di @it
definition: Correla un ente collettivo a una manifestazione che implica una responsabilità di un ente per la trasmissione a un pubblico via radio, televisione, web, etc. @it
toolkit label: emittente ente di @it
toolkit definition: Manifestazione che implica una responsabilità di un ente per la trasmissione a un pubblico via radio, televisione, web, etc. @it
label: είναι ευρυεκπομπέας συλλογικό όργανο του @el
toolkit label: ευρυεκπομπέας συλλογικό όργανο του @el
label: est une collectivité diffuseuse audiovisuelle de @fr
definition: Met une collectivité en relation avec une manifestation qui comporte une responsabilité de la part d’une collectivité en ce qui concerne la diffusion à un public par la radio, la télévision, la webdiffusion, etc. @fr
toolkit label: collectivité diffuseuse audiovisuelle de @fr
toolkit definition: Manifestation qui comporte une responsabilité de la part d’une collectivité en ce qui concerne la diffusion à un public par la radio, la télévision, la webdiffusion, etc. @fr
label: ir raidorganizācija (institūcija) @lv
definition: Sasaista institūciju ar manifestāciju, kas ietver institūcijas atbildību par pārraidi, izmantojot radio, televīziju, tīmekļa apraidi u.tml. @lv
toolkit label: ir raidorganizācija (institūcija) @lv
toolkit definition: Manifestācija, kas ietver institūcijas atbildību par pārraidi, izmantojot radio, televīziju, tīmekļa apraidi u.tml. @lv
label: 是……的广播者团体 @zh-hans
definition: 将一个团体与涉及一个通过广播、电视、网路直播等向听众播音的一个团体的责任的一种载体表现关联起来。 @zh-hans
toolkit label: ……的广播者团体 @zh-hans
toolkit definition: 涉及一个通过广播、电视、网路直播等向听众播音的一个团体的责任的一种载体表现 @zh-hans
label: yayıncı tüzel kişisidir @tr
definition: Bir tüzel kişiyi radyo, televizyon, web yayını vb. aracılığıyla bir izleyici kitlesine yayın yapmak için tüzel bir kişinin sorumluluğunu içeren bir gösterimle ilişkilendirir. @tr
toolkit label: yayıncı tüzel kişisi @tr
toolkit definition: Bir tüzel kişinin radyo, televizyon, web yayını vb. aracılığıyla bir izleyici kitlesine yayın yapma sorumluluğunu içeren bir gösterim. @tr
has subproperty: P50795

lähetyksestä vastaava suku manifestaatiossa
status: Published
label: is broadcaster family of @en
lexical alias: broadcasterFamilyOf.en
definition: Relates a family to a manifestation that involves a responsibility of a family for broadcasting to an audience via radio, television, webcast, etc. @en
toolkit label: broadcaster family of @en
toolkit definition: A manifestation that involves a responsibility of a family for broadcasting to an audience via radio, television, webcast, etc. @en
type: Property
domain: C10008
has element type: 2
sub property of: kustantaja (suku) manifestaatiossa
sub property of: lähetyksestä vastaava yhteistoimija manifestaatiossa
definition: Liittää suvun manifestaatioon, jossa suku on vastuussa radio-, televisio-, suoratoisto- tms. lähetyksen toteuttamisesta yleisölle.
toolkit label: lähetyksestä vastaava suku manifestaatiossa
toolkit definition: Manifestaatio, jossa suku on vastuussa radio-, televisio-, suoratoisto- tms. lähetyksen toteuttamisesta yleisölle.
label: er kringkaster av (familie) @no
definition: Relaterer en familie til en manifestasjon som involverer et ansvar for en familie i form av kringkasting til et publikum via radio, fjernsyn, webkast etc. @no
toolkit label: kringkaster av (familie) @no
toolkit definition: En manifestasjon som involverer et ansvar for en familie i form av kringkasting til et publikum via radio, fjernsyn, webkast etc. @no
label: is uitzender-familie van @nl
definition: Relateert een familie aan een manifestatie die met zich meebrengt een verantwoordelijkheid van een familie voor uitzending naar een publiek via radio, televisie, webcast etc. @nl
toolkit label: uitzender-familie van @nl
toolkit definition: Een manifestatie die met zich meebrengt een verantwoordelijkheid van een familie voor uitzending naar een publiek via radio, televisie, webcast etc. @nl
label: هي عائلة مسئولة عن الإذاعة لـ @ar
definition: يربط عائلة بتجسيدة تنطوي على مسئولية عائلة عن البث إلى جمهور عبر الإذاعة والتلفزيون والإنترنت، الخ. @ar
toolkit label: عائلة مسئولة عن الإذاعة @ar
toolkit definition: تجسيدة تنطوي على مسئولية عائلة عن البث إلى جمهور عبر الإذاعة والتلفزيون والإنترنت، الخ. @ar
label: és família difusora audiovisual de @ca
definition: Relaciona una família amb una manifestació que implica una responsabilitat d’una família en la difusió a uns destinataris mitjançant la ràdio, la televisió, el web, etc. @ca
toolkit label: família difusora audiovisual de @ca
toolkit definition: Manifestació que implica una responsabilitat d’una família en la difusió a uns destinataris mitjançant la ràdio, la televisió, el web, etc. @ca
label: er familie, som er broadcaster af @da
definition: Relaterer en familie til en manifestation, som involverer en families ansvar for at transmittere til et publikum via radio, tv, webcast etc. @da
toolkit label: familie, som er broadcaster af @da
toolkit definition: Manifestation, som involverer en families ansvar for at transmittere til et publikum via radio, tv, webcast etc. @da
label: leviedastaja (perekond) kehastuses @et
definition: Seostab perekonna kehastusega, mis sisaldab perekonna vastutust avalikkusele levitamise eest raadio, televisiooni, veebi vms kaudu. @et
toolkit label: leviedastaja (perekond) kehastuses @et
toolkit definition: Kehastus, mis sisaldab perekonna vastutust avalikkusele levitamise eest raadio, televisiooni, veebi vms kaudu. @et
label: ist Familie als Sender von @de
definition: Setzt eine Familie in Beziehung zu einer Manifestation, bei der eine Familie für die Ausstrahlung über Hörfunk, Fernsehen oder Webcast verantwortlich ist. @de
toolkit label: Familie als Sender von @de
toolkit definition: Eine Manifestation, bei der eine Familie für die Ausstrahlung über Hörfunk, Fernsehen oder Webcast verantwortlich ist. @de
label: műsorszolgáltató családja a következőnek: @hu
definition: Hozzákapcsol egy családot egy megjelenési formához, amelyhez hozzátartozik egy testület felelőssége műsorszórásért, amely a közönség felé rádión, televízión, webes közvetítésen stb. keresztül történik. @hu
toolkit label: műsorszolgáltató családja: @hu
toolkit definition: Egy megjelenési forma, amelyhez hozzátartozik egy testület felelőssége műsorszórásért, amely a közönség felé rádión, televízión, webes közvetítésen stb. keresztül történik. @hu
label: è emittente famiglia di @it
definition: Correla una famiglia a una manifestazione che implica una responsabilità di una famiglia per la trasmissione a un pubblico via radio, televisione, web, etc. @it
toolkit label: emittente famiglia di @it
toolkit definition: Manifestazione che implica una responsabilità di una famiglia per la trasmissione a un pubblico via radio, televisione, web, etc. @it
label: είναι ευρυεκπομπέας οικογένεια του @el
toolkit label: ευρυεκπομπέας οικογένεια του @el
label: est une famille diffuseuse audiovisuelle de @fr
definition: Met une famille en relation avec une manifestation qui comporte une responsabilité de la part d’une famille concernant la diffusion à un public par la radio, la télévision, la webdiffusion, etc. @fr
toolkit label: famille diffuseuse audiovisuelle de @fr
toolkit definition: Manifestation qui comporte une responsabilité de la part d’une famille concernant la diffusion à un public par la radio, la télévision, la webdiffusion, etc. @fr
label: ir raidorganizācija (dzimta/ģimene) @lv
definition: Sasaista dzimtu/ģimeni ar manifestāciju, kas ietver dzimtas/ģimenes atbildību par pārraidi, izmantojot radio, televīziju, tīmekļa apraidi u.tml. @lv
toolkit label: ir raidorganizācija (dzimta/ģimene) @lv
toolkit definition: Manifestācija, kas ietver dzimtas/ģimenes atbildību par pārraidi, izmantojot radio, televīziju, tīmekļa apraidi u.tml. @lv
label: 是……的广播者家族 @zh-hans
definition: 将一个家族与涉及一个通过广播、电视、网路直播等向听众播音的一个家族的责任的一种载体表现关联起来。 @zh-hans
toolkit label: ……的广播者家族 @zh-hans
toolkit definition: 涉及一个通过广播、电视、网路直播等向听众播音的一个家族的责任的一种载体表现 @zh-hans
label: yayıncı ailesidir @tr
definition: Bir aileyi radyo, televizyon, web yayını vb. aracılığıyla izleyici kitlesine yayın yapma sorumluluğunu içeren bir gösterimle ilişkilendirir. @tr
toolkit label: yayıncı ailesi @tr
toolkit definition: Bir ailenin radyo, televizyon, web yayını vb. aracılığıyla izleyici kitlesine yayın yapma sorumluluğunu içeren bir gösterim. @tr
has subproperty: P50946

lähetyksestä vastaava henkilö manifestaatiossa
status: Published
label: is broadcaster person of @en
lexical alias: broadcasterPersonOf.en
definition: Relates a person to a manifestation that involves a responsibility of a person for broadcasting to an audience via radio, television, webcast, etc. @en
toolkit label: broadcaster person of @en
toolkit definition: A manifestation that involves a responsibility of a person for broadcasting to an audience via radio, television, webcast, etc. @en
type: Property
domain: C10004
has element type: 2
sub property of: kustantaja (henkilö) manifestaatiossa
sub property of: lähetyksestä vastaava toimija manifestaatiossa
definition: Liittää henkilön manifestaatioon, jossa henkilö on vastuussa radio-, televisio-, suoratoisto- tms. lähetyksen toteuttamisesta yleisölle.
toolkit label: lähetyksestä vastaava henkilö manifestaatiossa
toolkit definition: Manifestaatio, jossa henkilö on vastuussa radio-, televisio-, suoratoisto- tms. lähetyksen toteuttamisesta yleisölle.
label: er kringkaster av (person) @no
definition: Relaterer en person til en manifestasjon som involverer et ansvar for en person i form av kringkasting til et publikum via radio, fjernsyn, webkast etc. @no
toolkit label: kringkaster av (person) @no
toolkit definition: En manifestasjon som involverer et ansvar for en person i form av kringkasting til et publikum via radio, fjernsyn, webkast etc. @no
label: is uitzender-persoon van @nl
definition: Relateert een persoon aan een manifestatie die met zich meebrengt een verantwoordelijkheid van een persoon voor uitzending naar een publiek via radio, televisie, webcast etc. @nl
toolkit label: uitzender-persoon van @nl
toolkit definition: Een manifestatie die met zich meebrengt een verantwoordelijkheid van een persoon voor uitzending naar een publiek via radio, televisie, webcast etc. @nl
label: هو شخص مذيع لـ @ar
definition: يربط شخصا بتجسيدة تنطوي على مسئولية شخص عن البث إلى جمهور عبر الإذاعة والتلفزيون والإنترنت، الخ. @ar
toolkit label: شخص مذيع @ar
toolkit definition: تجسيدة تنطوي على مسئولية شخص عن البث إلى جمهور عبر الإذاعة والتلفزيون والإنترنت، الخ. @ar
label: és persona difusora audiovisual de @ca
definition: Relaciona una persona amb una manifestació que implica una responsabilitat d’una persona en la difusió a uns destinataris mitjançant la ràdio, la televisió, el web, etc. @ca
toolkit label: persona difusora audiovisual de @ca
toolkit definition: Manifestació que implica una responsabilitat d’una persona en la difusió a uns destinataris mitjançant la ràdio, la televisió, el web, etc. @ca
label: er person, som er broadcaster af @da
definition: Relaterer en person til en manifestation, som involverer en persons ansvar for at transmittere til et publikum via radio, tv, webcast etc. @da
toolkit label: person, som er broadcaster af @da
toolkit definition: Manifestation, som involverer en persons ansvar for at transmittere til et publikum via radio, tv, webcast etc. @da
label: leviedastaja (isik) kehastuses @et
definition: Seostab isiku kehastusega, mis sisaldab isiku vastutust avalikkusele levitamise eest raadio, televisiooni, veebi vms kaudu. @et
toolkit label: leviedastaja (isik) kehastuses @et
toolkit definition: Kehastus, mis sisaldab isiku vastutust avalikkusele levitamise eest raadio, televisiooni, veebi vms kaudu. @et
label: ist Person als Sender von @de
definition: Setzt eine Person in Beziehung zu einer Manifestation, bei der eine Person für die Ausstrahlung über Hörfunk, Fernsehen oder Webcast verantwortlich ist. @de
toolkit label: Person als Sender von @de
toolkit definition: Eine Manifestation, bei der eine Person für die Ausstrahlung über Hörfunk, Fernsehen oder Webcast verantwortlich ist. @de
label: műsorszolgáltató személye a következőnek: @hu
definition: Hozzákapcsol egy személyt egy megjelenési formához, amelyhez hozzátartozik egy személy felelőssége műsorszórásért, amely a közönség felé rádión, televízión, webes közvetítésen stb. keresztül történik. @hu
toolkit label: műsorszolgáltató személye: @hu
toolkit definition: Egy megjelenési forma, amelyhez hozzátartozik egy személy felelőssége műsorszórásért, amely a közönség felé rádión, televízión, webes közvetítésen stb. keresztül történik. @hu
label: è emittente persona di @it
definition: Correla una persona a una manifestazione che implica una responsabilità di una persona nella trasmissione a un pubblico via radio, televisione, web, etc. @it
toolkit label: emittente persona di @it
toolkit definition: Manifestazione che implica una responsabilità di una persona nella trasmissione a un pubblico via radio, televisione, web, etc. @it
label: είναι ευρυεκπομπέας φυσικό πρόσωπο του @el
toolkit label: ευρυεκπομπέας φυσικό πρόσωπο του @el
label: est une personne diffuseuse audiovisuelle de @fr
definition: Met une personne en relation avec une manifestation qui comporte une responsabilité de la part d’une personne concernant la diffusion à un public par la radio, la télévision, la webdiffusion, etc. @fr
toolkit label: personne diffuseuse audiovisuelle de @fr
toolkit definition: Manifestation qui comporte une responsabilité de la part d’une personne concernant la diffusion à un public par la radio, la télévision, la webdiffusion, etc. @fr
label: ir raidorganizācija (persona) @lv
definition: Sasaista personu ar manifestāciju, kas ietver personas atbildību par pārraidi, izmantojot radio, televīziju, tīmekļa apraidi u.tml. @lv
toolkit label: ir raidorganizācija (persona) @lv
toolkit definition: Manifestācija, kas ietver personas atbildību par pārraidi, izmantojot radio, televīziju, tīmekļa apraidi u.tml. @lv
label: 是……的广播者个人 @zh-hans
definition: 将一个个人与涉及通过广播、电视、网络直播等向听众播音的一个个人的责任的一种载体表现关联起来。 @zh-hans
toolkit label: ……的广播者个人 @zh-hans
toolkit definition: 涉及通过广播、电视、网络直播等向听众播音的一个个人的责任的一种载体表现 @zh-hans
label: yayıncı kişisidir @tr
definition: Bir kişiyi, radyo, televizyon, web yayını vb. aracılığıyla bir izleyici kitlesine yayın yapma sorumluluğunu içeren gösterimle ilişkilendirir. @tr
toolkit label: yayıncı @tr
toolkit definition: Bir kişinin radyo, televizyon, web yayını vb. aracılığıyla bir izleyici kitlesine yayın yapma sorumluluğunu içeren bir gösterim. @tr
has subproperty: P50493

kalligrafi (toimija) teoksessa
status: Published
type: Property
label: is calligrapher agent of @en
lexical alias: calligrapherAgentOf.en
definition: Relates an agent to a work that involves a responsibility of an agent for calligraphy where the focus of interest lies in the aesthetic value of the penmanship or graphic artistry, regardless of whether the same agent is also responsible for the inscribed text. @en
domain: C10002
label: est un agent calligraphe de @fr
definition: Met un agent en relation avec une œuvre qui comporte une responsabilité de la part d’un agent en ce qui concerne la calligraphie où l’accent est mis sur la valeur esthétique de la calligraphie ou du graphisme, peu importe que le même agent soit aussi responsable du texte calligraphié. @fr
toolkit label: agent calligraphe de @fr
toolkit definition: Œuvre qui comporte une responsabilité de la part d’un agent en ce qui concerne la calligraphie où l’accent est mis sur la valeur esthétique de la calligraphie ou du graphisme, peu importe que le même agent soit aussi responsable du texte calligraphié. @fr
toolkit label: calligrapher agent of @en
toolkit definition: A work that involves a responsibility of an agent for calligraphy where the focus of interest lies in the aesthetic value of the penmanship or graphic artistry, regardless of whether the same agent is also responsible for the inscribed text. @en
instruction number: 18.5
sub property of: taiteilija (toimija) teoksessa
label: είναι καλλιγράφος φορέας του @el
definition: Συνδέει έναν καλλιτέχνη υπεύθυνο για τη δημιουργία ενός καλλιγραφικού έργου, όπου το ενδιαφέρον εστιάζει στην αισθητική αξία της καλλιγραφίας ή της γραφικής δεξιοτεχνίας, ανεξάρτητα από το αν πρόκειται για το ίδιο φυσικό πρόσωπο κ.λπ., με ένα έργο. @el
toolkit label: καλλιγράφος φορέας του @el
toolkit definition: Ένα έργο καλλιγραφίας που περιλαμβάνει την καλλιτεχνική ευθύνη, όπου το ενδιαφέρον εστιάζει στην αισθητική αξία της καλλιγραφίας ή της γραφικής δεξιοτεχνίας, ανεξάρτητα από το αν πρόκειται για το ίδιο φυσικό πρόσωπο κ.λπ., το οποίο είναι υπεύθυνο για το εγγραφόμενο κείμενο. @el
definition: Setzt einen Akteur in Beziehung zu einem Werk, bei dem ein Akteur für die Kalligrafie verantwortlich ist, bei der der ästhetische Wert der Schreibkunst oder die grafische Kunstfertigkeit im Mittelpunkt des Interesses liegt, unabhängig davon, ob derselbe Akteur auch für den aufgeschriebenen Text verantwortlich ist. @de
toolkit label: Akteur als Kalligrafin/Kalligraf von @de
toolkit definition: Ein Werk, bei dem ein Akteur für die Kalligrafie verantwortlich ist, bei der der ästhetische Wert der Schreibkunst oder die grafische Kunstfertigkeit im Mittelpunkt des Interesses liegt, unabhängig davon, ob derselbe Akteur auch für den aufgeschriebenen Text verantwortlich ist. @de
label: er agent, som er kalligraf af @da
definition: Relaterer en agent til et værk, som involverer en agents ansvar for kalligrafi, hvor fokus ligger på den æstetiske værdi af skrivekunsten eller den kunstneriske grafiske dygtighed, uagtet om den samme agent også har forfattet den indskrevne tekst. @da
toolkit label: agent, som er kalligraf af @da
toolkit definition: Værk, som involverer en agents ansvar for kalligrafi, hvor fokus ligger på den æstetiske værdi af skrivekunsten eller den kunstneriske grafiske dygtighed, uagtet om den samme agent også har forfattet den indskrevne tekst. @da
label: és agent cal·lígraf de @ca
definition: Relaciona un agent amb una obra que implica una responsabilitat d’un agent en la cal·ligrafia on el centre de l’interès se situa en el valor estètic de la cal·ligrafia o del grafisme, independentment de si el mateix agent és també responsable del text inscrit. @ca
toolkit label: agent cal·lígraf de @ca
toolkit definition: Obra que implica una responsabilitat d’un agent en la cal·ligrafia on el centre de l’interès se situa en el valor estètic de la cal·ligrafia o del grafisme, independentment de si el mateix agent és també responsable del text inscrit. @ca
definition: Liittää toimijan teokseen, jossa toimija on vastuussa kalligrafiasta, jossa pääpaino on käsin kirjoittamisen tai graafisen taiteen esteettisissä arvoissa, riippumatta siitä, onko sama toimija myös vastuussa kirjoitetusta tekstistä.
toolkit label: kalligrafi (toimija) teoksessa
toolkit definition: Teos, jossa toimija on vastuussa kalligrafiasta, jossa pääpaino on käsin kirjoittamisen tai graafisen taiteen esteettisissä arvoissa, riippumatta siitä, onko sama toimija myös vastuussa kirjoitetusta tekstistä.
toolkit label: kalligraf for (agent) @no
toolkit definition: Et verk som involverer ansvar for en agent i form av kalligrafi hvor fokuset er rettet mot den estetiske verdien av pennekunsten eller den kunstneriske dyktigheten, uavhengig av om den samme agenten også er ansvarlig for den inskriberte teksten. @no
label: ist Akteur als Kalligrafin/Kalligraf von @de
has element type: 2
label: kalligráfus ágense a következőnek: @hu
definition: Hozzákapcsol egy ágenst egy műhöz, amelyhez hozzátartozik egy ágens szépírással kapcsolatos felelőssége, ahol az érdeklődés középpontjában a kézírás esztétikai értéke vagy a grafika művészisége áll, tekintet nélkül arra, hogy ugyanaz az ágens a lejegyzett szöveg szerzője is egyben vagy sem. @hu
toolkit label: kalligráfus ágense: @hu
toolkit definition: Egy mű, amelyhez hozzátartozik egy ágens szépírással kapcsolatos felelőssége, ahol az érdeklődés középpontjában a kézírás esztétikai értéke vagy a grafika művészisége áll, tekintet nélkül arra, hogy ugyanaz az ágens a lejegyzett szöveg szerzője is egyben vagy sem. @hu
alternative label: calligrapher of @en
alternative label: kalligrafina kalligrafiassa
label: er kalligraf for (agent) @no
definition: Relaterer en agent til et verk som involverer ansvar for en agent i form av kalligrafi hvor fokuset er rettet mot den estetiske verdien av pennekunsten eller den kunstneriske dyktigheten, uavhengig av om den samme agenten også er ansvarlig for den inskriberte teksten. @no
alternative label: kalligraf for @no
label: is kalligraaf-actor van @nl
definition: Relateert een actor aan een werk dat met zich meebrengt een verantwoordelijkheid van een actor voor kalligrafie waar de aandacht primair uitgaat naar de esthetische waarde van de schrijfkunst of grafische kunstenaarschap, ongeacht of dezelfde actor ook verantwoordelijk is voor de inscriptie. @nl
toolkit label: kalligraaf-actor van @nl
toolkit definition: Een werk dat met zich meebrengt een verantwoordelijkheid van een actor voor kalligrafie waar de aandacht primair uitgaat naar de esthetische waarde van de schrijfkunst of grafische kunstenaarschap, ongeacht of dezelfde actor ook verantwoordelijk is voor de inscriptie. @nl
label: هو وكيل خطاط لـ @ar
definition: يربط وكيلا بعمل يترتب عليه مسئولية وكيل عن الخطاطة حيث ينصب الاهتمام على القيمة الجمالية لفن الخط أو فن الرسم، بغض النظر عما إذا كان الوكيل نفسه مسئولا أيضًا عن النص المكتوب. @ar
alternative label: خطّاط لـ @ar
toolkit label: وكيل خطاط @ar
toolkit definition: عمل يترتب عليه مسئولية وكيل عن الخط حيث ينصب الاهتمام على القيمة الجمالية لفن الخط أو فن الرسم، بغض النظر عن مسئولية هذا الوكيل أيضًا عن النص المكتوب. @ar
alternative label: cal·lígraf de @ca
alternative label: kalligraf af @da
label: kalligraaf (tegija) teoses @et
definition: Seostab tegija teosega, mis sisaldab tegija vastutust ilukirja eest. Ilukirja põhirõhk on kirjakunsti või graafilise kunstnikutöö esteetilisel väärtusel, olenemata sellest, kas sama tegija on vastutav ka kirjutatud teksti eest. @et
alternative label: kalligraaf teoses @et
toolkit label: kalligraaf (tegija) teoses @et
toolkit definition: Teos, mis sisaldab tegija vastutust ilukirja eest. Ilukirja põhirõhk on kirjakunsti või graafilise kunstnikutöö esteetilisel väärtusel, olenemata sellest, kas sama tegija on vastutav ka kirjutatud teksti eest. @et
alternative label: kalligráfusa: @hu
label: è calligrafo agente di @it
definition: Correla un agente a un'opera che implica la responsabilità di un agente per la calligrafia dove il centro dell'interesse sta nel valore estetico della scrittura o della perizia grafica, a prescindere che lo stesso agente sia responsabile anche del testo scritto. @it
alternative label: calligrafo di @it
toolkit label: calligrafo agente di @it
toolkit definition: Opera che implica la responsabilità di un agente per la calligrafia dove il centro dell'interesse sta nel valore estetico della scrittura o della perizia grafica, a prescindere che lo stesso agente sia responsabile anche del testo scritto. @it
alternative label: καλλιγράφος του @el
alternative label: calligraphe de @fr
label: ir kaligrāfs (aģents) @lv
definition: Sasaista aģentu ar darbu, kas ietver aģenta atbildību par kaligrāfiju, kurā galvenā uzmanība tiek pievērsta mākslinieciskās vai grafiskās meistarības estētiskajai vērtībai, neatkarīgi no tā, vai tā pati grupa ir atbildīgs arī par uzrakstīto tekstu. @lv
toolkit label: ir kaligrāfs (aģents) @lv
toolkit definition: Darbs, kas ietver aģenta atbildību par kaligrāfiju, kurā galvenā uzmanība tiek pievērsta mākslinieciskās vai grafiskās meistarības estētiskajai vērtībai, neatkarīgi no tā, vai tā pati grupa ir atbildīgs arī par uzrakstīto tekstu @lv
alternative label: Kalligraf von @de
alternative label: ……的书法者 @zh-hans
toolkit label: ……的书法者行为者 @zh-hans
toolkit definition: 涉及书法（其中兴趣重点是书法或图形艺术的美学价值，不管同一行为者是否负责题写文字）的一个行为者的责任的一种作品 @zh-hans
toolkit label: kaligraf temsilcisi @tr
toolkit definition: Yazılı metinden aynı temsilcinin sorumlu olup olmadığına bakılmaksızın, ilgi odağı hattatlığın veya grafik sanatının estetik değerinde olan hat sanatı için bir temsilcinin sorumluluğunu içeren bir eser. @tr
has subproperty: kalligrafi (yhteistoimija) teoksessa

kalligrafi (yhteistoimija) teoksessa
status: Published
label: is calligrapher collective agent of @en
lexical alias: calligrapherCollectiveAgentOf.en
definition: Relates a collective agent to a work that involves a responsibility of a collective agent for calligraphy where the focus of interest lies in the aesthetic value of the penmanship or graphic artistry, regardless of whether the same collective agent is also responsible for the inscribed text. @en
toolkit label: calligrapher collective agent of @en
toolkit definition: A work that involves a responsibility of a collective agent for calligraphy where the focus of interest lies in the aesthetic value of the penmanship or graphic artistry, regardless of whether the same collective agent is also responsible for the inscribed text. @en
type: Property
domain: C10011
has element type: 2
sub property of: taiteilija (yhteistoimija) teoksessa
sub property of: kalligrafi (toimija) teoksessa
definition: Liittää yhteistoimijan teokseen, jossa yhteistoimija on vastuussa kalligrafiasta, jossa pääpaino on käsin kirjoittamisen tai graafisen taiteen esteettisissä arvoissa, riippumatta siitä, onko sama toimija myös vastuussa kirjoitetusta tekstistä.
toolkit label: kalligrafi (yhteistoimija) teoksessa
toolkit definition: Teos, jossa yhteistoimija on vastuussa kalligrafiasta, jossa pääpaino on käsin kirjoittamisen tai graafisen taiteen esteettisissä arvoissa, riippumatta siitä, onko sama toimija myös vastuussa kirjoitetusta tekstistä.
label: er kalligraf for (kollektiv agent) @no
definition: Relaterer en kollektiv agent til et verk som involverer et ansvar for en kollektiv agent i form av kalligrafi der fokus er på den estetiske verdien av pennekunsten eller kunstnerisk dyktighet, uavhengig av om den samme kollektiv agenten også er ansvarlig for tekstinnholdet. @no
toolkit label: kalligraf for (kollektiv agent) @no
toolkit definition: Et verk som involverer et ansvar for en kollektiv agent i form av kalligrafi der fokus er på den estetiske verdien av pennekunsten eller kunstnerisk dyktighet, uavhengig av om den samme kollektiv agenten også er ansvarlig for tekstinnholdet. @no
label: is kalligraaf-collectieve actor van @nl
definition: Relateert een collectieve actor aan een werk dat met zich meebrengt een verantwoordelijkheid van een collectieve actor voor kalligrafie waar de aandacht primair uitgaat naar de esthetische waarde van de schrijfkunst of grafische kunstenaarschap, ongeacht of dezelfde collectieve actor ook verantwoordelijk is voor de inscriptie. @nl
toolkit label: kalligraaf-collectieve actor van @nl
toolkit definition: Een werk dat met zich meebrengt een verantwoordelijkheid van een collectieve actor voor kalligrafie waar de aandacht primair uitgaat naar de esthetische waarde van de schrijfkunst of grafische kunstenaarschap, ongeacht of dezelfde collectieve actor ook verantwoordelijk is voor de inscriptie. @nl
label: هو وكيل جماعي خطاط لـ @ar
definition: يربط وكيلا جماعيا بعمل يترتب عليه مسئولية وكيل جماعي عن الخطاطة، حيث ينصب الاهتمام على القيمة الجمالية لفن الخط أو الرسم، بغض النظر عن مسئولية هذا الوكيل الجماعي أيضًا عن النص المكتوب. @ar
toolkit label: وكيل جماعي خطاط @ar
toolkit definition: عمل يترتب عليه مسئولية وكيل جماعي عن الخِطاطة، حيث ينصب الاهتمام على القيمة الجمالية لفن الخط أو الرسم، بغض النظر عما إذا كان الوكيل الجماعي نفسه مسئولا أيضًا عن النص المكتوب. @ar
label: és agent col·lectiu cal·lígraf de @ca
definition: Relaciona un agent col·lectiu amb una obra que implica una responsabilitat d’un agent col·lectiu en la cal·ligrafia on el centre de l’interès se situa en el valor estètic de la cal·ligrafia o del grafisme, independentment de si el mateix agent col·lectiu és també responsable del text inscrit. @ca
toolkit label: agent col·lectiu cal·lígraf de @ca
toolkit definition: Obra que implica una responsabilitat d’un agent col·lectiu en la cal·ligrafia on el centre de l’interès se situa en el valor estètic de la cal·ligrafia o del grafisme, independentment de si el mateix agent col·lectiu és també responsable del text inscrit. @ca
label: er kollektiv agent, som er kalligraf af @da
definition: Relaterer en kollektiv agent til et værk, som involverer en kollektiv agents ansvar for kalligrafi, hvor fokus ligger på den æstetiske værdi af skrivekunsten eller den kunstneriske grafiske dygtighed, uagtet om den samme kollektiv agent også har forfattet den indskrevne tekst. @da
toolkit label: kollektiv agent, som er kalligraf af @da
toolkit definition: Værk, som involverer en kollektiv agents ansvar for kalligrafi, hvor fokus ligger på den æstetiske værdi af skrivekunsten eller den kunstneriske grafiske dygtighed, uagtet om den samme kollektiv agent også har forfattet den indskrevne tekst. @da
label: kalligraaf (kollektiiv) teoses @et
definition: Seostab kollektiivi teosega, mis sisaldab kollektiivi vastutust ilukirja eest. Ilukirja põhirõhk on kirjakunsti või graafilise kunstnikutöö esteetilisel väärtusel, olenemata sellest, kas sama kollektiiv on vastutav ka kirjutatud teksti eest. @et
toolkit label: kalligraaf (kollektiiv) teoses @et
toolkit definition: Teos, mis sisaldab kollektiivi vastutust ilukirja eest. Ilukirja põhirõhk on kirjakunsti või graafilise kunstnikutöö esteetilisel väärtusel, olenemata sellest, kas sama kollektiiv on vastutav ka kirjutatud teksti eest. @et
label: ist gemeinschaftlicher Akteur als Kalligrafin/Kalligraf von @de
definition: Setzt einen gemeinschaftlichen Akteur in Beziehung zu einem Werk, bei dem ein gemeinschaftlicher Akteur für die Kalligrafie verantwortlich ist, bei der der ästhetische Wert der Schreibkunst oder die grafische Kunstfertigkeit im Mittelpunkt des Interesses liegt, unabhängig davon, ob derselbe gemeinschaftliche Akteur auch für den aufgeschriebenen Text verantwortlich ist. @de
toolkit label: Gemeinschaftlicher Akteur als Kalligrafin/Kalligraf von @de
toolkit definition: Ein Werk, bei dem ein gemeinschaftlicher Akteur für die Kalligrafie verantwortlich ist, bei der der ästhetische Wert der Schreibkunst oder die grafische Kunstfertigkeit im Mittelpunkt des Interesses liegt, unabhängig davon, ob derselbe gemeinschaftliche Akteur auch für den aufgeschriebenen Text verantwortlich ist. @de
label: kalligráfus kollektív ágense a következőnek: @hu
definition: Hozzákapcsol egy kollektív ágenst egy műhöz, amelyhez hozzátartozik egy kollektív ágens szépírással kapcsolatos felelőssége, ahol az érdeklődés középpontjában a kézírás esztétikai értéke vagy a grafika művészisége áll, tekintet nélkül arra, hogy ugyanaz a kollektív ágens a lejegyzett szöveg szerzője is egyben vagy sem. @hu
toolkit label: kalligráfus kollektív ágense: @hu
toolkit definition: Egy mű, amelyhez hozzátartozik egy kollektív ágens szépírással kapcsolatos felelőssége, ahol az érdeklődés középpontjában a kézírás esztétikai értéke vagy a grafika művészisége áll, tekintet nélkül arra, hogy ugyanaz a kollektív ágens a lejegyzett szöveg szerzője is egyben vagy sem. @hu
label: è calligrafo agente collettivo di @it
definition: Correla un agente collettivo a un'opera che implica una responsabilità di un agente collettivo nella calligrafia dove l'interesse risiede nel valore estetico della scrittura o della perizia grafica, a prescindere che lo stesso agente collettivo sia responsabile anche del testo scritto. @it
toolkit label: calligrafo agente collettivo di @it
toolkit definition: Opera che implica una responsabilità di un agente collettivo nella calligrafia dove il focus dell'interesse risiede nel valore estetico della scrittura o della perizia grafica, a prescindere che lo stesso agente collettivo sia responsabile anche del testo scritto. @it
label: είναι καλλιγράφος συλλογικός φορέας του @el
toolkit label: καλλιγράφος συλλογικός φορέας του @el
label: est un agent collectif calligraphe de @fr
definition: Met un agent collectif en relation avec une œuvre qui comporte une responsabilité de la part d’un agent collectif en ce qui concerne la calligraphie où l’accent est mis sur la valeur esthétique de la calligraphie ou du graphisme, peu importe que le même agent collectif soit aussi responsable du texte calligraphié. @fr
toolkit label: agent collectif calligraphe de @fr
toolkit definition: Œuvre qui comporte une responsabilité de la part d’un agent collectif en ce qui concerne la calligraphie où l’accent est mis sur la valeur esthétique de la calligraphie ou du graphisme, peu importe que le même agent collectif soit aussi responsable du texte calligraphié. @fr
label: ir kaligrāfs (grupa) @lv
definition: Sasaista grupu ar darbu, kas ietver grupas atbildību par kaligrāfiju, kurā galvenā uzmanība tiek pievērsta mākslinieciskās vai grafiskās meistarības estētiskajai vērtībai, neatkarīgi no tā, vai tā pati grupa ir atbildīgs arī par uzrakstīto tekstu. @lv
toolkit label: ir kaligrāfs (grupa) @lv
toolkit definition: Darbs, kas ietver grupas atbildību par kaligrāfiju, kurā galvenā uzmanība tiek pievērsta mākslinieciskās vai grafiskās meistarības estētiskajai vērtībai, neatkarīgi no tā, vai tā pati grupa ir atbildīgs arī par uzrakstīto tekstu @lv
label: 是……的书法者集体行为者 @zh-hans
definition: 将一个集体行为者与涉及书法（其中兴趣重点是书法或图形艺术的美学价值，不管同一行为者是否负责题写文字）的一个集体行为者的责任的一种作品关联起来。 @zh-hans
toolkit label: ……的书法者集体行为者 @zh-hans
toolkit definition: 涉及书法（其中兴趣重点是书法或图形艺术的美学价值，不管同一行为者是否负责题写文字）的一个集体行为者的责任的一种作品 @zh-hans
label: kaligraf kolektif temsilcisidir @tr
definition: Kolektif bir temsilciyi, aynı kolektif temsilcinin yazılı metinden sorumlu olup olmadığına bakılmaksızın, ilgi odağının el yazısının veya grafik sanatının estetik değerinde yattığı kaligrafi için kolektif temsilcinin sorumluluğunu içeren bir eserle ilişkilendirir. @tr
toolkit label: kaligraf kolektif temsilcisi @tr
toolkit definition: Yazılı metinden aynı kolektif temsilcinin sorumlu olup olmadığına bakılmaksızın, ilgi odağının kaligraflık veya grafik sanatının estetik değerinde olan kaligrafi için kolektif bir temsilcinin sorumluluğunu içeren bir eser. @tr
has subproperty: kalligrafi (yhteisö) teoksessa
has subproperty: kalligrafi (suku) teoksessa
has subproperty: P50687

kalligrafi (yhteisö) teoksessa
status: Published
label: is calligrapher corporate body of @en
lexical alias: calligrapherCorporateBodyOf.en
definition: Relates a corporate body to a work that involves a responsibility of a corporate body for calligraphy where the focus of interest lies in the aesthetic value of the penmanship or graphic artistry, regardless of whether the same corporate body is also responsible for the inscribed text. @en
toolkit label: calligrapher corporate body of @en
toolkit definition: A work that involves a responsibility of a corporate body for calligraphy where the focus of interest lies in the aesthetic value of the penmanship or graphic artistry, regardless of whether the same corporate body is also responsible for the inscribed text. @en
type: Property
domain: C10005
has element type: 2
sub property of: taiteilija (yhteisö) teoksessa
sub property of: kalligrafi (yhteistoimija) teoksessa
definition: Liittää yhteisön teokseen, jossa yhteisö on vastuussa kalligrafiasta, jossa pääpaino on käsin kirjoittamisen tai graafisen taiteen esteettisissä arvoissa, riippumatta siitä, onko sama toimija myös vastuussa kirjoitetusta tekstistä.
toolkit label: kalligrafi (yhteisö) teoksessa
toolkit definition: Teos, jossa yhteisö on vastuussa kalligrafiasta, jossa pääpaino on käsin kirjoittamisen tai graafisen taiteen esteettisissä arvoissa, riippumatta siitä, onko sama toimija myös vastuussa kirjoitetusta tekstistä.
label: er kalligraf for (korporasjon) @no
definition: Relaterer en korporasjon til et verk som involverer et ansvar for en korporasjon i form av kalligrafi der fokus er på den estetiske verdien av pennekunsten eller kunstnerisk dyktighet, uavhengig av om den samme korporasjonen også er ansvarlig for tekstinnholdet. @no
toolkit label: kalligraf for (korporasjon) @no
toolkit definition: Et verk som involverer et ansvar for en korporasjon i form av kalligrafi der fokus er på den estetiske verdien av pennekunsten eller kunstnerisk dyktighet, uavhengig av om den samme korporasjonen også er ansvarlig for tekstinnholdet. @no
label: is kalligraaf-corporatie van @nl
definition: Relateert een corporatie aan een werk dat met zich meebrengt een verantwoordelijkheid van een corporatie voor kalligrafie waar de aandacht primair uitgaat naar de esthetische waarde van de schrijfkunst of grafische kunstenaarschap, ongeacht of dezelfde corporatie ook verantwoordelijk is voor de inscriptie. @nl
toolkit label: kalligraaf-corporatie van @nl
toolkit definition: Een werk dat met zich meebrengt een verantwoordelijkheid van een corporatie voor kalligrafie waar de aandacht primair uitgaat naar de esthetische waarde van de schrijfkunst of grafische kunstenaarschap, ongeacht of dezelfde corporatie ook verantwoordelijk is voor de inscriptie. @nl
label: هي هيئة مسئولة عن فن الخط لـ @ar
definition: يربط هيئة بعمل يترتب عليه مسئولية هيئة عن الخطاطة، حيث ينصب الاهتمام على القيمة الجمالية لفن الخط أو الرسم، بغض النظر عما إذا كانت هذه الهيئة مسئولة أيضًا عن النص المكتوب. @ar
toolkit label: هيئة مسئولة عن الخطاطة لـ @ar
toolkit definition: عمل يترتب عليه مسئولية هيئة عن الخطاطة، حيث ينصب الاهتمام على القيمة الجمالية لفن الخط أو الرسم، بغض النظر عما إذا كانت هذه الهيئة مسئولة أيضًا عن النص المكتوب. @ar
label: és entitat corporativa cal·lígraf de @ca
definition: Relaciona una entitat corporativa amb una obra que implica una responsabilitat d’una entitat corporativa en la cal·ligrafia on el centre de l’interès se situa en el valor estètic de la cal·ligrafia o del grafisme, independentment de si la mateixa entitat corporativa és també responsable del text inscrit. @ca
toolkit label: entitat corporativa cal·lígraf de @ca
toolkit definition: Obra que implica una responsabilitat d’una entitat corporativa en la cal·ligrafia on el centre de l’interès se situa en el valor estètic de la cal·ligrafia o del grafisme, independentment de si la mateixa entitat corporativa és també responsable del text inscrit. @ca
label: er korporation, som er kalligraf af @da
definition: Relaterer en korporation til et værk, som involverer en korporations ansvar for kalligrafi, hvor fokus ligger på den æstetiske værdi af skrivekunsten eller den kunstneriske grafiske dygtighed, uagtet om den samme korporation også har forfattet den indskrevne tekst. @da
toolkit label: korporation, som er kalligraf af @da
toolkit definition: Værk, som involverer en korporations ansvar for kalligrafi, hvor fokus ligger på den æstetiske værdi af skrivekunsten eller den kunstneriske grafiske dygtighed, uagtet om den samme korporation også har forfattet den indskrevne tekst. @da
label: kalligraaf (asutus) teoses @et
definition: Seostab asutuse teosega, mis sisaldab asutuse vastutust ilukirja eest. Ilukirja põhirõhk on kirjakunsti või graafilise kunstnikutöö esteetilisel väärtusel, olenemata sellest, kas sama asutus on vastutav ka kirjutatud teksti eest. @et
toolkit label: kalligraaf (asutus) teoses @et
toolkit definition: Teos, mis sisaldab asutuse vastutust ilukirja eest. Ilukirja põhirõhk on kirjakunsti või graafilise kunstnikutöö esteetilisel väärtusel, olenemata sellest, kas sama asutus on vastutav ka kirjutatud teksti eest. @et
label: ist Körperschaft als Kalligrafin/Kalligraf von @de
definition: Setzt eine Körperschaft in Beziehung zu einem Werk, bei dem eine Körperschaft für die Kalligrafie verantwortlich ist, bei der der ästhetische Wert der Schreibkunst oder die grafische Kunstfertigkeit im Mittelpunkt des Interesses liegt, unabhängig davon, ob dieselbe Körperschaft auch für den aufgeschriebenen Text verantwortlich ist. @de
toolkit label: Körperschaft als Kalligrafin/Kalligraf von @de
toolkit definition: Ein Werk, bei dem eine Körperschaft für die Kalligrafie verantwortlich ist, bei der der ästhetische Wert der Schreibkunst oder die grafische Kunstfertigkeit im Mittelpunkt des Interesses liegt, unabhängig davon, ob dieselbe Körperschaft auch für den aufgeschriebenen Text verantwortlich ist. @de
label: kalligráfus testülete a következőnek: @hu
definition: Hozzákapcsol egy testületet egy műhöz, amelyhez hozzátartozik egy testület szépírással kapcsolatos felelőssége, ahol az érdeklődés középpontjában a kézírás esztétikai értéke vagy a grafika művészisége áll, tekintet nélkül arra, hogy ugyanaz az testület a lejegyzett szöveg szerzője is egyben vagy sem. @hu
toolkit label: kalligráfus testülete: @hu
toolkit definition: Egy mű, amelyhez hozzátartozik egy testület szépírással kapcsolatos felelőssége, ahol az érdeklődés középpontjában a kézírás esztétikai értéke vagy a grafika művészisége áll, tekintet nélkül arra, hogy ugyanaz az testület a lejegyzett szöveg szerzője is egyben vagy sem. @hu
label: è calligrafo ente di @it
definition: Correla un ente a un'opera che implica una responsabilità di un ente per la calligrafia dove l'interesse risiede nel valore estetico della scrittura o della perizia grafica, a prescindere che lo stesso ente sia responsabile anche del testo scritto. @it
toolkit label: calligrafo ente di @it
toolkit definition: Opera che implica una responsabilità di un ente per la calligrafia dove l'interesse risiede nel valore estetico della scrittura o della perizia grafica, a prescindere che lo stesso ente sia responsabile anche del testo scritto. @it
label: είναι καλλιγράφος συλλογικό όργανο του @el
toolkit label: καλλιγράφος συλλογικό όργανο του @el
label: est une collectivité calligraphe de @fr
definition: Met une collectivité en relation avec une œuvre qui comporte une responsabilité de la part d’une collectivité en ce qui concerne la calligraphie où l’accent est mis sur la valeur esthétique de la calligraphie ou du graphisme, peu importe que la même collectivité soit aussi responsable du texte calligraphié. @fr
toolkit label: collectivité calligraphe de @fr
toolkit definition: Œuvre qui comporte une responsabilité de la part d’une collectivité en ce qui concerne la calligraphie où l’accent est mis sur la valeur esthétique de la calligraphie ou du graphisme, peu importe que la même collectivité soit aussi responsable du texte calligraphié. @fr
label: ir kaligrāfs (institūcija) @lv
definition: Sasaista institūciju ar darbu, kas ietver institūcijas atbildību par kaligrāfiju, kurā galvenā uzmanība tiek pievērsta mākslinieciskās vai grafiskās meistarības estētiskajai vērtībai, neatkarīgi no tā, vai tā pati grupa ir atbildīgs arī par uzrakstīto tekstu. @lv
toolkit label: ir kaligrāfs (institūcija) @lv
toolkit definition: Darbs, kas ietver institūcijas atbildību par kaligrāfiju, kurā galvenā uzmanība tiek pievērsta mākslinieciskās vai grafiskās meistarības estētiskajai vērtībai, neatkarīgi no tā, vai tā pati grupa ir atbildīgs arī par uzrakstīto tekstu @lv
label: 是……的书法者团体 @zh-hans
definition: 将一个团体与涉及书法（其中兴趣重点是书法或图形艺术的美学价值，不管同一团体是否负责题写文字）的一个团体的责任的一种作品关联起来。 @zh-hans
toolkit label: ……的书法者团体 @zh-hans
toolkit definition: 涉及书法（其中兴趣重点是书法或图形艺术的美学价值，不管同一团体是否负责题写文字）的一个团体的责任的一种作品 @zh-hans
label: kaligraf tüzel kişisidir @tr
definition: Bir tüzel kişiyi, aynı tüzel kişinin yazılı metinden de sorumlu olup olmadığına bakılmaksızın, ilgi odağının hattatlık veya grafik sanatının estetik değerinde olduğu hat sanatı sorumluluğunu içeren bir eserle ilişkilendirir. @tr
toolkit label: kaligraf tüzel kişisi @tr
toolkit definition: Yazılı metinden aynı tüzel kişinin sorumlu olup olmadığına bakılmaksızın, ilgi odağı hattatlığın veya grafik sanatının estetik değerinde olan hat sanatı için bir tüzel kişinin sorumluluğunu içeren bir eser. @tr
has subproperty: P50838

kalligrafi (suku) teoksessa
status: Published
label: is calligrapher family of @en
lexical alias: calligrapherFamilyOf.en
definition: Relates a family to a work that involves a responsibility of a family for calligraphy where the focus of interest lies in the aesthetic value of the penmanship or graphic artistry, regardless of whether the same family is also responsible for the inscribed text. @en
toolkit label: calligrapher family of @en
toolkit definition: A work that involves a responsibility of a family for calligraphy where the focus of interest lies in the aesthetic value of the penmanship or graphic artistry, regardless of whether the same family is also responsible for the inscribed text. @en
type: Property
domain: C10008
has element type: 2
sub property of: taiteilija (suku) teoksessa
sub property of: kalligrafi (yhteistoimija) teoksessa
definition: Liittää suvun teokseen, jossa suku on vastuussa kalligrafiasta, jossa pääpaino on käsin kirjoittamisen tai graafisen taiteen esteettisissä arvoissa, riippumatta siitä, onko sama toimija myös vastuussa kirjoitetusta tekstistä.
toolkit label: kalligrafi (suku) teoksessa
toolkit definition: Teos, jossa suku on vastuussa kalligrafiasta, jossa pääpaino on käsin kirjoittamisen tai graafisen taiteen esteettisissä arvoissa, riippumatta siitä, onko sama toimija myös vastuussa kirjoitetusta tekstistä.
label: er kalligraf for (familie) @no
definition: Relaterer en familie til et verk som involverer et ansvar for en familie i form av kalligrafi der fokus er på den estetiske verdien av pennekunsten eller kunstnerisk dyktighet, uavhengig av om den samme familieen også er ansvarlig for tekstinnholdet. @no
toolkit label: kalligraf for (familie) @no
toolkit definition: Et verk som involverer et ansvar for en familie i form av kalligrafi der fokus er på den estetiske verdien av pennekunsten eller kunstnerisk dyktighet, uavhengig av om den samme familieen også er ansvarlig for tekstinnholdet. @no
label: is kalligraaf-familie van @nl
definition: Relateert een familie aan een werk dat met zich meebrengt een verantwoordelijkheid van een familie voor kalligrafie waar de aandacht primair uitgaat naar de esthetische waarde van de schrijfkunst of grafische kunstenaarschap, ongeacht of dezelfde familie ook verantwoordelijk is voor de inscriptie. @nl
toolkit label: kalligraaf-familie van @nl
toolkit definition: Een werk dat met zich meebrengt een verantwoordelijkheid van een familie voor kalligrafie waar de aandacht primair uitgaat naar de esthetische waarde van de schrijfkunst of grafische kunstenaarschap, ongeacht of dezelfde familie ook verantwoordelijk is voor de inscriptie. @nl
label: és família cal·lígrafa de @ca
definition: Relaciona una família amb una obra que implica una responsabilitat d’una família en la cal·ligrafia on el centre de l’interès se situa en el valor estètic de la cal·ligrafia o del grafisme, independentment de si la mateixa família és també responsable del text inscrit. @ca
toolkit label: família cal·lígrafa de @ca
toolkit definition: Obra que implica una responsabilitat d’una família en la cal·ligrafia on el centre de l’interès se situa en el valor estètic de la cal·ligrafia o del grafisme, independentment de si la mateixa família és també responsable del text inscrit. @ca
label: er familie, som er kalligraf af @da
definition: Relaterer en familie til et værk, som involverer en families ansvar for kalligrafi, hvor fokus ligger på den æstetiske værdi af skrivekunsten eller den kunstneriske grafiske dygtighed, uagtet om den samme familie også har forfattet den indskrevne tekst. @da
toolkit label: familie, som er kalligraf af @da
toolkit definition: Værk, som involverer en families ansvar for kalligrafi, hvor fokus ligger på den æstetiske værdi af skrivekunsten eller den kunstneriske grafiske dygtighed, uagtet om den samme familie også har forfattet den indskrevne tekst. @da
label: kalligraaf (perekond) teoses @et
definition: Seostab perekonna teosega, mis sisaldab perekonna vastutust ilukirja eest. Ilukirja põhirõhk on kirjakunsti või graafilise kunstnikutöö esteetilisel väärtusel, olenemata sellest, kas sama perekond on vastutav ka kirjutatud teksti eest. @et
toolkit label: kalligraaf (perekond) teoses @et
toolkit definition: Teos, mis sisaldab perekonna vastutust ilukirja eest. Ilukirja põhirõhk on kirjakunsti või graafilise kunstnikutöö esteetilisel väärtusel, olenemata sellest, kas sama perekond on vastutav ka kirjutatud teksti eest. @et
label: ist Familie als Kalligrafin/Kalligraf von @de
definition: Setzt eine Familie in Beziehung zu einem Werk, bei dem eine Familie für die Kalligrafie verantwortlich ist, bei der der ästhetische Wert der Schreibkunst oder die grafische Kunstfertigkeit im Mittelpunkt des Interesses liegt, unabhängig davon, ob dieselbe Familie auch für den aufgeschriebenen Text verantwortlich ist. @de
toolkit label: Familie als Kalligrafin/Kalligraf von @de
toolkit definition: Ein Werk, bei dem eine Familie für die Kalligrafie verantwortlich ist, bei der der ästhetische Wert der Schreibkunst oder die grafische Kunstfertigkeit im Mittelpunkt des Interesses liegt, unabhängig davon, ob dieselbe Familie auch für den aufgeschriebenen Text verantwortlich ist. @de
label: kalligráfus családja a következőnek: @hu
definition: Hozzákapcsol egy családot egy műhöz, amelyhez hozzátartozik egy család szépírással kapcsolatos felelőssége, ahol az érdeklődés középpontjában a kézírás esztétikai értéke vagy a grafika művészisége áll, tekintet nélkül arra, hogy ugyanaz a család a lejegyzett szöveg szerzője is egyben vagy sem. @hu
toolkit label: kalligráfus családja: @hu
toolkit definition: Egy mű, amelyhez hozzátartozik egy család szépírással kapcsolatos felelőssége, ahol az érdeklődés középpontjában a kézírás esztétikai értéke vagy a grafika művészisége áll, tekintet nélkül arra, hogy ugyanaz a család a lejegyzett szöveg szerzője is egyben vagy sem. @hu
label: è calligrafo famiglia di @it
definition: Correla una famiglia a un'opera che implica una responsabilità di una famiglia per la calligrafia dove l'interesse risiede nel valore estetico della scrittura o della perizia grafica, a prescindere che la stessa famiglia sia responsabile anche del testo scritto. @it
toolkit label: calligrafo famiglia di @it
toolkit definition: Correla una famiglia a un'opera che implica una responsabilità di una famiglia per la calligrafia dove l'interesse risiede nel valore estetico della scrittura o della perizia grafica, a prescindere che la stessa famiglia sia responsabile anche del testo scritto. @it
label: είναι καλλιγράφος οικογένεια του @el
toolkit label: καλλιγράφος οικογένεια του @el
label: est une famille calligraphe de @fr
definition: Met une famille en relation avec une œuvre qui comporte une responsabilité de la part d’une famille en ce qui concerne la calligraphie où l’accent est mis sur la valeur esthétique de la calligraphie ou du graphisme, peu importe que la même famille soit aussi responsable du texte calligraphié. @fr
toolkit label: famille calligraphe de @fr
toolkit definition: Œuvre qui comporte une responsabilité de la part d’une famille en ce qui concerne la calligraphie où l’accent est mis sur la valeur esthétique de la calligraphie ou du graphisme, peu importe que la même famille soit aussi responsable du texte calligraphié. @fr
label: ir kaligrāfs (dzimta/ģimene) @lv
definition: Sasaista dzimtu/ģimeni ar darbu, kas ietver dzimtas/ģimenes atbildību par kaligrāfiju, kurā galvenā uzmanība tiek pievērsta mākslinieciskās vai grafiskās meistarības estētiskajai vērtībai, neatkarīgi no tā, vai tā pati grupa ir atbildīgs arī par uzrakstīto tekstu. @lv
toolkit label: ir kaligrāfs (dzimta/ģimene) @lv
toolkit definition: Darbs, kas ietver dzimtas/ģimenes atbildību par kaligrāfiju, kurā galvenā uzmanība tiek pievērsta mākslinieciskās vai grafiskās meistarības estētiskajai vērtībai, neatkarīgi no tā, vai tā pati grupa ir atbildīgs arī par uzrakstīto tekstu @lv
label: هي عائلة مسئولة عن الخطاطة @ar
definition: يربط عائلة بعمل ينطوي على مسئولية عائلة عن الخطاطة، حيث ينصب الاهتمام على القيمة الجمالية لفن الخط أو الرسم، بغض النظر عما إذا كانت هذه العائلة مسئولة أيضًا عن النص المكتوب. @ar
toolkit label: عائلة مسئولة عن الخطاطة لـ @ar
toolkit definition: عمل ينطوي على مسئولية عائلة عن الخطاطة حيث ينصب الاهتمام على القيمة الجمالية لفن الخط أو الرسم، بغض النظر عما إذا كان هذا الشخص مسئول أيضًا عن النص المكتوب. @ar
label: 是……的书法者家族 @zh-hans
definition: 将一个家族与涉及书法（其中兴趣重点是书法或图形艺术的美学价值，不管同一行为者是否负责题写文字）的一个家族的责任的一种作品关联起来。 @zh-hans
toolkit label: ……的书法者家族 @zh-hans
toolkit definition: 涉及书法（其中兴趣重点是书法或图形艺术的美学价值，不管同一行为者是否负责题写文字）的一个家族的责任的一种作品 @zh-hans
label: kaligraf ailesidir @tr
definition: Bir aileyi, aynı ailenin yazılı metinden de sorumlu olup olmadığına bakılmaksızın, ilgi odağının el yazısının veya grafik sanatının estetik değerinde yattığı hat sanatı için bir ailenin sorumluluğunu içeren bir eserle ilişkilendirir. @tr
toolkit label: kaligraf ailesi @tr
toolkit definition: Yazılı metinden aynı ailenin sorumlu olup olmadığına bakılmaksızın, ilgi odağı hattatlığın veya grafik sanatının estetik değerinde olan hat sanatı için bir ailenin sorumluluğunu içeren bir eser. @tr
has subproperty: P50989

kalligrafi (henkilö) teoksessa
status: Published
label: is calligrapher person of @en
lexical alias: calligrapherPersonOf.en
definition: Relates a person to a work that involves a responsibility of a person for calligraphy where the focus of interest lies in the aesthetic value of the penmanship or graphic artistry, regardless of whether the same person is also responsible for the inscribed text. @en
toolkit label: calligrapher person of @en
toolkit definition: A work that involves a responsibility of a person for calligraphy where the focus of interest lies in the aesthetic value of the penmanship or graphic artistry, regardless of whether the same person is also responsible for the inscribed text. @en
type: Property
domain: C10004
has element type: 2
sub property of: taiteilija (henkilö) teoksessa
sub property of: kalligrafi (toimija) teoksessa
definition: Liittää henkilön teokseen, jossa toimija on vastuussa kalligrafiasta, jossa pääpaino on käsin kirjoittamisen tai graafisen taiteen esteettisissä arvoissa, riippumatta siitä, onko sama toimija myös vastuussa kirjoitetusta tekstistä.
toolkit label: kalligrafi (henkilö) teoksessa
toolkit definition: Teos, jossa toimija on vastuussa kalligrafiasta, jossa pääpaino on käsin kirjoittamisen tai graafisen taiteen esteettisissä arvoissa, riippumatta siitä, onko sama toimija myös vastuussa kirjoitetusta tekstistä.
label: er kalligraf for (person) @no
definition: Relaterer en person til et verk som involverer et ansvar for en person i form av kalligrafi der fokus er på den estetiske verdien av pennekunsten eller kunstnerisk dyktighet, uavhengig av om den samme personen også er ansvarlig for tekstinnholdet. @no
toolkit label: kalligraf for (person) @no
toolkit definition: Et verk som involverer et ansvar for en person i form av kalligrafi der fokus er på den estetiske verdien av pennekunsten eller kunstnerisk dyktighet, uavhengig av om den samme personen også er ansvarlig for tekstinnholdet. @no
label: is kalligraaf-persoon van @nl
definition: Relateert een persoon aan een werk dat met zich meebrengt een verantwoordelijkheid van een persoon voor kalligrafie waar de aandacht primair uitgaat naar de esthetische waarde van de schrijfkunst of grafische kunstenaarschap, ongeacht of dezelfde persoon ook verantwoordelijk is voor de inscriptie. @nl
toolkit label: kalligraaf-persoon van @nl
toolkit definition: Een werk dat met zich meebrengt een verantwoordelijkheid van een persoon voor kalligrafie waar de aandacht primair uitgaat naar de esthetische waarde van de schrijfkunst of grafische kunstenaarschap, ongeacht of dezelfde persoon ook verantwoordelijk is voor de inscriptie. @nl
label: هو شخص خطاط لـ @ar
definition: يربط شخصا بعمل يترتب عليه مسئولية شخص عن الخطاطة، حيث ينصب الاهتمام على القيمة الجمالية لفن الخط أو الرسم، بغض النظر عن مسئولية هذا الوكيل أيضًا عن النص المكتوب. @ar
toolkit label: شخص خطاط @ar
toolkit definition: عمل يترتب عليه مسئولية شخص عن الخطاطة، حيث ينصب الاهتمام على القيمة الجمالية لفن الخط أو الرسم، عن مسئولية هذا الوكيل أيضًا عن النص المكتوب. @ar
label: és persona cal·lígrafa de @ca
definition: Relaciona una persona amb una obra que implica una responsabilitat d’una persona en la cal·ligrafia on el centre de l’interès se situa en el valor estètic de la cal·ligrafia o del grafisme, independentment de si la mateixa persona és també responsable del text inscrit. @ca
toolkit label: persona cal·lígrafa de @ca
toolkit definition: Obra que implica una responsabilitat d’una persona en la cal·ligrafia on el centre de l’interès se situa en el valor estètic de la cal·ligrafia o del grafisme, independentment de si la mateixa persona és també responsable del text inscrit. @ca
label: er person, som er kalligraf af @da
definition: Relaterer en person til et værk, som involverer en persons ansvar for kalligrafi, hvor fokus ligger på den æstetiske værdi af skrivekunsten eller den kunstneriske grafiske dygtighed, uagtet om den samme person også har forfattet den indskrevne tekst. @da
toolkit label: person, som er kalligraf af @da
toolkit definition: Værk, som involverer en persons ansvar for kalligrafi, hvor fokus ligger på den æstetiske værdi af skrivekunsten eller den kunstneriske grafiske dygtighed, uagtet om den samme person også har forfattet den indskrevne tekst. @da
label: kalligraaf (isik) teoses @et
definition: Seostab isiku teosega, mis sisaldab isiku vastutust ilukirja eest. Ilukirja põhirõhk on kirjakunsti või graafilise kunstnikutöö esteetilisel väärtusel, olenemata sellest, kas sama isik on vastutav ka kirjutatud teksti eest. @et
toolkit label: kalligraaf (isik) teoses @et
toolkit definition: Teos, mis sisaldab isiku vastutust ilukirja eest. Ilukirja põhirõhk on kirjakunsti või graafilise kunstnikutöö esteetilisel väärtusel, olenemata sellest, kas sama isik on vastutav ka kirjutatud teksti eest. @et
label: ist Person als Kalligrafin/Kalligraf von @de
definition: Setzt eine Person in Beziehung zu einem Werk, bei dem eine Person für die Kalligrafie verantwortlich ist, bei der der ästhetische Wert der Schreibkunst oder die grafische Kunstfertigkeit im Mittelpunkt des Interesses liegt, unabhängig davon, ob dieselbe Person auch für den aufgeschriebenen Text verantwortlich ist. @de
toolkit label: Person als Kalligrafin/Kalligraf von @de
toolkit definition: Ein Werk, bei dem eine Person für die Kalligrafie verantwortlich ist, bei der der ästhetische Wert der Schreibkunst oder die grafische Kunstfertigkeit im Mittelpunkt des Interesses liegt, unabhängig davon, ob dieselbe Person auch für den aufgeschriebenen Text verantwortlich ist. @de
label: kalligráfus személye a következőnek: @hu
definition: Hozzákapcsol egy személyt egy műhöz, amelyhez hozzátartozik egy személy szépírással kapcsolatos felelőssége, ahol az érdeklődés középpontjában a kézírás esztétikai értéke vagy a grafika művészisége áll, tekintet nélkül arra, hogy ugyanaz a személy a lejegyzett szöveg szerzője is egyben vagy sem. @hu
toolkit label: kalligráfus személye: @hu
toolkit definition: Egy mű, amelyhez hozzátartozik egy személy szépírással kapcsolatos felelőssége, ahol az érdeklődés középpontjában a kézírás esztétikai értéke vagy a grafika művészisége áll, tekintet nélkül arra, hogy ugyanaz a személy a lejegyzett szöveg szerzője is egyben vagy sem. @hu
label: è calligrafo persona di @it
definition: Correla una persona a un'opera che implica una responsabilità di una persona nella calligrafia dove l'interesse risiede nel valore estetico della scrittura o della perizia grafica, a prescindere che la stessa persona sia responsabile anche del testo scritto. @it
toolkit label: calligrafo persona di @it
toolkit definition: Opera che implica una responsabilità di una persona nella calligrafia dove il focus dell'interesse risiede nel valore estetico della scrittura o della perizia grafica, a prescindere che la stessa persona sia responsabile anche del testo scritto. @it
label: είναι καλλιγράφος φυσικό πρόσωπο του @el
toolkit label: καλλιγράφος φυσικό πρόσωπο του @el
label: est une personne calligraphe de @fr
definition: Met une personne en relation avec une œuvre qui comporte une responsabilité de la part d’une personne en ce qui concerne la calligraphie où l’accent est mis sur la valeur esthétique de la calligraphie ou du graphisme, peu importe que la même personne soit aussi responsable du texte calligraphié. @fr
toolkit label: personne calligraphe de @fr
toolkit definition: Œuvre qui comporte une responsabilité de la part d’une personne en ce qui concerne la calligraphie où l’accent est mis sur la valeur esthétique de la calligraphie ou du graphisme, peu importe que la même personne soit aussi responsable du texte calligraphié. @fr
label: ir kaligrāfs (persona) @lv
definition: Sasaista personu ar darbu, kas ietver personas atbildību par kaligrāfiju, kurā galvenā uzmanība tiek pievērsta mākslinieciskās vai grafiskās meistarības estētiskajai vērtībai, neatkarīgi no tā, vai tā pati grupa ir atbildīgs arī par uzrakstīto tekstu. @lv
toolkit label: ir kaligrāfs (persona) @lv
toolkit definition: Darbs, kas ietver personas atbildību par kaligrāfiju, kurā galvenā uzmanība tiek pievērsta mākslinieciskās vai grafiskās meistarības estētiskajai vērtībai, neatkarīgi no tā, vai tā pati grupa ir atbildīgs arī par uzrakstīto tekstu @lv
label: 是……的书法者个人 @zh-hans
definition: 将一个个人与涉及书法（其中兴趣重点是书法或图形艺术的美学价值，不管同一个人是否负责题写文字）的一个个人的责任的一种作品关联起来。 @zh-hans
toolkit label: ……的书法者个人 @zh-hans
toolkit definition: 涉及书法（其中兴趣重点是书法或图形艺术的美学价值，不管同一个人是否负责题写文字）的一个个人的责任的一种作品 @zh-hans
label: kaligraf kişisidir @tr
definition: Bir kişiyi, aynı kişinin yazılı metinden de sorumlu olup olmadığına bakılmaksızın, ilgi odağının hattatlığın veya grafik sanatının estetik değerinde olduğu hat sanatı için bir kişinin sorumluluğunu içeren bir eserle ilişkilendirir. @tr
toolkit label: kaligraf @tr
toolkit definition: Yazılı metinden aynı kişinin sorumlu olup olmadığına bakılmaksızın, ilgi odağı hattatlığın veya grafik sanatının estetik değerinde olan hat sanatı için bir kişinin sorumluluğunu içeren bir eser. @tr
has subproperty: P50536

teoksen kartantekijä (toimija) teoksessa
status: Published
label: is cartographer agent of work of @en
definition: Relates an agent to a work that involves a responsibility of an agent for creating a cartographic work. @en
type: Property
domain: C10002
sub property of: teoksen tekijä (toimija) teoksessa
lexical alias: cartographerAgentOfWorkOf.en
label: est un agent cartographe d’une œuvre de @fr
definition: Met un agent en relation avec une œuvre qui comporte une responsabilité de la part d’un agent consistant à créer une œuvre cartographique. @fr
toolkit label: agent cartographe d’une œuvre de @fr
toolkit definition: Œuvre qui comporte une responsabilité de la part d’un agent consistant à créer une œuvre cartographique. @fr
toolkit label: cartographer agent of work of @en
toolkit definition: A work that involves a responsibility of an agent for creating a cartographic work. @en
instruction number: 18.5
label: είναι χαρτογράφος φορέας του έργου του @el
definition: Συνδέει έναν φορέα υπεύθυνο για τη δημιουργία ενός χάρτη, ενός άτλαντα, μιας υδρόγειας σφαίρας ή άλλου χαρτογραφικού έργου, με ένα έργο. @el
toolkit label: χαρτογράφος φορέας του έργου του @el
toolkit definition: Ένα χαρτογραφικό έργο που περιλαμβάνει την ευθύνη της δημιουργίας ενός χάρτη, ενός άτλαντα, μιας υδρόγειας σφαίρας ή άλλου χαρτογραφικού έργου. @el
definition: Setzt einen Akteur in Beziehung zu einem Werk, bei dem ein Akteur für die Schaffung eines kartografischen Werks verantwortlich ist. @de
toolkit label: Akteur als Kartografin/Kartograf eines Werks von @de
toolkit definition: Ein Werk, bei dem ein Akteur für die Schaffung eines kartografischen Werks verantwortlich ist. @de
label: er agent, som er kartograf for værk af @da
definition: Relaterer en agent til et værk, som involverer en agents ansvar for at skabe et kartografisk værk. @da
toolkit label: agent, som er kartograf for værk af @da
toolkit definition: Værk, som involverer en agents ansvar for at skabe et kartografisk værk. @da
label: és agent cartògraf d’una obra de @ca
definition: Relaciona un agent amb una obra que implica una responsabilitat d’un agent en la creació d’una obra cartogràfica. @ca
toolkit label: agent cartògraf d’una obra de @ca
toolkit definition: Obra que implica una responsabilitat d’un agent en la creació d’una obra cartogràfica. @ca
definition: Liittää toimijan teokseen, joka on kartografinen teos, jonka luomisesta toimija on vastuussa.
toolkit label: teoksen kartantekijä (toimija) teoksessa
toolkit definition: Teos, joka on kartografinen teos, jonka luomisesta toimija on vastuussa.
toolkit label: kartograf for (agent) @no
toolkit definition: Et verk som involverer ansvar for en agent i form av et kartografisk verk. @no
label: ist Akteur als Kartografin/Kartograf eines Werks von @de
has element type: 2
label: térképész ágense a következő műnek: @hu
definition: Hozzákapcsol egy ágenst egy műhöz, amelyhez hozzátartozik egy ágens felelőssége egy kartográfiai mű létrehozásáért. @hu
toolkit label: térképész ágense a következő műnek: @hu
toolkit definition: Egy mű, amelyhez hozzátartozik egy ágens felelőssége egy kartográfiai mű létrehozásáért. @hu
alternative label: cartographer of @en
alternative label: kartantekijänä kartografisessa teoksessa
label: er kartograf for (agent) @no
definition: Relaterer en agent til et verk som involverer ansvar for en agent i form av et kartografisk verk. @no
alternative label: kartograf for @no
label: is cartograaf-actor van werk van @nl
definition: Relateert een actor aan een werk dat met zich meebrengt een verantwoordelijkheid van een actor voor het creëren van een cartografisch werk. @nl
toolkit label: cartograaf-actor van werk van @nl
toolkit definition: Een werk dat met zich meebrengt een verantwoordelijkheid van een actor voor het creëren van een cartografisch werk. @nl
label: هو وكيل رسام خرائط لعمل لـ @ar
definition: يربط وكيلا بعمل يترتب عليه مسئولية وكيل عن أعمال رسم الخرائط. @ar
alternative label: رسام خرائط لـ @ar
toolkit label: وكيل رسام خرائط لعمل @ar
toolkit definition: عمل يترتب عليه مسئولية وكيل عن أعمال رسم الخرائط. @ar
alternative label: cartògraf de @ca
alternative label: kartograf af @da
label: teose kartograaf (tegija) teoses @et
definition: Seostab tegija teosega, mis sisaldab tegija vastutust kartograafilise teose eest. @et
alternative label: teose kartograaf teoses @et
toolkit label: teose kartograaf (tegija) teoses @et
toolkit definition: Teos, mis sisaldab tegija vastutust kartograafilise teose eest. @et
alternative label: térképésze: @hu
label: è cartografo agente di @it
definition: Correla un agente a un'opera che implica una responsabilità di un agente per un'opera cartografica. @it
alternative label: cartografo di opera di @it
toolkit label: cartografo agente di opera di @it
toolkit definition: Opera che implica una responsabilità di un agente per un'opera cartografica. @it
alternative label: χαρτογράφος του έργου του @el
alternative label: cartographe de @fr
label: ir kartogrāfs (aģents) darbam @lv
definition: Sasaista aģentu ar darbu, kas ietver aģenta atbildību par karti, atlantu, globusu vai citu kartogrāfijas materiālu. @lv
toolkit label: ir kartogrāfs (aģents) darbam @lv
toolkit definition: Darbs, kas ietver aģenta atbildību par karti, atlantu, globusu vai citu kartogrāfijas materiālu. @lv
alternative label: Kartografin/Kartograf von @de
alternative label: ……的地图绘制者 @zh-hans
toolkit label: ……的作品的地图绘制者行为者 @zh-hans
toolkit definition: 涉及创作一种地图作品的一个行为者的责任的一种作品 @zh-hans
toolkit label: eserin kartograf temsilcisi @tr
toolkit definition: Kartografik bir eser oluşturmak için bir temsilcinin sorumluluğunu içeren bir çalışma. @tr
has subproperty: teoksen kartantekijä (yhteistoimija) teoksessa

teoksen kartantekijä (yhteistoimija) teoksessa
status: Published
label: is cartographer collective agent of work of @en
lexical alias: cartographerCollectiveAgentOfWorkOf.en
definition: Relates a collective agent to a work that involves a responsibility of a collective agent for creating a cartographic work. @en
toolkit label: cartographer collective agent of work of @en
toolkit definition: A work that involves a responsibility of a collective agent for creating a cartographic work. @en
type: Property
domain: C10011
has element type: 2
sub property of: teoksen tekijä (yhteistoimija) teoksessa
sub property of: teoksen kartantekijä (toimija) teoksessa
definition: Liittää yhteistoimijan teokseen, joka on kartografinen teos, jonka luomisesta yhteistoimija on vastuussa.
toolkit label: teoksen kartantekijä (yhteistoimija) teoksessa
toolkit definition: Teos, joka on kartografinen teos, jonka luomisesta yhteistoimija on vastuussa.
label: er kartograf for verk for (kollektiv agent) @no
definition: Relaterer en kollektiv agent til et verk som involverer et ansvar for en kollektiv agent i form av et kartografisk verk. @no
toolkit label: kartograf for verk for (kollektiv agent) @no
toolkit definition: Et verk som involverer et ansvar for en kollektiv agent i form av et kartografisk verk. @no
label: is cartograaf-collectieve actor van werk van @nl
definition: Relateert een collectieve actor aan een werk dat met zich meebrengt een verantwoordelijkheid van een collectieve actor voor het creëren van een cartografisch werk. @nl
toolkit label: cartograaf-collectieve actor van werk van @nl
toolkit definition: Een werk dat met zich meebrengt een verantwoordelijkheid van een collectieve actor voor het creëren van een cartografisch werk. @nl
label: هو وكيل جماعي رسام خرائط لعمل لـ @ar
definition: يربط وكيلا جماعيا بعمل يترتب عليه مسئولية وكيل جماعي عن أعمال رسم الخرائط. @ar
toolkit label: وكيل جماعي رسام خرائط لعمل @ar
toolkit definition: عمل يترتب عليه مسئولية وكيل جماعي عن أعمال رسم الخرائط. @ar
label: és agent col·lectiu cartògraf d’una obra de @ca
definition: Relaciona un agent col·lectiu amb una obra que implica una responsabilitat d’un agent col·lectiu en la creació d’una obra cartogràfica. @ca
toolkit label: agent col·lectiu cartògraf d’una obra de @ca
toolkit definition: Obra que implica una responsabilitat d’un agent col·lectiu en la creació d’una obra cartogràfica. @ca
label: er kollektiv agent, som er kartograf for værk af @da
definition: Relaterer en kollektiv agent til et værk, som involverer en kollektiv agents ansvar for at skabe et kartografisk værk. @da
toolkit label: kollektiv agent, som er kartograf for værk af @da
toolkit definition: Værk, som involverer en kollektiv agents ansvar for at skabe et kartografisk værk. @da
label: teose kartograaf (kollektiiv) teoses @et
definition: Seostab kollektiivi teosega, mis sisaldab kollektiivi vastutust kartograafilise teose eest. @et
toolkit label: teose kartograaf (kollektiiv) teoses @et
toolkit definition: Teos, mis sisaldab kollektiivi vastutust kartograafilise teose eest. @et
label: ist gemeinschaftlicher Akteur als Kartografin/Kartograf eines Werks von @de
definition: Setzt einen gemeinschaftlichen Akteur in Beziehung zu einem Werk, bei dem ein gemeinschaftlicher Akteur für die Schaffung eines kartografischen Werks verantwortlich ist. @de
toolkit label: Gemeinschaftlicher Akteur als Kartografin/Kartograf eines Werks von @de
toolkit definition: Ein Werk, bei dem ein gemeinschaftlicher Akteur für die Schaffung eines kartografischen Werks verantwortlich ist. @de
label: térképész kollektív ágense a következő műnek: @hu
definition: Hozzákapcsol egy kollektív ágenst egy műhöz, amelyhez hozzátartozik egy kollektív ágens felelőssége egy kartográfiai mű létrehozásáért. @hu
toolkit label: térképész kollektív ágense a következő műnek: @hu
toolkit definition: Egy mű, amelyhez hozzátartozik egy kollektív ágens felelőssége egy kartográfiai mű létrehozásáért. @hu
label: è cartografo agente collettivo di opera di @it
definition: Correla un agente collettivo a un'opera che implica una responsabilità di un agente collettivo per un'opera cartografica. @it
toolkit label: cartografo agente collettivo di opera di @it
toolkit definition: Opera che implica una responsabilità di un agente collettivo per un'opera cartografica. @it
label: είναι χαρτογράφος συλλογικός φορέας του έργου του @el
toolkit label: χαρτογράφος συλλογικός φορέας του έργου του @el
label: est un agent collectif cartographe d’une œuvre de @fr
definition: Met un agent collectif en relation avec une œuvre qui comporte une responsabilité de la part d’un agent collectif consistant à créer une œuvre cartographique. @fr
toolkit label: agent collectif cartographe d’une œuvre de @fr
toolkit definition: Œuvre qui comporte une responsabilité de la part d’un agent collectif consistant à créer une œuvre cartographique. @fr
label: ir kartogrāfs (grupa) darbam @lv
definition: Sasaista grupu ar darbu, kas ietver grupas atbildību par karti, atlantu, globusu vai citu kartogrāfijas materiālu. @lv
toolkit label: ir kartogrāfs (grupa) darbam @lv
toolkit definition: Darbs, kas ietver grupas atbildību par karti, atlantu, globusu vai citu kartogrāfijas materiālu. @lv
label: 是……的作品的地图绘制者集体行为者 @zh-hans
definition: 将一个集体行为者与涉及创作一种地图作品的一个集体行为者的责任的一种作品关联起来。 @zh-hans
toolkit label: ……的作品的地图绘制者集体行为者 @zh-hans
toolkit definition: 涉及创作一种地图作品的一个集体行为者的责任的一种作品 @zh-hans
label: eserinin kartograf kolektif temsilcisidir @tr
definition: Kolektif bir temsilciyi, bir kartografik eseri oluşturmak için kolektif bir temsilcinin sorumluluğunu içeren bir eserle ilişkilendirir. @tr
toolkit label: eserin kartograf kolektif temsilcisi @tr
toolkit definition: Kartografik bir eser oluşturmak için kolektif bir temsilcinin sorumluluğunu içeren bir eser. @tr
has subproperty: teoksen kartantekijä (yhteisö) teoksessa
has subproperty: teoksen kartantekijä (suku) teoksessa
has subproperty: P50676

teoksen kartantekijä (yhteisö) teoksessa
status: Published
label: is cartographer corporate body of work of @en
lexical alias: cartographerCorporateBodyOfWorkOf.en
definition: Relates a corporate body to a work that involves a responsibility of a corporate body for creating a cartographic work. @en
toolkit label: cartographer corporate body of work of @en
toolkit definition: A work that involves a responsibility of a corporate body for creating a cartographic work. @en
type: Property
domain: C10005
has element type: 2
sub property of: teoksen tekijä (yhteisö) teoksessa
sub property of: teoksen kartantekijä (yhteistoimija) teoksessa
definition: Liittää yhteisön teokseen, joka on kartografinen teos, jonka luomisesta yhteisö on vastuussa.
toolkit label: teoksen kartantekijä (yhteisö) teoksessa
toolkit definition: Teos, joka on kartografinen teos, jonka luomisesta yhteisö on vastuussa.
label: er kartograf for verk for (korporasjon) @no
definition: Relaterer en korporasjon til et verk som involverer et ansvar for en korporasjon i form av et kartografisk verk. @no
toolkit label: kartograf for verk for (korporasjon) @no
toolkit definition: Et verk som involverer et ansvar for en korporasjon i form av et kartografisk verk. @no
label: is cartograaf-corporatie van werk van @nl
definition: Relateert een corporatie aan een werk dat met zich meebrengt een verantwoordelijkheid van een corporatie voor het creëren van een cartografisch werk. @nl
toolkit label: cartograaf-corporatie van werk van @nl
toolkit definition: Een werk dat met zich meebrengt een verantwoordelijkheid van een corporatie voor het creëren van een cartografisch werk. @nl
label: هي هيئة رسامة خرائط لعمل لـ @ar
definition: يربط هيئة بعمل يترتب عليه مسئولية هيئة عن أعمال رسم الخرائط. @ar
toolkit label: هيئة رسامة خرائط لعمل @ar
toolkit definition: عمل يترتب عليه مسئولية هيئة عن أعمال رسم الخرائط. @ar
label: és entitat corporativa cartògrafa d’una obra de @ca
definition: Relaciona una entitat corporativa amb una obra que implica una responsabilitat d’una entitat corporativa en la creació d’una obra cartogràfica. @ca
toolkit label: entitat corporativa cartògrafa d’una obra de @ca
toolkit definition: Obra que implica una responsabilitat d’una entitat corporativa en la creació d’una obra cartogràfica. @ca
label: er korporation, som er kartograf for værk af @da
definition: Relaterer en korporation til et værk, som involverer en korporations ansvar for at skabe et kartografisk værk. @da
toolkit label: korporation, som er kartograf for værk af @da
toolkit definition: Værk, som involverer en korporations ansvar for at skabe et kartografisk værk. @da
label: teose kartograaf (asutus) teoses @et
definition: Seostab asutuse teosega, mis sisaldab asutuse vastutust kartograafilise teose eest. @et
toolkit label: teose kartograaf (asutus) teoses @et
toolkit definition: Teos, mis sisaldab asutuse vastutust kartograafilise teose eest. @et
label: ist Körperschaft als Kartografin/Kartograf eines Werks von @de
definition: Setzt eine Körperschaft in Beziehung zu einem Werk, bei dem eine Körperschaft für die Schaffung eines kartografischen Werks verantwortlich ist. @de
toolkit label: Körperschaft als Kartografin/Kartograf eines Werks von @de
toolkit definition: Ein Werk, bei dem eine Körperschaft für die Schaffung eines kartografischen Werks verantwortlich ist. @de
label: térképész testülete a következő műnek: @hu
definition: Hozzákapcsol egy testületet egy műhöz, amelyhez hozzátartozik egy testület felelőssége egy kartográfiai mű létrehozásáért. @hu
toolkit label: térképész testülete a következő műnek: @hu
toolkit definition: Egy mű, amelyhez hozzátartozik egy testület felelőssége egy kartográfiai mű létrehozásáért. @hu
label: è cartografo ente di opera di @it
definition: Correla un ente a un'opera che implica una responsabilità di un ente per un'opera cartografica. @it
toolkit label: cartografo ente di opera di @it
toolkit definition: Opera che implica una responsabilità di un ente per un'opera cartografica. @it
label: είναι χαρτογράφος συλλογικό όργανο του έργου του @el
toolkit label: χαρτογράφος συλλογικό όργανο του έργου του @el
label: est une collectivité cartographe d’une œuvre de @fr
definition: Met une collectivité en relation avec une œuvre qui comporte une responsabilité de la part d’une collectivité consistant à créer une œuvre cartographique. @fr
toolkit label: collectivité cartographe d’une œuvre de @fr
toolkit definition: Œuvre qui comporte une responsabilité de la part d’une collectivité consistant à créer une œuvre cartographique. @fr
label: ir kartogrāfs (institūcija) darbam @lv
definition: Sasaista institūciju ar darbu, kas ietver institūcijas atbildību par karti, atlantu, globusu vai citu kartogrāfijas materiālu. @lv
toolkit label: ir kartogrāfs (institūcija) darbam @lv
toolkit definition: Darbs, kas ietver institūcijas atbildību par karti, atlantu, globusu vai citu kartogrāfijas materiālu. @lv
label: 是……的作品的地图绘制者团体 @zh-hans
definition: 将一个团体与涉及创作一种地图作品的一个团体的责任的一种作品关联起来。 @zh-hans
toolkit label: ……的作品的地图绘制者团体 @zh-hans
toolkit definition: 涉及创作一种地图作品的一个团体的责任的一种作品 @zh-hans
label: eserinin kartograf tüzel kişisidir @tr
definition: Bir tüzel kişiyi, bir kartografik çalışma yaratmak için bir tüzel kişiliğin sorumluluğunu içeren bir eserle ilişkilendirir. @tr
toolkit label: eserin kartograf tüzel kişisi @tr
toolkit definition: Kartografik bir eser oluşturmak için bir tüzel kişinin sorumluluğunu içeren bir eser. @tr
has subproperty: P50827

teoksen kartantekijä (suku) teoksessa
status: Published
label: is cartographer family of work of @en
lexical alias: cartographerFamilyOfWorkOf.en
definition: Relates a family to a work that involves a responsibility of a family for creating a cartographic work. @en
toolkit label: cartographer family of work of @en
toolkit definition: A work that involves a responsibility of a family for creating a cartographic work. @en
type: Property
domain: C10008
has element type: 2
sub property of: teoksen tekijä (suku) teoksessa
sub property of: teoksen kartantekijä (yhteistoimija) teoksessa
definition: Liittää suvun teokseen, joka on kartografinen teos, jonka luomisesta suku on vastuussa.
toolkit label: teoksen kartantekijä (suku) teoksessa
toolkit definition: Teos, joka on kartografinen teos, jonka luomisesta suku on vastuussa.
label: er kartograf for verk for (familie) @no
definition: Relaterer en familie til et verk som involverer et ansvar for en familie i form av et kartografisk verk. @no
toolkit label: kartograf for verk for (familie) @no
toolkit definition: Et verk som involverer et ansvar for en familie i form av et kartografisk verk. @no
label: is cartograaf-familie van werk van @nl
definition: Relateert een familie aan een werk dat met zich meebrengt een verantwoordelijkheid van een familie voor het creëren van een cartografisch werk. @nl
toolkit label: cartograaf-familie van werk van @nl
toolkit definition: Een werk dat met zich meebrengt een verantwoordelijkheid van een familie voor het creëren van een cartografisch werk. @nl
label: هي عائلة رسامة خرائط لعمل لـ @ar
definition: يربط عائلة بعمل يترتب عليه مسئولية عائلة عن أعمال رسم الخرائط. @ar
toolkit label: عائلة رسامة خرائط لعمل @ar
toolkit definition: عمل يترتب عليه مسئولية عائلة عن أعمال رسم الخرائط. @ar
label: és família cartògrafa d’una obra de @ca
definition: Relaciona una família amb una obra que implica una responsabilitat d’una família en la creació d’una obra cartogràfica. @ca
toolkit label: família cartògrafa d’una obra de @ca
toolkit definition: Obra que implica una responsabilitat d’una família en la creació d’una obra cartogràfica. @ca
label: er familie, som er kartograf for værk af @da
definition: Relaterer en familie til et værk, som involverer en families ansvar for et kartografisk værk. @da
toolkit label: familie, som er kartograf for værk af @da
toolkit definition: Værk, som involverer en families ansvar for at skabe et kartografisk værk. @da
label: teose kartograaf (perekond) teoses @et
definition: Seostab perekonna teosega, mis sisaldab perekonna vastutust kartograafilise teose eest. @et
toolkit label: teose kartograaf (perekond) teoses @et
toolkit definition: Teos, mis sisaldab perekonna vastutust kartograafilise teose eest. @et
label: ist Familie als Kartografin/Kartograf eines Werks von @de
definition: Setzt eine Familie in Beziehung zu einem Werk, bei dem eine Familie für die Schaffung eines kartografischen Werks verantwortlich ist. @de
toolkit label: Familie als Kartografin/Kartograf eines Werks von @de
toolkit definition: Ein Werk, bei dem eine Familie für die Schaffung eines kartografischen Werks verantwortlich ist. @de
label: térképész családja a következő műnek: @hu
definition: Hozzákapcsol egy családot egy műhöz, amelyhez hozzátartozik egy család felelőssége egy kartográfiai mű létrehozásáért. @hu
toolkit label: térképész családja a következő műnek: @hu
toolkit definition: Egy mű, amelyhez hozzátartozik egy család felelőssége egy kartográfiai mű létrehozásáért. @hu
label: è cartografo famiglia di opera di @it
definition: Correla una famiglia a un'opera che implica una responsabilità di una famiglia per un'opera cartografica. @it
toolkit label: cartografo famiglia di opera di @it
toolkit definition: Opera che implica una responsabilità di una famiglia per un'opera cartografica. @it
label: είναι χαρτογράφος οικογένεια του έργου του @el
toolkit label: χαρτογράφος οικογένεια του έργου του @el
label: est une famille cartographe d’une œuvre de @fr
definition: Met une famille en relation avec une œuvre qui comporte une responsabilité de la part d’une famille consistant à créer une œuvre cartographique. @fr
toolkit label: famille cartographe d’une œuvre de @fr
toolkit definition: Œuvre qui comporte une responsabilité de la part d’une famille consistant à créer une œuvre cartographique. @fr
label: ir kartogrāfs (dzimta/ģimene) darbam @lv
definition: Sasaista dzimtu/ģimeni ar darbu, kas ietver dzimtas/ģimenes atbildību par karti, atlantu, globusu vai citu kartogrāfijas materiālu. @lv
toolkit label: ir kartogrāfs (dzimta/ģimene) darbam @lv
toolkit definition: Darbs, kas ietver dzimtas/ģimenes atbildību par karti, atlantu, globusu vai citu kartogrāfijas materiālu. @lv
label: 是……的作品的地图绘制者家族 @zh-hans
definition: 将一个家族与涉及创作一种地图作品的一个家族的责任的一种作品关联起来。 @zh-hans
toolkit label: ……的作品的地图绘制者家族 @zh-hans
toolkit definition: 涉及创作一种地图作品的一个家族的责任的一种作品 @zh-hans
label: eserinin kartograf ailesidir @tr
definition: Bir aileyi, bir ailenin kartografik bir eser yaratma sorumluluğunu içeren bir eserle ilişkilendirir @tr
toolkit label: eserin kartograf ailesi @tr
toolkit definition: Kartografik bir eser oluşturmak için bir ailenin sorumluluğunu içeren bir çalışma. @tr
has subproperty: P50978

teoksen kartantekijä (henkilö) teoksessa
status: Published
label: is cartographer person of work of @en
lexical alias: cartographerPersonOfWorkOf.en
definition: Relates a person to a work that involves a responsibility of a person for creating a cartographic work. @en
toolkit label: cartographer person of work of @en
toolkit definition: A work that involves a responsibility of a person for creating a cartographic work. @en
type: Property
domain: C10004
has element type: 2
sub property of: teoksen tekijä (henkilö) teoksessa
sub property of: teoksen kartantekijä (toimija) teoksessa
definition: Liittää henkilön teokseen, joka on kartografinen teos, jonka luomisesta henkilö on vastuussa.
toolkit label: teoksen kartantekijä (henkilö) teoksessa
toolkit definition: Teos, joka on kartografinen teos, jonka luomisesta henkilö on vastuussa.
label: er kartograf for verk for (person) @no
definition: Relaterer en person til et verk som involverer et ansvar for en person i form av et kartografisk verk. @no
toolkit label: kartograf for verk for (person) @no
toolkit definition: Et verk som involverer et ansvar for en person i form av et kartografisk verk. @no
label: is cartograaf-persoon van werk van @nl
definition: Relateert een persoon aan een werk dat met zich meebrengt een verantwoordelijkheid van een persoon voor het creëren van een cartografisch werk. @nl
toolkit label: cartograaf-persoon van werk van @nl
toolkit definition: Een werk dat met zich meebrengt een verantwoordelijkheid van een persoon voor het creëren van een cartografisch werk. @nl
label: هو شخص رسام خرائط لعمل لـ @ar
definition: يربط شخصا بعمل يترتب عليه مسئولية شخص ما عن أعمال رسم الخرائط. @ar
toolkit label: شخص رسام خرائط لعمل @ar
toolkit definition: عمل يترتب عليه مسئولية شخص عن أعمال رسم الخرائط. @ar
label: és persona cartògrafa d’una obra de @ca
definition: Relaciona una persona amb una obra que implica una responsabilitat d’una persona en la creació d’una obra cartogràfica. @ca
toolkit label: persona cartògrafa d’una obra de @ca
toolkit definition: Obra que implica una responsabilitat d’una persona en la creació d’una obra cartogràfica. @ca
label: er person, som er kartograf for værk af @da
definition: Relaterer en person til et værk, som involverer en persons ansvar for at skabe et kartografisk værk. @da
toolkit label: person, som er kartograf for værk af @da
toolkit definition: Værk, som involverer en persons ansvar for at skabe et kartografisk værk. @da
label: teose kartograaf (isik) teoses @et
definition: Seostab isiku teosega, mis sisaldab isiku vastutust kartograafilise teose eest. @et
toolkit label: teose kartograaf (isik) teoses @et
toolkit definition: Teos, mis sisaldab isiku vastutust kartograafilise teose eest. @et
label: ist Person als Kartografin/Kartograf eines Werks von @de
definition: Setzt eine Person in Beziehung zu einem Werk, bei dem eine Person für die Schaffung eines kartografischen Werks verantwortlich ist. @de
toolkit label: Person als Kartografin/Kartograf eines Werks von @de
toolkit definition: Ein Werk, bei dem eine Person für die Schaffung eines kartografischen Werks verantwortlich ist. @de
label: térképész személye a következő műnek: @hu
definition: Hozzákapcsol egy személyt egy műhöz, amelyhez hozzátartozik egy személy felelőssége egy kartográfiai mű létrehozásáért. @hu
toolkit label: térképész személye a következő műnek: @hu
toolkit definition: Egy mű, amelyhez hozzátartozik egy személy felelőssége egy kartográfiai mű létrehozásáért. @hu
label: è cartografo persona di opera di @it
definition: Correla una persona a un'opera che implica una responsabilità di una persona per una mappa, atlante, mappamondo o altra risorsa cartografica. @it
toolkit label: cartografo persona di opera di @it
toolkit definition: Opera che implica una responsabilità di una persona per un'opera cartografica. @it
label: είναι χαρτογράφος φυσικό πρόσωπο του έργου του @el
toolkit label: χαρτογράφος φυσικό πρόσωπο του έργου του @el
label: est une personne cartographe d’une œuvre de @fr
definition: Met une personne en relation avec une œuvre qui comporte une responsabilité de la part d’une personne consistant à créer une œuvre cartographique. @fr
toolkit label: personne cartographe d’une œuvre de @fr
toolkit definition: Œuvre qui comporte une responsabilité de la part d’une personne consistant à créer une œuvre cartographique. @fr
label: ir kartogrāfs (persona) darbam @lv
definition: Sasaista personu ar darbu, kas ietver personas atbildību par karti, atlantu, globusu vai citu kartogrāfijas materiālu. @lv
toolkit label: ir kartogrāfs (persona) darbam @lv
toolkit definition: Darbs, kas ietver personas atbildību par karti, atlantu, globusu vai citu kartogrāfijas materiālu. @lv
label: 是……的作品的地图绘制者个人 @zh-hans
definition: 将一个个人与涉及创作一种地图作品的一个个人的责任的一种作品关联起来。 @zh-hans
toolkit label: ……的作品的地图绘制者个人 @zh-hans
toolkit definition: 涉及创作一种地图作品的一个个人的责任的一种作品 @zh-hans
label: eserinin kartograf kişisidir @tr
definition: Bir kişiyi, bir kişinin haritacılık çalışması oluşturma sorumluluğunu içeren bir eserle ilişkilendirir. @tr
toolkit label: eserin kartografı @tr
toolkit definition: Kartografik bir eser oluşturmak için bir kişinin sorumluluğunu içeren bir çalışma. @tr
has subproperty: P50525

valaja (toimija) manifestaatiossa
status: Published
label: is caster agent of @en
definition: Relates an agent to a manifestation that involves a responsibility of an agent for pouring a liquid or molten substance into a mold and leaving it to solidify to take the shape of the mold. @en
type: Property
domain: C10002
lexical alias: casterAgentOf.en
label: est un agent fondeur de @fr
definition: Met un agent en relation avec une manifestation qui comporte une responsabilité de la part d’un agent consistant à verser un liquide ou une substance fondue dans un moule et à laisser ce liquide ou cette substance se solidifier pour prendre la forme du moule. @fr
toolkit label: agent fondeur de @fr
toolkit definition: Manifestation qui comporte une responsabilité de la part d’un agent consistant à verser un liquide ou une substance fondue dans un moule et à laisser ce liquide ou cette substance se solidifier pour prendre la forme du moule. @fr
toolkit label: caster agent of @en
toolkit definition: A manifestation that involves a responsibility of an agent for pouring a liquid or molten substance into a mold and leaving it to solidify to take the shape of the mold. @en
instruction number: 18.5
label: είναι αναδευτήρας φορέας του @el
definition: Συνδέει έναν φορέα, ο οποίος εμπλέκεται στην κατασκευή μιας εκδήλωσης μέσω της έκχυσης υγρής ή τηγμένης ουσίας αφήνοντάς την να στερεοποιηθεί για να πάρει το σχήμα του καλουπιού, με μια εκδήλωση. @el
toolkit label: αναδευτήρας φορέας του @el
toolkit definition: Μια εκδήλωση που κατασκευάζεται από έναν φορέα υπεύθυνο για την έκχυση υγρής ή τηγμένης ουσίας και τη στερεοποίησή της μέχρι να πάρει το σχήμα του καλουπιού. @el
definition: Setzt einen Akteur in Beziehung zu einer Manifestation, bei der ein Akteur dafür verantwortlich ist, eine Flüssigkeit oder eine geschmolzene Substanz in eine Form zu gießen, die in der Gießform verbleibt, bis sie ausgehärtet ist. @de
toolkit label: Akteur als Formgießerin/Formgießer von @de
toolkit definition: Eine Manifestation, bei der ein Akteur dafür verantwortlich ist, eine Flüssigkeit oder eine geschmolzene Substanz in eine Form zu gießen, die in der Gießform verbleibt, bis sie ausgehärtet ist. @de
label: er agent, som er støber af @da
definition: Relaterer en agent til en manifestation, som involverer en agents ansvar for at hælde en væske eller et varmt, flydende stof i en form og lade det størkne, så det tager facon efter formen. @da
toolkit label: agent, som er støber af @da
toolkit definition: Manifestation, som involverer en agents ansvar for at hælde en væske eller et varmt, flydende stof i en form og lade det størkne, så det tager facon efter formen. @da
label: és agent emmotllador de @ca
definition: Relaciona un agent amb una manifestació que implica una responsabilitat d’un agent en l’abocament d’un líquid o una substància fosa en un motlle tot deixant que se solidifiqui perquè prengui la forma del motlle. @ca
toolkit label: agent emmotllador de @ca
toolkit definition: Manifestació que implica una responsabilitat d’un agent en l’abocament d’un líquid o una substància fosa en un motlle tot deixant que se solidifiqui perquè prengui la forma del motlle. @ca
definition: Liittää toimijan manifestaatioon, jonka valmistamisesta toimija on vastuussa muovaamalla sulatettua tai nestemäistä ainetta muotin avulla.
toolkit label: valaja (toimija) manifestaatiossa
toolkit definition: Manifestaatio, jonka valmistamisesta toimija on vastuussa muovaamalla sulatettua tai nestemäistä ainetta muotin avulla.
toolkit label: støper av (agent) @no
toolkit definition: En manifestasjon som involverer ansvar for en agent i form av å å helle et flytende eller smeltet stoff i en støpeform og la det stivne i denne formen. @no
label: ist Akteur als Formgießerin/Formgießer von @de
has element type: 2
label: öntvénykészítő ágense a következőnek: @hu
definition: Hozzákapcsol egy ágenst egy megjelenési formához, amelyhez hozzátartozik egy ágens felelőssége folyékony vagy olvasztott anyag öntőformába öntéséért, hogy az ott megszilárduljon és fölvegye az öntőforma formáját. @hu
toolkit label: öntvénykészítő ágense: @hu
toolkit definition: Egy megjelenési forma, amelyhez hozzátartozik egy ágens felelőssége folyékony vagy olvasztott anyag öntőformába öntéséért, hogy az ott megszilárduljon és fölvegye az öntőforma formáját. @hu
alternative label: caster of @en
alternative label: valajana valoksessa
label: er støper av (agent) @no
definition: Relaterer en agent til en manifestasjon som involverer ansvar for en agent i form av å å helle et flytende eller smeltet stoff i en støpeform og la det stivne i denne formen. @no
alternative label: støper av @no
label: is gieter-actor van @nl
definition: Relateert een actor aan een manifestatie die met zich meebrengt een verantwoordelijkheid van een actor voor het gieten van een vloeistof of gesmolten substantie in een mal en het laten stollen om de vorm van de mal aan te laten nemen. @nl
toolkit label: gieter-actor van @nl
toolkit definition: Een manifestatie die met zich meebrengt een verantwoordelijkheid van een actor voor het gieten van een vloeistof of gesmolten substantie in een mal en het laten stollen om de vorm van de mal aan te laten nemen. @nl
label: هو وكيل عامل صب لـ @ar
definition: يربط وكيلا بتجسيدة تنطوي على مسئولية وكيل لصب مادة سائلة أو منصهرة في قالب وتركها للتصلب لأخذ شكل القالب. @ar
alternative label: عامل صب @ar
toolkit label: وكيل عامل صب @ar
toolkit definition: تجسيدة تنطوي على مسئولية وكيل عن صب مادة سائلة أو منصهرة في قالب وتركها للتصلب لأخذ شكل القالب. @ar
alternative label: emmotllador de @ca
alternative label: støber af @da
label: valaja (tegija) kehastuses @et
definition: Seostab tegija kehastusega, mis sisaldab tegija vastutust vedela või sulatatud materjali valuvormi valamise ja valuvormi kuju võtmiseks tahkuda laskmise eest. @et
alternative label: valaja kehastuses @et
toolkit label: valaja (tegija) kehastuses @et
toolkit definition: Kehastus, mis sisaldab tegija vastutust vedela või sulatatud materjali valuvormi valamise ja valuvormi kuju võtmiseks tahkuda laskmise eest. @et
alternative label: öntvénykészítője: @hu
label: è fonditore agente di @it
definition: Correla un agente a una manifestazione che implica la responsabilità di un agente nel versare un liquido o sostanza fusa in uno stampo e lasciarlo solidificare per assumere la forma dello stampo. @it
alternative label: fonditore di @it
toolkit label: fonditore agente di @it
toolkit definition: Manifestazione che implica la responsabilità di un agente nel versare un liquido o sostanza fusa in uno stampo e lasciarlo solidificare per assumere la forma dello stampo. @it
alternative label: αναδευτήρας του @el
alternative label: fondeur de @fr
label: ir atliešanas meistars (aģents) @lv
definition: Sasaista aģentu ar manifestāciju, kas ietver aģenta atbildību par šķidruma vai izkausētas vielas ieliešanu veidnē un atstāšanu sacietēt, lai tā saglabātu formu. @lv
toolkit label: ir atliešanas meistars (aģents) @lv
toolkit definition: Manifestācija, kas ietver aģenta atbildību par šķidruma vai izkausētas vielas ieliešanu veidnē un atstāšanu sacietēt, lai tā saglabātu formu. @lv
sub property of: manifestaation tekijä (toimija) manifestaatiossa
alternative label: Formgießer von @de
alternative label: ……的铸造者 @zh-hans
toolkit label: ……的铸造者行为者 @zh-hans
toolkit definition: 涉及将液体或融化的物质倒入模具中使其按模具固化成型的一个行为者的责任的一种载体表现 @zh-hans
toolkit label: dökümcü temsilcisi @tr
toolkit definition: Sıvı veya erimiş bir maddenin bir kalıba dökülmesi ve kalıbın şeklini alması için katılaşmaya bırakılması ile görevli temsilcinin sorumluluğunu içeren bir gösterim. @tr
has subproperty: valaja (yhteistoimija) manifestaatiossa

valaja (yhteistoimija) manifestaatiossa
status: Published
label: is caster collective agent of @en
lexical alias: casterCollectiveAgentOf.en
definition: Relates a collective agent to a manifestation that involves a responsibility of a collective agent for pouring a liquid or molten substance into a mold and leaving it to solidify to take the shape of the mold. @en
toolkit label: caster collective agent of @en
toolkit definition: A manifestation that involves a responsibility of a collective agent for pouring a liquid or molten substance into a mold and leaving it to solidify to take the shape of the mold. @en
type: Property
domain: C10011
has element type: 2
sub property of: valaja (toimija) manifestaatiossa
definition: Liittää yhteistoimijan manifestaatioon, jonka valmistamisesta yhteistoimija on vastuussa muovaamalla sulatettua tai nestemäistä ainetta muotin avulla.
toolkit label: valaja (yhteistoimija) manifestaatiossa
toolkit definition: Manifestaatio, jonka valmistamisesta yhteistoimija on vastuussa muovaamalla sulatettua tai nestemäistä ainetta muotin avulla.
label: er støper av (kollektiv agent) @no
definition: Relaterer en kollektiv agent til en manifestasjon som involverer et ansvar for en kollektiv agent i form av framstilling av trykt tekst, nedskrevet musikk eller annet innhold fra typer eller plater. @no
toolkit label: støper av (kollektiv agent) @no
toolkit definition: En manifestasjon som involverer et ansvar for en kollektiv agent i form av framstilling av trykt tekst, nedskrevet musikk eller annet innhold fra typer eller plater. @no
label: is gieter-collectieve actor van @nl
definition: Relateert een collectieve actor aan een manifestatie die met zich meebrengt een verantwoordelijkheid van een collectieve actor voor het gieten van een vloeistof of gesmolten substantie in een mal en het laten stollen om de vorm van de mal aan te laten nemen. @nl
toolkit label: gieter-collectieve actor van @nl
toolkit definition: Een manifestatie die met zich meebrengt een verantwoordelijkheid van een collectieve actor voor het gieten van een vloeistof of gesmolten substantie in een mal en het laten stollen om de vorm van de mal aan te laten nemen. @nl
label: هو وكيل جماعى عامل صب لـ @ar
definition: يربط وكيلا جماعيا بتجسيدة تنطوي على مسئولية وكيل جماعي عن صب مادة سائلة أو مذابة في قالب وتركه ليتصلب ليأخذ شكل القالب. @ar
toolkit label: وكيل جماعى عامل صب @ar
toolkit definition: تجسيدة تنطوي على مسئولية وكيل جماعي عن صب مادة سائلة أو مذابة في قالب وتركه ليتصلب ليأخذ شكل القالب. @ar
label: és agent col·lectiu emmotllador de @ca
definition: Relaciona un agent col·lectiu amb una manifestació que implica una responsabilitat d’un agent col·lectiu en l’abocament d’un líquid o una substància fosa en un motlle tot deixant que se solidifiqui perquè prengui la forma del motlle. @ca
toolkit label: agent col·lectiu emmotllador de @ca
toolkit definition: Manifestació que implica una responsabilitat d’un agent col·lectiu en l’abocament d’un líquid o una substància fosa en un motlle tot deixant que se solidifiqui perquè prengui la forma del motlle. @ca
label: er kollektiv agent, som er støber af @da
definition: Relaterer en kollektiv agent til en manifestation, som involverer en kollektiv agents ansvar for at hælde en væske eller et varmt, flydende stof i en form og lade det størkne, så det tager facon efter formen. @da
toolkit label: kollektiv agent, som er støber af @da
toolkit definition: Manifestation, som involverer en kollektiv agents ansvar for at hælde en væske eller et varmt, flydende stof i en form og lade det størkne, så det tager facon efter formen. @da
label: valaja (kollektiiv) kehastuses @et
definition: Seostab kollektiivi kehastusega, mis sisaldab kollektiivi vastutust vedela või sulatatud materjali valuvormi valamise ja valuvormi kuju võtmiseks tahkuda laskmise eest. @et
toolkit label: valaja (kollektiiv) kehastuses @et
toolkit definition: Kehastus, mis sisaldab kollektiivi vastutust vedela või sulatatud materjali valuvormi valamise ja valuvormi kuju võtmiseks tahkuda laskmise eest. @et
label: ist gemeinschaftlicher Akteur als Formgießerin/Formgießer von @de
definition: Setzt einen gemeinschaftlichen Akteur in Beziehung zu einer Manifestation, bei der ein gemeinschaftlicher Akteur dafür verantwortlich ist, eine Flüssigkeit oder eine geschmolzene Substanz in eine Form zu gießen, die in der Gießform verbleibt, bis sie ausgehärtet ist. @de
toolkit label: Gemeinschaftlicher Akteur als Formgießerin/Formgießer von @de
toolkit definition: Eine Manifestation, bei der ein gemeinschaftlicher Akteur dafür verantwortlich ist, eine Flüssigkeit oder eine geschmolzene Substanz in eine Form zu gießen, die in der Gießform verbleibt, bis sie ausgehärtet ist. @de
label: öntvénykészítő kollektív ágense a következőnek: @hu
definition: Hozzákapcsol egy kollektív ágenst egy megjelenési formához, amelyhez hozzátartozik egy kollektív ágens felelőssége folyékony vagy olvasztott anyag öntőformába öntéséért, hogy az ott megszilárduljon és fölvegye az öntőforma formáját. @hu
toolkit label: öntvénykészítő kollektív ágense: @hu
toolkit definition: Egy megjelenési forma, amelyhez hozzátartozik egy kollektív ágens felelőssége folyékony vagy olvasztott anyag öntőformába öntéséért, hogy az ott megszilárduljon és fölvegye az öntőforma formáját. @hu
label: è fonditore agente collettivo di @it
definition: Correla un agente collettivo a una manifestazione che implica una responsabilità di un agente collettivo nel versare un liquido o sostanza fusa in uno stampo e lasciarlo solidificare per assumere la forma dello stampo. @it
toolkit label: fonditore agente collettivo di @it
toolkit definition: Manifestazione che implica una responsabilità di un agente collettivo nel versare un liquido o sostanza fusa in uno stampo e lasciarlo solidificare per assumere la forma dello stampo. @it
label: είναι χυτευτής συλλογικός φορέας του @el
toolkit label: χυτευτής συλλογικός φορέας του @el
label: est un agent collectif fondeur de @fr
definition: Met un agent collectif en relation avec une manifestation qui comporte une responsabilité de la part d’un agent collectif consistant à verser un liquide ou une substance fondue dans un moule et à laisser ce liquide ou cette substance se solidifier pour prendre la forme du moule. @fr
toolkit label: agent collectif fondeur de @fr
toolkit definition: Manifestation qui comporte une responsabilité de la part d’un agent collectif consistant à verser un liquide ou une substance fondue dans un moule et à laisser ce liquide ou cette substance se solidifier pour prendre la forme du moule. @fr
label: ir atliešanas meistars (grupa) @lv
definition: Sasaista grupu ar manifestāciju, kas ietver grupas atbildību par šķidruma vai izkausētas vielas ieliešanu veidnē un atstāšanu sacietēt, lai tā saglabātu formu. @lv
toolkit label: ir atliešanas meistars (grupa) @lv
toolkit definition: Manifestācija, kas ietver grupas atbildību par šķidruma vai izkausētas vielas ieliešanu veidnē un atstāšanu sacietēt, lai tā saglabātu formu. @lv
sub property of: manifestaation tekijä (yhteistoimija) manifestaatiossa
label: 是……的铸造者集体行为者 @zh-hans
definition: 将一个集体行为者与涉及将液体或融化的物质倒入模具中使其按模具固化成型的一个集体行为者的责任的一种载体表现关联起来。 @zh-hans
toolkit label: ……的铸造者集体行为者 @zh-hans
toolkit definition: 涉及将液体或融化的物质倒入模具中使其按模具固化成型的一个集体行为者的责任的一种载体表现 @zh-hans
label: dökümcü kolektif temsilcisidir @tr
definition: Kolektif bir temsilciyi, sıvı veya erimiş bir maddeyi bir kalıba dökme ve kalıbın şeklini alması için katılaşmaya bırakma sorumluluğunu içeren bir gösterimle ilişkilendirir. @tr
toolkit label: dökümcü kolektif temsilcisi @tr
toolkit definition: Sıvı veya erimiş bir maddeyi bir kalıba dökmek ve kalıbın şeklini almak üzere katılaşmaya bırakmak için kolektif bir temsilcinin sorumluluğunu içeren bir gösterim. @tr
has subproperty: valaja (yhteisö) manifestaatiossa
has subproperty: valaja (suku) manifestaatiossa
has subproperty: P50653

valaja (yhteisö) manifestaatiossa
status: Published
label: is caster corporate body of @en
lexical alias: casterCorporateBodyOf.en
definition: Relates a corporate body to a manifestation that involves a responsibility of a corporate body for pouring a liquid or molten substance into a mold and leaving it to solidify to take the shape of the mold. @en
toolkit label: caster corporate body of @en
toolkit definition: A manifestation that involves a responsibility of a corporate body for pouring a liquid or molten substance into a mold and leaving it to solidify to take the shape of the mold. @en
type: Property
domain: C10005
has element type: 2
sub property of: valaja (yhteistoimija) manifestaatiossa
definition: Liittää yhteisön manifestaatioon, jonka valmistamisesta yhteisö on vastuussa muovaamalla sulatettua tai nestemäistä ainetta muotin avulla.
toolkit label: valaja (yhteisö) manifestaatiossa
toolkit definition: Manifestaatio, jonka valmistamisesta yhteisö on vastuussa muovaamalla sulatettua tai nestemäistä ainetta muotin avulla.
label: er støper av (korporasjon) @no
definition: Relaterer en korporasjon til en manifestasjon som involverer et ansvar for en korporasjon i form av framstilling av trykt tekst, nedskrevet musikk eller annet innhold fra typer eller plater. @no
toolkit label: støper av (korporasjon) @no
toolkit definition: En manifestasjon som involverer et ansvar for en korporasjon i form av framstilling av trykt tekst, nedskrevet musikk eller annet innhold fra typer eller plater. @no
label: is gieter-corporatie van @nl
definition: Relateert een corporatie aan een manifestatie die met zich meebrengt een verantwoordelijkheid van een corporatie voor het gieten van een vloeistof of gesmolten substantie in een mal en het laten stollen om de vorm van de mal aan te laten nemen. @nl
toolkit label: gieter-corporatie van @nl
toolkit definition: Een manifestatie die met zich meebrengt een verantwoordelijkheid van een corporatie voor het gieten van een vloeistof of gesmolten substantie in een mal en het laten stollen om de vorm van de mal aan te laten nemen. @nl
label: هي هيئة مسئولة عن الصب لـ @ar
definition: يربط هيئة بتجسيدة تنطوي على مسئولية هيئة عن صب مادة سائلة أو مذابة في قالب وتركه ليتصلب ليأخذ شكل القالب. @ar
toolkit label: هيئة مسئولة عن الصب @ar
toolkit definition: تجسيدة تنطوي على مسئولية هيئة عن صب مادة سائلة أو مذابة في قالب وتركه ليتصلب ليأخذ شكل القالب. @ar
label: és entitat corporativa emmotlladora de @ca
definition: Relaciona una entitat corporativa amb una manifestació que implica una responsabilitat d’una entitat corporativa en l’abocament d’un líquid o una substància fosa en un motlle tot deixant que se solidifiqui perquè prengui la forma del motlle. @ca
toolkit label: entitat corporativa emmotlladora de @ca
toolkit definition: Manifestació que implica una responsabilitat d’una entitat corporativa en l’abocament d’un líquid o una substància fosa en un motlle tot deixant que se solidifiqui perquè prengui la forma del motlle. @ca
label: er korporation, som er støber af @da
definition: Relaterer en korporation til en manifestation, som involverer en korporations ansvar for at hælde en væske eller et varmt, flydende stof i en form og lade det størkne, så det tager facon efter formen. @da
toolkit label: korporation, som er støber af @da
toolkit definition: Manifestation, som involverer en korporations ansvar for at hælde en væske eller et varmt, flydende stof i en form og lade det størkne, så det tager facon efter formen. @da
label: valaja (asutus) kehastuses @et
definition: Seostab asutuse kehastusega, mis sisaldab asutuse vastutust vedela või sulatatud materjali valuvormi valamise ja valuvormi kuju võtmiseks tahkuda laskmise eest. @et
toolkit label: valaja (asutus) kehastuses @et
toolkit definition: Kehastus, mis sisaldab asutuse vastutust vedela või sulatatud materjali valuvormi valamise ja valuvormi kuju võtmiseks tahkuda laskmise eest. @et
label: ist Körperschaft als Formgießerin/Formgießer von @de
definition: Setzt eine Körperschaft in Beziehung zu einer Manifestation, bei der eine Körperschaft dafür verantwortlich ist, eine Flüssigkeit oder eine geschmolzene Substanz in eine Form zu gießen, die in der Gießform verbleibt, bis sie ausgehärtet ist. @de
toolkit label: Körperschaft als Formgießerin/Formgießer von @de
toolkit definition: Eine Manifestation, bei der eine Körperschaft dafür verantwortlich ist, eine Flüssigkeit oder eine geschmolzene Substanz in eine Form zu gießen, die in der Gießform verbleibt, bis sie ausgehärtet ist. @de
label: öntvénykészítő testülete a következőnek: @hu
definition: Hozzákapcsol egy testületet egy megjelenési formához, amelyhez hozzátartozik egy testület felelőssége folyékony vagy olvasztott anyag öntőformába öntéséért, hogy az ott megszilárduljon és fölvegye az öntőforma formáját. @hu
toolkit label: öntvénykészítő testülete: @hu
toolkit definition: Egy megjelenési forma, amelyhez hozzátartozik egy testület felelőssége folyékony vagy olvasztott anyag öntőformába öntéséért, hogy az ott megszilárduljon és fölvegye az öntőforma formáját. @hu
label: è fonditore ente di @it
definition: Correla un ente a una manifestazione che implica una responsabilità di un ente nel versare un liquido o sostanza fusa in uno stampo e lasciarlo solidificare per assumere la forma dello stampo. @it
toolkit label: fonditore ente di @it
toolkit definition: Manifestazione che implica una responsabilità di un ente nel versare un liquido o sostanza fusa in uno stampo e lasciarlo solidificare per assumere la forma dello stampo. @it
label: είναι χυτευτής συλλογικό όργανο του @el
toolkit label: είναι χυτευτής συλλογικό όργανο του @el
label: est une collectivité fondeuse de @fr
definition: Met une collectivité en relation avec une manifestation qui comporte une responsabilité de la part d’une collectivité consistant à verser un liquide ou une substance fondue dans un moule et à laisser ce liquide ou cette substance se solidifier pour prendre la forme du moule. @fr
toolkit label: collectivité fondeuse de @fr
toolkit definition: Manifestation qui comporte une responsabilité de la part d’une collectivité consistant à verser un liquide ou une substance fondue dans un moule et à laisser ce liquide ou cette substance se solidifier pour prendre la forme du moule. @fr
label: ir atliešanas meistars (institūcija) @lv
definition: Sasaista institūciju ar manifestāciju, kas ietver institūcijas atbildību par šķidruma vai izkausētas vielas ieliešanu veidnē un atstāšanu sacietēt, lai tā saglabātu formu. @lv
toolkit label: ir atliešanas meistars (institūcija) @lv
toolkit definition: Manifestācija, kas ietver institūcijas atbildību par šķidruma vai izkausētas vielas ieliešanu veidnē un atstāšanu sacietēt, lai tā saglabātu formu. @lv
sub property of: manifestaation tekijä (yhteisö) manifestaatiossa
label: 是……的铸造者团体 @zh-hans
definition: 将一个团体与涉及将液体或融化的物质倒入模具中使其按模具固化成型的一个团体的责任的一种载体表现关联起来。 @zh-hans
toolkit label: ……的铸造者团体 @zh-hans
toolkit definition: 涉及将液体或融化的物质倒入模具中使其按模具固化成型的一个团体的责任的一种载体表现 @zh-hans
label: dökümcü tüzel kişisidir @tr
definition: Bir tüzel kişiyi, sıvı veya erimiş bir maddeyi kalıba dökerek katılaşmaya bırakarak kalıbın şeklini alması sorumluluğunu içeren bir gösterim ile ilişkilendirir. @tr
toolkit label: dökümcü tüzel kişisi @tr
toolkit definition: Sıvı veya erimiş bir maddeyi kalıba dökerek katılaşmaya bırakarak kalıbın şeklini alması için tüzel bir kişinin sorumluluğunu içeren bir gösterim @tr
has subproperty: P50804

valaja (suku) manifestaatiossa
status: Published
label: is caster family of @en
lexical alias: casterFamilyOf.en
definition: Relates a family to a manifestation that involves a responsibility of a family for pouring a liquid or molten substance into a mold and leaving it to solidify to take the shape of the mold. @en
toolkit label: caster family of @en
toolkit definition: A manifestation that involves a responsibility of a family for pouring a liquid or molten substance into a mold and leaving it to solidify to take the shape of the mold. @en
type: Property
domain: C10008
has element type: 2
sub property of: valaja (yhteistoimija) manifestaatiossa
definition: Liittää suvun manifestaatioon, jonka valmistamisesta suku on vastuussa muovaamalla sulatettua tai nestemäistä ainetta muotin avulla.
toolkit label: valaja (suku) manifestaatiossa
toolkit definition: Manifestaatio, jonka valmistamisesta suku on vastuussa muovaamalla sulatettua tai nestemäistä ainetta muotin avulla.
label: er støper av (familie) @no
definition: Relaterer en familie til en manifestasjon som involverer et ansvar for en familie i form av framstilling av trykt tekst, nedskrevet musikk eller annet innhold fra typer eller plater. @no
toolkit label: støper av (familie) @no
toolkit definition: En manifestasjon som involverer et ansvar for en familie i form av framstilling av trykt tekst, nedskrevet musikk eller annet innhold fra typer eller plater. @no
label: is gieter-familie van @nl
definition: Relateert een familie aan een manifestatie die met zich meebrengt een verantwoordelijkheid van een familie voor het gieten van een vloeistof of gesmolten substantie in een mal en het laten stollen om de vorm van de mal aan te laten nemen. @nl
toolkit label: gieter-familie van @nl
toolkit definition: Een manifestatie die met zich meebrengt een verantwoordelijkheid van een familie voor het gieten van een vloeistof of gesmolten substantie in een mal en het laten stollen om de vorm van de mal aan te laten nemen. @nl
label: هي عائلة مسئولة عن الصب لـ @ar
definition: يربط عائلة بتجسيدة تنطوي على مسئولية عائلة عن صب مادة سائلة أو مذابة في قالب وتركه ليتصلب ليأخذ شكل القالب. @ar
toolkit label: عائلة مسئولة عن الصب @ar
toolkit definition: تجسيدة تنطوي على مسئولية عائلة عن صب مادة سائلة أو مذابة في قالب وتركه ليتصلب ليأخذ شكل القالب. @ar
label: és família emmotlladora de @ca
definition: Relaciona una família amb una manifestació que implica una responsabilitat d’una família en l’abocament d’un líquid o una substància fosa en un motlle tot deixant que se solidifiqui perquè prengui la forma del motlle. @ca
toolkit label: família emmotlladora de @ca
toolkit definition: Manifestació que implica una responsabilitat d’una família en l’abocament d’un líquid o una substància fosa en un motlle tot deixant que se solidifiqui perquè prengui la forma del motlle. @ca
label: er familie, som er støber af @da
definition: Relaterer en familie til en manifestation, som involverer en families ansvar for at hælde en væske eller et varmt, flydende stof i en form og lade det størkne, så det tager facon efter formen. @da
toolkit label: familie, som er støber af @da
toolkit definition: Manifestation, som involverer en families ansvar for at hælde en væske eller et varmt, flydende stof i en form og lade det størkne, så det tager facon efter formen. @da
label: valaja (perekond) kehastuses @et
definition: Seostab perekonna kehastusega, mis sisaldab perekonna vastutust vedela või sulatatud materjali valuvormi valamise ja valuvormi kuju võtmiseks tahkuda laskmise eest. @et
toolkit label: valaja (perekond) kehastuses @et
toolkit definition: Kehastus, mis sisaldab perekonna vastutust vedela või sulatatud materjali valuvormi valamise ja valuvormi kuju võtmiseks tahkuda laskmise eest. @et
label: ist Familie als Formgießerin/Formgießer von @de
definition: Setzt eine Familie in Beziehung zu einer Manifestation, bei der eine Familie dafür verantwortlich ist, eine Flüssigkeit oder eine geschmolzenen Substanz in eine Form zu gießen, die in der Gießform verbleibt, bis sie ausgehärtet ist. @de
toolkit label: Familie als Formgießerin/Formgießer von @de
toolkit definition: Eine Manifestation, bei der eine Familie dafür verantwortlich ist, eine Flüssigkeit oder eine geschmolzenen Substanz in eine Form zu gießen, die in der Gießform verbleibt, bis sie ausgehärtet ist. @de
label: öntvénykészítő családja a következőnek: @hu
definition: Hozzákapcsol egy családot egy megjelenési formához, amelyhez hozzátartozik egy család felelőssége folyékony vagy olvasztott anyag öntőformába öntéséért, hogy az ott megszilárduljon és fölvegye az öntőforma formáját. @hu
toolkit label: öntvénykészítő családja: @hu
toolkit definition: Egy megjelenési forma, amelyhez hozzátartozik egy család felelőssége folyékony vagy olvasztott anyag öntőformába öntéséért, hogy az ott megszilárduljon és fölvegye az öntőforma formáját. @hu
label: è fonditore famiglia di @it
definition: Correla una famiglia a una manifestazione che implica una responsabilità di una famiglia nel versare un liquido o sostanza fusa in uno stampo e lasciarlo solidificare per assumere la forma dello stampo. @it
toolkit label: fonditore famiglia di @it
toolkit definition: Manifestazione che implica una responsabilità di una famiglia nel versare un liquido o sostanza fusa in uno stampo e lasciarlo solidificare per assumere la forma dello stampo. @it
label: είναι χυτευτής οικογένεια του @el
toolkit label: χυτευτής οικογένεια του @el
label: est une famille fondeuse de @fr
definition: Met une famille en relation avec une manifestation qui comporte une responsabilité de la part d’une famille consistant à verser un liquide ou une substance fondue dans un moule et à laisser ce liquide ou cette substance se solidifier pour prendre la forme du moule. @fr
toolkit label: famille fondeuse de @fr
toolkit definition: Manifestation qui comporte une responsabilité de la part d’une famille consistant à verser un liquide ou une substance fondue dans un moule et à laisser ce liquide ou cette substance se solidifier pour prendre la forme du moule. @fr
label: ir atliešanas meistars (dzimta/ģimene) @lv
definition: Sasaista dzimtu/ģimeni ar manifestāciju, kas ietver dzimtas/ģimenes atbildību par šķidruma vai izkausētas vielas ieliešanu veidnē un atstāšanu sacietēt, lai tā saglabātu formu. @lv
toolkit label: ir atliešanas meistars (dzimta/ģimene) @lv
toolkit definition: Manifestācija, kas ietver dzimtas/ģimenes atbildību par šķidruma vai izkausētas vielas ieliešanu veidnē un atstāšanu sacietēt, lai tā saglabātu formu. @lv
sub property of: manifestaation tekijä (suku) manifestaatiossa
label: 是……的铸造者家族 @zh-hans
definition: 将一个家族与涉及将液体或融化的物质倒入模具中使其按模具固化成型的一个家族的责任的一种载体表现关联起来。 @zh-hans
toolkit label: ……的铸造者家族 @zh-hans
toolkit definition: 涉及将液体或融化的物质倒入模具中使其按模具固化成型的一个家族的责任的一种载体表现 @zh-hans
label: dökümcü ailesidir @tr
definition: Bir aileyi, ailenin sıvı veya erimiş bir maddeyi bir kalıba dökmek ve kalıbın şeklini almak üzere katılaşmaya bırakmaktaki sorumluluğunu içeren gösterimle ilişkilendirir. @tr
toolkit label: dökümcü ailesi @tr
toolkit definition: Bir ailenin sıvı veya erimiş bir maddeyi bir kalıba dökmek ve kalıbın şeklini almak üzere katılaşmaya bırakmaktaki sorumluluğunu içeren bir gösterim. @tr
has subproperty: P50955

valaja (henkilö) manifestaatiossa
status: Published
label: is caster person of @en
lexical alias: casterPersonOf.en
definition: Relates a person to a manifestation that involves a responsibility of a person for pouring a liquid or molten substance into a mold and leaving it to solidify to take the shape of the mold. @en
toolkit label: caster person of @en
toolkit definition: A manifestation that involves a responsibility of a person for pouring a liquid or molten substance into a mold and leaving it to solidify to take the shape of the mold. @en
type: Property
domain: C10004
has element type: 2
sub property of: valaja (toimija) manifestaatiossa
definition: Liittää henkilön manifestaatioon, jonka valmistamisesta henkilö on vastuussa muovaamalla sulatettua tai nestemäistä ainetta muotin avulla.
toolkit label: valaja (henkilö) manifestaatiossa
toolkit definition: Manifestaatio, jonka valmistamisesta henkilö on vastuussa muovaamalla sulatettua tai nestemäistä ainetta muotin avulla.
label: er støper av (person) @no
definition: Relaterer en person til en manifestasjon som involverer et ansvar for en person i form av å helle et flytende eller smeltet stoff i en støpeform og la det stivne i denne formen. @no
toolkit label: støper av (person) @no
toolkit definition: En manifestasjon som involverer et ansvar for en person i form av å helle et flytende eller smeltet stoff i en støpeform og la det stivne i denne formen. @no
label: is gieter-persoon van @nl
definition: Relateert een persoon aan een manifestatie die met zich meebrengt een verantwoordelijkheid van een persoon voor het gieten van een vloeistof of gesmolten substantie in een mal en het laten stollen om de vorm van de mal aan te laten nemen. @nl
toolkit label: gieter-persoon van @nl
toolkit definition: Een manifestatie die met zich meebrengt een verantwoordelijkheid van een persoon voor het gieten van een vloeistof of gesmolten substantie in een mal en het laten stollen om de vorm van de mal aan te laten nemen. @nl
label: هو شخص عامل صب لـ @ar
definition: يربط شخصا بتجسيدة تنطوي على مسئولية شخص عن صب مادة سائلة أو مذابة في قالب وتركه يتصلب ليأخذ شكل القالب. @ar
toolkit label: شخص عامل صب @ar
toolkit definition: تجسيدة تنطوي على مسئولية شخص عن صب مادة سائلة أو مذابة في قالب وتركه ليتصلب ليأخذ شكل القالب. @ar
label: és persona emmotlladora de @ca
definition: Relaciona una persona amb una manifestació que implica una responsabilitat d’una persona en l’abocament d’un líquid o una substància fosa en un motlle tot deixant que se solidifiqui perquè prengui la forma del motlle. @ca
toolkit label: persona emmotlladora de @ca
toolkit definition: Manifestació que implica una responsabilitat d’una persona en l’abocament d’un líquid o una substància fosa en un motlle tot deixant que se solidifiqui perquè prengui la forma del motlle. @ca
label: er person, som er støber af @da
definition: Relaterer en person til en manifestation, som involverer en persons ansvar for at hælde en væske eller et varmt, flydende stof i en form og lade det størkne, så det tager facon efter formen. @da
toolkit label: person, som er støber af @da
toolkit definition: Manifestation, som involverer en persons ansvar for at hælde en væske eller et varmt, flydende stof i en form og lade det størkne, så det tager facon efter formen. @da
label: valaja (isik) kehastuses @et
definition: Seostab isiku kehastusega, mis sisaldab isiku vastutust vedela või sulatatud materjali valuvormi valamise ja valuvormi kuju võtmiseks tahkuda laskmise eest. @et
toolkit label: valaja (isik) kehastuses @et
toolkit definition: Kehastus, mis sisaldab isiku vastutust vedela või sulatatud materjali valuvormi valamise ja valuvormi kuju võtmiseks tahkuda laskmise eest. @et
label: ist Person als Formgießerin/Formgießer von @de
definition: Setzt eine Person in Beziehung zu einer Manifestation, bei der eine Person dafür verantwortlich ist, eine Flüssigkeit oder eine geschmolzene Substanz in eine Form zu gießen, die in der Gießform verbleibt, bis sie ausgehärtet ist. @de
toolkit label: Person als Formgießerin/Formgießer von @de
toolkit definition: Eine Manifestation, bei der eine Person dafür verantwortlich ist, eine Flüssigkeit oder eine geschmolzene Substanz in eine Form zu gießen, die in der Gießform verbleibt, bis sie ausgehärtet ist. @de
label: öntvénykészítő személye a következőnek: @hu
definition: Hozzákapcsol egy személyt egy megjelenési formához, amelyhez hozzátartozik egy ágens felelőssége folyékony vagy olvasztott anyag öntőformába öntéséért, hogy az ott megszilárduljon és fölvegye az öntőforma formáját. @hu
toolkit label: öntvénykészítő személye: @hu
toolkit definition: Egy megjelenési forma, amelyhez hozzátartozik egy ágens felelőssége folyékony vagy olvasztott anyag öntőformába öntéséért, hogy az ott megszilárduljon és fölvegye az öntőforma formáját. @hu
label: è fonditore persona di @it
definition: Correla una persona a una manifestazione che implica una responsabilità di una persona nel versare un liquido o sostanza fusa in uno stampo e lasciarlo solidificare per assumere la forma dello stampo. @it
toolkit label: fonditore persona di @it
toolkit definition: Manifestazione che implica una responsabilità di una persona nel versare un liquido o sostanza fusa in uno stampo e lasciarlo solidificare per assumere la forma dello stampo. @it
label: είναι χυτευτής φυσικό πρόσωπο του @el
toolkit label: χυτευτής φυσικό πρόσωπο του @el
label: est une personne fondeuse de @fr
definition: Met une personne en relation avec une manifestation qui comporte une responsabilité de la part d’une personne consistant à verser un liquide ou une substance fondue dans un moule et à laisser ce liquide ou cette substance se solidifier pour prendre la forme du moule. @fr
toolkit label: personne fondeuse de @fr
toolkit definition: Manifestation qui comporte une responsabilité de la part d’une personne consistant à verser un liquide ou une substance fondue dans un moule et à laisser ce liquide ou cette substance se solidifier pour prendre la forme du moule. @fr
label: ir atliešanas meistars (persona) @lv
definition: Sasaista personu ar manifestāciju, kas ietver personas atbildību par šķidruma vai izkausētas vielas ieliešanu veidnē un atstāšanu sacietēt, lai tā saglabātu formu. @lv
toolkit label: ir atliešanas meistars (persona) @lv
toolkit definition: Manifestācija, kas ietver personas atbildību par šķidruma vai izkausētas vielas ieliešanu veidnē un atstāšanu sacietēt, lai tā saglabātu formu. @lv
sub property of: manifestaation tekijä (henkilö) manifestaatiossa
label: 是……的铸造者个人 @zh-hans
definition: 将一个个人与涉及将液体或融化的物质倒入模具中使其按模具固化成型的一个个人的责任的一种载体表现关联起来。 @zh-hans
toolkit label: ……的铸造者个人 @zh-hans
toolkit definition: 涉及将液体或融化的物质倒入模具中使其按模具固化成型的一个个人的责任的一种载体表现 @zh-hans
label: dökümcü kişisidir @tr
definition: Bir kişiyi, kişinin sıvı veya erimiş bir maddeyi bir kalıba dökmek ve kalıbın şeklini almak üzere katılaşmaya bırakmaktaki sorumluluğunu içeren gösterimle ilişkilendirir. @tr
toolkit label: dökümcü @tr
toolkit definition: Bir kişinin kişinin sıvı veya erimiş bir maddeyi bir kalıba dökmek ve kalıbın şeklini almak üzere katılaşmaya bırakmaktaki sorumluluğunu içeren bir gösterim. @tr
has subproperty: P50502

roolittaja (toimija) teoksessa
status: Published
type: Property
label: is casting director agent of @en
lexical alias: castingDirectorAgentOf.en
definition: Relates an agent to a work that involves a responsibility of an agent for most aspects of assigning roles and duties to performers. @en
domain: C10002
toolkit label: casting director agent of @en
toolkit definition: A work that involves a responsibility of an agent for most aspects of assigning roles and duties to performers. @en
instruction number: 18.5
sub property of: teoksen tekijä (toimija) teoksessa
label: είναι διευθυντής διανομής ρόλων φορέας του @el
definition: Συνδέει έναν φορέα μια ένα έργο που ενσωματώνει την ευθύνη της συνεισφοράς για τις περισσότερες πτυχές ανάθεσης μερών και καθηκόντων στους εκτελεστές. @el
toolkit label: διευθυντής διανομής ρόλων φορέας του @el
toolkit definition: Ένα έργο, το οποίο ενσωματώνει την ευθύνη της συνεισφοράς για τις περισσότερες πτυχές ανάθεσης μερών και καθηκόντων στους εκτελεστές. @el
definition: Setzt einen Akteur in Beziehung zu einem Werk, bei dem ein Akteur für die meisten Aspekte der Rollenvergabe und Aufgabenzuteilung an Ausführende verantwortlich ist. @de
toolkit label: Akteur als Casting Director von @de
toolkit definition: Ein Werk, bei dem ein Akteur für die meisten Aspekte der Rollenvergabe und Aufgabenzuteilung an Ausführende verantwortlich ist. @de
label: er agent, som er caster af @da
definition: Relaterer en agent til et værk, som involverer en agents ansvar for de fleste aspekter ved tildeling af roller og opgaver til udøvere. @da
toolkit label: agent, som er caster af @da
toolkit definition: Værk, som involverer en agents ansvar for de fleste aspekter ved tildeling af roller og opgaver til udøvere. @da
label: és agent director de càsting de @ca
definition: Relaciona un agent amb una obra que implica una responsabilitat d’un agent en la majoria dels aspectes de l’assignació de papers i funcions als intèrprets. @ca
toolkit label: agent director de càsting de @ca
toolkit definition: Obra que implica una responsabilitat d’un agent en la majoria dels aspectes de l’assignació de papers i funcions als intèrprets. @ca
definition: Liittää toimijan teokseen, jossa toimija on vastuussa useimmista esiintyjien roolien ja tehtävien antamiseen kuuluvista tehtävistä.
toolkit label: roolittaja (toimija) teoksessa
toolkit definition: Teos, jossa toimija on vastuussa useimmista esiintyjien roolien ja tehtävien antamiseen kuuluvista tehtävistä.
toolkit label: casting director for (agent) @no
toolkit definition: Et verk som involverer ansvar for en agent for de fleste aspekter ved rollefordeling og oppgaver mellom utøvere. @no
label: ist Akteur als Casting Director von @de
label: est un agent directeur de casting de @fr
definition: Met un agent en relation avec une œuvre qui comporte une responsabilité de la part d’un agent en ce qui concerne la majeure partie des aspects relatifs à la distribution des rôles et des fonctions aux interprètes. @fr
toolkit label: agent directeur de casting de @fr
toolkit definition: Œuvre qui comporte une responsabilité de la part d’un agent en ce qui concerne la majeure partie des aspects relatifs à la distribution des rôles et des fonctions aux interprètes. @fr
has element type: 2
label: szereposztó rendező ágense a következőnek: @hu
definition: Hozzákapcsol egy ágenst egy műhöz, amelyhez hozzátartozik egy ágens felelőssége a szerepek és feladatok előadókra osztásának legtöbb vonatkozásáért. @hu
toolkit label: szereposztó rendező ágense: @hu
toolkit definition: Egy mű, amelyhez hozzátartozik egy ágens felelőssége a szerepek és feladatok előadókra osztásának legtöbb vonatkozásáért. @hu
alternative label: casting director of @en
alternative label: roolittajana esityksessä
label: er casting director for (agent) @no
definition: Relaterer en agent til et verk som involverer ansvar for en agent for de fleste aspekter ved rollefordeling og oppgaver mellom utøvere. @no
alternative label: casting director for @no
label: is castingdirector-actor van @nl
definition: Relateert een actor aan een werk dat met zich meebrengt een verantwoordelijkheid van een actor voor de meeste aspecten van het toewijzen van rollen en taken aan uitvoerders. @nl
toolkit label: castingdirector-actor van @nl
toolkit definition: Een werk dat met zich meebrengt een verantwoordelijkheid van een actor voor de meeste aspecten van het toewijzen van rollen en taken aan uitvoerders. @nl
label: هو وكيل مدير لطاقم التمثيل لـ @ar
definition: يربط وكيلا بعمل يترتب عليه مسئولية وكيل عن تحديد معظم الجوانب المتعلقة بأدوار الممثلين ومهامهم. @ar
alternative label: مدير طاقم التمثيل @ar
toolkit label: وكيل مدير لطاقم التمثيل @ar
toolkit definition: عمل يترتب عليه مسئولية وكيل عن تحديد معظم الجوانب المتعلقة بأدوار الممثلين ومهامهم. @ar
alternative label: director de càsting de @ca
alternative label: casting director af @da
label: casting'u juht (tegija) teoses @et
definition: Seostab tegija teosega, mis sisaldab tegija vastutust esitajatele rollide ja ülesannete jagamise enamiku aspektide eest. @et
alternative label: casting'u juht teoses @et
toolkit label: casting'u juht (tegija) teoses @et
toolkit definition: Teos, mis sisaldab tegija vastutust esitajatele rollide ja ülesannete jagamise enamiku aspektide eest. @et
alternative label: szereposztó rendezője: @hu
label: è direttore del casting di @it
definition: Correla un agente a un'opera che implica la responsabilità di un agente per diversi aspetti nell'assegnare ruoli e compiti agli attori. @it
alternative label: direttore del casting di @it
toolkit label: direttore del casting agente di @it
toolkit definition: Opera che implica la responsabilità di un agente per diversi aspetti nell'assegnare ruoli e compiti agli attori. @it
alternative label: διευθυντής διανομής ρόλων του @el
alternative label: directeur de casting de @fr
label: ir aktieru atlases režisors (aģents) @lv
definition: Sasaista aģentu ar darbu, kas ietver aģenta atbildību par lomu sadali un pienākumu piešķiršanu izpildītājiem. @lv
toolkit label: ir aktieru atlases režisors (aģents) @lv
toolkit definition: Darbs, kas ietver aģenta atbildību par lomu sadali un pienākumu piešķiršanu izpildītājiem. @lv
alternative label: Casting Director von @de
alternative label: ……的角色导演 @zh-hans
toolkit label: ……的角色导演行为者 @zh-hans
toolkit definition: 涉及给演员分配角色和任务的大多数工作的一个行为者的责任的一种作品 @zh-hans
toolkit label: kast yönetmeni temsilcisi @tr
toolkit definition: Sanatçılara roller ve görevler atamanın çoğu yönü için bir temsilcinin sorumluluğunu içeren bir eser. @tr
has subproperty: roolittaja (yhteistoimija) teoksessa

roolittaja (yhteistoimija) teoksessa
status: Published
label: is casting director collective agent of @en
lexical alias: castingDirectorCollectiveAgentOf.en
definition: Relates a collective agent to a work that involves a responsibility of a collective agent for most aspects of assigning roles and duties to performers. @en
toolkit label: casting director collective agent of @en
toolkit definition: A work that involves a responsibility of a collective agent for most aspects of assigning roles and duties to performers. @en
type: Property
domain: C10011
has element type: 2
sub property of: teoksen tekijä (yhteistoimija) teoksessa
sub property of: roolittaja (toimija) teoksessa
definition: Liittää yhteistoimijan teokseen, jossa yhteistoimija on vastuussa useimmista esiintyjien roolien ja tehtävien antamiseen kuuluvista tehtävistä.
toolkit label: roolittaja (yhteistoimija) teoksessa
toolkit definition: Teos, jossa yhteistoimija on vastuussa useimmista esiintyjien roolien ja tehtävien antamiseen kuuluvista tehtävistä.
label: er casting director for (kollektiv agent) @no
definition: Relaterer en kollektiv agent til et verk som involverer et ansvar for en kollektiv agent i form av de fleste aspektene ved å fordele roller og oppgaver mellom utøvere. @no
toolkit label: casting director for (kollektiv agent) @no
toolkit definition: Et verk som involverer et ansvar for en kollektiv agent i form av de fleste aspektene ved å fordele roller og oppgaver mellom utøvere. @no
label: is castingdirector-collectieve actor van @nl
definition: Relateert een collectieve actor aan een werk dat met zich meebrengt een verantwoordelijkheid van een collectieve actor voor de meeste aspecten van het toewijzen van rollen en taken aan uitvoerders. @nl
toolkit label: castingdirector-collectieve actor van @nl
toolkit definition: Een werk dat met zich meebrengt een verantwoordelijkheid van een collectieve actor voor de meeste aspecten van het toewijzen van rollen en taken aan uitvoerders. @nl
label: هو وكيل جماعي مدير طاقم التمثيل لـ @ar
definition: يربط وكيلا جماعيا بعمل يترتب عليه مسئولية وكيل جماعي عن تحديد معظم الجوانب المتعلقة بأدوار الممثلين ومهامهم. @ar
toolkit label: وكيل جماعي مدير طاقم التمثيل @ar
toolkit definition: عمل يترتب عليه مسئولية وكيل جماعي عن تحديد معظم الجوانب المتعلقة بأدوار الممثلين ومهامهم. @ar
label: és agent col·lectiu director de càsting de @ca
definition: Relaciona un agent amb una obra que implica una responsabilitat d’un agent col·lectiu en la majoria dels aspectes de l’assignació de papers i funcions als intèrprets. @ca
toolkit label: agent col·lectiu director de càsting de @ca
toolkit definition: Obra que implica una responsabilitat d’un agent col·lectiu en la majoria dels aspectes de l’assignació de papers i funcions als intèrprets. @ca
label: er kollektiv agent, som er caster af @da
definition: Relaterer en kollektiv agent til et værk, som involverer en kollektiv agents ansvar for de fleste aspekter ved tildeling af roller og opgaver til udøvere. @da
toolkit label: kollektiv agent, som er caster af @da
toolkit definition: Værk, som involverer en kollektiv agents ansvar for de fleste aspekter ved tildeling af roller og opgaver til udøvere. @da
label: casting'u juht (kollektiiv) teoses @et
definition: Seostab kollektiivi teosega, mis sisaldab kollektiivi vastutust esitajatele rollide ja ülesannete jagamise enamiku aspektide eest. @et
toolkit label: casting'u juht (kollektiiv) teoses @et
toolkit definition: Teos, mis sisaldab kollektiivi vastutust esitajatele rollide ja ülesannete jagamise enamiku aspektide eest. @et
label: ist gemeinschaftlicher Akteur als Casting Director von @de
definition: Setzt einen gemeinschaftlichen Akteur in Beziehung zu einem Werk, bei dem ein gemeinschaftlicher Akteur für die meisten Aspekte der Rollenvergabe und Aufgabenzuteilung an Ausführende verantwortlich ist. @de
toolkit label: Gemeinschaftlicher Akteur als Casting Director von @de
toolkit definition: Ein Werk, bei dem ein gemeinschaftlicher Akteur für die meisten Aspekte der Rollenvergabe und Aufgabenzuteilung an Ausführende verantwortlich ist. @de
label: szereposztó rendező kollektív ágense a következőnek: @hu
definition: Hozzákapcsol egy kollektív ágenst egy műhöz, amelyhez hozzátartozik egy kollektív ágens felelőssége a szerepek és feladatok előadókra osztásának legtöbb vonatkozásáért. @hu
toolkit label: szereposztó rendező kollektív ágense: @hu
toolkit definition: Egy mű, amelyhez hozzátartozik egy kollektív ágens felelőssége a szerepek és feladatok előadókra osztásának legtöbb vonatkozásáért. @hu
label: è direttore del casting agente collettivo di @it
definition: Correla un agente collettivo a un'opera che implica una responsabilità di un agente collettivo nella maggior parte degli aspetti dell'assegnazione di ruoli e incarichi agli attori. @it
toolkit label: direttore del casting agente collettivo di @it
toolkit definition: Opera che implica una responsabilità di un agente collettivo nella maggior parte degli aspetti dell'assegnazione di ruoli e incarichi agli attori. @it
label: είναι διευθυντής διανομής ρόλων συλλογικός φορέας του @el
toolkit label: διευθυντής διανομής ρόλων συλλογικός φορέας του @el
label: est un agent collectif directeur de casting de @fr
definition: Met un agent collectif en relation avec une œuvre qui comporte une responsabilité de la part d’un agent collectif en ce qui concerne la majeure partie des aspects relatifs à la distribution des rôles et des fonctions aux interprètes. @fr
toolkit label: agent collectif directeur de casting de @fr
toolkit definition: Œuvre qui comporte une responsabilité de la part d’un agent collectif en ce qui concerne la majeure partie des aspects relatifs à la distribution des rôles et des fonctions aux interprètes. @fr
label: ir aktieru atlases režisors (grupa) @lv
definition: Sasaista grupu ar darbu, kas ietver grupas atbildību par lomu sadali un pienākumu piešķiršanu izpildītājiem. @lv
toolkit label: ir aktieru atlases režisors (grupa) @lv
toolkit definition: Darbs, kas ietver grupas atbildību par lomu sadali un pienākumu piešķiršanu izpildītājiem. @lv
label: 是……的角色导演集体行为者 @zh-hans
definition: 将一个集体行为者与涉及给演员分配角色和任务的大多数工作的一个集体行为者的责任的一种作品关联起来。 @zh-hans
toolkit label: ……的角色导演集体行为者 @zh-hans
toolkit definition: 涉及给演员分配角色和任务的大多数工作的一个集体行为者的责任的一种作品 @zh-hans
label: cast yönetmeni kolektif temsilcisidir @tr
definition: Kollektif bir temsilciyi, oyunculara roller ve görevler atamanın çoğu durum için kolektif bir temsilcinin sorumluluğunu içeren bir eseri ilişkilendirir. @tr
toolkit label: kast yönetmeni kolektif temsilcisi @tr
toolkit definition: Sanatçılara roller ve görevler atamanın çoğu yönü için kollektif bir temsilcinin sorumluluğunu içeren bir eser. @tr
has subproperty: roolittaja (yhteisö) teoksessa
has subproperty: roolittaja (suku) teoksessa
has subproperty: P50700

roolittaja (yhteisö) teoksessa
status: Published
label: is casting director corporate body of @en
lexical alias: castingDirectorCorporateBodyOf.en
definition: Relates a corporate body to a work that involves a responsibility of a corporate body for most aspects of assigning roles and duties to performers. @en
toolkit label: casting director corporate body of @en
toolkit definition: A work that involves a responsibility of a corporate body for most aspects of assigning roles and duties to performers. @en
type: Property
domain: C10005
has element type: 2
sub property of: teoksen tekijä (yhteisö) teoksessa
sub property of: roolittaja (yhteistoimija) teoksessa
definition: Liittää yhteisön teokseen, jossa yhteisö on vastuussa useimmista esiintyjien roolien ja tehtävien antamiseen kuuluvista tehtävistä.
toolkit label: roolittaja (yhteisö) teoksessa
toolkit definition: Teos, jossa yhteisö on vastuussa useimmista esiintyjien roolien ja tehtävien antamiseen kuuluvista tehtävistä.
label: er casting director for (korporasjon) @no
definition: Relaterer en korporasjon til et verk som involverer et ansvar for en korporasjon i form av de fleste aspektene ved å fordele roller og oppgaver mellom utøvere. @no
toolkit label: casting director for (korporasjon) @no
toolkit definition: Et verk som involverer et ansvar for en korporasjon i form av de fleste aspektene ved å fordele roller og oppgaver mellom utøvere. @no
label: is castingdirector-corporatie van @nl
definition: Relateert een corporatie aan een werk dat met zich meebrengt een verantwoordelijkheid van een corporatie voor de meeste aspecten van het toewijzen van rollen en taken aan uitvoerders. @nl
toolkit label: castingdirector-corporatie van @nl
toolkit definition: Een werk dat met zich meebrengt een verantwoordelijkheid van een corporatie voor de meeste aspecten van het toewijzen van rollen en taken aan uitvoerders. @nl
label: هي هيئة مسئولة عن إدارة طاقم التمثيل لـ @ar
definition: يربط هيئة بعمل يترتب عليه مسئولية هيئة عن تحديد معظم الجوانب المتعلقة بأدوار الممثلين ومهامهم. @ar
toolkit label: هيئة مسئولة عن إدارة طاقم التمثيل @ar
toolkit definition: عمل يترتب عليه مسئولية هيئة عن تحديد معظم الجوانب المتعلقة بأدوار الممثلين ومهامهم. @ar
label: és entitat corporativa directora de càsting de @ca
definition: Relaciona una entitat corporativa amb una obra que implica una responsabilitat d’una entitat corporativa en la majoria dels aspectes de l’assignació de papers i funcions als intèrprets. @ca
toolkit label: entitat corporativa directora de càsting de @ca
toolkit definition: Obra que implica una responsabilitat d’una entitat corporativa en la majoria dels aspectes de l’assignació de papers i funcions als intèrprets. @ca
label: er korporation, som er caster af @da
definition: Relaterer en korporation til et værk, som involverer en korporations ansvar for de fleste aspekter ved tildeling af roller og opgaver til udøvere. @da
toolkit label: korporation, som er caster af @da
toolkit definition: Værk, som involverer en korporations ansvar for de fleste aspekter ved tildeling af roller og opgaver til udøvere. @da
label: casting'u juht (asutus) teoses @et
definition: Seostab asutuse teosega, mis sisaldab asutuse vastutust esitajatele rollide ja ülesannete jagamise enamiku aspektide eest. @et
toolkit label: casting'u juht (asutus) teoses @et
toolkit definition: Teos, mis sisaldab asutuse vastutust esitajatele rollide ja ülesannete jagamise enamiku aspektide eest. @et
label: ist Körperschaft als Casting Director von @de
definition: Setzt eine Körperschaft in Beziehung zu einem Werk, bei dem eine Körperschaft für die meisten Aspekte der Rollenvergabe und Aufgabenzuteilung an Ausführende verantwortlich ist. @de
toolkit label: Körperschaft als Casting Director von @de
toolkit definition: Ein Werk, bei dem eine Körperschaft für die meisten Aspekte der Rollenvergabe und Aufgabenzuteilung an Ausführende verantwortlich ist. @de
label: szereposztó rendező testülete a következőnek: @hu
definition: Hozzákapcsol egy testületet egy műhöz, amelyhez hozzátartozik egy testület felelőssége a szerepek és feladatok előadókra osztásának legtöbb vonatkozásáért. @hu
toolkit label: szereposztó rendező testülete: @hu
toolkit definition: Egy mű, amelyhez hozzátartozik egy testület felelőssége a szerepek és feladatok előadókra osztásának legtöbb vonatkozásáért. @hu
label: è direttore del casting ente di @it
definition: Correla un ente a un'opera che implica una responsabilità di un ente per la maggior parte degli aspetti dell'assegnazione di ruoli e incarichi agli attori. @it
toolkit label: direttore del casting ente di @it
toolkit definition: Opera che implica una responsabilità di un ente per la maggior parte degli aspetti dell'assegnazione di ruoli e incarichi agli attori. @it
label: είναι διευθυντής διανομής ρόλων συλλογικό όργανο του @el
toolkit label: διευθυντής διανομής ρόλων συλλογικό όργανο του @el
label: est une collectivité directrice de casting de @fr
definition: Met une collectivité en relation avec une œuvre qui comporte une responsabilité de la part d’une collectivité en ce qui concerne la majeure partie des aspects relatifs à la distribution des rôles et des fonctions aux interprètes. @fr
toolkit label: collectivité directrice de casting de @fr
toolkit definition: Œuvre qui comporte une responsabilité de la part d’une collectivité en ce qui concerne la majeure partie des aspects relatifs à la distribution des rôles et des fonctions aux interprètes. @fr
label: ir aktieru atlases režisors (institūcija) @lv
definition: Sasaista institūciju ar darbu, kas ietver institūcijas atbildību par lomu sadali un pienākumu piešķiršanu izpildītājiem. @lv
toolkit label: ir aktieru atlases režisors (institūcija) @lv
toolkit definition: Darbs, kas ietver institūcijas atbildību par lomu sadali un pienākumu piešķiršanu izpildītājiem. @lv
label: 是……的角色导演团体 @zh-hans
definition: 将一个团体与涉及给演员分配角色和任务的大多数工作的一个团体的责任的一种作品关联起来。 @zh-hans
toolkit label: ……的角色导演团体 @zh-hans
toolkit definition: 涉及给演员分配角色和任务的大多数工作的一个团体的责任的一种作品 @zh-hans
label: cast yönetmeni tüzel kişisidir @tr
definition: Bir tüzel kişiyi, oyunculara roller ve görevler atamanın çoğu yönü için bir tüzel kişinin sorumluluğunu içeren bir eserle ilişkilendirir. @tr
toolkit label: kast yönetmeni tüzel kişisi @tr
toolkit definition: Sanatçılara roller ve görevler atamanın çoğu yönü için bir tüzel kişinin sorumluluğunu içeren bir eser. @tr
has subproperty: P50851

roolittaja (suku) teoksessa
status: Published
label: is casting director family of @en
lexical alias: castingDirectorFamilyOf.en
definition: Relates a family to a work that involves a responsibility of a family for most aspects of assigning roles and duties to performers. @en
toolkit label: casting director family of @en
toolkit definition: A work that involves a responsibility of a family for most aspects of assigning roles and duties to performers. @en
type: Property
domain: C10008
has element type: 2
sub property of: teoksen tekijä (suku) teoksessa
sub property of: roolittaja (yhteistoimija) teoksessa
definition: Liittää suvun teokseen, jossa suku on vastuussa useimmista esiintyjien roolien ja tehtävien antamiseen kuuluvista tehtävistä.
toolkit label: roolittaja (suku) teoksessa
toolkit definition: Teos, jossa suku on vastuussa useimmista esiintyjien roolien ja tehtävien antamiseen kuuluvista tehtävistä.
label: er casting director for (familie) @no
definition: Relaterer en familie til et verk som involverer et ansvar for en familie i form av de fleste aspektene ved å fordele roller og oppgaver mellom utøvere. @no
toolkit label: casting director for (familie) @no
toolkit definition: Et verk som involverer et ansvar for en familie i form av de fleste aspektene ved å fordele roller og oppgaver mellom utøvere. @no
label: is castingdirector-familie van @nl
definition: Relateert een familie aan een werk dat met zich meebrengt een verantwoordelijkheid van een familie voor de meeste aspecten van het toewijzen van rollen en taken aan uitvoerders. @nl
toolkit label: castingdirector-familie van @nl
toolkit definition: Een werk dat met zich meebrengt een verantwoordelijkheid van een familie voor de meeste aspecten van het toewijzen van rollen en taken aan uitvoerders. @nl
label: هي عائلة مسئولة عن إدارة طاقم التمثيل لـ @ar
definition: يربط عائلة بعمل يترتب عليه مسئولية عائلة عن تحديد معظم الجوانب المتعلقة بأدوار الممثلين ومهامهم. @ar
toolkit label: عائلة مسئولة عن إدارة طاقم التمثيل @ar
toolkit definition: عمل يترتب عليه مسئولية عائلة عن تحديد معظم الجوانب المتعلقة بأدوار الممثلين ومهامهم. @ar
label: és família directora de càsting de @ca
definition: Relaciona una família amb una obra que implica una responsabilitat d’una família en la majoria dels aspectes de l’assignació de papers i funcions als intèrprets. @ca
toolkit label: família directora de càsting de @ca
toolkit definition: Obra que implica una responsabilitat d’una família en la majoria dels aspectes de l’assignació de papers i funcions als intèrprets. @ca
label: er familie, som er caster af @da
definition: Relaterer en familie til et værk, som involverer en families ansvar for de fleste aspekter ved tildeling af roller og opgaver til udøvere. @da
toolkit label: familie, som er caster af @da
toolkit definition: Værk, som involverer en families ansvar for de fleste aspekter ved tildeling af roller og opgaver til udøvere. @da
label: casting'u juht (perekond) teoses @et
definition: Seostab perekonna teosega, mis sisaldab perekonna vastutust esitajatele rollide ja ülesannete jagamise enamiku aspektide eest. @et
toolkit label: casting'u juht (perekond) teoses @et
toolkit definition: Teos, mis sisaldab perekonna vastutust esitajatele rollide ja ülesannete jagamise enamiku aspektide eest. @et
label: ist Familie als Casting Director von @de
definition: Setzt eine Familie in Beziehung zu einem Werk, bei dem eine Familie für die meisten Aspekte der Rollenvergabe und Aufgabenzuteilung an Ausführende verantwortlich ist. @de
toolkit label: Familie als Casting Director von @de
toolkit definition: Ein Werk, bei dem eine Familie für die meisten Aspekte der Rollenvergabe und Aufgabenzuteilung an Ausführende verantwortlich ist. @de
label: szereposztó rendező családja a következőnek: @hu
definition: Hozzákapcsol egy családot egy műhöz, amelyhez hozzátartozik egy család felelőssége a szerepek és feladatok előadókra osztásának legtöbb vonatkozásáért. @hu
toolkit label: szereposztó rendező családja: @hu
toolkit definition: Egy mű, amelyhez hozzátartozik egy család felelőssége a szerepek és feladatok előadókra osztásának legtöbb vonatkozásáért. @hu
label: è direttore del casting famiglia di @it
definition: Correla una famiglia a un'opera che implica una responsabilità di una famiglia per la maggior parte degli aspetti dell'assegnazione di ruoli e incarichi agli attori. @it
toolkit label: direttore del casting famiglia di @it
toolkit definition: Opera che implica una responsabilità di una famiglia per la maggior parte degli aspetti dell'assegnazione di ruoli e incarichi agli attori. @it
label: είναι διευθυντής διανομής ρόλων οικογένεια του @el
toolkit label: διευθυντής διανομής ρόλων οικογένεια του @el
label: est une famille directrice de casting de @fr
definition: Met une famille en relation avec une œuvre qui comporte une responsabilité de la part d’une famille en ce qui concerne la majeure partie des aspects relatifs à la distribution des rôles et des fonctions aux interprètes. @fr
toolkit label: famille directrice de casting de @fr
toolkit definition: Œuvre qui comporte une responsabilité de la part d’une famille en ce qui concerne la majeure partie des aspects relatifs à la distribution des rôles et des fonctions aux interprètes. @fr
label: ir aktieru atlases režisors (dzimta/ģimene) @lv
definition: Sasaista dzimtu/ģimeni ar darbu, kas ietver dzimtas/ģimenes atbildību par lomu sadali un pienākumu piešķiršanu izpildītājiem. @lv
toolkit label: ir aktieru atlases režisors (dzimta/ģimene) @lv
toolkit definition: Darbs, kas ietver dzimtas/ģimenes atbildību par lomu sadali un pienākumu piešķiršanu izpildītājiem. @lv
label: 是……的角色导演家族 @zh-hans
definition: 将一个家族与涉及给演员分配角色和任务的大多数工作的一个家族的责任的一种作品关联起来。 @zh-hans
toolkit label: ……的角色导演家族 @zh-hans
toolkit definition: 涉及给演员分配角色和任务的大多数工作的一个家族的责任的一种作品 @zh-hans
label: cast yönetmeni̇ ai̇lesidir @tr
definition: Bir aileyi, sanatçılara rolleri ve görevleri atama konusundaki birçok yönün sorumluluğunu içeren bir eserle ilişkilendirir. @tr
toolkit label: kast yönetmeni̇ ai̇lesi @tr
toolkit definition: Sanatçılara roller ve görevler atamanın çoğu yönü için bir ailenin sorumluluğunu içeren bir eser. @tr
has subproperty: P51002

roolittaja (henkilö) teoksessa
status: Published
label: is casting director person of @en
lexical alias: castingDirectorPersonOf.en
definition: Relates a person to a work that involves a responsibility of a person for most aspects of assigning roles and duties to performers. @en
toolkit label: casting director person of @en
toolkit definition: A work that involves a responsibility of a person for most aspects of assigning roles and duties to performers. @en
type: Property
domain: C10004
has element type: 2
sub property of: teoksen tekijä (henkilö) teoksessa
sub property of: roolittaja (toimija) teoksessa
definition: Liittää henkilön teokseen, jossa henkilö on vastuussa useimmista esiintyjien roolien ja tehtävien antamiseen kuuluvista tehtävistä.
toolkit label: roolittaja (henkilö) teoksessa
toolkit definition: Teos, jossa henkilö on vastuussa useimmista esiintyjien roolien ja tehtävien antamiseen kuuluvista tehtävistä.
label: er casting director for (person) @no
definition: Relaterer en person til et verk som involverer et ansvar for en person i form av de fleste aspektene ved å fordele roller og oppgaver mellom utøvere. @no
toolkit label: casting director for (person) @no
toolkit definition: Et verk som involverer et ansvar for en person i form av de fleste aspektene ved å fordele roller og oppgaver mellom utøvere. @no
label: is castingdirector-persoon van @nl
definition: Relateert een persoon aan een werk dat met zich meebrengt een verantwoordelijkheid van een persoon voor de meeste aspecten van het toewijzen van rollen en taken aan uitvoerders. @nl
toolkit label: castingdirector-persoon van @nl
toolkit definition: Een werk dat met zich meebrengt een verantwoordelijkheid van een persoon voor de meeste aspecten van het toewijzen van rollen en taken aan uitvoerders. @nl
label: هو شخص مدير طاقم التمثيل لـ @ar
definition: يربط شخصا بعمل يترتب عليه مسئولية شخص عن تحديد معظم الجوانب المتعلقة بأدوار الممثلين ومهامهم. @ar
toolkit label: شخص مدير طاقم التمثيل @ar
toolkit definition: عمل يترتب عليه مسئولية شخص عن تحديد معظم الجوانب المتعلقة بأدوار الممثلين ومهامهم. @ar
label: és persona directora de càsting de @ca
definition: Relaciona una persona amb una obra que implica una responsabilitat d’una persona en la majoria dels aspectes de l’assignació de papers i funcions als intèrprets. @ca
toolkit label: persona directora de càsting de @ca
toolkit definition: Obra que implica una responsabilitat d’una persona en la majoria dels aspectes de l’assignació de papers i funcions als intèrprets. @ca
label: er person, som er caster af @da
definition: Relaterer en person til et værk, som involverer en persons ansvar for de fleste aspekter ved tildeling af roller og opgaver til udøvere. @da
toolkit label: person, som er caster af @da
toolkit definition: Værk, som involverer en persons ansvar for de fleste aspekter ved tildeling af roller og opgaver til udøvere. @da
label: casting'u juht (isik) teoses @et
definition: Seostab isiku teosega, mis sisaldab isiku vastutust esitajatele rollide ja ülesannete jagamise enamiku aspektide eest. @et
toolkit label: casting'u juht (isik) teoses @et
toolkit definition: Teos, mis sisaldab isiku vastutust esitajatele rollide ja ülesannete jagamise enamiku aspektide eest. @et
label: ist Person als Casting Director von @de
definition: Setzt eine Person in Beziehung zu einem Werk, bei dem eine Person für die meisten Aspekte der Rollenvergabe und Aufgabenzuteilung an Ausführende verantwortlich ist. @de
toolkit label: Person als Casting Director von @de
toolkit definition: Ein Werk, bei dem eine Person für die meisten Aspekte der Rollenvergabe und Aufgabenzuteilung an Ausführende verantwortlich ist. @de
label: szereposztó rendező személye a következőnek: @hu
definition: Hozzákapcsol egy személyt egy műhöz, amelyhez hozzátartozik egy személy felelőssége a szerepek és feladatok előadókra osztásának legtöbb vonatkozásáért. @hu
toolkit label: szereposztó rendező személye: @hu
toolkit definition: Egy mű, amelyhez hozzátartozik egy személy felelőssége a szerepek és feladatok előadókra osztásának legtöbb vonatkozásáért. @hu
label: è direttore del casting persona di @it
definition: Correla una persona a un'opera che implica una responsabilità di una persona nella maggior parte degli aspetti dell'assegnazione di ruoli e incarichi agli attori. @it
toolkit label: direttore del casting persona di @it
toolkit definition: Opera che implica una responsabilità di una persona nella maggior parte degli aspetti dell'assegnazione di ruoli e incarichi agli attori. @it
label: είναι διευθυντής διανομής ρόλων φυσικό πρόσωπο του @el
toolkit label: διευθυντής διανομής ρόλων φυσικό πρόσωπο του @el
label: est une personne directrice de casting de @fr
definition: Met une personne en relation avec une œuvre qui comporte une responsabilité de la part d’une personne en ce qui concerne la majeure partie des aspects relatifs à la distribution des rôles et des fonctions aux interprètes. @fr
toolkit label: personne directrice de casting de @fr
toolkit definition: Œuvre qui comporte une responsabilité de la part d’une personne en ce qui concerne la majeure partie des aspects relatifs à la distribution des rôles et des fonctions aux interprètes. @fr
label: ir aktieru atlases režisors (persona) @lv
definition: Sasaista personu ar darbu, kas ietver personas atbildību par lomu sadali un pienākumu piešķiršanu izpildītājiem. @lv
toolkit label: ir aktieru atlases režisors (persona) @lv
toolkit definition: Darbs, kas ietver personas atbildību par lomu sadali un pienākumu piešķiršanu izpildītājiem. @lv
label: 是……的角色导演个人 @zh-hans
definition: 将一个个人与涉及给演员分配角色和任务的大多数工作的一个个人的责任的一种作品关联起来。 @zh-hans
toolkit label: ……的角色导演个人 @zh-hans
toolkit definition: 涉及给演员分配角色和任务的大多数工作的一个个人的责任的一种作品 @zh-hans
label: cast yönetmeni kişisidir @tr
definition: Bir kişiyi, sanatçılara rol ve görev atamanın çoğu yönü için bir kişinin sorumluluğunu içeren bir eserle ilişkilendirir. @tr
toolkit label: kast yönetmeni @tr
toolkit definition: Sanatçılara roller ve görevler atamanın çoğu yönü için bir kişinin sorumluluğunu içeren bir eser. @tr
has subproperty: P50549

toimijan kategoria
status: Published
label: has category of agent @en
lexical alias: categoryOfAgent.en
definition: Relates an agent to a type to which an agent belongs. @en
alternative label: type of agent @en
toolkit label: category of agent @en
toolkit definition: A type to which an agent belongs. @en
type: Property
domain: C10002
sub property of: P00029
has element type: 5
definition: Liittää toimijan tyyppiin tai jaotteluun, johon toimija kuuluu.
alternative label: toimijan tyyppi
toolkit label: toimijan kategoria
toolkit definition: Tyyppi tai jaottelu, johon toimija kuuluu.
label: har kategori for agent @no
definition: Relaterer en agent til en type som en agent tilhører. @no
alternative label: type agent @no
toolkit label: kategori for agent @no
toolkit definition: En type som en agent tilhører. @no
label: heeft categorie van actor @nl
definition: Relateert een actor aan een type waartoe een actor behoort. @nl
toolkit label: categorie van actor @nl
toolkit definition: Een type waartoe een actor behoort. @nl
label: له فئة لوكيل @ar
definition: يربط وكيلا بالنوع الذي ينتمي إليه وكيل. @ar
alternative label: نوع الوكيل @ar
toolkit label: فئة وكيل @ar
toolkit definition: نوع ينتمي إليه وكيل. @ar
label: té com a categoria d’agent @ca
definition: Relaciona un agent amb un tipus al qual pertany un agent. @ca
alternative label: tipus d’agent @ca
toolkit label: categoria d’agent @ca
toolkit definition: Tipus al qual pertany un agent. @ca
label: har kategori af agent @da
definition: Relaterer en agent til en type, som en agent tilhører. @da
alternative label: type af agent @da
toolkit label: kategori af agent @da
toolkit definition: Type, som en agent tilhører. @da
label: tegija kategooria @et
definition: Seostab tegija tüübiga, millesse tegija kuulub. @et
alternative label: tegija tüüp @et
toolkit label: tegija kategooria @et
toolkit definition: Tüüp, millesse tegija kuulub. @et
label: hat Kategorie eines Akteurs @de
definition: Setzt einen Akteur in Beziehung zu einer Art, zu der ein Akteur gehört. @de
toolkit label: Kategorie eines Akteurs @de
toolkit definition: Eine Art, zu der ein Akteur gehört. @de
label: ágens kategóriája a következő: @hu
definition: Hozzákapcsol egy ágenst ahhoz a típushoz, amelyhez az ágens tartozik. @hu
alternative label: ágens típusa: @hu
toolkit label: ágens kategóriája: @hu
toolkit definition: Egy típus, amelyhez az ágens tartozik. @hu
label: ha come categoria di agente @it
definition: Correla un agente a un tipo a cui un agente appartiene. @it
alternative label: tipo di agente @it
toolkit label: categoria di agente @it
toolkit definition: Tipo a cui un agente appartiene. @it
label: έχει κατηγορία του φορέα @el
alternative label: τύπος του φορέα @el
toolkit label: κατηγορία του φορέα @el
label: a pour catégorie d’agent @fr
definition: Met un agent en relation avec un type auquel un agent appartient. @fr
alternative label: type d’agent @fr
toolkit label: catégorie d’agent @fr
toolkit definition: Type auquel un agent appartient. @fr
label: aģenta kategorija @lv
definition: Sasaista aģentu ar veidu, pie kura pieder aģents. @lv
toolkit label: aģenta kategorija @lv
toolkit definition: Veids, pie kura pieder aģents. @lv
alternative label: 行为者的类型 @zh-hans
label: 有行为者的类别 @zh-hans
definition: 将一个行为者与一个行为者所属于的一个类型关联起来。 @zh-hans
toolkit label: 行为者的类别 @zh-hans
toolkit definition: 一个行为者所属于的一个类型 @zh-hans
toolkit label: temsilci kategorisi @tr
toolkit definition: Bir temsilcinin ait olduğu bir tür. @tr
has subproperty: yhteistoimijan kategoria
has subproperty: henkilön kategoria
has subproperty: P50490

yhteistoimijan kategoria
status: Published
label: has category of collective agent @en
lexical alias: categoryOfCollectiveAgent.en
definition: Relates a collective agent to a type to which a collective agent belongs. @en
alternative label: type of collective agent @en
toolkit label: category of collective agent @en
toolkit definition: A type to which a collective agent belongs. @en
type: Property
domain: C10011
sub property of: toimijan kategoria
has element type: 5
definition: Liittää yhteistoimijan tyyppiin tai jaotteluun, johon yhteistoimija kuuluu.
alternative label: yhteistoimijan tyyppi
toolkit label: yhteistoimijan kategoria
toolkit definition: Tyyppi tai jaottelu, johon yhteistoimija kuuluu.
label: har kategori for kollektiv agent @no
definition: Relaterer en kollektiv agent til en type som en kollektiv agent tilhører. @no
alternative label: type kollektiv agent @no
toolkit label: kategori for kollektiv agent @no
toolkit definition: En type som en kollektiv agent tilhører. @no
label: heeft categorie van collectieve actor @nl
definition: Relateert een collectieve actor aan een type waartoe een collectieve actor behoort. @nl
toolkit label: categorie van collectieve actor @nl
toolkit definition: Een type waartoe een collectieve actor behoort. @nl
label: له فئة لوكيل جماعي @ar
definition: يربط وكيلا جماعيا بالنوع الذي ينتمي إليه وكيل جماعي. @ar
alternative label: نوع الوكيل الجماعي @ar
toolkit label: فئة الوكيل الجماعي @ar
toolkit definition: نوع ينتمي إليه وكيل جماعي. @ar
label: té com a categoria d’agent col·lectiu @ca
definition: Relaciona un agent col·lectiu amb un tipus al qual pertany un agent col·lectiu. @ca
alternative label: tipus d’agent col·lectiu @ca
toolkit label: categoria d’agent col·lectiu @ca
toolkit definition: Tipus al qual pertany un agent col·lectiu. @ca
label: har kategori af kollektiv agent @da
definition: Relaterer en kollektiv agent til en type, som en kollektiv agent tilhører. @da
alternative label: type af kollektiv agent @da
toolkit label: kategori af kollektiv agent @da
toolkit definition: Type, som en kollektiv agent tilhører. @da
label: kollektiivi kategooria @et
definition: Seostab kollektiivi tüübiga, millesse kollektiiv kuulub. @et
alternative label: kollektiivi tüüp @et
toolkit label: kollektiivi kategooria @et
toolkit definition: Tüüp, millesse kollektiiv kuulub. @et
label: hat Kategorie eines gemeinschaftlichen Akteurs @de
definition: Setzt einen gemeinschaftlichen Akteur in Beziehung zu einer Art, zu der ein gemeinschaftlicher Akteur gehört. @de
toolkit label: Kategorie eines gemeinschaftlichen Akteurs @de
toolkit definition: Eine Art, zu der ein gemeinschaftlicher Akteur gehört. @de
label: kollektív ágens kategóriája: @hu
definition: Hozzákapcsol egy kollektív ágenst ahhoz a típushoz, amelyhez a kollektív ágens tartozik. @hu
alternative label: kollektív ágens típusa: @hu
toolkit label: kollektív ágens kategóriája: @hu
toolkit definition: Egy típus, amelyhez a kollektív ágens tartozik. @hu
label: ha come categoria di agente collettivo @it
definition: Correla un agente collettivo a un tipo a cui un agente collettivo appartiene. @it
alternative label: tipo di agente collettivo @it
toolkit label: categoria di agente collettivo @it
toolkit definition: Tipo a cui un agente collettivo appartiene. @it
label: έχει κατηγορία του συλλογικού φορέα @el
alternative label: τύπος του συλλογικού φορέα @el
toolkit label: κατηγορία του συλλογικού φορέα @el
label: a pour catégorie d’agent collectif @fr
definition: Met un agent collectif en relation avec un type auquel un agent collectif appartient. @fr
alternative label: type d’agent collectif @fr
toolkit label: catégorie d’agent collectif @fr
toolkit definition: Type auquel un agent collectif appartient. @fr
label: grupas kategorija @lv
definition: Sasaista grupu ar veidu, pie kura pieder grupa. @lv
toolkit label: grupas kategorija @lv
toolkit definition: Veids, pie kura pieder grupa. @lv
alternative label: 集体行为者的类型 @zh-hans
label: 有集体行为者的类别 @zh-hans
definition: 将一个集体行为者与一个集体行为者所属于的一个类型关联起来。 @zh-hans
toolkit label: 集体行为者的类别 @zh-hans
toolkit definition: 一个集体行为者所属于的一个类型 @zh-hans
toolkit label: kolektif temsilci kategorisi @tr
toolkit definition: Bir kollektif temsilcinin ait olduğu tür. @tr
has subproperty: yhteisön kategoria
has subproperty: suvun kategoria
has subproperty: P50491

yhteisön kategoria
status: Published
label: has category of corporate body @en
type: Property
domain: C10005
lexical alias: categoryOfCorporateBody.en
definition: Relates a corporate body to a type to which a corporate body belongs. @en
instruction number: 11.7.1.4
toolkit label: category of corporate body @en
label: a pour catégorie de collectivité @fr
definition: Met une collectivité en relation avec un type auquel une collectivité appartient. @fr
toolkit label: catégorie de collectivité @fr
toolkit definition: Type auquel une collectivité appartient. @fr
toolkit label: tipo de entidad corporativa @es
toolkit definition: A type to which a corporate body belongs. @en
label: έχει κατηγορία του συλλογικού οργάνου @el
definition: Συνδέει ένα συλλογικό όργανο με έναν τύπο συλλογικού οργάνου. @el
toolkit label: κατηγορία του συλλογικού οργάνου @el
toolkit definition: Μια κατηγοριοποίηση για έναν τύπο συλλογικού οργάνου. @el
definition: Setzt eine Körperschaft in Beziehung zu einer Art, zu der eine Körperschaft gehört. @de
toolkit label: Kategorie einer Körperschaft @de
toolkit definition: Eine Art, zu der eine Körperschaft gehört. @de
label: har kategori af korporation @da
definition: Relaterer en korporation til en type, som en korporation tilhører. @da
toolkit label: kategori af korporation @da
toolkit definition: Type, som en korporation tilhører. @da
label: té com a categoria d’entitat corporativa @ca
definition: Relaciona una entitat corporativa amb un tipus al qual pertany una entitat corporativa. @ca
toolkit label: categoria d’entitat corporativa @ca
toolkit definition: Tipus al qual pertany una entitat corporativa. @ca
definition: Liittää yhteisön tyyppiin, johon yhteisö kuuluu.
toolkit label: yhteisön kategoria
toolkit definition: Tyyppi, johon yhteisö kuuluu.
toolkit label: kategori av korporasjon @no
toolkit definition: En type som en korporasjon tilhører. @no
label: hat Kategorie einer Körperschaft @de
has element type: 5
label: testület kategóriája a következő: @hu
definition: Hozzákapcsol egy testületet ahhoz a típushoz, amelyhez a testület tartozik. @hu
toolkit label: testület kategóriája: @hu
toolkit definition: Egy típus, amelyhez egy testület tartozik. @hu
alternative label: type of corporate body @en
sub property of: yhteistoimijan kategoria
alternative label: yhteisön tyyppi
label: har kategori av korporasjon @no
definition: Relaterer en korporasjon til en type som en korporasjon tilhører. @no
alternative label: type korporasjon @no
label: heeft categorie van corporatie @nl
definition: Relateert een corporatie aan een type waartoe een corporatie behoort. @nl
toolkit label: categorie van corporatie @nl
toolkit definition: Een type waartoe een corporatie behoort. @nl
label: له فئة لهيئة @ar
definition: يربط هيئة بالنوع الذي تنتمي إليه هيئة. @ar
alternative label: نوع الهيئة @ar
toolkit label: فئة الهيئة @ar
toolkit definition: نوع تنتمي إليه هيئة. @ar
alternative label: tipus d’entitat corporativa @ca
alternative label: type af korporation @da
label: asutuse kategooria @et
definition: Seostab asutuse tüübiga, millesse asutus kuulub. @et
alternative label: asutuse tüüp @et
toolkit label: asutuse kategooria @et
toolkit definition: Tüüp, millesse asutus kuulub. @et
alternative label: testület típusa: @hu
label: ha come categoria di ente @it
definition: Correla un ente a un tipo a cui un ente appartiene. @it
alternative label: tipo di ente @it
toolkit label: categoria di ente @it
toolkit definition: Tipo a cui un ente appartiene. @it
alternative label: τύπος του συλλογικού οργάνου @el
alternative label: type de collectivité @fr
label: institūcijas kategorija @lv
definition: Sasaista institūciju ar veidu, pie kura pieder institūcija. @lv
toolkit label: institūcijas kategorija @lv
toolkit definition: Veids, pie kura pieder institūcija. @lv
alternative label: 团体的类型 @zh-hans
label: 有团体的类别 @zh-hans
toolkit label: 团体的类别 @zh-hans
toolkit definition: 一个团体所属于的一种类型 @zh-hans
toolkit label: tüzel kişi kategorisi @tr
toolkit definition: Bir tüzel kişinin ait olduğu tür. @tr

suvun kategoria
status: Published
label: has category of family @en
definition: Relates a family to a type to which a family belongs. @en
type: Property
domain: C10008
lexical alias: categoryOfFamily.en
instruction number: 10.3
toolkit label: category of family @en
toolkit definition: A type to which a family belongs. @en
label: a pour catégorie de famille @fr
definition: Met une famille en relation avec un type auquel une famille appartient. @fr
toolkit label: catégorie de famille @fr
toolkit definition: Type auquel une famille appartient. @fr
toolkit label: tipo de familia @es
toolkit definition: Una categorización o descriptor genérico del tipo de familia. @es
label: har typ av familj/släkt @sv
toolkit label: typ av familj/släkt @sv
label: έχει κατηγορία της οικογένειας @el
definition: Συνδέει μια οικογένεια με μια κατηγοριοποίηση ή με έναν γενικό περιγραφέα για έναν τύπο οικογένειας. @el
toolkit label: κατηγορία της οικογένειας @el
toolkit definition: Μια κατηγοριοποίηση ή γενικός περιγραφέας για έναν τύπο οικογένειας. @el
definition: Setzt eine Familie in Beziehung zu einer Art, zu der eine Familie gehört. @de
toolkit label: Kategorie einer Familie @de
toolkit definition: Eine Art, zu der eine Familie gehört. @de
label: har kategori af familie @da
definition: Relaterer en familie til en type, som en familie tilhører. @da
toolkit label: kategori af familie @da
toolkit definition: Type, som en familie tilhører. @da
label: té com a categoria de família @ca
definition: Relaciona una família amb un tipus al qual pertany una família. @ca
toolkit label: categoria de família @ca
toolkit definition: Tipus al qual pertany una família. @ca
definition: Liittää suvun tyyppiin tai jaotteluun, johon suku kuuluu.
toolkit label: suvun kategoria
toolkit definition: Sukuun liittyvä tyyppi tai jaottelu.
toolkit label: kategori av familie @no
toolkit definition: En type som en familie tilhører. @no
label: hat Kategorie einer Familie @de
has element type: 5
label: entitás kategóriája a következő: @hu
definition: Hozzákapcsol egy családot ahhoz a típushoz, amelyhez a család tartozik. @hu
toolkit label: családkategória @hu
toolkit definition: Egy típus, amelyhez egy család tartozik. @hu
alternative label: type of family @en
sub property of: yhteistoimijan kategoria
alternative label: suvun tyyppi
label: har kategori av familie @no
definition: Relaterer en familie til en type som en familie tilhører. @no
alternative label: type familie @no
label: heeft categorie van familie @nl
definition: Relateert een familie aan een type waartoe een familie behoort. @nl
toolkit label: categorie van familie @nl
toolkit definition: Een type waartoe een familie behoort. @nl
label: له فئة عائلة @ar
definition: يربط عائلة بنوع تنتمي إليه عائلة. @ar
alternative label: نوع عائلة @ar
toolkit label: فئة عائلة @ar
toolkit definition: نوع تنتمي إليه عائلة. @ar
alternative label: tipus de família @ca
alternative label: type af familie @da
label: perekonna kategooria @et
definition: Seostab perekonna tüübiga, millesse perekond kuulub. @et
alternative label: perekonna tüüp @et
toolkit label: perekonna kategooria @et
toolkit definition: Tüüp, millesse perekond kuulub. @et
alternative label: Art einer Familie @de
alternative label: családtípus @hu
label: ha come categoria di famiglia @it
definition: Correla una famiglia a un tipo a cui la famiglia appartiene. @it
alternative label: tipo di famiglia @it
toolkit label: categoria di famiglia @it
toolkit definition: Tipo a cui una famiglia appartiene. @it
alternative label: τύπος της οικογένειας @el
alternative label: type de famille @fr
label: dzimtas/ģimenes kategorija @lv
definition: Sasaista dzimtu/ģimeni ar veidu, pie kura pieder dzimta/ģimene. @lv
toolkit label: dzimtas/ģimenes kategorija @lv
toolkit definition: Veids, pie kura pieder dzimta/ģimene. @lv
toolkit label: 家族的类别 @zh-hans
toolkit definition: 一个家族所属于的类型 @zh-hans

julkishallinnollisen yhteisön kategoria
status: Published
label: has category of government @en
type: Property
domain: C10005
sub property of: yhteisön kategoria
lexical alias: categoryOfGovernment.en
definition: Relates a corporate body to a type to which a government belongs. @en
instruction number: 11.7.1.5
toolkit label: category of government @en
label: a pour catégorie de gouvernement @fr
definition: Met une collectivité en relation avec un type auquel un gouvernement appartient. @fr
toolkit label: catégorie de gouvernement @fr
toolkit definition: Type auquel un gouvernement appartient. @fr
toolkit label: tipo de jurisdicción @es
toolkit definition: A type to which a government belongs. @en
label: έχει κατηγορία της κυβέρνησης @el
definition: Συνδέει ένα συλλογικό όργανο με έναν τύπο δικαιοδοσίας. @el
toolkit label: κατηγορία της δικαιοδοσίας @el
toolkit definition: Μια κατηγοριοποίηση για έναν τύπο συλλογικού οργάνου. @el
definition: Setzt eine Körperschaft in Beziehung zu einer Art, zu der eine Gebietskörperschaft gehört. @de
toolkit label: Kategorie einer Gebietskörperschaft @de
toolkit definition: Eine Art, zu der eine Gebietskörperschaft gehört. @de
label: har kategori af myndighed @da
definition: Relaterer en korporation til en type, som en myndighed tilhører. @da
toolkit label: kategori af myndighed @da
toolkit definition: Type, som en myndighed tilhører. @da
label: té com a categoria de govern @ca
definition: Relaciona una entitat corporativa amb un tipus al qual pertany un govern. @ca
toolkit label: categoria de govern @ca
toolkit definition: Tipus al qual pertany un govern. @ca
definition: Liittää yhteisön tyyppiin, johon julkishallinnollinen yhteisö kuuluu.
toolkit label: julkishallinnollisen yhteisön kategoria
toolkit definition: Tyyppi, johon julkishallinnollinen yhteisö kuuluu.
toolkit label: kategori av myndighet @no
toolkit definition: En type som en myndighet tilhører. @no
label: hat Kategorie einer Gebietskörperschaft @de
alternative label: type of jurisdiction @en
has element type: 5
label: igazgatási szerv kategóriája a következő: @hu
definition: Hozzákapcsol egy testületet ahhoz a típushoz, amelyhez az igazgatási szerv tartozik. @hu
toolkit label: igazgatási szerv kategóriája: @hu
toolkit definition: Egy típus, amelyhez a igazgatási szerv tartozik. @hu
alternative label: type of government @en
label: har kategori av myndighet @no
definition: Relaterer en korporasjon til en type som en myndighet tilhører. @no
alternative label: type jurisdiksjon @no
alternative label: type myndighet @no
label: heeft categorie van regering @nl
definition: Relateert een corporatie aan een type waartoe een regering behoort. @nl
toolkit label: categorie van regering @nl
toolkit definition: Een type waartoe een regering behoort. @nl
label: له فئة حكومة @ar
definition: يربط هيئة بنوع تنتمي إليه حكومة. @ar
alternative label: نوع حكومة @ar
toolkit label: فئة حكومة @ar
toolkit definition: نوع تنتمي إليه حكومة. @ar
alternative label: type af myndighed @da
label: valitsuse kategooria @et
definition: Seostab asutuse tüübiga, millesse valitsus kuulub. @et
alternative label: võimkonna kategooria @et
alternative label: valitsuse tüüp @et
toolkit label: valitsuse kategooria @et
toolkit definition: Tüüp, millesse valitsus kuulub. @et
label: ha come categoria di governo @it
definition: Correla un ente a un tipo a cui un governo appartiene. @it
alternative label: tipo di giurisdizione @it
toolkit label: categoria di governo @it
toolkit definition: Tipo a cui un governo appartiene. @it
alternative label: τύπος της δικαιοδοσίας @el
alternative label: τύπος της κυβέρνησης @el
alternative label: type de juridiction @fr
alternative label: type de gouvernement @fr
label: jurisdikcijas kategorija @lv
definition: Sasaista institūciju ar veidu, pie kura pieder jurisdikcija. @lv
toolkit label: jurisdikcijas kategorija @lv
toolkit definition: Veids, pie kura pieder jurisdikcija. @lv
toolkit label: 政府的类别 @zh-hans
toolkit definition: 一个政府所属于的一种类型 @zh-hans
toolkit label: hükümet kategorisi @tr
toolkit definition: Bir hükümetin ait olduğu bir tür @tr

henkilön kategoria
status: Published
label: has category of person @en
lexical alias: categoryOfPerson.en
definition: Relates a person to a type to which a person belongs. @en
alternative label: type of person @en
toolkit label: category of person @en
toolkit definition: A type to which a person belongs. @en
type: Property
domain: C10004
has element type: 5
sub property of: toimijan kategoria
definition: Liittää henkilön tyyppiin tai jaotteluun, johon henkilö kuuluu.
alternative label: henkilön tyyppi
toolkit label: henkilön kategoria
toolkit definition: Tyyppi tai jaottelu, johon henkilö kuuluu.
label: har kategori for person @no
definition: Relaterer en person til en type som en person tilhører. @no
alternative label: type person @no
toolkit label: kategori for person @no
toolkit definition: En type som en person tilhører. @no
label: heeft categorie van persoon @nl
definition: Relateert een persoon aan een type waartoe een persoon behoort. @nl
toolkit label: categorie van persoon @nl
toolkit definition: Een type waartoe een persoon behoort. @nl
label: له فئة لشخص @ar
definition: يربط شخصا بالنوع الذي ينتمي إليه شخص. @ar
alternative label: نوع الشخص @ar
toolkit label: فئة الشخص @ar
toolkit definition: نوع ينتمي إليه شخص. @ar
label: té com a categoria de persona @ca
definition: Relaciona una persona amb un tipus al qual pertany una persona. @ca
alternative label: tipus de persona @ca
toolkit label: categoria de persona @ca
toolkit definition: Tipus al qual pertany una persona. @ca
label: har kategori af person @da
definition: Relaterer en person til en type, som en person tilhører. @da
alternative label: type af person @da
toolkit label: kategori af person @da
toolkit definition: Type, som en person tilhører. @da
label: isiku kategooria @et
definition: Seostab isiku tüübiga, millesse isik kuulub. @et
alternative label: isiku tüüp @et
toolkit label: isiku kategooria @et
toolkit definition: Tüüp, millesse isik kuulub. @et
label: hat Kategorie einer Person @de
definition: Setzt eine Person in Beziehung zu einer Art, zu der eine Person gehört. @de
toolkit label: Kategorie einer Person @de
toolkit definition: Eine Art, zu der eine Person gehört. @de
label: személy kategóriája a következő: @hu
definition: Hozzákapcsol egy személyt ahhoz a típushoz, amelyhez a személy tartozik. @hu
alternative label: személy típusa: @hu
toolkit label: személy kategóriája: @hu
toolkit definition: Egy típus, amelyhez a személy tartozik. @hu
label: ha come categoria di persona @it
definition: Correla una persona a un tipo a cui una persona appartiene. @it
alternative label: tipo di persona @it
toolkit label: categoria di persona @it
toolkit definition: Tipo a cui una persona appartiene. @it
label: έχει κατηγορία του φυσικού προσώπου @el
alternative label: τύπος του φυσικού προσώπου @el
toolkit label: κατηγορία του φυσικού προσώπου @el
label: a pour catégorie de personne @fr
definition: Met une personne en relation avec un type auquel une personne appartient. @fr
alternative label: type de personne @fr
toolkit label: catégorie de personne @fr
toolkit definition: Type auquel une personne appartient. @fr
label: personas kategorija @lv
definition: Sasaista personu ar veidu, pie kura pieder persona. @lv
toolkit label: personas kategorija @lv
toolkit definition: Veids, pie kura pieder persona. @lv
alternative label: 个人的类型 @zh-hans
label: 有个人的类别 @zh-hans
definition: 将一个个人与一个个人所属于的一个类型关联起来。 @zh-hans
toolkit label: 个人的类别 @zh-hans
toolkit definition: 一个个人所属于的一个类型 @zh-hans
alternative label: tipo de persona @es
alternative label: kişinin türü @tr
toolkit label: kişi kategorisi @tr
toolkit definition: Bir kişinin ait olduğu bir tür. @tr
has subproperty: P50489

sensori (toimija) ekspressiossa
status: Published
type: Property
label: is censor agent of @en
lexical alias: censorAgentOf.en
definition: Relates an agent to an expression that includes a contribution by an agent of revising the content of another expression for the purpose of suppressing content that is deemed objectionable on moral, political, military, or other grounds, but leaving the nature and general content substantially unchanged. @en
domain: C10002
toolkit label: censor agent of @en
toolkit definition: An expression that includes a contribution by an agent of revising the content of another expression for the purpose of suppressing content that is deemed objectionable on moral, political, military, or other grounds, but leaving the nature and general content substantially unchanged. @en
see also: kirjoittaja (toimija) teoksessa
instruction number: 18.5
sub property of: tarkastaja (toimija) ekspressiossa
label: είναι λογοκριτής φορέας του @el
definition: Συνδέει έναν φορέα, ο οποίος συνεισφέρει σε μια έκφραση ενός έργου αναθεωρώντας το περιεχόμενο με σκοπό την απόκρυψη, η οποία θεωρείται μη αποδεκτή σε ηθικό, πολιτικό, στρατιωτικό ή άλλο επίπεδο, αφήνοντας ωστόσο τη φύση και το περιεχόμενο αμετάβλητα, με μια έκφραση. @el
toolkit label: λογοκριτής φορέας του @el
toolkit definition: Μια έκφραση ενός έργου που περιλαμβάνει την ευθύνη της αναθεώρησης του περιεχομένου με σκοπό την απόκρυψη, η οποία θεωρείται μη αποδεκτή σε ηθικό, πολιτικό, στρατιωτικό ή άλλο επίπεδο, αφήνοντας ωστόσο τη φύση και το περιεχόμενο αμετάβλητα. @el
definition: Setzt einen Akteur in Beziehung zu einer Expression, zu der ein Akteur beiträgt, indem er den Inhalt einer anderen Expression überarbeitet, um Teile zu unterdrücken, die aus moralischen, politischen, militärischen oder anderen Gründen unerwünscht sind, ohne den Charakter und den Inhalt des Originalwerks substantiell zu verändern. @de
toolkit label: Akteur als Zensorin/Zensor von @de
toolkit definition: Eine Expression, zu der ein Akteur beiträgt, indem er den Inhalt einer anderen Expression überarbeitet, um Teile zu unterdrücken, die aus moralischen, politischen, militärischen oder anderen Gründen unerwünscht sind, ohne den Charakter und den Inhalt des Originalwerks substantiell zu verändern. @de
label: er agent, som er censor af @da
definition: Relaterer en agent til et udtryk, som omfatter en agents bidrag ved at revidere indholdet af et andet indtryk med henblik på at undertrykke indhold, som anses for at være moralsk, politisk, militært eller af anden årsag stødende, men som i alt væsentligt lader originalværkets karakter og indhold være uændret. @da
toolkit label: agent, som er censor af @da
toolkit definition: Udtryk, som omfatter en agents bidrag ved at revidere indholdet af et andet indtryk med henblik på at undertrykke indhold, som anses for at være moralsk, politisk, militært eller af anden årsag stødende, men som i alt væsentligt lader originalværkets karakter og indhold være uændret. @da
label: és agent censor de @ca
definition: Relaciona un agent amb una expressió que inclou una contribució d’un agent revisant el contingut d’una altra expressió amb el propòsit de suprimir el contingut considerat objectable per motius ètics, polítics, militars o altres motius, però deixant la natura i el contingut general sense canvis substancials. @ca
toolkit label: agent censor de @ca
toolkit definition: Expressió que inclou una contribució d’un agent revisant el contingut d’una altra expressió amb el propòsit de suprimir el contingut considerat objectable per motius ètics, polítics, militars o altres motius, però deixant la natura i el contingut general sense canvis substancials. @ca
definition: Liittää toimijan ekspressioon, jonka tekemiseen toimija osallistuu tarkastamalla toisen ekspression sisältöä kiistanalaisen sisällön salaamiseksi moraalisin, poliittisin, sotilaallisin tai muin perustein, mutta jättäen alkuperäisen teoksen luonteen ja yleisen sisällön olennaisilta osiltaan muuttumattomaksi.
toolkit label: sensori (toimija) ekspressiossa
toolkit definition: Ekspressio, jonka tekemiseen toimija osallistuu tarkastamalla toisen ekspression sisältöä kiistanalaisen sisällön salaamiseksi moraalisin, poliittisin, sotilaallisin tai muin perustein, mutta jättäen alkuperäisen teoksen luonteen ja yleisen sisällön olennaisilta osiltaan muuttumattomaksi..
toolkit label: sensor av (agent) @no
toolkit definition: Et uttrykk som inkluderer et bidrag fra en agent i form av å redigerer innholdet i et annet uttrykk i den hensikt å fjerne deler som anses som upassende av moralske, politiske, militære eller andre årsaker, men som lar originalverkets særpreg og innhold forbli hovedsakelig uendret. @no
label: ist Akteur als Zensorin/Zensor von @de
label: est un agent censeur de @fr
definition: Met un agent en relation avec une expression qui intègre une contribution de la part d’un agent consistant à réviser le contenu d’une autre expression dans le but de supprimer le contenu jugé inadmissible pour des motifs moraux, politiques, militaires ou autres tout en conservant la nature et le contenu sensiblement inchangés. @fr
toolkit label: agent censeur de @fr
toolkit definition: Expression qui intègre une contribution de la part d’un agent consistant à réviser le contenu d’une autre expression dans le but de supprimer le contenu jugé inadmissible pour des motifs moraux, politiques, militaires ou autres tout en conservant la nature et le contenu sensiblement inchangés. @fr
has element type: 2
label: cenzor ágense a következőnek: @hu
definition: Hozzákapcsol egy ágenst egy kifejezési formához, amely magában foglalja egy ágens közreműködését egy másik kifejezési forma tartalmának a felülvizsgálatában, morális, politikai, katonai vagy egyéb alapon kifogásolható tartalom kiküszöbölése céljából, ugyanakkor a jellegzetességeket és általánosságban a tartalmat lényegében változatlanul hagyja. @hu
toolkit label: cenzor ágense: @hu
toolkit definition: Egy kifejezési forma, amely magában foglalja egy ágens közreműködését egy másik kifejezési forma tartalmának a felülvizsgálatában, morális, politikai, katonai vagy egyéb alapon kifogásolható tartalom kiküszöbölése céljából, ugyanakkor a jellegzetességeket és általánosságban a tartalmat lényegében változatlanul hagyja. @hu
alternative label: censor of @en
alternative label: sensorina ekspressiossa
label: er sensor av (agent) @no
definition: Relaterer en agent til et uttrykk som inkluderer et bidrag fra en agent i form av å redigerer innholdet i et annet uttrykk i den hensikt å fjerne deler som anses som upassende av moralske, politiske, militære eller andre årsaker, men som lar originalverkets særpreg og innhold forbli hovedsakelig uendret. @no
alternative label: sensor av @no
label: is censor-actor van @nl
definition: Relateert een actor aan een expressie die omvat een bijdrage door een actor door het herzien van content van een andere expressie met de bedoeling content die gezien wordt als bezwaarlijk op morele, politieke, militaire of andere gronden te onderdrukken, maar de aard en algemene content grotendeels intact te laten. @nl
toolkit label: censor-actor van @nl
toolkit definition: Een expressie die omvat een bijdrage door een actor door het herzien van content van een andere expressie met de bedoeling content die gezien wordt als bezwaarlijk op morele, politieke, militaire of andere gronden te onderdrukken, maar de aard en algemene content grotendeels intact te laten. @nl
label: هو وكيل مراقب لـ @ar
definition: يربط وكيلا بتعبيرة تتضمن إسهام وكيل في مراجعة محتوى تعبيرة أخرى بغرض حجب محتوى قد يكون موضع اعتراض لأسباب أخلاقية أو سياسية أو عسكرية أو لاعتبارات أخرى، دون أن يُحدث تغييرا جوهريا في طابعه أو في مضمونه العام. @ar
alternative label: مراقب @ar
toolkit label: وكيل مراقب @ar
toolkit definition: تعبيرة تتضمن إسهام وكيل في مراجعة محتوى تعبيرة أخرى بغرض حجب محتوى قد يكون موضع اعتراض لأسباب أخلاقية أو سياسية أو عسكرية أو لاعتبارات أخرى، دون أن يُحدث تغييرا جوهريا في طابعه أو في مضمونه العام. @ar
alternative label: censor de @ca
alternative label: censor af @da
label: tsensor (tegija) väljenduses @et
definition: Seostab tegija väljendusega, millesse tegija on andnud panuse, revideerides teise väljenduse sisu eesmärgiga välja jätta sisu, mida peetakse moraalsetel, poliitilistel, militaarsetel või muudel põhjustel ebasoovitavaks, kuid jättes allikväljenduse olemuse ja üldise sisu põhiliselt muutmata. @et
alternative label: tsensor väljenduses @et
toolkit label: tsensor (tegija) väljenduses @et
toolkit definition: Väljendus, millesse tegija on andnud panuse, revideerides teise väljenduse sisu eesmärgiga välja jätta sisu, mida peetakse moraalsetel, poliitilistel, militaarsetel või muudel põhjustel ebasoovitavaks, kuid jättes allikväljenduse olemuse ja üldise sisu põhiliselt muutmata. @et
alternative label: cenzora: @hu
label: è censore agente di @it
definition: Correla un agente a un'espressione che comprende il contributo da parte di un agente nella revisione del contenuto di un'altra espressione allo scopo di eliminare contenuto ritenuto opinabile per ragioni morali, politiche, militari o di altra natura, ma lasciando sostanzialmente immutati la natura e il contenuto generale. @it
alternative label: censore di @it
toolkit label: censore agente di @it
toolkit definition: Espressione che comprende il contributo da parte di un agente nella revisione del contenuto di un'altra espressione allo scopo di eliminare contenuto ritenuto opinabile per ragioni morali, politiche, militari o di altra natura, ma lasciando sostanzialmente immutati la natura e il contenuto generale. @it
alternative label: λογοκριτής του @el
alternative label: censeur de @fr
label: ir cenzors (aģents) @lv
definition: Sasaista aģentu ar izteiksmi, kas ietver aģenta ieguldījumu, pārskatot citas izteiksmes saturu ar mērķi, lai izslēgtu saturu, kas tiek uzskatīts par nepieņemamu morālu, politisku, militāru vai citu iemeslu dēļ, bet tā būtību un vispārējo saturu būtiski nemaina. @lv
toolkit label: ir cenzors (aģents) @lv
toolkit definition: Izteiksme, kas ietver aģenta ieguldījumu, pārskatot citas izteiksmes saturu ar mērķi, lai izslēgtu saturu, kas tiek uzskatīts par nepieņemamu morālu, politisku, militāru vai citu iemeslu dēļ, bet tā būtību un vispārējo saturu būtiski nemaina. @lv
alternative label: Zensor von @de
alternative label: ……的审查者 @zh-hans
toolkit label: ……的审查者行为者 @zh-hans
toolkit definition: 包括修订另一种内容表达的内容以禁止视为不符合道德、政治、军事或其他背景的内容但却保持性质和总体内容不变的一个行为者的贡献的内容表达 @zh-hans
toolkit label: sansür temsilcisi @tr
toolkit definition: Ahlaki, politik, askeri veya diğer alanlarda sakıncalı görülen içeriğin temzilenmesi amaçlı bir başka anlatım içeriğini revize etmek, fakat yapıyı ve genel içeriği önemli ölçüde değiştirmeden bırakmakla görevli bir temsilcinin katkısını içeren bir anlatım. @tr

sensori (yhteistoimija) ekspressiossa
status: Published
label: is censor collective agent of @en
lexical alias: censorCollectiveAgentOf.en
definition: Relates a collective agent to an expression that includes a contribution by a collective agent of revising the content of another expression for the purpose of suppressing content that is deemed objectionable on moral, political, military, or other grounds, but leaving the nature and general content substantially unchanged. @en
toolkit label: censor collective agent of @en
toolkit definition: An expression that includes a contribution by a collective agent of revising the content of another expression for the purpose of suppressing content that is deemed objectionable on moral, political, military, or other grounds, but leaving the nature and general content substantially unchanged. @en
type: Property
domain: C10011
has element type: 2
sub property of: tarkastaja (yhteistoimija) ekspressiossa
sub property of: sensori (toimija) ekspressiossa
definition: Liittää yhteistoimijan ekspressioon, jossa yhteistoimija on osallisena tarkastamalla toisen ekspression sisältöä kiistanalaisen sisällön salaamiseksi moraalisin, poliittisin, sotilaallisin tai muin perustein, mutta jättäen alkuperäisen teoksen luonteen ja yleisen sisällön olennaisilta osiltaan muuttumattomaksi..
toolkit label: sensori (yhteistoimija) ekspressiossa
toolkit definition: Ekspressio, jossa yhteistoimija on osallisena tarkastamalla toisen ekspression sisältöä kiistanalaisen sisällön salaamiseksi moraalisin, poliittisin, sotilaallisin tai muin perustein, mutta jättäen alkuperäisen teoksen luonteen ja yleisen sisällön olennaisilta osiltaan muuttumattomaksi..
label: er sensor for (kollektiv agent) @no
definition: Relaterer en kollektiv agent til et uttrykk som inkluderer et bidrag fra en kollektiv agent i form av å redigere innholdet av et annet uttrykk i den hensikt å fjerne deler som upassende av moralske, politiske, militære eller andre årsaker, men som lar originalverkets særpreg og innhold forbli hovedsakelig uendret. @no
toolkit label: sensor for (kollektiv agent) @no
toolkit definition: Et uttrykk som inkluderer et bidrag fra en kollektiv agent i form av å redigere innholdet av et annet uttrykk i den hensikt å fjerne deler som upassende av moralske, politiske, militære eller andre årsaker, men som lar originalverkets særpreg og innhold forbli hovedsakelig uendret. @no
label: is censor-collectieve actor van @nl
definition: Relateert een collectieve actor aan een expressie die omvat een bijdrage door een collectieve actor door het herzien van content van een andere expressie met de bedoeling content die gezien wordt als bezwaarlijk op morele, politieke, militaire of andere gronden te onderdrukken, maar de aard en algemene content grotendeels intact te laten. @nl
toolkit label: censor-collectieve actor van @nl
toolkit definition: Een expressie die omvat een bijdrage door een collectieve actor door het herzien van content van een andere expressie met de bedoeling content die gezien wordt als bezwaarlijk op morele, politieke, militaire of andere gronden te onderdrukken, maar de aard en algemene content grotendeels intact te laten. @nl
label: هو وكيل جماعي مراقب لـ @ar
definition: يربط وكيلا جماعيا بتعبيرة تتضمن إسهام وكيل جماعي في مراجعة محتوى تعبيرة أخرى بغرض حجب محتوى قد يكون موضع اعتراض لأسباب أخلاقية أو سياسية أو عسكرية أو لاعتبارات أخرى، دون أن يُحدث تغييرا جوهريا في طابعه أو في مضمونه العام . @ar
toolkit label: وكيل جماعي مراقِب @ar
toolkit definition: تعبيرة تتضمن إسهام وكيل جماعي في مراجعة محتوى تعبيرة أخرى بغرض حجب محتوى قد يكون موضع اعتراض لأسباب أخلاقية أو سياسية أو عسكرية أو لاعتبارات أخرى، دون أن يُحدث تغييرا جوهريا في طابعه أو في مضمونه العام. @ar
label: és agent col·lectiu censor de @ca
definition: Relaciona un agent col·lectiu amb una expressió que inclou una contribució d’un agent col·lectiu revisant el contingut d’una altra expressió amb el propòsit de suprimir el contingut considerat objectable per motius ètics, polítics, militars o altres motius, però deixant la natura i el contingut general sense canvis substancials. @ca
toolkit label: agent col·lectiu censor de @ca
toolkit definition: Expressió que inclou una contribució d’un agent col·lectiu revisant el contingut d’una altra expressió amb el propòsit de suprimir el contingut considerat objectable per motius ètics, polítics, militars o altres motius, però deixant la natura i el contingut general sense canvis substancials. @ca
label: er kollektiv agent, som er censor af @da
definition: Relaterer en kollektiv agent til et udtryk, som omfatter en kollektiv agents bidrag ved at revidere indholdet af et andet indtryk med henblik på at undertrykke indhold, som anses for at være moralsk, politisk, militært eller af anden årsag stødende, men som i alt væsentligt lader originalværkets karakter og indhold være uændret. @da
toolkit label: kollektiv agent, som er censor af @da
toolkit definition: Udtryk, som omfatter en kollektiv agents bidrag ved at revidere indholdet af et andet indtryk med henblik på at undertrykke indhold, som anses for at være moralsk, politisk, militært eller af anden årsag stødende, men som i alt væsentligt lader originalværkets karakter og indhold være uændret. @da
label: tsensor (kollektiiv) väljenduses @et
definition: Seostab kollektiivi väljendusega, millesse kollektiiv on andnud panuse, revideerides teise väljenduse sisu eesmärgiga välja jätta sisu, mida peetakse moraalsetel, poliitilistel, militaarsetel või muudel põhjustel ebasoovitavaks, kuid jättes allikväljenduse olemuse ja üldise sisu põhiliselt muutmata. @et
toolkit label: tsensor (kollektiiv) väljenduses @et
toolkit definition: Väljendus, millesse kollektiiv on andnud panuse, revideerides teise väljenduse sisu eesmärgiga välja jätta sisu, mida peetakse moraalsetel, poliitilistel, militaarsetel või muudel põhjustel ebasoovitavaks, kuid jättes allikväljenduse olemuse ja üldise sisu põhiliselt muutmata. @et
label: ist gemeinschaftlicher Akteur als Zensorin/Zensor von @de
definition: Setzt einen gemeinschaftlichen Akteur in Beziehung zu einer Expression, zu der ein gemeinschaftlicher Akteur beiträgt, indem er den Inhalt einer anderen Expression überarbeitet, um Teile zu unterdrücken, die aus moralischen, politischen, militärischen oder anderen Gründen unerwünscht sind, ohne den Charakter und den Inhalt des Originalwerks substantiell zu verändern. @de
toolkit label: Gemeinschaftlicher Akteur als Zensorin/Zensor von @de
toolkit definition: Eine Expression, zu der ein gemeinschaftlicher Akteur beiträgt, indem er den Inhalt einer anderen Expression überarbeitet, um Teile zu unterdrücken, die aus moralischen, politischen, militärischen oder anderen Gründen unerwünscht sind, ohne den Charakter und den Inhalt des Originalwerks substantiell zu verändern. @de
label: cenzor kollektív ágense a következőnek: @hu
definition: Hozzákapcsol egy kollektív ágenst egy kifejezési formához, amely magában foglalja egy kollektív ágens közreműködését egy másik kifejezési forma tartalmának a felülvizsgálatában, morális, politikai, katonai vagy egyéb alapon kifogásolható részek kiküszöbölése céljából, ugyanakkor a jellegzetességeket és az általános tartalmat lényegében változatlanul hagyja. @hu
toolkit label: cenzor kollektív ágense: @hu
toolkit definition: Egy kifejezési forma, amely magában foglalja egy kollektív ágens közreműködését egy másik kifejezési forma tartalmának a felülvizsgálatában, morális, politikai, katonai vagy egyéb alapon kifogásolható részek kiküszöbölése céljából, ugyanakkor a jellegzetességeket és az általános tartalmat lényegében változatlanul hagyja. @hu
label: è censore agente collettivo di @it
definition: Correla un agente collettivo a un'espressione che comprende un contributo di un agente collettivo nella revisione del contenuto di un'altra espressione allo scopo di eliminare contenuto ritenuto opinabile per ragioni morali, politiche, militari o di altra natura, ma lasciando sostanzialmente immutati la natura e il contenuto generale. @it
toolkit label: censore agente collettivo di @it
toolkit definition: Espressione che comprende un contributo di un agente collettivo nella revisione del contenuto di un'altra espressione allo scopo di eliminare contenuto ritenuto opinabile per ragioni morali, politiche, militari o di altra natura, ma lasciando sostanzialmente immutati la natura e il contenuto generale. @it
label: είναι λογοκριτής συλλογικός φορέας του @el
toolkit label: λογοκριτής συλλογικός φορέας του @el
label: est un agent collectif censeur de @fr
definition: Met un agent collectif en relation avec une expression qui intègre une contribution de la part d’un agent collectif consistant à réviser le contenu d’une autre expression dans le but de supprimer le contenu jugé inadmissible pour des motifs moraux, politiques, militaires ou autres tout en conservant la nature et le contenu sensiblement inchangés. @fr
toolkit label: agent collectif censeur de @fr
toolkit definition: Expression qui intègre une contribution de la part d’un agent collectif consistant à réviser le contenu d’une autre expression dans le but de supprimer le contenu jugé inadmissible pour des motifs moraux, politiques, militaires ou autres tout en conservant la nature et le contenu sensiblement inchangés. @fr
label: ir cenzors (grupa) @lv
definition: Sasaista grupu ar izteiksmi, kas ietver grupas ieguldījumu, pārskatot citas izteiksmes saturu ar mērķi, lai izslēgtu saturu, kas tiek uzskatīts par nepieņemamu morālu, politisku, militāru vai citu iemeslu dēļ, bet tā būtību un vispārējo saturu būtiski nemaina. @lv
toolkit label: ir cenzors (grupa) @lv
toolkit definition: Izteiksme, kas ietver grupas ieguldījumu, pārskatot citas izteiksmes saturu ar mērķi, lai izslēgtu saturu, kas tiek uzskatīts par nepieņemamu morālu, politisku, militāru vai citu iemeslu dēļ, bet tā būtību un vispārējo saturu būtiski nemaina. @lv
label: 是……的审查者集体行为者 @zh-hans
definition: 将一个集体行为者与包括修订另一种内容表达的内容以禁止视为不符合道德、政治、军事或其他背景的内容但却保持性质和总体内容不变的一个集体行为者的贡献的内容表达关联起来。 @zh-hans
toolkit label: ……的审查者集体行为者 @zh-hans
toolkit definition: 包括修订另一种内容表达的内容以禁止视为不符合道德、政治、军事或其他背景的内容但却保持性质和总体内容不变的一个集体行为者的贡献的内容表达 @zh-hans
label: sansürcü kolektif temsilcisidir @tr
definition: Kolektif bir temsilciyi, ahlaki, politik, askeri veya diğer alanlarda sakıncalı görülen içeriğin temizlenmesi amaçlı bir başka anlatımın içeriğinigözden geçirme, fakat yapıyı ve genel içeriği önemli ölçüde değiştirmeden bırakmakla görevli bir kolektif temsilcinin katkısını içeren bir anlatım ile ilişkilendirir. @tr
toolkit label: sansür kolektif temsilcisi @tr
toolkit definition: Ahlaki, politik, askeri veya diğer alanlarda sakıncalı görülen içeriğin temzilenmesi amaçlı bir başka anlatım içeriğini revize etmek, fakat yapıyı ve genel içeriği önemli ölçüde değiştirmeden bırakmakla görevli kolektif bir temsilcinin katkısını içeren bir anlatım. @tr
has subproperty: sensori (yhteisö) ekspressiossa
has subproperty: sensori (suku) ekspressiossa
has subproperty: P50764

sensori (yhteisö) ekspressiossa
status: Published
label: is censor corporate body of @en
lexical alias: censorCorporateBodyOf.en
definition: Relates a corporate body to an expression that includes a contribution by a corporate body of revising the content of another expression for the purpose of suppressing content that is deemed objectionable on moral, political, military, or other grounds, but leaving the nature and general content substantially unchanged. @en
toolkit label: censor corporate body of @en
toolkit definition: An expression that includes a contribution by a corporate body of revising the content of another expression for the purpose of suppressing content that is deemed objectionable on moral, political, military, or other grounds, but leaving the nature and general content substantially unchanged. @en
type: Property
domain: C10005
has element type: 2
sub property of: tarkastaja (yhteisö) ekspressiossa
sub property of: sensori (yhteistoimija) ekspressiossa
definition: Liittää yhteisön ekspressioon, jossa yhteisö on osallisena tarkastamalla toisen ekspression sisältöä kiistanalaisen sisällön salaamiseksi moraalisin, poliittisin, sotilaallisin tai muin perustein, mutta jättäen alkuperäisen teoksen luonteen ja yleisen sisällön olennaisilta osiltaan muuttumattomaksi.
toolkit label: sensori (yhteisö) ekspressiossa
toolkit definition: Ekspressio, jossa yhteisö on osallisena tarkastamalla toisen ekspression sisältöä kiistanalaisen sisällön salaamiseksi moraalisin, poliittisin, sotilaallisin tai muin perustein, mutta jättäen alkuperäisen teoksen luonteen ja yleisen sisällön olennaisilta osiltaan muuttumattomaksi.
label: er sensor for (korporasjon) @no
definition: Relaterer en korporasjon til et uttrykk som inkluderer et bidrag fra en korporasjon i form av å redigere innholdet av et annet uttrykk i den hensikt å fjerne deler som upassende av moralske, politiske, militære eller andre årsaker, men som lar originalverkets særpreg og innhold forbli hovedsakelig uendret. @no
toolkit label: sensor for (korporasjon) @no
toolkit definition: Et uttrykk som inkluderer et bidrag fra en korporasjon i form av å redigere innholdet av et annet uttrykk i den hensikt å fjerne deler som upassende av moralske, politiske, militære eller andre årsaker, men som lar originalverkets særpreg og innhold forbli hovedsakelig uendret. @no
label: is censor-corporatie van @nl
definition: Relateert een corporatie aan een expressie die omvat een bijdrage door een corporatie door het herzien van content van een andere expressie met de bedoeling content die gezien wordt als bezwaarlijk op morele, politieke, militaire of andere gronden te onderdrukken, maar de aard en algemene content grotendeels intact te laten. @nl
toolkit label: censor-corporatie van @nl
toolkit definition: Een expressie die omvat een bijdrage door een corporatie door het herzien van content van een andere expressie met de bedoeling content die gezien wordt als bezwaarlijk op morele, politieke, militaire of andere gronden te onderdrukken, maar de aard en algemene content grotendeels intact te laten. @nl
label: هي هيئة مراقِبة لـ @ar
definition: يربط هيئة بتعبيرة تتضمن إسهام هيئة في مراجعة محتوى تعبيرة أخرى بغرض حجب محتوى قد يكون موضع اعتراض لأسباب أخلاقية أو سياسية أو عسكرية أو لاعتبارات أخرى، دون أن تُحدث تغييرا جوهريا في طابعه أو في مضمونه العام. @ar
toolkit label: هيئة مراقِبة @ar
toolkit definition: تعبيرة تتضمن إسهام هيئة في مراجعة محتوى تعبيرة أخرى بغرض حجب محتوى قد يكون موضع اعتراض لأسباب أخلاقية أو سياسية أو عسكرية أو لاعتبارات أخرى، دون أن تُحدث تغييرا جوهريا في طابعه أو في مضمونه العام. @ar
label: és entitat corporativa censora de @ca
definition: Relaciona una entitat corporativa amb una expressió que inclou una contribució d’una entitat corporativa revisant el contingut d’una altra expressió amb el propòsit de suprimir el contingut considerat objectable per motius ètics, polítics, militars o altres motius, però deixant la natura i el contingut general sense canvis substancials. @ca
toolkit label: entitat corporativa censora de @ca
toolkit definition: Expressió que inclou una contribució d’una entitat corporativa revisant el contingut d’una altra expressió amb el propòsit de suprimir el contingut considerat objectable per motius ètics, polítics, militars o altres motius, però deixant la natura i el contingut general sense canvis substancials. @ca
label: er korporation, som er censor af @da
definition: Relaterer en korporation til et udtryk, som omfatter en korporations bidrag ved at revidere indholdet af et andet indtryk med henblik på at undertrykke indhold, som anses for at være moralsk, politisk, militært eller af anden årsag stødende, men som i alt væsentligt lader originalværkets karakter og indhold være uændret. @da
toolkit label: korporation, som er censor af @da
toolkit definition: Udtryk, som omfatter en korporations bidrag ved at revidere indholdet af et andet indtryk med henblik på at undertrykke indhold, som anses for at være moralsk, politisk, militært eller af anden årsag stødende, men som i alt væsentligt lader originalværkets karakter og indhold være uændret. @da
label: tsensor (asutus) väljenduses @et
definition: Seostab asutuse väljendusega, millesse asutus on andnud panuse, revideerides teise väljenduse sisu eesmärgiga välja jätta sisu, mida peetakse moraalsetel, poliitilistel, militaarsetel või muudel põhjustel ebasoovitavaks, kuid jättes allikväljenduse olemuse ja üldise sisu põhiliselt muutmata. @et
toolkit label: tsensor (asutus) väljenduses @et
toolkit definition: Väljendus, millesse asutus on andnud panuse, revideerides teise väljenduse sisu eesmärgiga välja jätta sisu, mida peetakse moraalsetel, poliitilistel, militaarsetel või muudel põhjustel ebasoovitavaks, kuid jättes allikväljenduse olemuse ja üldise sisu põhiliselt muutmata. @et
label: ist Körperschaft als Zensorin/Zensor von @de
definition: Setzt eine Körperschaft in Beziehung zu einer Expression, zu der eine Körperschaft beiträgt, indem sie den Inhalt einer anderen Expression überarbeitet, um Teile zu unterdrücken, die aus moralischen, politischen, militärischen oder aus anderen Gründen unerwünscht sind, ohne den Charakter und den Inhalt des Originalwerks substantiell zu verändern. @de
toolkit label: Körperschaft als Zensorin/Zensor von @de
toolkit definition: Eine Expression, zu der eine Körperschaft beiträgt, indem sie den Inhalt einer anderen Expression überarbeitet, um Teile zu unterdrücken, die aus moralischen, politischen, militärischen oder aus anderen Gründen unerwünscht sind, ohne den Charakter und den Inhalt des Originalwerks substantiell zu verändern. @de
label: cenzor testülete a következőnek: @hu
definition: Hozzákapcsol egy testületet egy kifejezési formához, amely magában foglalja egy testület közreműködését egy másik kifejezési forma tartalmának a felülvizsgálatában, morális, politikai, katonai vagy egyéb alapon kifogásolható részek kiküszöbölése céljából, ugyanakkor a jellegzetességeket és az általános tartalmat lényegében változatlanul hagyja. @hu
toolkit label: cenzor testülete: @hu
toolkit definition: Egy kifejezési forma, amely magában foglalja egy testület közreműködését egy másik kifejezési forma tartalmának a felülvizsgálatában, morális, politikai, katonai vagy egyéb alapon kifogásolható részek kiküszöbölése céljából, ugyanakkor a jellegzetességeket és az általános tartalmat lényegében változatlanul hagyja. @hu
label: è censore ente di @it
definition: Correla un ente a un'espressione che comprende un contributo di un ente nella revisione del contenuto di un'altra espressione allo scopo di eliminare contenuto ritenuto opinabile per ragioni morali, politiche, militari o di altra natura, ma lasciando sostanzialmente immutati la natura e il contenuto generale. @it
toolkit label: censore ente di @it
toolkit definition: Espressione che comprende un contributo di un ente nella revisione del contenuto di un'altra espressione allo scopo di eliminare contenuto ritenuto opinabile per ragioni morali, politiche, militari o di altra natura, ma lasciando sostanzialmente immutati la natura e il contenuto generale. @it
label: είναι λογοκριτής συλλογικό όργανο του @el
toolkit label: λογοκριτής συλλογικός φορέας του @el
label: est une collectivité censeure de @fr
definition: Met une collectivité en relation avec une expression qui intègre une contribution de la part d’une collectivité consistant à réviser le contenu d’une autre expression dans le but de supprimer le contenu jugé inadmissible pour des motifs moraux, politiques, militaires ou autres tout en conservant la nature et le contenu sensiblement inchangés. @fr
toolkit label: collectivité censeure de @fr
toolkit definition: Expression qui intègre une contribution de la part d’une collectivité consistant à réviser le contenu d’une autre expression dans le but de supprimer le contenu jugé inadmissible pour des motifs moraux, politiques, militaires ou autres tout en conservant la nature et le contenu sensiblement inchangés. @fr
label: ir cenzors (institūcija) @lv
definition: Sasaista institūciju ar izteiksmi, kas ietver institūcijas ieguldījumu, pārskatot citas izteiksmes saturu ar mērķi, lai izslēgtu saturu, kas tiek uzskatīts par nepieņemamu morālu, politisku, militāru vai citu iemeslu dēļ, bet tā būtību un vispārējo saturu būtiski nemaina. @lv
toolkit label: ir cenzors (institūcija) @lv
toolkit definition: Izteiksme, kas ietver institūcijas ieguldījumu, pārskatot citas izteiksmes saturu ar mērķi, lai izslēgtu saturu, kas tiek uzskatīts par nepieņemamu morālu, politisku, militāru vai citu iemeslu dēļ, bet tā būtību un vispārējo saturu būtiski nemaina. @lv
label: 是……的审查者团体 @zh-hans
definition: 将一个团体与包括修订另一种内容表达的内容以禁止视为不符合道德、政治、军事或其他背景的内容但却保持性质和总体内容不变的一个团体的贡献的内容表达关联起来。 @zh-hans
toolkit label: ……的审查者团体 @zh-hans
toolkit definition: 包括修订另一种内容表达的内容以禁止视为不符合道德、政治、军事或其他背景的内容但却保持性质和总体内容不变的一个团体的贡献的内容表达 @zh-hans
label: sansürcü tüzel kişisidir @tr
definition: Bir tüzel kişiyi, ahlaki, politik, askeri veya diğer gerekçelerle sakıncalı görülen içeriği bastırmak amacıyla başka bir ifadenin içeriğini gözden geçirmeye yönelik bir kurumsal organın katkısını içeren, ancak niteliğini ve genel içeriğini büyük ölçüde değiştirmeden bırakan bir anlatımla ilişkilendirir. @tr
toolkit label: sansür tüzel kişisi @tr
toolkit definition: Bir ifadenin içeriğini, ahlaki, politik, askeri veya diğer nedenlerle hoş karşılanmayan içeriği bastırmak amacıyla gözden geçiren ancak doğasını ve genel içeriğini büyük ölçüde değiştirmeyen tüzel bir kişinin katkısını içeren bir anlatım. @tr
has subproperty: P50915

sensori (suku) ekspressiossa
status: Published
label: is censor family of @en
lexical alias: censorFamilyOf.en
definition: Relates a family to an expression that includes a contribution by a family of revising the content of another expression for the purpose of suppressing content that is deemed objectionable on moral, political, military, or other grounds, but leaving the nature and general content substantially unchanged. @en
toolkit label: censor family of @en
toolkit definition: An expression that includes a contribution by a family of revising the content of another expression for the purpose of suppressing content that is deemed objectionable on moral, political, military, or other grounds, but leaving the nature and general content substantially unchanged. @en
type: Property
domain: C10008
has element type: 2
sub property of: tarkastaja (suku) ekspressiossa
sub property of: sensori (yhteistoimija) ekspressiossa
definition: Liittää suvun ekspressioon, jossa suku on osallisena tarkastamalla toisen ekspression sisältöä kiistanalaisen sisällön salaamiseksi moraalisin, poliittisin, sotilaallisin tai muin perustein, mutta jättäen alkuperäisen teoksen luonteen ja yleisen sisällön olennaisilta osiltaan muuttumattomaksi..
toolkit label: sensori (suku) ekspressiossa
toolkit definition: Ekspressio, jossa suku on osallisena tarkastamalla toisen ekspression sisältöä kiistanalaisen sisällön salaamiseksi moraalisin, poliittisin, sotilaallisin tai muin perustein, mutta jättäen alkuperäisen teoksen luonteen ja yleisen sisällön olennaisilta osiltaan muuttumattomaksi..
label: er sensor for (familie) @no
definition: Relaterer en familie til et uttrykk som inkluderer et bidrag fra en familie i form av å redigere innholdet av et annet uttrykk i den hensikt å fjerne deler som upassende av moralske, politiske, militære eller andre årsaker, men som lar originalverkets særpreg og innhold forbli hovedsakelig uendret. @no
toolkit label: sensor for (familie) @no
toolkit definition: Et uttrykk som inkluderer et bidrag fra en familie i form av å redigere innholdet av et annet uttrykk i den hensikt å fjerne deler som upassende av moralske, politiske, militære eller andre årsaker, men som lar originalverkets særpreg og innhold forbli hovedsakelig uendret. @no
label: is censor-familie van @nl
definition: Relateert een familie aan een expressie die omvat een bijdrage door een familie door het herzien van content van een andere expressie met de bedoeling content die gezien wordt als bezwaarlijk op morele, politieke, militaire of andere gronden te onderdrukken, maar de aard en algemene content grotendeels intact te laten. @nl
toolkit label: censor-familie van @nl
toolkit definition: Een expressie die omvat een bijdrage door een familie door het herzien van content van een andere expressie met de bedoeling content die gezien wordt als bezwaarlijk op morele, politieke, militaire of andere gronden te onderdrukken, maar de aard en algemene content grotendeels intact te laten. @nl
label: هي عائلة مراقِبة لـ @ar
definition: يربط عائلة بتعبيرة تتضمن إسهام عائلة في مراجعة محتوى تعبيرة أخرى بغرض حجب محتوى قد يكون موضع اعتراض لأسباب أخلاقية أو سياسية أو عسكرية أو لاعتبارات أخرى، دون أن تُحدث تغييرا جوهريا في طابعه أو في مضمونه العام. @ar
toolkit label: عائلة مراقِبة @ar
toolkit definition: تعبيرة تتضمن إسهام عائلة في مراجعة محتوى تعبيرة أخرى بغرض حجب محتوى قد يكون موضع اعتراض لأسباب أخلاقية أو سياسية أو عسكرية أو لاعتبارات أخرى، دون أن حدث تغييرا جوهريا في طابعه أو في مضمونه العام. @ar
label: és família censora de @ca
definition: Relaciona una família amb una expressió que inclou una contribució d’una família revisant el contingut d’una altra expressió amb el propòsit de suprimir el contingut considerat objectable per motius ètics, polítics, militars o altres motius, però deixant la natura i el contingut general sense canvis substancials. @ca
toolkit label: família censora de @ca
toolkit definition: Expressió que inclou una contribució d’una família revisant el contingut d’una altra expressió amb el propòsit de suprimir el contingut considerat objectable per motius ètics, polítics, militars o altres motius, però deixant la natura i el contingut general sense canvis substancials. @ca
label: er familie, som er censor af @da
definition: Relaterer en familie til et udtryk, som omfatter en families bidrag ved at revidere indholdet af et andet indtryk med henblik på at undertrykke indhold, som anses for at være moralsk, politisk, militært eller af anden årsag stødende, men som i alt væsentligt lader originalværkets karakter og indhold være uændret. @da
toolkit label: familie, som er censor af @da
toolkit definition: Udtryk, som omfatter en families bidrag ved at revidere indholdet af et andet indtryk med henblik på at undertrykke indhold, som anses for at være moralsk, politisk, militært eller af anden årsag stødende, men som i alt væsentligt lader originalværkets karakter og indhold være uændret. @da
label: tsensor (perekond) väljenduses @et
definition: Seostab perekonna väljendusega, millesse perekond on andnud panuse, revideerides teise väljenduse sisu eesmärgiga välja jätta sisu, mida peetakse moraalsetel, poliitilistel, militaarsetel või muudel põhjustel ebasoovitavaks, kuid jättes allikväljenduse olemuse ja üldise sisu põhiliselt muutmata. @et
toolkit label: tsensor (perekond) väljenduses @et
toolkit definition: Väljendus, millesse perekond on andnud panuse, revideerides teise väljenduse sisu eesmärgiga välja jätta sisu, mida peetakse moraalsetel, poliitilistel, militaarsetel või muudel põhjustel ebasoovitavaks, kuid jättes allikväljenduse olemuse ja üldise sisu põhiliselt muutmata. @et
label: ist Familie als Zensorin/Zensor von @de
definition: Setzt eine Familie in Beziehung zu einer Expression, zu der eine Familie beiträgt, indem sie den Inhalt einer anderen Expression überarbeitet, um Teile zu unterdrücken, die aus moralischen, politischen, militärischen oder aus anderen Gründen unerwünscht sind, ohne den Charakter und den Inhalt des Originalwerks substantiell zu verändern. @de
toolkit label: Familie als Zensorin/Zensor von @de
toolkit definition: Eine Expression, zu der eine Familie beiträgt, indem sie den Inhalt einer anderen Expression überarbeitet, um Teile zu unterdrücken, die aus moralischen, politischen, militärischen oder aus anderen Gründen unerwünscht sind, ohne den Charakter und den Inhalt des Originalwerks substantiell zu verändern. @de
label: cenzor családja a következőnek: @hu
definition: Hozzákapcsol egy családot egy kifejezési formához, amely magában foglalja egy család közreműködését egy másik kifejezési forma tartalmának a felülvizsgálatában, morális, politikai, katonai vagy egyéb alapon kifogásolható részek kiküszöbölése céljából, ugyanakkor a jellegzetességeket és az általános tartalmat lényegében változatlanul hagyja. @hu
toolkit label: cenzor családja: @hu
toolkit definition: Egy kifejezési forma, amely magában foglalja egy család közreműködését egy másik kifejezési forma tartalmának a felülvizsgálatában, morális, politikai, katonai vagy egyéb alapon kifogásolható részek kiküszöbölése céljából, ugyanakkor a jellegzetességeket és az általános tartalmat lényegében változatlanul hagyja. @hu
label: è censore famiglia di @it
definition: Correla una famiglia a un'espressione che comprende un contributo di una famiglia nella revisione del contenuto di un'altra espressione allo scopo di eliminare contenuto ritenuto opinabile per ragioni morali, politiche, militari o di altra natura, ma lasciando sostanzialmente immutati la natura e il contenuto generale. @it
toolkit label: censore famiglia di @it
toolkit definition: Espressione che comprende un contributo di una famiglia nella revisione del contenuto di un'altra espressione allo scopo di eliminare contenuto ritenuto opinabile per ragioni morali, politiche, militari o di altra natura, ma lasciando sostanzialmente immutati la natura e il contenuto generale. @it
label: είναι λογοκριτής οικογένεια του @el
toolkit label: λογοκριτής οικογένεια του @el
label: est une famille censeure de @fr
definition: Met une famille en relation avec une expression qui intègre une contribution de la part d’une famille consistant à réviser le contenu d’une autre expression dans le but de supprimer le contenu jugé inadmissible pour des motifs moraux, politiques, militaires ou autres tout en conservant la nature et le contenu sensiblement inchangés. @fr
toolkit label: famille censeure de @fr
toolkit definition: Expression qui intègre une contribution de la part d’une famille consistant à réviser le contenu d’une autre expression dans le but de supprimer le contenu jugé inadmissible pour des motifs moraux, politiques, militaires ou autres tout en conservant la nature et le contenu sensiblement inchangés. @fr
label: ir cenzors (dzimta/ģimene) @lv
definition: Sasaista dzimtu/ģimeni ar izteiksmi, kas ietver dzimtas/ģimenes ieguldījumu, pārskatot citas izteiksmes saturu ar mērķi, lai izslēgtu saturu, kas tiek uzskatīts par nepieņemamu morālu, politisku, militāru vai citu iemeslu dēļ, bet tā būtību un vispārējo saturu būtiski nemaina. @lv
toolkit label: ir cenzors (dzimta/ģimene) @lv
toolkit definition: Izteiksme, kas ietver dzimtas/ģimenes ieguldījumu, pārskatot citas izteiksmes saturu ar mērķi, lai izslēgtu saturu, kas tiek uzskatīts par nepieņemamu morālu, politisku, militāru vai citu iemeslu dēļ, bet tā būtību un vispārējo saturu būtiski nemaina. @lv
label: 是……的审查者家族 @zh-hans
definition: 将一个家族与包括修订另一种内容表达的内容以禁止视为不符合道德、政治、军事或其他背景的内容但却保持性质和总体内容不变的一个家族的贡献的内容表达关联起来。 @zh-hans
toolkit label: ……的审查者家族 @zh-hans
toolkit definition: 包括修订另一种内容表达的内容以禁止视为不符合道德、政治、军事或其他背景的内容但却保持性质和总体内容不变的一个家族的贡献的内容表达 @zh-hans
label: sansürcü ailesidir @tr
definition: Bir aileyi, ahlaki, politik, askeri veya diğer gerekçelerle sakıncalı görülen içeriği bastırmak amacıyla başka bir ifadenin içeriğinin gözden geçirilmesine yönelik bir ailenin katkısını içeren ancak niteliğini ve genel içeriğini büyük ölçüde değiştirmeden bırakan bir anlatımla ilişkilendirir. @tr
toolkit label: sansür ailesi @tr
toolkit definition: Ahlaki, politik, askeri veya diğer alanlarda sakıncalı görülen içeriğin temzilenmesi amaçlı bir başka anlatım içeriğini revize etmek, fakat yapıyı ve genel içeriği önemli ölçüde değiştirmeden bırakmakla görevli bir ailenin katkısını içeren bir anlatım. @tr
has subproperty: P51066

sensori (henkilö) ekspressiossa
status: Published
label: is censor person of @en
lexical alias: censorPersonOf.en
definition: Relates a person to an expression that includes a contribution by a person of revising the content of another expression for the purpose of suppressing content that is deemed objectionable on moral, political, military, or other grounds, but leaving the nature and general content substantially unchanged. @en
toolkit label: censor person of @en
toolkit definition: An expression that includes a contribution by a person of revising the content of another expression for the purpose of suppressing content that is deemed objectionable on moral, political, military, or other grounds, but leaving the nature and general content substantially unchanged. @en
type: Property
domain: C10004
has element type: 2
sub property of: tarkastaja (henkilö) ekspressiossa
sub property of: sensori (toimija) ekspressiossa
definition: Liittää henkilön ekspressioon, jossa henkilö on osallisena tarkastamalla toisen ekspression sisältöä kiistanalaisen sisällön salaamiseksi moraalisin, poliittisin, sotilaallisin tai muin perustein, mutta jättäen alkuperäisen teoksen luonteen ja yleisen sisällön olennaisilta osiltaan muuttumattomaksi..
toolkit label: sensori (henkilö) ekspressiossa
toolkit definition: Ekspressio, jossa henkilö on osallisena tarkastamalla toisen ekspression sisältöä kiistanalaisen sisällön salaamiseksi moraalisin, poliittisin, sotilaallisin tai muin perustein, mutta jättäen alkuperäisen teoksen luonteen ja yleisen sisällön olennaisilta osiltaan muuttumattomaksi..
label: er sensor for (person) @no
definition: Relaterer en person til et uttrykk som inkluderer et bidrag fra en person i form av å redigere innholdet av et annet uttrykk i den hensikt å fjerne deler som upassende av moralske, politiske, militære eller andre årsaker, men som lar originalverkets særpreg og innhold forbli hovedsakelig uendret. @no
toolkit label: sensor for (person) @no
toolkit definition: Et uttrykk som inkluderer et bidrag fra en person i form av å redigere innholdet av et annet uttrykk i den hensikt å fjerne deler som upassende av moralske, politiske, militære eller andre årsaker, men som lar originalverkets særpreg og innhold forbli hovedsakelig uendret. @no
label: is censor-persoon van @nl
definition: Relateert een persoon aan een expressie die omvat een bijdrage door een persoon door het herzien van content van een andere expressie met de bedoeling content die gezien wordt als bezwaarlijk op morele, politieke, militaire of andere gronden te onderdrukken, maar de aard en algemene content grotendeels intact te laten. @nl
toolkit label: censor-persoon van @nl
toolkit definition: Een expressie die omvat een bijdrage door een persoon door het herzien van content van een andere expressie met de bedoeling content die gezien wordt als bezwaarlijk op morele, politieke, militaire of andere gronden te onderdrukken, maar de aard en algemene content grotendeels intact te laten. @nl
label: هو شخص رقيب لـ @ar
definition: يربط شخصا بتعبيرة تتضمن إسهام شخص في مراجعة محتوى تعبيرة أخرى بغرض حجب محتوى قد يكون موضع اعتراض لأسباب أخلاقية أو سياسية أو عسكرية أو لاعتبارات أخرى، دون أن يُحدث تغييرا جوهريا في طابعه أو في مضمونه العام . @ar
toolkit label: شخص مراقب @ar
toolkit definition: تعبيرة تتضمن إسهام شخص في مراجعة محتوى تعبيرة أخرى بغرض حجب محتوى قد يكون موضع اعتراض لأسباب أخلاقية أو سياسية أو عسكرية أو لاعتبارات أخرى، دون أن يُحدث تغييرا جوهريا في طابعه أو في مضمونه العام. @ar
label: és persona censora de @ca
definition: Relaciona una persona amb una expressió que inclou una contribució d’una persona revisant el contingut d’una altra expressió amb el propòsit de suprimir el contingut considerat objectable per motius ètics, polítics, militars o altres motius, però deixant la natura i el contingut general sense canvis substancials. @ca
toolkit label: persona censora de @ca
toolkit definition: Expressió que inclou una contribució d’una persona revisant el contingut d’una altra expressió amb el propòsit de suprimir el contingut considerat objectable per motius ètics, polítics, militars o altres motius, però deixant la natura i el contingut general sense canvis substancials. @ca
label: er person, som er censor af @da
definition: Relaterer en person til et udtryk, som omfatter en persons bidrag ved at revidere indholdet af et andet indtryk med henblik på at undertrykke indhold, som anses for at være moralsk, politisk, militært eller af anden årsag stødende, men som i alt væsentligt lader originalværkets karakter og indhold være uændret. @da
toolkit label: person, som er censor af @da
toolkit definition: Udtryk, som omfatter en persons bidrag ved at revidere indholdet af et andet indtryk med henblik på at undertrykke indhold, som anses for at være moralsk, politisk, militært eller af anden årsag stødende, men som i alt væsentligt lader originalværkets karakter og indhold være uændret. @da
label: tsensor (isik) väljenduses @et
definition: Seostab isiku väljendusega, millesse isik on andnud panuse, revideerides teise väljenduse sisu eesmärgiga välja jätta sisu, mida peetakse moraalsetel, poliitilistel, militaarsetel või muudel põhjustel ebasoovitavaks, kuid jättes allikväljenduse olemuse ja üldise sisu põhiliselt muutmata. @et
toolkit label: tsensor (isik) väljenduses @et
toolkit definition: Väljendus, millesse isik on andnud panuse, revideerides teise väljenduse sisu eesmärgiga välja jätta sisu, mida peetakse moraalsetel, poliitilistel, militaarsetel või muudel põhjustel ebasoovitavaks, kuid jättes allikväljenduse olemuse ja üldise sisu põhiliselt muutmata. @et
label: ist Person als Zensorin/Zensor von @de
definition: Setzt eine Person in Beziehung zu einer Expression, zu der eine Person beiträgt, indem sie den Inhalt einer anderen Expression überarbeitet, um Teile zu unterdrücken, die aus moralischen, politischen, militärischen oder aus anderen Gründen unerwünscht sind, ohne den Charakter und den Inhalt des Originalwerks substantiell zu verändern. @de
toolkit label: Person als Zensorin/Zensor von @de
toolkit definition: Eine Expression, zu der eine Person beiträgt, indem sie den Inhalt einer anderen Expression überarbeitet, um Teile zu unterdrücken, die aus moralischen, politischen, militärischen oder aus anderen Gründen unerwünscht sind, ohne den Charakter und den Inhalt des Originalwerks substantiell zu verändern. @de
label: cenzor személye a következőnek: @hu
definition: Hozzákapcsol egy személyt egy kifejezési formához, amely magában foglalja egy személy közreműködését egy másik kifejezési forma tartalmának a felülvizsgálatában, morális, politikai, katonai vagy egyéb alapon kifogásolható részek kiküszöbölése céljából, ugyanakkor a jellegzetességeket és a tartalmat lényegében változatlanul hagyja. @hu
toolkit label: cenzor személye: @hu
toolkit definition: Egy kifejezési forma, amely magában foglalja egy személy közreműködését egy másik kifejezési forma tartalmának a felülvizsgálatában, morális, politikai, katonai vagy egyéb alapon kifogásolható részek kiküszöbölése céljából, ugyanakkor a jellegzetességeket és a tartalmat lényegében változatlanul hagyja. @hu
label: è censore persona di @it
definition: Correla una persona a un'espressione che comprende un contributo di una persona nella revisione del contenuto di un'altra espressione allo scopo di eliminare contenuto ritenuto opinabile per ragioni morali, politiche, militari o di altra natura, ma lasciando sostanzialmente immutati la natura e il contenuto generale. @it
toolkit label: censore persona di @it
toolkit definition: Espressione che comprende un contributo di una persona nella revisione del contenuto di un'altra espressione allo scopo di eliminare contenuto ritenuto opinabile per ragioni morali, politiche, militari o di altra natura, ma lasciando sostanzialmente immutati la natura e il contenuto generale. @it
label: είναι λογοκριτής φυσικό πρόσωπο του @el
toolkit label: λογοκριτής φυσικό πρόσωπο του @el
label: est une personne censeure de @fr
definition: Met une personne en relation avec une expression qui intègre une contribution de la part d’une personne consistant à réviser le contenu d’une autre expression dans le but de supprimer le contenu jugé inadmissible pour des motifs moraux, politiques, militaires ou autres tout en conservant la nature et le contenu sensiblement inchangés. @fr
toolkit label: personne censeure de @fr
toolkit definition: Expression qui intègre une contribution de la part d’une personne consistant à réviser le contenu d’une autre expression dans le but de supprimer le contenu jugé inadmissible pour des motifs moraux, politiques, militaires ou autres tout en conservant la nature et le contenu sensiblement inchangés. @fr
label: ir cenzors (persona) @lv
definition: Sasaista personu ar izteiksmi, kas ietver personas ieguldījumu, pārskatot citas izteiksmes saturu ar mērķi, lai izslēgtu saturu, kas tiek uzskatīts par nepieņemamu morālu, politisku, militāru vai citu iemeslu dēļ, bet tā būtību un vispārējo saturu būtiski nemaina. @lv
toolkit label: ir cenzors (persona) @lv
toolkit definition: Izteiksme, kas ietver personas ieguldījumu, pārskatot citas izteiksmes saturu ar mērķi, lai izslēgtu saturu, kas tiek uzskatīts par nepieņemamu morālu, politisku, militāru vai citu iemeslu dēļ, bet tā būtību un vispārējo saturu būtiski nemaina. @lv
label: ……的审查者个人 @zh-hans
definition: 将一个个人与包括修订另一种内容表达的内容以禁止视为不符合道德、政治、军事或其他背景的内容但却保持性质和总体内容不变的一个个人的贡献的内容表达关联起来。 @zh-hans
toolkit label: ……的审查者个人 @zh-hans
toolkit definition: 包括修订另一种内容表达的内容以禁止视为不符合道德、政治、军事或其他背景的内容但却保持性质和总体内容不变的一个个人的贡献的内容表达 @zh-hans
label: sansürcü kişisidir @tr
definition: Bir kişiyi, ahlaki, siyasi, askeri veya diğer gerekçelerle sakıncalı olduğu düşünülen, bununla birlikte niteliği ve genel içeriği temelde değişmeden bırakılan içeriği gizlemek amacıyla bir başka içeriğin gözden geçirilmesine yönelik bir kişinin katkısını içeren anlatımla ilişkilendirir. @tr
toolkit label: sansürcü kişi @tr
toolkit definition: Ahlaki, politik, askeri veya diğer alanlarda sakıncalı görülen içeriğin temzilenmesi amaçlı bir başka anlatım içeriğini revize etmek, fakat yapıyı ve genel içeriği önemli ölçüde değiştirmeden bırakmakla görevli bir kişinin katkısını içeren bir anlatım. @tr
has subproperty: P50613

kuoronjohtaja (toimija) ekspressiossa
status: Published
type: Property
label: is choral conductor agent of @en
lexical alias: choralConductorAgentOf.en
definition: Relates an agent to an expression that includes a contribution by an agent of leading a choral performing group in a musical or dramatic presentation. @en
domain: C10002
toolkit label: choral conductor agent of @en
toolkit definition: An expression that includes a contribution by an agent of leading a choral performing group in a musical or dramatic presentation. @en
instruction number: 18.5
sub property of: johtaja (toimija) ekspressiossa
label: είναι διευθυντής χορωδίας φορέας του @el
definition: Συνδέει έναν διευθυντή ορχήστρας με μια έκφραση ενός μουσικού έργου μέσω της καθοδήγησης ενός χορωδιακού συνόλου σε μια μουσική ή δραματική παρουσίαση κ.λπ., με μια έκφραση. @el
toolkit label: διευθυντής χορωδίας φορέας του @el
toolkit definition: Μια έκφραση ενός μουσικού έργου που ενσωματώνει τη συνεισφορά της διεύθυνσης ενός χορωδιακού συνόλου σε μια μουσική ή δραματική παρουσίαση κ.λπ. @el
definition: Setzt einen Akteur in Beziehung zu einer Expression, zu der ein Akteur beiträgt, indem er einen Chor in einer musikalischen oder dramatischen Darbietung leitet. @de
toolkit label: Akteur als Chorleiterin/Chorleiter von @de
toolkit definition: Eine Expression, zu der ein Akteur beiträgt, indem er einen Chor in einer musikalischen oder dramatischen Darbietung leitet. @de
label: er agent, som er kordirigent af @da
definition: Relaterer en agent til et udtryk, som omfatter en agents bidrag ved at lede et optrædende kor i en musikalsk eller dramatisk præsentation. @da
toolkit label: agent, som er kordirigent af @da
toolkit definition: Udtryk, som omfatter en agents bidrag ved at lede et optrædende kor i en musikalsk eller dramatisk præsentation. @da
label: és agent director de cor de @ca
definition: Relaciona un agent amb una expressió que inclou una contribució d’un agent dirigint una coral en una representació musical o dramàtica. @ca
toolkit label: agent director de cor de @ca
toolkit definition: Expressió que inclou una contribució d’un agent dirigint una coral en una representació musical o dramàtica. @ca
definition: Liittää toimijan ekspressioon, jonka tekemiseen toimija osallistuu johtamalla kuoroa musiikki- tai näytelmäesityksessä.
toolkit label: kuoronjohtaja (toimija) ekspressiossa
toolkit definition: Ekspressio, jonka tekemiseen toimija osallistuu johtamalla kuoroa musiikki- tai näytelmäesityksessä.
toolkit label: kordirigent for (agent) @no
toolkit definition: Et uttrykk som inkluderer et bidrag fra en agent i form av å lede et kor i en musikalsk eller dramatisk forestilling. @no
label: ist Akteur als Chorleiterin/Chorleiter von @de
label: est un agent chef de chœur de @fr
definition: Met un agent en relation avec une expression qui intègre une contribution de la part d’un agent consistant à diriger un groupe de choristes dans une présentation musicale ou dramatique. @fr
toolkit label: agent chef de chœur de @fr
toolkit definition: Expression qui intègre une contribution de la part d’un agent consistant à diriger un groupe de choristes dans une présentation musicale ou dramatique. @fr
has element type: 2
label: kórusvezető ágense a következőnek: @hu
definition: Hozzákapcsol egy ágenst egy kifejezési formához, amely magában foglalja egy zenei vagy drámai bemutatóban énekkari előadó csoportot vezető ágens közreműködését. @hu
toolkit label: kórusvezető ágense: @hu
toolkit definition: Egy kifejezési forma, amely magában foglalja egy zenei vagy drámai bemutatóban énekkari előadó csoportot vezető ágens közreműködését. @hu
alternative label: choral conductor of @en
alternative label: kuoronjohtajana ekspressiossa
label: er kordirigent for (agent) @no
definition: Relaterer en agent til et uttrykk som inkluderer et bidrag fra en agent i form av å lede et kor i en musikalsk eller dramatisk forestilling. @no
alternative label: kordirigent for @no
label: is koordirigent-actor van @nl
definition: Relateert een actor aan een expressie die omvat een bijdrage door een actor door leiden van een optredende koorgroep in een muzikale of dramatische presentatie. @nl
toolkit label: koordirigent-actor van @nl
toolkit definition: Een expressie die omvat een bijdrage door een actor door leiden van een optredende koorgroep in een muzikale of dramatische presentatie. @nl
label: هو وكيل قائد كورال لـ @ar
definition: يربط وكيلا بتعبيرة تتضمن إسهام وكيل في قيادة فريق كورال في عرض موسيقي أو درامي. @ar
alternative label: قائد كورال @ar
toolkit label: وكيل قائد كورال @ar
toolkit definition: تعبيرة تتضمن إسهام وكيل في قيادة فريق كورال في عرض موسيقي أو درامي. @ar
alternative label: director de cor de @ca
alternative label: kordirigent af @da
label: koorijuht (tegija) väljenduses @et
definition: Seostab tegija väljendusega, millesse tegija on andnud panuse, juhatades koori muusika- või draamaetenduses. @et
alternative label: koorijuht väljenduses @et
toolkit label: koorijuht (tegija) väljenduses @et
toolkit definition: Väljendus, millesse tegija on andnud panuse, juhatades koori muusika- või draamaetenduses. @et
alternative label: kórusvezetője: @hu
label: è agente direttore agente di corale agente di @it
definition: Correla un agente a un'espressione che comprende un contributo da parte di un agente nel condurre e guidare un gruppo corale che si esibisce in una rappresentazione musicale o teatrale. @it
alternative label: diettore di corale di @it
toolkit label: direttore di corale agente di @it
toolkit definition: Espressione che comprende un contributo da parte di un agente nel condurre e guidare un gruppo corale che si esibisce in una rappresentazione musicale o teatrale. @it
alternative label: διευθυντής χορωδίας του @el
alternative label: chef de chœur de @fr
label: ir kordiriģents (aģents) @lv
definition: Sasaista aģentu ar izteiksmi, kas ietver aģenta ieguldījumu, diriģējot izpildītājmākslinieku grupu mūzikas vai dramatiskā uzvedumā. @lv
toolkit label: ir kordiriģents (aģents) @lv
toolkit definition: Izteiksme, kas ietver aģenta ieguldījumu, diriģējot izpildītājmākslinieku grupu mūzikas vai dramatiskā uzvedumā. @lv
alternative label: Chorleiter von @de
alternative label: ……的合唱指挥 @zh-hans
toolkit label: ……的合唱指挥行为者 @zh-hans
toolkit definition: 包括在音乐或戏剧呈现中领导一个合唱表演团体的一个行为者的贡献的一种内容表达 @zh-hans
toolkit label: koro şefi temsilcisi @tr
toolkit definition: Müzikal veya dramatik bir sunumda bir koro performans grubuna liderlik eden bir temsilcinin katkısını içeren bir anlatım. @tr
has subproperty: kuoronjohtaja (yhteistoimija) ekspressiossa

kuoronjohtaja (yhteistoimija) ekspressiossa
status: Published
label: is choral conductor collective agent of @en
lexical alias: choralConductorCollectiveAgentOf.en
definition: Relates a collective agent to an expression that includes a contribution by a collective agent of leading a choral performing group in a musical or dramatic presentation. @en
toolkit label: choral conductor collective agent of @en
toolkit definition: An expression that includes a contribution by a collective agent of leading a choral performing group in a musical or dramatic presentation. @en
type: Property
domain: C10011
has element type: 2
sub property of: johtaja (yhteistoimija) ekspressiossa
sub property of: kuoronjohtaja (toimija) ekspressiossa
definition: Liittää yhteistoimijan ekspressioon, jonka tekemisessä yhteistoimija on osallisena johtamalla kuoroa musiikki- tai näytelmäesityksessä.
toolkit label: kuoronjohtaja (yhteistoimija) ekspressiossa
toolkit definition: Ekspressio, jonka tekemisessä yhteistoimija on osallisena johtamalla kuoroa musiikki- tai näytelmäesityksessä.
label: er kordirigent for (kollektiv agent) @no
definition: Relaterer en kollektiv agent til et uttrykk som inkluderer et bidrag fra en kollektiv agent i form av ledelse av et kor i en musikalsk eller dramatisk forestilling. @no
toolkit label: kordirigent for (kollektiv agent) @no
toolkit definition: Et uttrykk som inkluderer et bidrag fra en kollektiv agent i form av ledelse av et kor i en musikalsk eller dramatisk forestilling. @no
label: is koordirigent-collectieve actor van @nl
definition: Relateert een collectieve actor aan een expressie die omvat een bijdrage door een collectieve actor door leiden van een optredende koorgroep in een muzikale of dramatische presentatie. @nl
toolkit label: koordirigent-collectieve actor van @nl
toolkit definition: Een expressie die omvat een bijdrage door een collectieve actor door leiden van een optredende koorgroep in een muzikale of dramatische presentatie. @nl
label: هو وكيل جماعي قائد كورال لـ @ar
definition: يربط وكيلا جماعيا بتعبيرة تتضمن إسهام وكيل جماعي في قيادة فريق كورال في عرض موسيقي أو درامي. @ar
toolkit label: وكيل جماعي قائد كورال @ar
toolkit definition: تعبيرة تتضمن إسهام وكيل جماعي في قيادة فريق كورال في عرض موسيقي أو درامي. @ar
label: és agent col·lectiu director de cor de @ca
definition: Relaciona un agent col·lectiu amb una expressió que inclou una contribució d’un agent col·lectiu dirigint una coral en una representació musical o dramàtica. @ca
toolkit label: agent col·lectiu director de cor de @ca
toolkit definition: Expressió que inclou una contribució d’un agent col·lectiu dirigint una coral en una representació musical o dramàtica. @ca
label: er kollektiv agent, som er kordirigent af @da
definition: Relaterer en kollektiv agent til et udtryk, som omfatter en kollektiv agents bidrag ved at lede et optrædende kor i en musikalsk eller dramatisk præsentation. @da
toolkit label: kollektiv agent, som er kordirigent af @da
toolkit definition: Udtryk, som omfatter en kollektiv agents bidrag ved at lede et optrædende kor i en musikalsk eller dramatisk præsentation. @da
label: koorijuht (kollektiiv) väljenduses @et
definition: Seostab kollektiivi väljendusega, millesse kollektiiv on andnud panuse, juhatades koori muusika- või draamaetenduses @et
toolkit label: koorijuht (kollektiiv) väljenduses @et
toolkit definition: Väljendus, millesse kollektiiv on andnud panuse, juhatades koori muusika- või draamaetenduses @et
label: ist gemeinschaftlicher Akteur als Chorleiterin/Chorleiter von @de
definition: Setzt einen gemeinschaftlichen Akteur in Beziehung zu einer Expression, zu der ein gemeinschaftlicher Akteur beiträgt, indem er einen Chor in einer musikalischen oder dramatischen Darbietung leitet. @de
toolkit label: Gemeinschaftlicher Akteur als Chorleiterin/Chorleiter von @de
toolkit definition: Eine Expression, zu der ein gemeinschaftlicher Akteur beiträgt, indem er einen Chor in einer musikalischen oder dramatischen Darbietung leitet. @de
label: kórusvezető kollektív ágense a következőnek: @hu
definition: Hozzákapcsol egy kollektív ágenst egy kifejezési formához, amely magában foglalja egy zenei vagy drámai bemutatóban énekkari előadó csoportot vezető kollektív ágens közreműködését. @hu
toolkit label: kórusvezető kollektív ágense: @hu
toolkit definition: Egy kifejezési forma, amely magában foglalja egy zenei vagy drámai bemutatóban énekkari előadó csoportot vezető kollektív ágens közreműködését. @hu
label: è direttore di coro agente collettivo di @it
definition: Correla un agente collettivo a un'espressione che comprende un contributo di un agente collettivo nella direzione di un gruppo di esecuzione corale in una presentazione musicale o drammatica. @it
toolkit label: direttore di coro agente collettivo di @it
toolkit definition: Espressione che comprende un contributo di un agente collettivo nella direzione di un gruppo di esecuzione corale in una presentazione musicale o drammatica. @it
label: είναι διευθυντής χορωδίας συλλογικός φορέας του @el
toolkit label: διευθυντής χορωδίας συλλογικός φορέας του @el
label: est un agent collectif chef de chœur de @fr
definition: Met un agent collectif en relation avec une expression qui intègre une contribution de la part d’un agent collectif consistant à diriger un groupe de choristes dans une présentation musicale ou dramatique. @fr
toolkit label: agent collectif chef de chœur de @fr
toolkit definition: Expression qui intègre une contribution de la part d’un agent collectif consistant à diriger un groupe de choristes dans une présentation musicale ou dramatique. @fr
label: ir kordiriģents (grupa) @lv
definition: Sasaista grupu ar izteiksmi, kas ietver grupas ieguldījumu, diriģējot izpildītājmākslinieku grupu mūzikas vai dramatiskā uzvedumā. @lv
toolkit label: ir kordiriģents (grupa) @lv
toolkit definition: Izteiksme, kas ietver grupas ieguldījumu, diriģējot izpildītājmākslinieku grupu mūzikas vai dramatiskā uzvedumā. @lv
label: 是……的合唱指挥集体行为者 @zh-hans
definition: 将一个集体行为者与包括在音乐或戏剧呈现中领导一个合唱表演团体的一个集体行为者的贡献的一种内容表达关联起来。 @zh-hans
toolkit label: ……的合唱指挥集体行为者 @zh-hans
toolkit definition: 包括在音乐或戏剧呈现中领导一个合唱表演团体的一个集体行为者的贡献的一种内容表达 @zh-hans
label: koro şefi kolektif temsilcisidir @tr
definition: Kolektif bir temsilciyi, müzikal veya drama gösteriminde bir koro performans grubuna liderlik eden bir kolektif temsilcinin katkısını içeren anlatım ile ilişkilendirir. @tr
toolkit label: koro şefi kolektif temsilcisi @tr
toolkit definition: Müzikal veya dramatik bir gösteride, bir koro performans grubuna liderlik eden kolektif bir temsilcinin katkısını içeren bir anlatım. @tr
has subproperty: kuoronjohtaja (yhteisö) ekspressiossa
has subproperty: kuoronjohtaja (suku) ekspressiossa
has subproperty: P50740

kuoronjohtaja (yhteisö) ekspressiossa
status: Published
label: is choral conductor corporate body of @en
lexical alias: choralConductorCorporateBodyOf.en
definition: Relates a corporate body to an expression that includes a contribution by a corporate body of leading a choral performing group in a musical or dramatic presentation. @en
toolkit label: choral conductor corporate body of @en
toolkit definition: An expression that includes a contribution by a corporate body of leading a choral performing group in a musical or dramatic presentation. @en
type: Property
domain: C10005
has element type: 2
sub property of: johtaja (yhteisö) ekspressiossa
sub property of: kuoronjohtaja (yhteistoimija) ekspressiossa
definition: Liittää yhteisön ekspressioon, jonka tekemisessä yhteisö on osallisena johtamalla kuoroa musiikki- tai näytelmäesityksessä.
toolkit label: kuoronjohtaja (yhteisö) ekspressiossa
toolkit definition: Ekspressio, jonka tekemisessä yhteisö on osallisena johtamalla kuoroa musiikki- tai näytelmäesityksessä.
label: er kordirigent for (korporasjon) @no
definition: Relaterer en korporasjon til et uttrykk som inkluderer et bidrag fra en korporasjon i form av ledelse av et kor i en musikalsk eller dramatisk forestilling. @no
toolkit label: kordirigent for (korporasjon) @no
toolkit definition: Et uttrykk som inkluderer et bidrag fra en korporasjon i form av ledelse av et kor i en musikalsk eller dramatisk forestilling. @no
label: is koordirigent-corporatie van @nl
definition: Relateert een corporatie aan een expressie die omvat een bijdrage door een corporatie door leiden van een optredende koorgroep in een muzikale of dramatische presentatie. @nl
toolkit label: koordirigent-corporatie van @nl
toolkit definition: Een expressie die omvat een bijdrage door een corporatie door leiden van een optredende koorgroep in een muzikale of dramatische presentatie. @nl
label: هي هيئة قائد كورال لـ @ar
definition: يربط هيئة بتعبيرة تتضمن إسهام هيئة في قيادة فريق كورال في عرض موسيقي أو درامي. @ar
toolkit label: هيئة قائد كورال @ar
toolkit definition: تعبيرة تتضمن إسهام هيئة في قيادة فريق كورال في عرض موسيقي أو درامي. @ar
label: és entitat corporativa directora de cor de @ca
definition: Relaciona una entitat corporativa amb una expressió que inclou una contribució d’una entitat corporativa dirigint una coral en una representació musical o dramàtica. @ca
toolkit label: entitat corporativa directora de cor de @ca
toolkit definition: Expressió que inclou una contribució d’una entitat corporativa dirigint una coral en una representació musical o dramàtica. @ca
label: er korporation, som er kordirigent af @da
definition: Relaterer en korporation til et udtryk, som omfatter en korporations bidrag ved at lede et optrædende kor i en musikalsk eller dramatisk præsentation. @da
toolkit label: korporation, som er kordirigent af @da
toolkit definition: Udtryk, som omfatter en korporations bidrag ved at lede et optrædende kor i en musikalsk eller dramatisk præsentation. @da
label: koorijuht (asutus) väljenduses @et
definition: Seostab asutuse väljendusega, millesse asutus on andnud panuse, juhatades koori muusika- või draamaetenduses @et
toolkit label: koorijuht (asutus) väljenduses @et
toolkit definition: Väljendus, millesse asutus on andnud panuse, juhatades koori muusika- või draamaetenduses @et
label: ist Körperschaft als Chorleiterin/Chorleiter von @de
definition: Setzt eine Körperschaft in Beziehung zu einer Expression, zu der eine Körperschaft beiträgt, indem sie einen Chor in einer musikalischen oder dramatischen Darbietung leitet. @de
toolkit label: Körperschaft als Chorleiterin/Chorleiter von @de
toolkit definition: Eine Expression, zu der eine Körperschaft beiträgt, indem sie einen Chor in einer musikalischen oder dramatischen Darbietung leitet. @de
label: kórusvezető testülete a következőnek: @hu
definition: Hozzákapcsol egy testületet egy kifejezési formához, amely magában foglalja egy zenei vagy drámai bemutatóban énekkari előadó csoportot vezető testület közreműködését. @hu
toolkit label: kórusvezető testülete: @hu
toolkit definition: Egy kifejezési forma, amely magában foglalja egy zenei vagy drámai bemutatóban énekkari előadó csoportot vezető testület közreműködését. @hu
label: è direttore del coro ente di @it
definition: Correla un ente a un'espressione che include un contributo di un ente nella direzione di un gruppo di esecuzione corale in una presentazione musicale o drammatica. @it
toolkit label: direttore del coro ente di @it
toolkit definition: Espressione che include un contributo di un ente nella direzione di un gruppo di esecuzione corale in una presentazione musicale o drammatica. @it
label: είναι διευθυντής χορωδίας συλλογικό όργανο του @el
toolkit label: διευθυντής χορωδίας συλλογικό όργανο του @el
label: est une collectivité chef de chœur de @fr
definition: Met une collectivité en relation avec une expression qui intègre une contribution de la part d’une collectivité consistant à diriger un groupe de choristes dans une présentation musicale ou dramatique. @fr
toolkit label: collectivité chef de chœur de @fr
toolkit definition: Expression qui intègre une contribution de la part d’une collectivité consistant à diriger un groupe de choristes dans une présentation musicale ou dramatique. @fr
label: ir kordiriģents (institūcija) @lv
definition: Sasaista institūciju ar izteiksmi, kas ietver institūcijas ieguldījumu, diriģējot izpildītājmākslinieku grupu mūzikas vai dramatiskā uzvedumā. @lv
toolkit label: ir kordiriģents (institūcija) @lv
toolkit definition: Izteiksme, kas ietver institūcijas ieguldījumu, diriģējot izpildītājmākslinieku grupu mūzikas vai dramatiskā uzvedumā. @lv
label: 是……的合唱指挥团体 @zh-hans
definition: 将一个团体与包括在音乐或戏剧呈现中领导一个合唱表演团体的一个团体的贡献的一种内容表达关联起来。 @zh-hans
toolkit label: ……的合唱指挥团体 @zh-hans
toolkit definition: 包括在音乐或戏剧呈现中领导一个合唱表演团体的一个团体的贡献的一种内容表达 @zh-hans
label: koro şefi tüzel kişisidir @tr
definition: Bir tüzel kişiyi müzikal veya dramatik bir sunumda bir koro icra grubuna liderlik etme konusunda bir tüzel kişinin yaptığı katkıyı içeren bir anlatımla ilişkilendirir. @tr
toolkit label: Koro şefi tüzel kişisi @tr
toolkit definition: Bir müzikal veya dramatik sunumda bir koro performans grubuna liderlik eden tüzel bir kişinin katkısını içeren bir anlatım. @tr
has subproperty: P50891

kuoronjohtaja (suku) ekspressiossa
status: Published
label: is choral conductor family of @en
lexical alias: choralConductorFamilyOf.en
definition: Relates a family to an expression that includes a contribution by a family of leading a choral performing group in a musical or dramatic presentation. @en
toolkit label: choral conductor family of @en
toolkit definition: An expression that includes a contribution by a family of leading a choral performing group in a musical or dramatic presentation. @en
type: Property
domain: C10008
has element type: 2
sub property of: johtaja (suku) ekspressiossa
sub property of: kuoronjohtaja (yhteistoimija) ekspressiossa
definition: Liittää suvun ekspressioon, jonka tekemisessä suku on osallisena johtamalla kuoroa musiikki- tai näytelmäesityksessä.
toolkit label: kuoronjohtaja (suku) ekspressiossa
toolkit definition: Ekspressio, jonka tekemisessä suku on osallisena johtamalla kuoroa musiikki- tai näytelmäesityksessä.
label: er kordirigent for (familie) @no
definition: Relaterer en familie til et uttrykk som inkluderer et bidrag fra en familie i form av ledelse av et kor i en musikalsk eller dramatisk forestilling. @no
toolkit label: kordirigent for (familie) @no
toolkit definition: Et uttrykk som inkluderer et bidrag fra en familie i form av ledelse av et kor i en musikalsk eller dramatisk forestilling. @no
label: is koordirigent-familie van @nl
definition: Relateert een familie aan een expressie die omvat een bijdrage door een familie door leiden van een optredende koorgroep in een muzikale of dramatische presentatie. @nl
toolkit label: koordirigent-familie van @nl
toolkit definition: Een expressie die omvat een bijdrage door een familie door leiden van een optredende koorgroep in een muzikale of dramatische presentatie. @nl
label: هي عائلة تقود كورال لـ @ar
definition: يربط عائلة بتعبيرة تتضمن إسهام عائلة في قيادة فريق كورال في عرض موسيقي أو درامي. @ar
toolkit label: عائلة تقود كورال @ar
toolkit definition: تعبيرة تتضمن إسهام عائلة في قيادة فريق كورال في عرض موسيقي أو درامي. @ar
label: és família directora de cor de @ca
definition: Relaciona una família amb una expressió que inclou una contribució d’una família dirigint una coral en una representació musical o dramàtica. @ca
toolkit label: família directora de cor de @ca
toolkit definition: Expressió que inclou una contribució d’una família dirigint una coral en una representació musical o dramàtica. @ca
label: er familie, som er kordirigent af @da
definition: Relaterer en familie til et udtryk, som omfatter en families bidrag ved at lede et optrædende kor i en musikalsk eller dramatisk præsentation. @da
toolkit label: familie, som er kordirigent af @da
toolkit definition: Udtryk, som omfatter en families bidrag ved at lede et optrædende kor i en musikalsk eller dramatisk præsentation. @da
label: koorijuht (perekond) väljenduses @et
definition: Seostab perekonna väljendusega, millesse perekond on andnud panuse, juhatades koori muusika- või draamaetenduses @et
toolkit label: koorijuht (perekond) väljenduses @et
toolkit definition: Väljendus, millesse perekond on andnud panuse, juhatades koori muusika- või draamaetenduses @et
label: ist Familie als Chorleiterin/Chorleiter von @de
definition: Setzt eine Familie in Beziehung zu einer Expression, zu der eine Familie beiträgt, indem sie einen Chor in einer musikalischen oder dramatischen Darbietung leitet. @de
toolkit label: Familie als Chorleiterin/Chorleiter von @de
toolkit definition: Eine Expression, zu der eine Familie beiträgt, indem sie einen Chor in einer musikalischen oder dramatischen Darbietung leitet. @de
label: kórusvezető családja a következőnek: @hu
definition: Hozzákapcsol egy családot egy kifejezési formához, amely magában foglalja egy zenei vagy drámai bemutatóban énekkari előadó csoportot vezető család közreműködését. @hu
toolkit label: kórusvezető családja: @hu
toolkit definition: Egy kifejezési forma, amely magában foglalja egy zenei vagy drámai bemutatóban énekkari előadó csoportot vezető család közreműködését. @hu
label: è direttore del coro famiglia di @it
definition: Correla una famiglia a un'espressione che comprende un contributo di una famiglia nella direzione di un gruppo di esecuzione corale in una presentazione musicale o drammatica. @it
toolkit label: direttore del coro famiglia di @it
toolkit definition: Espressione che comprende un contributo di una famiglia nella direzione di un gruppo di esecuzione corale in una presentazione musicale o drammatica. @it
label: είναι διευθυντής χορωδίας οικογένεια του @el
toolkit label: διευθυντής χορωδίας οικογένεια του @el
label: est une famille chef de chœur de @fr
definition: Met une famille en relation avec une expression qui intègre une contribution de la part d’une famille consistant à diriger un groupe de choristes dans une présentation musicale ou dramatique. @fr
toolkit label: famille chef de chœur de @fr
toolkit definition: Expression qui intègre une contribution de la part d’une famille consistant à diriger un groupe de choristes dans une présentation musicale ou dramatique. @fr
label: ir kordiriģents (dzimta/ģimene) @lv
definition: Sasaista dzimtu/ģimeni ar izteiksmi, kas ietver dzimtas/ģimenes ieguldījumu, diriģējot izpildītājmākslinieku grupu mūzikas vai dramatiskā uzvedumā. @lv
toolkit label: ir kordiriģents (dzimta/ģimene) @lv
toolkit definition: Izteiksme, kas ietver dzimtas/ģimenes ieguldījumu, diriģējot izpildītājmākslinieku grupu mūzikas vai dramatiskā uzvedumā. @lv
label: 是……的合唱指挥家族 @zh-hans
definition: 将一个家族与包括在音乐或戏剧呈现中领导一个合唱表演团体的一个家族的贡献的一种内容表达关联起来。 @zh-hans
toolkit label: ……的合唱指挥家族 @zh-hans
toolkit definition: 包括在音乐或戏剧呈现中领导一个合唱表演团体的一个家族的贡献的一种内容表达 @zh-hans
label: koro şefi ailesidir @tr
definition: Bir aileyi, müzikal veya dramatik bir sunumda bir koro performans grubuna liderlik eden bir ailenin katkısını içeren bir anlatımla ilişkilendirir. @tr
toolkit label: koro şefi ailesi @tr
toolkit definition: Müzikal veya dramatik bir sunumda bir koro performans grubuna liderlik eden bir ailenin katkısını içeren bir anlatım. @tr
has subproperty: P51042

kuoronjohtaja (henkilö) ekspressiossa
status: Published
label: is choral conductor person of @en
lexical alias: choralConductorPersonOf.en
definition: Relates a person to an expression that includes a contribution by a person of leading a choral performing group in a musical or dramatic presentation. @en
toolkit label: choral conductor person of @en
toolkit definition: An expression that includes a contribution by a person of leading a choral performing group in a musical or dramatic presentation. @en
type: Property
domain: C10004
has element type: 2
sub property of: johtaja (henkilö) ekspressiossa
sub property of: kuoronjohtaja (toimija) ekspressiossa
definition: Liittää henkilön ekspressioon, jonka tekemisessä henkilö on osallisena johtamalla kuoroa musiikki- tai näytelmäesityksessä.
toolkit label: kuoronjohtaja (henkilö) ekspressiossa
toolkit definition: Ekspressio, jonka tekemisessä henkilö on osallisena johtamalla kuoroa musiikki- tai näytelmäesityksessä.
label: er kordirigent for (person) @no
definition: Relaterer en person til et uttrykk som inkluderer et bidrag fra en person i form av ledelse av et kor i en musikalsk eller dramatisk forestilling. @no
toolkit label: kordirigent for (person) @no
toolkit definition: Et uttrykk som inkluderer et bidrag fra en person i form av ledelse av et kor i en musikalsk eller dramatisk forestilling. @no
label: is koordirigent-persoon van @nl
definition: Relateert een persoon aan een expressie die omvat een bijdrage door een persoon door leiden van een optredende koorgroep in een muzikale of dramatische presentatie. @nl
toolkit label: koordirigent-persoon van @nl
toolkit definition: Een expressie die omvat een bijdrage door een persoon door leiden van een optredende koorgroep in een muzikale of dramatische presentatie. @nl
label: هو شخص قائد كورال لـ @ar
definition: يربط شخصا بتعبيرة تتضمن إسهام شخص في قيادة فريق كورال في عرض موسيقي أو درامي. @ar
toolkit label: شخص قائد كورال @ar
toolkit definition: تعبيرة تتضمن إسهام شخص في قيادة فريق كورال في عرض موسيقي أو درامي. @ar
label: és persona directora de cor de @ca
definition: Relaciona una persona amb una expressió que inclou una contribució d’una persona dirigint una coral en una representació musical o dramàtica. @ca
toolkit label: persona directora de cor de @ca
toolkit definition: Expressió que inclou una contribució d’una persona dirigint una coral en una representació musical o dramàtica. @ca
label: er person, som er kordirigent af @da
definition: Relaterer en person til et udtryk, som omfatter en persons bidrag ved at lede et optrædende kor i en musikalsk eller dramatisk præsentation. @da
toolkit label: person, som er kordirigent af @da
toolkit definition: Udtryk, som omfatter en persons bidrag ved at lede et optrædende kor i en musikalsk eller dramatisk præsentation. @da
label: koorijuht (isik) väljenduses @et
definition: Seostab isiku väljendusega, millesse isik on andnud panuse, juhatades koori muusika- või draamaetenduses @et
toolkit label: koorijuht (isik) väljenduses @et
toolkit definition: Väljendus, millesse isik on andnud panuse, juhatades koori muusika- või draamaetenduses @et
label: ist Person als Chorleiterin/Chorleiter von @de
definition: Setzt eine Person in Beziehung zu einer Expression, zu der eine Person beiträgt, indem sie einen Chor in einer musikalischen oder dramatischen Darbietung leitet. @de
toolkit label: Person als Chorleiterin/Chorleiter von @de
toolkit definition: Eine Expression, zu der eine Person beiträgt, indem sie einen Chor in einer musikalischen oder dramatischen Darbietung leitet. @de
label: kórusvezető személye a következőnek: @hu
definition: Hozzákapcsol egy személyt egy kifejezési formához, amely magában foglalja egy zenei vagy drámai bemutatóban énekkari előadó csoportot vezető személy közreműködését. @hu
toolkit label: kórusvezető személye: @hu
toolkit definition: Egy kifejezési forma, amely magában foglalja egy zenei vagy drámai bemutatóban énekkari előadó csoportot vezető személy közreműködését. @hu
label: è direttore di coro persona di @it
definition: Correla una persona a un'espressione che comprende un contributo di una persona nella direzione di un gruppo di esecuzione corale in una presentazione musicale o drammatica. @it
toolkit label: direttore di coro persona di @it
toolkit definition: Espressione che comprende un contributo di una persona nella direzione di un gruppo di esecuzione corale in una presentazione musicale o drammatica. @it
label: είναι διευθυντής χορωδίας φυσικό πρόσωπο του @el
toolkit label: διευθυντής χορωδίας φυσικό πρόσωπο του @el
label: est une personne chef de chœur de @fr
definition: Met une personne en relation avec une expression qui intègre une contribution de la part d’une personne consistant à diriger un groupe de choristes dans une présentation musicale ou dramatique. @fr
toolkit label: personne chef de chœur de @fr
toolkit definition: Expression qui intègre une contribution de la part d’une personne consistant à diriger un groupe de choristes dans une présentation musicale ou dramatique. @fr
label: ir kordiriģents (persona) @lv
definition: Sasaista personu ar izteiksmi, kas ietver personas ieguldījumu, diriģējot izpildītājmākslinieku grupu mūzikas vai dramatiskā uzvedumā. @lv
toolkit label: ir kordiriģents (persona) @lv
toolkit definition: Izteiksme, kas ietver personas ieguldījumu, diriģējot izpildītājmākslinieku grupu mūzikas vai dramatiskā uzvedumā. @lv
label: 是……的合唱指挥个人 @zh-hans
definition: 将一个个人与包括在音乐或戏剧呈现中领导一个合唱表演团体的一个个人的贡献的一种内容表达关联起来。 @zh-hans
toolkit label: ……的合唱指挥个人 @zh-hans
toolkit definition: 包括在音乐或戏剧呈现中领导一个合唱表演团体的一个个人的贡献的一种内容表达 @zh-hans
label: koro şefi kişisidir @tr
definition: Bir kişiyi, müzikal veya dramatik bir sunumda bir koro icra grubuna liderlik eden bir kişinin katkısını içeren bir anlatımla ilişkilendirir. @tr
toolkit label: koro şefi @tr
toolkit definition: Müzikal veya dramatik bir sunumda bir koro performans grubuna liderlik eden bir kişinin katkısını içeren bir anlatım. @tr
has subproperty: P50589

koreografi (toimija) teoksessa
status: Published
label: is choreographer agent of @en
definition: Relates an agent to a work that involves a responsibility of an agent for creating a choreographic work. @en
type: Property
domain: C10002
sub property of: teoksen tekijä (toimija) teoksessa
lexical alias: choreographerAgentOf.en
label: est un agent chorégraphe de @fr
definition: Met un agent en relation avec une œuvre qui comporte une responsabilité de la part d’un agent consistant à créer une œuvre chorégraphique. @fr
toolkit label: agent chorégraphe de @fr
toolkit definition: Œuvre qui comporte une responsabilité de la part d’un agent consistant à créer une œuvre chorégraphique. @fr
toolkit label: choreographer agent of @en
toolkit definition: A work that involves a responsibility of an agent for creating a choreographic work. @en
instruction number: 18.5
label: είναι χορογράφος φορέας του @el
definition: Συνδέει έναν φορέα υπεύθυνο για τη δημιουργία ενός έργου κίνησης, με ένα έργο. @el
toolkit label: χορογράφος φορέας του @el
toolkit definition: Ένα έργο κίνησης που περιλαμβάνει την ευθύνη της δημιουργίας του. @el
definition: Setzt einen Akteur in Beziehung zu einem Werk, bei dem ein Akteur für die Schaffung eines choreografischen Werks verantwortlich ist. @de
toolkit label: Akteur als Choreografin/Choreograf von @de
toolkit definition: Ein Werk, bei dem ein Akteur für die Schaffung eines choreografischen Werks verantwortlich ist. @de
label: er agent, som er koreograf af @da
definition: Relaterer en agent til et værk, som involverer en agents ansvar for at skabe et koreografisk værk. @da
toolkit label: agent, som er koreograf af @da
toolkit definition: Værk, som involverer en agents ansvar for at skabe et koreografisk værk. @da
label: és agent coreògraf de @ca
definition: Relaciona un agent amb una obra que implica una responsabilitat d’un agent en la creació d’una obra coreogràfica. @ca
toolkit label: agent coreògraf de @ca
toolkit definition: Obra que implica una responsabilitat d’un agent en la creació d’una obra coreogràfica. @ca
definition: Liittää toimijan teokseen, joka on koreografinen teos, jonka luomisesta toimija on vastuussa.
toolkit label: koreografi (toimija) teoksessa
toolkit definition: Teos, joka on koreografinen teos, jonka luomisesta toimjia on vastuussa.
toolkit label: koreograf for (agent) @no
toolkit definition: Et koreografisk verk som involverer ansvar for en agent i form av koreografi. @no
label: ist Akteur als Choreografin/Choreograf von @de
has element type: 2
label: koreográfus ágense a következőnek: @hu
definition: Hozzákapcsol egy ágenst egy műhöz, amelyhez hozzátartozik egy ágens felelőssége egy koreografikus mű létrehozásáért. @hu
toolkit label: koreográfus ágense: @hu
toolkit definition: Egy mű, amelyhez hozzátartozik egy ágens felelőssége egy koreografikus mű létrehozásáért. @hu
alternative label: choreographer of @en
alternative label: koreografina koreografiassa
label: er koreograf for (agent) @no
definition: Relaterer en agent til et koreografisk verk som involverer ansvar for en agent i form av koreografi. @no
alternative label: koreograf for verk for @no
label: is choreograaf-actor van @nl
definition: Relateert een actor aan een werk dat met zich meebrengt een verantwoordelijkheid van een actor voor het creëren van een choreografisch werk. @nl
toolkit label: choreograaf-actor van @nl
toolkit definition: Een werk dat met zich meebrengt een verantwoordelijkheid van een actor voor het creëren van een choreografisch werk. @nl
label: هو وكيل مصمم رقصات لـ @ar
definition: يربط وكيلا بعمل راقص يترتب عليه مسئولية وكيل عن وضع الألحان الراقصة. @ar
alternative label: واضع الألحان الراقصة لـ @ar
toolkit label: وكيل مصمم رقصات لـ @ar
toolkit definition: عمل راقص يترتب عليه مسئولية وكيل عن وضع الألحان الراقصة. @ar
alternative label: coreògraf de @ca
alternative label: koreograf af @da
label: koreograaf (tegija) teoses @et
definition: Seostab tegija koreograafilise teosega, mis sisaldab tegija vastutust koreograafia eest. @et
alternative label: koreograaf teoses @et
toolkit label: koreograaf (tegija) teoses @et
toolkit definition: Koreograafiline teos, mis sisaldab tegija vastutust koreograafia eest. @et
alternative label: koreográfusa: @hu
label: è coreografo agente di @it
definition: Correla un agente a un'opera coreografica che implica la responsabilità di un agente per la coreografia. @it
alternative label: coreografo di opera di @it
toolkit label: coreografo agente di @it
toolkit definition: Opera coreografica che implica la responsabilità di un agente per la coreografia. @it
alternative label: χορογράφος του έργου του @el
alternative label: chorégraphe de @fr
label: ir horeogrāfs (aģents) @lv
definition: Sasaista aģentu ar horeogrāfijas darbu, kas ietver aģenta atbildību par horeogrāfiju. @lv
toolkit label: ir horeogrāfs (aģents) @lv
toolkit definition: Horeogrāfisks darbs, kas ietver aģenta atbildību par horeogrāfiju. @lv
alternative label: Choreograf von @de
alternative label: ……的编舞者 @zh-hans
toolkit label: ……的编舞者行为者 @zh-hans
toolkit definition: 涉及创作编舞作品的一个行为者的责任的一种作品 @zh-hans
toolkit label: koreograf temsilcisi @tr
toolkit definition: Koreografik bir eser oluşturmak için bir temsilcinin sorumluluğunu içeren bir eser. @tr
has subproperty: koreografi (yhteistoimija) teoksessa

koreografi (yhteistoimija) teoksessa
status: Published
label: is choreographer collective agent of @en
lexical alias: choreographerCollectiveAgentOf.en
definition: Relates a collective agent to a work that involves a responsibility of a collective agent for creating a choreographic work. @en
toolkit label: choreographer collective agent of @en
toolkit definition: A work that involves a responsibility of a collective agent for creating a choreographic work. @en
type: Property
domain: C10011
has element type: 2
sub property of: teoksen tekijä (yhteistoimija) teoksessa
sub property of: koreografi (toimija) teoksessa
definition: Liittää toimijan teokseen, joka on koreografinen teos, jonka luomisesta yhteistoimija on vastuussa.
toolkit label: koreografi (yhteistoimija) teoksessa
toolkit definition: Teos, joka on koreografinen teos, jonka luomisesta yhteistoimija on vastuussa.
label: er koreograf for (kollektiv agent) @no
definition: Relaterer en kollektiv agent til et koreografisk verk som involverer et ansvar for en kollektiv agent i form av koreografi. @no
toolkit label: koreograf for (kollektiv agent) @no
toolkit definition: Et koreografisk verk som involverer et ansvar for en kollektiv agent i form av koreografi. @no
label: is choreograaf-collectieve actor van @nl
definition: Relateert een collectieve actor aan een werk dat met zich meebrengt een verantwoordelijkheid van een collectieve actor voor het creëren van een choreografisch werk. @nl
toolkit label: choreograaf-collectieve actor van @nl
toolkit definition: Een werk dat met zich meebrengt een verantwoordelijkheid van een collectieve actor voor het creëren van een choreografisch werk. @nl
label: هو وكيل جماعي مُصمم رقصات لـ @ar
definition: يربط وكيلا جماعيا بعمل راقص يترتب عليه مسئولية وكيل جماعي عن وضع الألحان الراقصة. @ar
toolkit label: وكيل جماعي مُصمم رقصات @ar
toolkit definition: عمل راقص يترتب عليه مسئولية وكيل جماعي عن وضع الألحان الراقصة. @ar
label: és agent col·lectiu coreògraf de @ca
definition: Relaciona un agent col·lectiu amb una obra que implica una responsabilitat d’un agent col·lectiu en la creació d’una obra coreogràfica. @ca
toolkit label: agent col·lectiu coreògraf de @ca
toolkit definition: Obra que implica una responsabilitat d’un agent col·lectiu en la creació d’una obra coreogràfica. @ca
label: er kollektiv agent, som er koreograf af @da
definition: Relaterer en kollektiv agent til et værk, som involverer en kollektiv agents ansvar for at skabe et koreografisk værk. @da
toolkit label: kollektiv agent, som er koreograf af @da
toolkit definition: Værk, som involverer en kollektiv agents ansvar for at skabe et koreografisk værk. @da
label: koreograaf (kollektiiv) teoses @et
definition: Seostab kollektiivi koreograafilise teosega, mis sisaldab kollektiivi vastutust koreograafia eest. @et
toolkit label: koreograaf (kollektiiv) teoses @et
toolkit definition: Koreograafiline teos, mis sisaldab kollektiivi vastutust koreograafia eest. @et
label: ist gemeinschaftlicher Akteur als Choreografin/Choreograf von @de
definition: Setzt einen gemeinschaftlichen Akteur in Beziehung zu einem Werk, bei dem ein gemeinschaftlicher Akteur für die Schaffung eines choreografischen Werks verantwortlich ist. @de
toolkit label: Gemeinschaftlicher Akteur als Choreografin/Choreograf von @de
toolkit definition: Ein Werk, bei dem ein gemeinschaftlicher Akteur für die Schaffung eines choreografischen Werks verantwortlich ist. @de
label: koreográfus kollektív ágense a következőnek: @hu
definition: Hozzákapcsol egy ágenst egy műhöz, amelyhez hozzátartozik egy kollektív ágens felelőssége egy koreografikus mű létrehozásáért. @hu
toolkit label: koreográfus kollektív ágense: @hu
toolkit definition: Egy mű, amelyhez hozzátartozik egy kollektív ágens felelőssége egy koreografikus mű létrehozásáért. @hu
label: è coreografo agente collettivo di @it
definition: Correla un agente collettivo a un'opera coreografica che implica una responsabilità di un agente collettivo per la coreografia. @it
toolkit label: coreografo agente collettivo di @it
toolkit definition: Opera coreografica che implica una responsabilità di un agente collettivo per la coreografia. @it
label: είναι χορογράφος συλλογικός φορέας του @el
toolkit label: χορογράφος συλλογικός φορέας του @el
label: est un agent collectif chorégraphe de @fr
definition: Met un agent collectif en relation avec une œuvre qui comporte une responsabilité de la part d’un agent collectif consistant à créer une œuvre chorégraphique. @fr
toolkit label: agent collectif chorégraphe de @fr
toolkit definition: Œuvre qui comporte une responsabilité de la part d’un agent collectif consistant à créer une œuvre chorégraphique. @fr
label: ir horeogrāfs (grupa) @lv
definition: Sasaista aģentu ar horeogrāfijas darbu, kas ietver grupas atbildību par horeogrāfiju. @lv
toolkit label: ir horeogrāfs (grupa) @lv
toolkit definition: Horeogrāfisks darbs, kas ietver grupas atbildību par horeogrāfiju. @lv
label: 是……的编舞者集体行为者 @zh-hans
definition: 将一个集体行为者与涉及创作编舞作品的一个集体行为者的责任的一种作品关联起来。 @zh-hans
toolkit label: ……的编舞者集体行为者 @zh-hans
toolkit definition: 涉及创作编舞作品的一个集体行为者的责任的一种作品 @zh-hans
label: koreograf kolektif temsilcisidir @tr
definition: Bir temsilciyi, kolektif bir temsilcinin koreografik bir eser oluşturma sorumluluğunu içeren bir eserle ilişkilendirir. @tr
toolkit label: koreograf kolektif temsilcisi @tr
toolkit definition: Bir koreografik eser yaratmak için kolektif bir temsilcinin sorumluluğunu içeren bir eser @tr
has subproperty: koreografi (yhteisö) teoksessa
has subproperty: koreografi (suku) teoksessa
has subproperty: P50643

koreografi (yhteisö) teoksessa
status: Published
label: is choreographer corporate body of @en
lexical alias: choreographerCorporateBodyOf.en
definition: Relates a corporate body to a work that involves a responsibility of a corporate body for creating a choreographic work. @en
toolkit label: choreographer corporate body of @en
toolkit definition: A work that involves a responsibility of a corporate body for creating a choreographic work. @en
type: Property
domain: C10005
has element type: 2
sub property of: teoksen tekijä (yhteisö) teoksessa
sub property of: koreografi (yhteistoimija) teoksessa
definition: Liittää toimijan teokseen, joka on koreografinen teos, jonka luomisesta yhteisö on vastuussa.
toolkit label: koreografi (yhteisö) teoksessa
toolkit definition: Teos, joka on koreografinen teos, jonka luomisesta yhteisö on vastuussa.
label: er koreograf for (korporasjon) @no
definition: Relaterer en korporasjon til et koreografisk verk som involverer et ansvar for en korporasjon i form av koreografi. @no
toolkit label: koreograf for (korporasjon) @no
toolkit definition: Et koreografisk verk som involverer et ansvar for en korporasjon i form av koreografi. @no
label: is choreograaf-corporatie van @nl
definition: Relateert een corporatie aan een werk dat met zich meebrengt een verantwoordelijkheid van een corporatie voor het creëren van een choreografisch werk. @nl
toolkit label: choreograaf-corporatie van @nl
toolkit definition: Een werk dat met zich meebrengt een verantwoordelijkheid van een corporatie voor het creëren van een choreografisch werk. @nl
label: هي هيئة مسئولة عن تصميم رقصات لـ @ar
definition: يربط هيئة بعمل راقص يترتب عليه مسئولية هيئة عن وضع الألحان الراقصة. @ar
toolkit label: هيئة مسئولة عن تصميم رقصات @ar
toolkit definition: عمل راقص يترتب عليه مسئولية هيئة عن وضع الألحان الراقصة. @ar
label: és entitat corporativa coreògrafa de @ca
definition: Relaciona una entitat corporativa amb una obra que implica una responsabilitat d’una entitat corporativa en la creació d'una obra coreogràfica. @ca
toolkit label: entitat corporativa coreògrafa de @ca
toolkit definition: Obra que implica una responsabilitat d’una entitat corporativa en la creació d'una obra coreogràfica. @ca
label: er korporation, som er koreograf af @da
definition: Relaterer en korporation til et værk, som involverer en korporations ansvar for at skabe et koreografisk værk. @da
toolkit label: korporation, som er koreograf af @da
toolkit definition: Værk, som involverer en korporations ansvar for at skabe et koreografisk værk. @da
label: koreograaf (asutus) teoses @et
definition: Seostab asutuse koreograafilise teosega, mis sisaldab asutuse vastutust koreograafia eest. @et
toolkit label: koreograaf (asutus) teoses @et
toolkit definition: Koreograafiline teos, mis sisaldab asutuse vastutust koreograafia eest. @et
label: ist Körperschaft als Choreografin/Choreograf von @de
definition: Setzt eine Körperschaft in Beziehung zu einem Werk, bei dem eine Körperschaft für die Schaffung eines choreografischen Werks verantwortlich ist. @de
toolkit label: Körperschaft als Choreografin/Choreograf von @de
toolkit definition: Ein Werk, bei dem eine Körperschaft für die Schaffung eines choreografischen Werks verantwortlich ist. @de
label: koreográfus testülete a következőnek: @hu
definition: Hozzákapcsol egy ágenst egy műhöz, amelyhez hozzátartozik egy testület felelőssége egy koreografikus mű létrehozásáért. @hu
toolkit label: koreográfus testülete: @hu
toolkit definition: Egy mű, amelyhez hozzátartozik egy testület felelőssége egy koreografikus mű létrehozásáért. @hu
label: è coreografo ente di @it
definition: Correla un ente a un'opera coreografica che implica la responsabilità di un ente per la coreografia. @it
toolkit label: coreografo ente di @it
toolkit definition: Opera coreografica che implica una responsabilità di un ente per la coreografia. @it
label: είναι χορογράφος συλλογικό όργανο του @el
toolkit label: χορογράφος συλλογικό όργανο του @el
label: est une collectivité chorégraphe de @fr
definition: Met une collectivité en relation avec une œuvre qui comporte une responsabilité de la part d’une collectivité consistant à créer une œuvre chorégraphique. @fr
toolkit label: collectivité chorégraphe de @fr
toolkit definition: Œuvre qui comporte une responsabilité de la part d’une collectivité consistant à créer une œuvre chorégraphique. @fr
label: ir horeogrāfs (institūcija) @lv
definition: Sasaista aģentu ar horeogrāfijas darbu, kas ietver institūcijas atbildību par horeogrāfiju. @lv
toolkit label: ir horeogrāfs (institūcija) @lv
toolkit definition: Horeogrāfisks darbs, kas ietver institūcijas atbildību par horeogrāfiju. @lv
label: 是……的编舞者团体 @zh-hans
definition: 将一个团体与涉及创作编舞作品的一个团体的责任的一种作品关联起来。 @zh-hans
toolkit label: ……的编舞者团体 @zh-hans
toolkit definition: 涉及创作编舞作品的一个团体的责任的一种作品 @zh-hans
label: koreograf tüzel kişisidir @tr
definition: Bir temsilciyi, tüzel bir kişinin koreografik bir eser oluşturma sorumluluğunu içeren bir eserle ilişkilendirir. @tr
toolkit label: koreograf tüzel kişisi @tr
toolkit definition: Koreografik bir eser oluşturmak için bir tüzel kişinin sorumluluğunu içeren bir eser. @tr
has subproperty: P50794

koreografi (suku) teoksessa
status: Published
label: is choreographer family of @en
lexical alias: choreographerFamilyOf.en
definition: Relates a family to a work that involves a responsibility of a family for creating a choreographic work. @en
toolkit label: choreographer family of @en
toolkit definition: A work that involves a responsibility of a family for creating a choreographic work. @en
type: Property
domain: C10008
has element type: 2
sub property of: teoksen tekijä (suku) teoksessa
sub property of: koreografi (yhteistoimija) teoksessa
definition: Liittää toimijan teokseen, joka on koreografinen teos, jonka luomisesta suku on vastuussa.
toolkit label: koreografi (suku) teoksessa
toolkit definition: Teos, joka on koreografinen teos, jonka luomisesta suku on vastuussa.
label: er koreograf for (familie) @no
definition: Relaterer en familie til et koreografisk verk som involverer et ansvar for en familie i form av koreografi. @no
toolkit label: koreograf for (familie) @no
toolkit definition: Et koreografisk verk som involverer et ansvar for en familie i form av koreografi. @no
label: is choreograaf-familie van @nl
definition: Relateert een familie aan een werk dat met zich meebrengt een verantwoordelijkheid van een familie voor het creëren van een choreografisch werk. @nl
toolkit label: choreograaf-familie van @nl
toolkit definition: Een werk dat met zich meebrengt een verantwoordelijkheid van een familie voor het creëren van een choreografisch werk. @nl
label: هي عائلة مسئولة عن وضع الألحان الرقصة لـ @ar
definition: يربط وكيل بعمل يترتب عليه مسئولية عائلة عن وضع الألحان الراقصة. @ar
toolkit label: عائلة مسئولة عن وضع الألحان الرقصة لـ @ar
toolkit definition: عمل راقص يترتب عليه مسئولية عائلة عن وضع الألحان الرقصة @ar
label: és família coreògrafa de @ca
definition: Relaciona una família amb una obra que implica una responsabilitat d’una família en la creació d’una obra coreogràfica. @ca
toolkit label: família coreògrafa de @ca
toolkit definition: Obra que implica una responsabilitat d’una família en la creació d’una obra coreogràfica. @ca
label: er familie, som er koreograf af @da
definition: Relaterer en familie til et værk, som involverer en families ansvar for at skabe et koreografisk værk. @da
toolkit label: familie, som er koreograf af @da
toolkit definition: Værk, som involverer en families ansvar for at skabe et koreografisk værk. @da
label: koreograaf (perekond) teoses @et
definition: Seostab perekonna koreograafilise teosega, mis sisaldab perekonna vastutust koreograafia eest. @et
toolkit label: koreograaf (perekond) teoses @et
toolkit definition: Koreograafiline teos, mis sisaldab perekonna vastutust koreograafia eest. @et
label: ist Familie als Choreografin/Choreograf von @de
definition: Setzt eine Familie in Beziehung zu einem Werk, bei dem eine Familie für die Schaffung eines choreografischen Werks verantwortlich ist. @de
toolkit label: Familie als Choreografin/Choreograf von @de
toolkit definition: Ein Werk, bei dem eine Familie für die Schaffung eines choreografischen Werks verantwortlich ist. @de
label: koreográfus családja a következőnek: @hu
definition: Hozzákapcsol egy ágenst egy műhöz, amelyhez hozzátartozik egy család felelőssége egy koreografikus mű létrehozásáért. @hu
toolkit label: koreográfus családja: @hu
toolkit definition: Egy mű, amelyhez hozzátartozik egy család felelőssége egy koreografikus mű létrehozásáért. @hu
label: è coreografo famiglia di @it
definition: Correla una famiglia a un'opera coreografica che implica una responsabilità di una famiglia per la coreografia. @it
toolkit label: coreografo famiglia di @it
toolkit definition: Opera coreografica che implica una responsabilità di una famiglia per la coreografia. @it
label: είναι χορογράφος οικογένεια του @el
toolkit label: χορογράφος οικογένεια του @el
label: est une famille chorégraphe de @fr
definition: Met une famille en relation avec une œuvre qui comporte une responsabilité de la part d’une famille consistant à créer une œuvre chorégraphique. @fr
toolkit label: famille chorégraphe de @fr
toolkit definition: Œuvre qui comporte une responsabilité de la part d’une famille consistant à créer une œuvre chorégraphique. @fr
label: ir horeogrāfs (dzimta/ģimene) @lv
definition: Sasaista aģentu ar horeogrāfijas darbu, kas ietver dzimtas/ģimenes atbildību par horeogrāfiju. @lv
toolkit label: ir horeogrāfs (dzimta/ģimene) @lv
toolkit definition: Horeogrāfisks darbs, kas ietver dzimtas/ģimenes atbildību par horeogrāfiju. @lv
label: 是……的编舞者家族 @zh-hans
definition: 将一个家族与涉及创作编舞作品的一个家族的责任的一种作品关联起来。 @zh-hans
toolkit label: ……的编舞者家族 @zh-hans
toolkit definition: 涉及创作编舞作品的一个家族的责任的一种作品 @zh-hans
label: koreograf ailesidir @tr
definition: Bir temsilciyi, bir ailenin koreografik bir eser oluşturma sorumluluğunu içeren bir eserle ilişkilendirir. @tr
toolkit label: koreograf ailesi @tr
toolkit definition: Koreografik bir eser oluşturmak için bir ailenin sorumluluğunu içeren bir eser. @tr
has subproperty: P50945

koreografi (henkilö) teoksessa
status: Published
label: is choreographer person of @en
lexical alias: choreographerPersonOf.en
definition: Relates a person to a work that involves a responsibility of a person for creating a choreographic work. @en
toolkit label: choreographer person of @en
toolkit definition: A work that involves a responsibility of a person for creating a choreographic work. @en
type: Property
domain: C10004
has element type: 2
sub property of: teoksen tekijä (henkilö) teoksessa
sub property of: koreografi (toimija) teoksessa
definition: Liittää toimijan teokseen, joka on koreografinen teos, jonka luomisesta henkilö on vastuussa.
toolkit label: koreografi (henkilö) teoksessa
toolkit definition: Teos, joka on koreografinen teos, jonka luomisesta henkilö on vastuussa.
label: er koreograf for (person) @no
definition: Relaterer en person til et koreografisk verk som involverer et ansvar for en person i form av koreografi. @no
toolkit label: koreograf for (person) @no
toolkit definition: Et koreografisk verk som involverer et ansvar for en person i form av koreografi. @no
label: is choreograaf-persoon van @nl
definition: Relateert een persoon aan een werk dat met zich meebrengt een verantwoordelijkheid van een persoon voor het creëren van een choreografisch werk. @nl
toolkit label: choreograaf-persoon van @nl
toolkit definition: Een werk dat met zich meebrengt een verantwoordelijkheid van een persoon voor het creëren van een choreografisch werk. @nl
label: هو شخص واضع الألحان الراقصة لـ @ar
definition: يربط شخصا بعمل يترتب عليه تحمل شخص مسئولية وضع الألحان الراقصة لعمل @ar
toolkit label: شخص واضع الألحان الراقصة لـ @ar
toolkit definition: عمل تصميم رقصات يترتب عليه مسئولية شخص عن وضع الألحان الراقصة. @ar
label: és persona coreògrafa de @ca
definition: Relaciona una persona amb una obra que implica una responsabilitat d’una persona en la creació d’una obra coreogràfica. @ca
toolkit label: persona coreògrafa de @ca
toolkit definition: Obra que implica una responsabilitat d’una persona en la creació d’una obra coreogràfica. @ca
label: er person, som er koreograf af @da
definition: Relaterer en agent til et værk, som involverer en persons ansvar for at skabe et koreografisk værk. @da
toolkit label: person, som er koreograf af @da
toolkit definition: Værk, som involverer en persons ansvar for at skabe et koreografisk værk. @da
label: koreograaf (isik) teoses @et
definition: Seostab isiku koreograafilise teosega, mis sisaldab isiku vastutust koreograafia eest. @et
toolkit label: koreograaf (isik) teoses @et
toolkit definition: Koreograafiline teos, mis sisaldab isiku vastutust koreograafia eest. @et
label: ist Person als Choreografin/Choreograf von @de
definition: Setzt eine Person in Beziehung zu einem Werk, bei dem ein Akteur für die Schaffung eines choreografischen Werks verantwortlich ist. @de
toolkit label: Person als Choreografin/Choreograf von @de
toolkit definition: Ein Werk, bei dem eine Person für die Schaffung eines choreografischen Werks verantwortlich ist. @de
label: koreográfus személye a következőnek: @hu
definition: Hozzákapcsol egy ágenst egy műhöz, amelyhez hozzátartozik egy személy felelőssége egy koreografikus mű létrehozásáért. @hu
toolkit label: koreográfus személye: @hu
toolkit definition: Egy mű, amelyhez hozzátartozik egy személy felelőssége egy koreografikus mű létrehozásáért. @hu
label: è coreografo persona di @it
definition: Correla una persona a un'opera coreografica che implica una responsabilità di una persona nella coreografia. @it
toolkit label: coreografo persona di @it
toolkit definition: Opera coreografica che implica una responsabilità di una persona nella coreografia. @it
label: είναι χορογράφος φυσικό πρόσωπο του @el
toolkit label: χορογράφος φυσικό πρόσωπο του @el
label: est une personne chorégraphe de @fr
definition: Met une personne en relation avec une œuvre qui comporte une responsabilité de la part d’une personne consistant à créer une œuvre chorégraphique. @fr
toolkit label: personne chorégraphe de @fr
toolkit definition: Œuvre qui comporte une responsabilité de la part d’une personne consistant à créer une œuvre chorégraphique. @fr
label: ir horeogrāfs (persona) @lv
definition: Sasaista aģentu ar horeogrāfijas darbu, kas ietver personas atbildību par horeogrāfiju. @lv
toolkit label: ir horeogrāfs (persona) @lv
toolkit definition: Horeogrāfisks darbs, kas ietver personas atbildību par horeogrāfiju. @lv
label: 是……的编舞者个人 @zh-hans
definition: 将一个行为者与涉及创作一种编舞作品的一个个人的贡献的一种作品关联起来。 @zh-hans
toolkit label: ……的编舞者个人 @zh-hans
toolkit definition: 涉及创作一种编舞作品的一个个人的贡献的一种作品 @zh-hans
label: koreograf kişisidir @tr
definition: Bir temsilciyi, bir kişinin koreografik bir eser oluşturma sorumluluğunu içeren bir eserle ilişkilendirir. @tr
toolkit label: koreograf @tr
toolkit definition: Koreografik bir eser oluşturmak için bir kişinin sorumluluğunu içeren bir eser. @tr
has subproperty: P50492

yhteisövastaaja siviilioikeudessa teoksessa
status: Published
label: is civil defendant corporate body of @en
lexical alias: civilDefendantCorporateBodyOf.en
definition: Relates a corporate body to a work that involves a responsibility for being sued as a corporate body in a civil proceeding. @en
toolkit label: civil defendant corporate body of @en
toolkit definition: A work that involves a responsibility for being sued as a corporate body in a civil proceeding. @en
type: Property
domain: C10005
sub property of: yhteisö vastaajana kanteessa
has element type: 2
definition: Liittää yhteisön teokseen, jossa yhteisöä vastaan on nostettu kanne.
toolkit label: yhteisövastaaja siviilioikeudessa teoksessa
toolkit definition: Teos, jossa yhteisöä vastaan on nostettu kanne.
label: er sivilrettslig saksøkt korporasjon for @no
definition: Relaterer en korporasjon til et verk som involverer et ansvar for å være en saksøkt korporasjon i en sivilrettslig sak. @no
toolkit label: sivilrettslig saksøkt korporasjon for @no
toolkit definition: Et verk som involverer et ansvar for å være en saksøkt korporasjon i en sivilrettslig sak. @no
label: is burgelijke verweerder-corporatie van @nl
definition: Relateert een corporatie aan een werk dat met zich meebrengt een verantwoordelijkheid van gedaagd worden als een corporatie in een civielrechtelijke procedure. @nl
toolkit label: burgelijke verweerder-corporatie van @nl
toolkit definition: Een werk dat met zich meebrengt een verantwoordelijkheid van gedaagd worden als een corporatie in een civielrechtelijke procedure. @nl
label: هي هيئة مدعى عليها مدنياً لـ @ar
definition: يربط هيئة بعمل يترتب عليه مسئولية اتهامها كهيئة في دعوى مدنية. @ar
toolkit label: هيئة مدعى عليها مدنياً @ar
toolkit definition: عمل يترتب عليه مسئولية اتهامها كهيئة في دعوى مدنية. @ar
label: és entitat corporativa acusada civil de @ca
definition: Relaciona una entitat corporativa amb una obra que implica una responsabilitat de ser demandada com a entitat corporativa en un procés civil. @ca
toolkit label: entitat corporativa acusada civil de @ca
toolkit definition: Obra que implica una responsabilitat de ser demandada com a entitat corporativa en un procés civil. @ca
label: er korporation, som er civilretlig sagsøgt af @da
definition: Relaterer en korporation til et værk, som involverer et ansvar for at være en sagsøgt korporation i en civilretlig straffesag. @da
toolkit label: korporation, som er civilretlig sagsøgt af @da
toolkit definition: Værk, som involverer et ansvar for at være en sagsøgt korporation i en civilretlig straffesag. @da
label: kostja (asutus) teoses @et
definition: Seostab asutuse teosega, mis sisaldab asutuse vastu esitatud hagi tsiviilkohtumenetluses. @et
toolkit label: kostja (asutus) teoses @et
toolkit definition: Teos, mis sisaldab asutuse vastu esitatud hagi tsiviilkohtumenetluses. @et
label: ist Körperschaft als Beklagte/Beklagter in einem Zivilverfahren von @de
definition: Setzt eine Körperschaft in Beziehung zu einem Werk, das mit einer Verantwortung verbunden ist, als Körperschaft in einem Zivilverfahren verklagt zu werden. @de
toolkit label: Körperschaft als Beklagte/Beklagter in einem Zivilverfahren von @de
toolkit definition: Ein Werk, das mit einer Verantwortung verbunden ist, als Körperschaft in einem Zivilverfahren verklagt zu werden. @de
label: polgári eljárás alperes testülete a következőnek: @hu
definition: Hozzákapcsol egy testületet egy műhöz, amelyhez hozzátartozik annak felelőssége, hogy egy testületet egy polgári jogi eljárásban beperelnek. @hu
toolkit label: polgári eljárás alperes testülete: @hu
toolkit definition: Egy mű, amelyhez hozzátartozik annak felelőssége, hogy egy testületet egy polgári jogi eljárásban beperelnek. @hu
label: è imputato civile ente di @it
definition: Correla un ente a un'opera che implica una responsabilità nell'essere denunciato come ente in un processo civile. @it
toolkit label: imputato civile ente di @it
toolkit definition: Opera che implica una responsabilità nell'essere denunciato come ente in un processo civile. @it
label: είναι αστικά εναγόμενο συλλογικό όργανο του @el
toolkit label: αστικά εναγόμενο συλλογικό όργανο του @el
label: est une collectivité défenderesse civile de @fr
definition: Met une collectivité en relation avec une œuvre qui comporte une responsabilité consistant à être poursuivie en tant que collectivité dans une poursuite civile. @fr
toolkit label: collectivité défenderesse civile de @fr
toolkit definition: Œuvre qui comporte une responsabilité consistant à être poursuivie en tant que collectivité dans une poursuite civile. @fr
label: ir civiltiesisks atbildētājs (institūcija) @lv
definition: Sasaista institūciju ar darbu, kas ietver atbildību par to, ka institūcija iesūdzēta civillietā. @lv
toolkit label: ir civiltiesisks atbildētājs (institūcija) @lv
toolkit definition: Darbs, kas ietver atbildību par to, ka institūcija iesūdzēta civillietā. @lv
label: 是……的民事被告团体 @zh-hans
definition: 将一个团体与涉及在一项民事诉讼中作为团体被控告的一个责任的一种作品关联起来。 @zh-hans
toolkit label: ……的民事被告团体 @zh-hans
toolkit definition: 涉及在一项民事诉讼中作为团体被控告的一个责任的一种作品 @zh-hans
label: hukuki davalı tüzel kişisidir @tr
definition: Bir tüzel kişiyi, bir hukuk davasında tüzel kişi olarak dava edilme sorumluluğunu içeren bir eserle ilişkilendirir. @tr
toolkit label: davalı tüzel kişi @tr
toolkit definition: Bir hukuk davasında tüzel bir kişi olarak dava edilme sorumluluğunu içeren bir çalışma. @tr
has subproperty: P50456

henkilövastaaja siviilioikeudessa teoksessa
status: Published
label: is civil defendant person of @en
lexical alias: civilDefendantPersonOf.en
definition: Relates a person to a work that involves a responsibility for being sued as a person in a civil proceeding. @en
toolkit label: civil defendant person of @en
toolkit definition: A work that involves a responsibility for being sued as a person in a civil proceeding. @en
type: Property
domain: C10004
sub property of: henkilö vastaajana kanteessa
has element type: 2
definition: Liittää henkilön teokseen, jossa henkilöä vastaan on nostettu kanne.
toolkit label: henkilövastaaja siviilioikeudessa teoksessa
toolkit definition: Teos, jossa henkilöä vastaan on nostettu kanne.
label: er sivilrettslig saksøkt person for @no
definition: Relaterer en person til et verk som involverer et ansvar for å være en saksøkt person i en sivilrettslig sak. @no
toolkit label: sivilrettslig saksøkt person for @no
toolkit definition: Et verk som involverer et ansvar for å være en saksøkt person i en sivilrettslig sak. @no
label: is burgelijke verweerder-persoon van @nl
definition: Relateert een persoon aan een werk dat met zich meebrengt een verantwoordelijkheid van gedaagd worden als een persoon in een civielrechtelijke procedure. @nl
toolkit label: burgelijke verweerder-persoon van @nl
toolkit definition: Een werk dat met zich meebrengt een verantwoordelijkheid van gedaagd worden als een persoon in een civielrechtelijke procedure. @nl
label: هو شخص مدعى عليه مدنيا لـ @ar
definition: يربط شخصا بعمل يترتب عليه مسئولية اتهامه كشخص في دعوى مدنية. @ar
toolkit label: شخص مدعى عليه مدنيا @ar
toolkit definition: عمل يترتب عليه مسئولية اتهامه كشخص في دعوى مدنية. @ar
label: és persona acusada civil de @ca
definition: Relaciona una persona amb una obra que implica una responsabilitat de ser demandada com a persona en un procés civil. @ca
toolkit label: persona acusada civil de @ca
toolkit definition: Obra que implica una responsabilitat de ser demandada com a persona en un procés civil. @ca
label: er person, som er civilretlig sagsøgt af @da
definition: Relaterer en person til et værk, som involverer et ansvar for at være en sagsøgt person i en civilretlig straffesag. @da
toolkit label: person, som er civilretlig sagsøgt af @da
toolkit definition: Værk, som involverer et ansvar for at være en sagsøgt person i en civilretlig straffesag. @da
label: kostja (isik) teoses @et
definition: Seostab isiku teosega, mis sisaldab isiku vastu esitatud hagi tsiviilkohtumenetluses. @et
toolkit label: kostja (isik) teoses @et
toolkit definition: Teos, mis sisaldab isiku vastu esitatud hagi tsiviilkohtumenetluses. @et
label: ist Person als Beklagte/Beklagter in einem Zivilverfahren von @de
definition: Setzt eine Person in Beziehung zu einem Werk, das mit einer Verantwortung verbunden ist, als Person in einem Zivilverfahren verklagt zu werden. @de
toolkit label: Person als Beklagte/Beklagter in einem Zivilverfahren von @de
toolkit definition: Ein Werk, das mit einer Verantwortung verbunden ist, als Person in einem Zivilverfahren verklagt zu werden. @de
label: polgári eljárás alperes személye a következőnek: @hu
definition: Hozzákapcsol egy személyt egy műhöz, amelyhez hozzátartozik annak felelőssége, hogy egy személyt egy polgári jogi eljárásban beperelnek. @hu
toolkit label: polgári eljárás alperes személye: @hu
toolkit definition: Egy mű, amelyhez hozzátartozik annak felelőssége, hogy egy személyt egy polgári jogi eljárásban beperelnek. @hu
label: è imputato civile persona di @it
definition: Correla una persona a un'opera che implica una responsabilità nell'essere denunciato come persona in un processo civile. @it
toolkit label: imputato civile persona di @it
toolkit definition: Opera che implica una responsabilità nell'essere denunciato come persona in un processo civile. @it
label: είναι αστικά εναγόμενο φυσικό πρόσωπο του @el
toolkit label: αστικά εναγόμενο φυσικό πρόσωπο του @el
label: est une personne défenderesse civile de @fr
definition: Met une personne en relation avec une œuvre qui comporte une responsabilité consistant à être poursuivie en tant que personne dans une poursuite civile. @fr
toolkit label: personne défenderesse civile de @fr
toolkit definition: Œuvre qui comporte une responsabilité consistant à être poursuivie en tant que personne dans une poursuite civile. @fr
label: ir civiltiesisks atbildētājs (persona) @lv
definition: Sasaista personu ar darbu, kas ietver atbildību par to, ka persona iesūdzēta civillietā. @lv
toolkit label: ir civiltiesisks atbildētājs (persona) @lv
toolkit definition: Darbs, kas ietver atbildību par to, ka persona iesūdzēta civillietā. @lv
label: 是……的民事被告个人 @zh-hans
definition: 将一个个人与涉及在一项民事诉讼中作为个人被控告的一个责任的一种作品关联起来。 @zh-hans
toolkit label: ……的民事被告个人 @zh-hans
toolkit definition: 涉及在一项民事诉讼中作为个人被控告的一个责任的一种作品 @zh-hans
label: hukuki davalı kişisidir @tr
definition: Bir kişiyi, bir hukuk davasında kişi olarak dava edilme sorumluluğunu içeren bir eserle ilişkilendirir. @tr
toolkit label: davalı kişi @tr
toolkit definition: Bir hukuk davasında kişi olarak dava edilme sorumluluğunu içeren bir çalışma. @tr
has subproperty: P50457

kokoelman luetteloija (toimija) kappaleessa
label: is collection registrar agent of (Deprecated) @en
definition: Relates an agent to an item that is listed or inventoried by an agent in an aggregate work such as a collection of items or works. (Deprecated) @en
type: Property
domain: C10002
sub property of: kuraattori (toimija) kappaleelle
lexical alias: collectionRegistrarAgentOf.en
label: est un agent catalogueur d’une collection de ressources de @fr
definition: Met un agent en relation avec un item qui est listé ou inventorié par un agent dans une œuvre agrégative telle qu’une collection d’items ou d’œuvres. @fr
toolkit label: agent catalogueur d’une collection de ressources de @fr
toolkit definition: Item qui est listé ou inventorié par un agent dans une œuvre agrégative telle qu’une collection d’items ou d’œuvres. @fr
toolkit label: collection registrar agent of (Deprecated) @en
toolkit definition: An item that is listed or inventoried by an agent in an aggregate work such as a collection of items or works. (Deprecated) @en
instruction number: 18.5
label: είναι καταχωρητής συλλογής φορέας του @el
definition: Συνδέει έναν έφορο ο οποίος απαριθμεί ή καταγράφει τα αντικείμενα σε ένα συγκεντρωτικό έργο, όπως μία συλλογή αντικειμένων ή έργων, με ένα αντικείμενο. @el
toolkit label: καταχωρητής συλλογής φορέας του @el
toolkit definition: Ένα αντικείμενο το οποίο απαριθμείται ή καταγράφεται σε ένα συγκεντρωτικό έργο, όπως μία συλλογή αντικειμένων ή έργων. @el
definition: Setzt einen Akteur in Beziehung zu einem Exemplar, das von einem Akteur als aggregiertes Werk verzeichnet oder inventarisiert wird, wie zum Beispiel eine Sammlung von Exemplaren oder Werken. @de
toolkit label: Akteur als Registrarin/Registrar von @de
toolkit definition: Ein Exemplar, das von einem Akteur als aggregiertes Werk verzeichnet oder inventarisiert wird, wie zum Beispiel eine Sammlung von Exemplaren oder Werken. @de
label: er agent, som er samlingsregistrator af @da
definition: Relaterer en agent til et eksemplar, som er listet eller opstillet af en agent i et samlingsværk, såsom en samling af eksemplarer eller værker. @da
toolkit label: agent, som er samlingsregistrator af @da
toolkit definition: Eksemplar, som er listet eller opstillet af en agent i et samlingsværk, såsom en samling af eksemplarer eller værker. @da
label: és agent conservador de col·leccions de recursos de @ca
definition: Relaciona un agent amb un ítem que és llistat o inventariat per un agent en una obra agregada com ara una col·lecció d’ítems o d’obres. @ca
toolkit label: agent conservador de col·leccions de recursos de @ca
toolkit definition: Ítem que és llistat o inventariat per un agent en una obra agregada,com ara una col·lecció d’ítems o d’obres. @ca
definition: Liittää toimijan kappaleeseen, jonka toimija on luetteloinut tai inventoinut osaksi aggregaattiteosta, kuten kappaleista tai teoksista koostuvaa kokoelmaa.
toolkit label: kokoelman luetteloija (toimija) kappaleessa
toolkit definition: Kappale, jonka toimija on luetteloinut tai inventoinut osaksi aggregaattiteosta, kuten kappaleista tai teoksista koostuvaa kokoelmaa.
toolkit label: samlingsregistrator for (agent) @no
toolkit definition: Et eksemplar som er oppført av en agent i en liste eller oversikt over eksemplarene i et samleverk, for eksempel en samling av eksemplarer eller verk. @no
label: ist Akteur als Registrarin/Registrar von @de
has element type: 2
label: gyűjtemény-nyilvántartó ágense a következőnek: @hu
definition: Hozzákapcsol egy ágenst egy példányhoz, amelyet egy ágens felsorol vagy leltárba vesz egy aggregáló műben, mint például példányok vagy művek gyűjteményében. @hu
toolkit label: gyűjtemény-nyilvántartó ágense: @hu
toolkit definition: Egy példány, amelyet egy ágens felsorol vagy leltárba vesz egy aggregáló műben, mint például példányok vagy művek gyűjteményében. @hu
alternative label: collection registrar of @en
alternative label: kokoelmarekisteri
label: er samlingsregistrator for (agent) @no
definition: Relaterer en agent til et eksemplar som er oppført av en agent i en liste eller oversikt over eksemplarene i et samleverk, for eksempel en samling av eksemplarer eller verk. @no
alternative label: samlingsregistrator for @no
label: is collectieregistrator-actor van @nl
definition: Relateert een actor aan een item dat vermeld of geïnventariseerd is door een actor in een aggregaatwerk zoals een collectie van items of werken. @nl
toolkit label: collectieregistrator-actor van @nl
toolkit definition: Een item dat vermeld of geïnventariseerd is door een actor in een aggregaatwerk zoals een collectie van items of werken. @nl
label: هو وكيل مسجل مجموعة لـ @ar
definition: يربط وكيلا بمفردة مسجلة في قائمة أو قام وكيل بجردها في عمل تجميعي، مثل مجموعة مفردات أو أعمال. @ar
alternative label: مسجل مجموعة لـ @ar
toolkit label: وكيل مسجِل مجموعة لـ @ar
toolkit definition: مفردة مسجلة في قائمة أو قام وكيل بجردها في عمل تجميعي، مثل مجموعة من المفردات أو الأعمال. @ar
alternative label: conservador de col·leccions de recursos @ca
alternative label: samlingsregistrator af @da
label: kogu registreerija (tegija) eksemplarile @et
definition: Seostab tegija eksemplariga, mille tegija on loetlenud või inventeerinud liitumit moodustavate eksemplaride või teoste kogu jaoks. @et
alternative label: kogu registreerija eksemplarile @et
toolkit label: kogu registreerija (tegija) eksemplarile @et
toolkit definition: Eksemplar, mille tegija on loetlenud või inventeerinud liitumit moodustavate eksemplaride või teoste kogu jaoks. @et
alternative label: gyűjtemény-nyilvántartója: @hu
label: è conservatore della raccolta agente di @it
definition: Correla un agente a un item che è elencato o inventariato da un agente in un'opera aggregata come una raccolta di item o opere. @it
alternative label: conservatore della raccolta di @it
toolkit label: conservatore della raccolta agente di @it
toolkit definition: Item che è elencato o inventariato da un agente in un'opera aggregata come una raccolta di item o opere. @it
alternative label: καταχωρητής συλλογής του @el
alternative label: agent conservateur d’une collection de ressources de @fr
status: Deprecated
label: ir kolekcijas reģistrētājs (aģents) @lv
definition: Sasaista aģentu ar vienību, ko aģents uzskaitījis vai inventarizējis apkopotā darbā, piemēram, vienību vai darbu kolekcijā. @lv
toolkit label: ir kolekcijas reģistrētājs (aģents) @lv
toolkit definition: Vienība, ko aģents uzskaitījis vai inventarizējis apkopotā darbā, piemēram, vienību vai darbu kolekcijā. @lv
alternative label: Registrar von @de
has subproperty: kokoelman luetteloija (yhteistoimija) kappaleessa
has subproperty: kokoelman luetteloija (henkilö) kappaleessa
has subproperty: P50046

kokoelman luetteloija (yhteistoimija) kappaleessa
label: is collection registrar collective agent of (Deprecated) @en
lexical alias: collectionRegistrarCollectiveAgentOf.en
definition: Relates a collective agent to an item that is listed or inventoried by a collective agent in an aggregate work such as a collection of items or works. (Deprecated) @en
toolkit label: collection registrar collective agent of (Deprecated) @en
toolkit definition: An item that is listed or inventoried by a collective agent in an aggregate work such as a collection of items or works. (Deprecated) @en
type: Property
domain: C10011
has element type: 2
sub property of: kuraattori (yhteistoimija) kappaleessa
sub property of: kokoelman luetteloija (toimija) kappaleessa
definition: Liittää yhteistoimijan kappaleeseen, jonka yhteistoimija on luetteloinut tai inventoinut osaksi aggregaattiteosta, kuten kappaleista tai teoksista koostuvaa kokoelmaa.
toolkit label: kokoelman luetteloija (yhteistoimija) kappaleessa
toolkit definition: Kappale, jonka yhteistoimija on luetteloinut tai inventoinut osaksi aggregaattiteosta, kuten kappaleista tai teoksista koostuvaa kokoelmaa.
label: er samlingsregistrator for (kollektiv agent) @no
definition: Relaterer en kollektiv agent til et eksemplar som av en kollektiv agent er oppført i lister eller oversikter i et aggregert verk som for eksempel en samling av eksemplarer eller verk. @no
toolkit label: samlingsregistrator for (kollektiv agent) @no
toolkit definition: Et eksemplar som av en kollektiv agent er oppført i lister eller oversikter i et aggregert verk som for eksempel en samling av eksemplarer eller verk. @no
label: is collectieregistrator-collectieve actor van @nl
definition: Relateert een collectieve actor aan een item dat vermeld of geïnventariseerd is door een collectieve actor in een aggregaatwerk zoals een collectie van items of werken. @nl
toolkit label: collectieregistrator-collectieve actor van @nl
toolkit definition: Een item dat vermeld of geïnventariseerd is door een collectieve actor in een aggregaatwerk zoals een collectie van items of werken. @nl
label: هو وكيل جماعي مسجل مجموعة لـ @ar
definition: يربط وكيلا جماعيا بمفردة مدرجة في القائمة أو تم جردها من قِبل وكيل جماعي ما في عمل تجميعي مثل مجموعة من المفردات أو الأعمال. @ar
toolkit label: وكيل جماعي مسجل مجموعة @ar
toolkit definition: مفردة مدرجة في القائمة أو تم جردها من قِبل وكيل جماعي ما في عمل تجميعي مثل مجموعة من المفردات أو الأعمال. @ar
label: és agent col·lectiu conservador de col·leccions de recursos de @ca
definition: Relaciona un agent col·lectiu amb un ítem que és llistat o inventariat per un agent col·lectiu en una obra agregada, com ara una col·lecció d’ítems o d’obres. @ca
toolkit label: agent col·lectiu conservador de col·leccions de recursos de @ca
toolkit definition: Ítem que és llistat o inventariat per un agent col·lectiu en una obra agregada, com ara una col·lecció d’ítems o d’obres. @ca
label: er kollektiv agent, som er samlingsregistrator af @da
definition: Relaterer en kollektiv agent til et eksemplar, som er listet eller opstillet af en kollektiv agent i et samlingsværk, såsom en samling af eksemplarer eller værker. @da
toolkit label: kollektiv agent, som er samlingsregistrator af @da
toolkit definition: Eksemplar, som er listet eller opstillet af en kollektiv agent i et samlingsværk, såsom en samling af eksemplarer eller værker. @da
label: kogu registreerija (kollektiiv) eksemplarile @et
definition: Seostab kollektiivi eksemplariga, mille kollektiiv on loetlenud või inventeerinud liitumit moodustavate eksemplaride või teoste kogu jaoks. @et
toolkit label: kogu registreerija (kollektiiv) eksemplarile @et
toolkit definition: Eksemplar, mille kollektiiv on loetlenud või inventeerinud liitumit moodustavate eksemplaride või teoste kogu jaoks. @et
label: ist gemeinschaftlicher Akteur als Registrarin/Registrar von @de
definition: Setzt einen gemeinschaftlichen Akteur in Beziehung zu einem Exemplar, das von einem gemeinschaftlichen Akteur als aggregiertes Werk verzeichnet und inventarisiert wird, wie zum Beispiel eine Sammlung von Exemplaren oder Werken. @de
toolkit label: Gemeinschaftlicher Akteur als Registrarin/Registrar von @de
toolkit definition: Ein Exemplar, das von einem gemeinschaftlichen Akteur als aggregiertes Werk verzeichnet und inventarisiert wird, wie zum Beispiel eine Sammlung von Exemplaren oder Werken. @de
label: gyűjtemény-nyilvántartó kollektív ágense a következőnek: @hu
definition: Hozzákapcsol egy kollektív ágenst egy példányhoz, amelyet egy kollektív ágens felsorol vagy leltárba vesz egy aggregáló műben, mint például példányok vagy művek gyűjteményében. @hu
toolkit label: gyűjtemény-nyilvántartó kollektív ágense: @hu
toolkit definition: Egy példány, amelyet egy kollektív ágens felsorol vagy leltárba vesz egy aggregáló műben, mint például példányok vagy művek gyűjteményében. @hu
label: è conservatore della raccolta agente collettivo di @it
definition: Correla un agente collettivo a un item elencato o inventariato da un agente collettivo in un'opera aggregata come una raccolta di item o opere. @it
toolkit label: conservatore della raccolta agente collettivo di @it
toolkit definition: Item elencato o inventariato da un agente collettivo in un'opera aggregata come una raccolta di item o opere. @it
label: είναι καταχωρητής συλλογής συλλογικός φορέας του @el
toolkit label: καταχωρητής συλλογής συλλογικός φορέας του @el
label: est un agent collectif catalogueur d’une collection de ressources de @fr
definition: Met un agent collectif en relation avec un item qui est listé ou inventorié par un agent collectif dans une œuvre agrégative telle qu’une collection d’items ou d’œuvres. @fr
toolkit label: agent collectif catalogueur d’une collection de ressources de @fr
toolkit definition: Item qui est listé ou inventorié par un agent collectif dans une œuvre agrégative telle qu’une collection d’items ou d’œuvres. @fr
status: Deprecated
label: ir kolekcijas reģistrētājs (grupa) @lv
definition: Sasaista grupu ar vienību, ko grupa uzskaitījusi vai inventarizējusi apkopotā darbā, piemēram, vienību vai darbu kolekcijā. @lv
toolkit label: ir kolekcijas reģistrētājs (grupa) @lv
toolkit definition: Vienība, ko grupa uzskaitījusi vai inventarizējusi apkopotā darbā, piemēram, vienību vai darbu kolekcijā. @lv
alternative label: agent collectif conservateur d’une collection de ressources de @fr
has subproperty: kokoelman luetteloija (yhteisö) kappaleessa
has subproperty: kokoelman luetteloija (suku) kappaleessa
has subproperty: P50791

kokoelman luetteloija (yhteisö) kappaleessa
label: is collection registrar corporate body of (Deprecated) @en
lexical alias: collectionRegistrarCorporateBodyOf.en
definition: Relates a corporate body to an item that is listed or inventoried by a corporate body in an aggregate work such as a collection of items or works. (Deprecated) @en
toolkit label: collection registrar corporate body of (Deprecated) @en
toolkit definition: An item that is listed or inventoried by a corporate body in an aggregate work such as a collection of items or works. (Deprecated) @en
type: Property
domain: C10005
has element type: 2
sub property of: kuraattori (yhteisö) kappaleessa
sub property of: kokoelman luetteloija (yhteistoimija) kappaleessa
definition: Liittää yhteisön kappaleeseen, jonka yhteisö on luetteloinut tai inventoinut osaksi aggregaattiteosta, kuten kappaleista tai teoksista koostuvaa kokoelmaa.
toolkit label: kokoelman luetteloija (yhteisö) kappaleessa
toolkit definition: Kappale, jonka yhteisö on luetteloinut tai inventoinut osaksi aggregaattiteosta, kuten kappaleista tai teoksista koostuvaa kokoelmaa.
label: er samlingsregistrator for (korporasjon) @no
definition: Relaterer en korporasjon til et eksemplar som av en korporasjon er oppført i lister eller oversikter i et aggregert verk som for eksempel en samling av eksemplarer eller verk. @no
toolkit label: samlingsregistrator for (korporasjon) @no
toolkit definition: Et eksemplar som av en korporasjon er oppført i lister eller oversikter i et aggregert verk som for eksempel en samling av eksemplarer eller verk. @no
label: is collectieregistrator-corporatie van @nl
definition: Relateert een corporatie aan een item dat vermeld of geïnventariseerd is door een corporatie in een aggregaatwerk zoals een collectie van items of werken. @nl
toolkit label: collectieregistrator-corporatie van @nl
toolkit definition: Een item dat vermeld of geïnventariseerd is door een corporatie in een aggregaatwerk zoals een collectie van items of werken. @nl
label: هي هيئة مسجلة لمجموعة لـ @ar
definition: يربط هيئة بمفردة مدرجة في القائمة أو يتم جردها من قِبل هيئة ما في عمل تجميعي مثل مجموعة من المفردات أو الأعمال. @ar
toolkit label: هيئة مسجلة مجموعة @ar
toolkit definition: مفردة مدرجة في القائمة أو تم جردها من قِبل هيئة ما في عمل تجميعي مثل مجموعة من المفردات أو الأعمال. @ar
label: és entitat corporativa conservadora de col·leccions de recursos de @ca
definition: Relaciona una entitat corporativa amb un ítem que és llistat o inventariat per una entitat corporativa en una obra agregada, com ara una col·lecció d’ítems o d’obres. @ca
toolkit label: entitat corporativa conservadora de col·leccions de recursos de @ca
toolkit definition: Ítem que és llistat o inventariat per una entitat corporativa en una obra agregada, com ara una col·lecció d’ítems o d’obres. @ca
label: er korporation, som er samlingsregistrator af @da
definition: Relaterer en korporation til et eksemplar, som er listet eller opstillet af en korporation i et samlingsværk, såsom en samling af eksemplarer eller værker. @da
toolkit label: korporation, som er samlingsregistrator af @da
toolkit definition: Eksemplar, som er listet eller opstillet af en korporation i et samlingsværk, såsom en samling af eksemplarer eller værker. @da
label: kogu registreerija (asutus) eksemplarile @et
definition: Seostab asutuse eksemplariga, mille asutus on loetlenud või inventeerinud liitumit moodustavate eksemplaride või teoste kogu jaoks. @et
toolkit label: kogu registreerija (asutus) eksemplarile @et
toolkit definition: Eksemplar, mille asutus on loetlenud või inventeerinud liitumit moodustavate eksemplaride või teoste kogu jaoks. @et
label: ist Körperschaft als Registrarin/Registrar von @de
definition: Setzt eine Körperschaft in Beziehung zu einem Exemplar, das von einer Körperschaft als aggregiertes Werk verzeichnet und inventarisiert wird, wie zum Beispiel eine Sammlung von Exemplaren oder Werken. @de
toolkit label: Körperschaft als Registrarin/Registrar von @de
toolkit definition: Ein Exemplar, das von einer Körperschaft als aggregiertes Werk verzeichnet und inventarisiert wird, wie zum Beispiel eine Sammlung von Exemplaren oder Werken. @de
label: gyűjtemény-nyilvántartó testülete a következőnek: @hu
definition: Hozzákapcsol egy testületet egy példányhoz, amelyet egy testület felsorol vagy leltárba vesz egy aggregáló műben, mint például példányok vagy művek gyűjteményében. @hu
toolkit label: gyűjtemény-nyilvántartó testülete: @hu
toolkit definition: Egy példány, amelyet egy testület felsorol vagy leltárba vesz egy aggregáló műben, mint például példányok vagy művek gyűjteményében. @hu
label: è conservatore della raccolta ente di @it
definition: Correla un ente con un item elencato o inventariato da un ente in un'opera aggregata come una raccolta di item o opere. @it
toolkit label: conservatore della raccolta ente di @it
toolkit definition: Item elencato o inventariato da un ente in un'opera aggregata come una raccolta di item o opere. @it
label: είναι καταχωρητής συλλογής συλλογικό όργανο του @el
toolkit label: καταχωρητής συλλογής συλλογικό όργανο του @el
label: est une collectivité catalogueuse d’une collection de ressources de @fr
definition: Met une collectivité en relation avec un item qui est listé ou inventorié par une collectivité dans une œuvre agrégative telle qu’une collection d’items ou d’œuvres. @fr
toolkit label: collectivité catalogueuse d’une collection de ressources de @fr
toolkit definition: Item qui est listé ou inventorié par une collectivité dans une œuvre agrégative telle qu’une collection d’items ou d’œuvres. @fr
status: Deprecated
label: ir kolekcijas reģistrētājs (institūcija) @lv
definition: Sasaista institūciju ar vienību, ko institūcija uzskaitījusi vai inventarizējusi apkopotā darbā, piemēram, vienību vai darbu kolekcijā. @lv
toolkit label: ir kolekcijas reģistrētājs (institūcija) @lv
toolkit definition: Vienība, ko institūcija uzskaitījusi vai inventarizējusi apkopotā darbā, piemēram, vienību vai darbu kolekcijā. @lv
alternative label: collectivité conservatrice d’une collection de ressources de @fr
has subproperty: P50942

kokoelman luetteloija (suku) kappaleessa
label: is collection registrar family of (Deprecated) @en
lexical alias: collectionRegistrarFamilyOf.en
definition: Relates a family to an item that is listed or inventoried by a family in an aggregate work such as a collection of items or works. (Deprecated) @en
toolkit label: collection registrar family of (Deprecated) @en
toolkit definition: An item that is listed or inventoried by a family in an aggregate work such as a collection of items or works. (Deprecated) @en
type: Property
domain: C10008
has element type: 2
sub property of: kuraattori (suku) kappaleessa
sub property of: kokoelman luetteloija (yhteistoimija) kappaleessa
definition: Liittää suvun kappaleeseen, jonka suku on luetteloinut tai inventoinut osaksi aggregaattiteosta, kuten kappaleista tai teoksista koostuvaa kokoelmaa.
toolkit label: kokoelman luetteloija (suku) kappaleessa
toolkit definition: Kappale, jonka suku on luetteloinut tai inventoinut osaksi aggregaattiteosta, kuten kappaleista tai teoksista koostuvaa kokoelmaa.
label: er samlingsregistrator for (familie) @no
definition: Relaterer en familie til et eksemplar som av en familie er oppført i lister eller oversikter i et aggregert verk som for eksempel en samling av eksemplarer eller verk. @no
toolkit label: samlingsregistrator for (familie) @no
toolkit definition: Et eksemplar som av en familie er oppført i lister eller oversikter i et aggregert verk som for eksempel en samling av eksemplarer eller verk. @no
label: is collectieregistrator-familie van @nl
definition: Relateert een familie aan een item dat vermeld of geïnventariseerd is door een familie in een aggregaatwerk zoals een collectie van items of werken. @nl
toolkit label: collectieregistrator-familie van @nl
toolkit definition: Een item dat vermeld of geïnventariseerd is door een familie in een aggregaatwerk zoals een collectie van items of werken. @nl
label: هي عائلة مسجلة لمجموعة لـ @ar
definition: يربط عائلة بمفردة مدرجة في القائمة أو تم جردها من قِبل عائلة ما في عمل تجميعي مثل مجموعة من المفردات أو الأعمال. @ar
toolkit label: عائلة مسجلة مجموعة @ar
toolkit definition: مفردة مدرجة في القائمة أو تم جردها من قِبل عائلة ما في عمل تجميعي مثل مجموعة من المفردات أو الأعمال. @ar
label: és família conservadora de col·leccions de recursos de @ca
definition: Relaciona una família amb un ítem que és llistat o inventariat per una família en una obra agregada, com ara una col·lecció d’ítems o d’obres. @ca
toolkit label: família conservadora de col·leccions de @ca
toolkit definition: Ítem que és llistat o inventariat per una família en una obra agregada, com ara una col·lecció d’ítems o d’obres. @ca
label: er familie, som er samlingsregistrator af @da
definition: Relaterer en familie til et eksemplar, som er listet eller opstillet af en familie i et samlingsværk, såsom en samling af eksemplarer eller værker. @da
toolkit label: familie, som er samlingsregistrator af @da
toolkit definition: Eksemplar, som er listet eller opstillet af en familie i et samlingsværk, såsom en samling af eksemplarer eller værker. @da
label: kogu registreerija (perekond) eksemplarile @et
definition: Seostab perekonna eksemplariga, mille perekond on loetlenud või inventeerinud liitumit moodustavate eksemplaride või teoste kogu jaoks. @et
toolkit label: kogu registreerija (perekond) eksemplarile @et
toolkit definition: Eksemplar, mille perekond on loetlenud või inventeerinud liitumit moodustavate eksemplaride või teoste kogu jaoks. @et
label: ist Familie als Registrarin/Registrar von @de
definition: Setzt eine Familie in Beziehung zu einem Exemplar, das von einer Familie als aggregiertes Werk verzeichnet oder inventarisiert wird, wie zum Beispiel eine Sammlung von Exemplaren oder Werken. @de
toolkit label: Familie als Registrarin/Registrar von @de
toolkit definition: Ein Exemplar, das von einer Familie als aggregiertes Werk verzeichnet oder inventarisiert wird, wie zum Beispiel eine Sammlung von Exemplaren oder Werken. @de
label: gyűjtemény-nyilvántartó családja a következőnek: @hu
definition: Hozzákapcsol egy családot egy példányhoz, amelyet egy család felsorol vagy leltárba vesz egy aggregáló műben, mint például példányok vagy művek gyűjteményében. @hu
toolkit label: gyűjtemény-nyilvántartó családja: @hu
toolkit definition: Egy példány, amelyet egy család felsorol vagy leltárba vesz egy aggregáló műben, mint például példányok vagy művek gyűjteményében. @hu
label: è conservatore della raccolta famiglia di @it
definition: Correla una famiglia a un item elencato o inventariato da una famiglia in un'opera aggregata come una raccolta di item o opere. @it
toolkit label: conservatore della raccolta famiglia di @it
toolkit definition: Item elencato o inventariato da una famiglia in un'opera aggregata come una raccolta di item o opere. @it
label: είναι υπεύθυνος γραμματέας συλλογής της οικογένειας του @el
definition: Συνδέει μια οικογένεια με ένα αντίτυπο το οποίο καταχωρίζεται ή κατατίθεται από μια οικογένεια σε ένα συνολικό έργο, όπως μια συλλογή αντιτύπων ή έργων. @el
toolkit label: υπεύθυνος γραμματέας συλλογής της οικογένειας του @el
label: est une famille catalogueuse d’une collection de ressources de @fr
definition: Met une famille en relation avec un item qui est listé ou inventorié par une famille dans une œuvre agrégative telle qu’une collection d’items ou d’œuvres. @fr
toolkit label: famille catalogueuse d’une collection de ressources de @fr
toolkit definition: Item qui est listé ou inventorié par une famille dans une œuvre agrégative telle qu’une collection d’items ou d’œuvres. @fr
status: Deprecated
label: ir kolekcijas reģistrētājs (dzimta/ģimene) @lv
definition: Sasaista dzimtu/ģimeni ar vienību, ko dzimta/ģimene uzskaitījusi vai inventarizējusi apkopotā darbā, piemēram, vienību vai darbu kolekcijā. @lv
toolkit label: ir kolekcijas reģistrētājs (dzimta/ģimene) @lv
toolkit definition: Vienība, ko dzimta/ģimene uzskaitījusi vai inventarizējusi apkopotā darbā, piemēram, vienību vai darbu kolekcijā. @lv
alternative label: famille conservatrice d’une collection de ressources de @fr
has subproperty: P51093

kokoelman luetteloija (henkilö) kappaleessa
label: is collection registrar person of (Deprecated) @en
lexical alias: collectionRegistrarPersonOf.en
definition: Relates a person to an item that is listed or inventoried by a person in an aggregate work such as a collection of items or works. (Deprecated) @en
toolkit label: collection registrar person of (Deprecated) @en
toolkit definition: An item that is listed or inventoried by a person in an aggregate work such as a collection of items or works. (Deprecated) @en
type: Property
domain: C10004
has element type: 2
sub property of: kuraattori (henkilö) kappaleessa
sub property of: kokoelman luetteloija (toimija) kappaleessa
definition: Liittää henkilön kappaleeseen, jonka henkilö on luetteloinut tai inventoinut osaksi aggregaattiteosta, kuten kappaleista tai teoksista koostuvaa kokoelmaa.
toolkit label: kokoelman luetteloija (henkilö) kappaleessa
toolkit definition: Kappale, jonka henkilö on luetteloinut tai inventoinut osaksi aggregaattiteosta, kuten kappaleista tai teoksista koostuvaa kokoelmaa.
label: er samlingsregistrator for (person) @no
definition: Relaterer en person til et eksemplar som av en person er oppført i lister eller oversikter i et aggregert verk som for eksempel en samling av eksemplarer eller verk. @no
toolkit label: samlingsregistrator for (person) @no
toolkit definition: Et eksemplar som av en person er oppført i lister eller oversikter i et aggregert verk som for eksempel en samling av eksemplarer eller verk. @no
label: is collectieregistrator-persoon van @nl
definition: Relateert een persoon aan een item dat vermeld of geïnventariseerd is door een persoon in een aggregaatwerk zoals een collectie van items of werken. @nl
toolkit label: collectieregistrator-persoon van @nl
toolkit definition: Een item dat vermeld of geïnventariseerd is door een persoon in een aggregaatwerk zoals een collectie van items of werken. @nl
label: هو شخص مسجل مجموعة لـ @ar
definition: يربط شخصا بمفردة مدرجة في قائمة أو جردها شخص في عمل تجميعي مثل مجموعة من المفردات أو الأعمال. @ar
toolkit label: شخص مسجل مجموعة @ar
toolkit definition: مفردة مدرجة في القائمة أو تم جردها من قِبل شخص ما في عمل تجميعي مثل مجموعة من المفردات أو الأعمال. @ar
label: és persona conservadora de col·leccions de recursos de @ca
definition: Relaciona una persona amb un ítem que és llistat o inventariat per una persona en una obra agregada, com ara una col·lecció d’ítems o d’obres. @ca
toolkit label: persona conservadora de col·leccions de recursos de @ca
toolkit definition: Ítem que és llistat o inventariat per una persona en una obra agregada, com ara una col·lecció d’ítems o d’obres. @ca
label: er person, som er samlingsregistrator af @da
definition: Relaterer en person til et eksemplar, som er listet eller opstillet af en person i et samlingsværk, såsom en samling af eksemplarer eller værker. @da
toolkit label: person, som er samlingsregistrator af @da
toolkit definition: Eksemplar, som er listet eller opstillet af en person i et samlingsværk, såsom en samling af eksemplarer eller værker. @da
label: kogu registreerija (isik) eksemplarile @et
definition: Seostab isiku eksemplariga, mille isik on loetlenud või inventeerinud liitumit moodustavate eksemplaride või teoste kogu jaoks. @et
toolkit label: kogu registreerija (isik) eksemplarile @et
toolkit definition: Eksemplar, mille isik on loetlenud või inventeerinud liitumit moodustavate eksemplaride või teoste kogu jaoks. @et
label: ist Person als Registrarin/Registrar von @de
definition: Setzt eine Person in Beziehung zu einem Exemplar, das von einer Person als aggregiertes Werk verzeichnet oder inventarisiert wird, wie zum Beispiel eine Sammlung von Exemplaren oder Werken. @de
toolkit label: Person als Registrarin/Registrar von @de
toolkit definition: Ein Exemplar, das von einer Person als aggregiertes Werk verzeichnet oder inventarisiert wird, wie zum Beispiel eine Sammlung von Exemplaren oder Werken. @de
label: gyűjtemény-nyilvántartó személye a következőnek: @hu
definition: Hozzákapcsol egy személyt egy példányhoz, amelyet egy személy felsorol vagy leltárba vesz egy aggregáló műben, mint például példányok vagy művek gyűjteményében. @hu
toolkit label: gyűjtemény-nyilvántartó személye: @hu
toolkit definition: Egy példány, amelyet egy személy felsorol vagy leltárba vesz egy aggregáló műben, mint például példányok vagy művek gyűjteményében. @hu
label: è conservatore della raccolta persona di @it
definition: Correla una persona a un item elencato o inventariato da una persona in un'opera aggregata come una raccolta di item o opere. @it
toolkit label: conservatore della raccolta persona di @it
toolkit definition: Item elencato o inventariato da una persona in un'opera aggregata come una raccolta di item o opere. @it
label: είναι καταχωρητής συλλογής φυσικό πρόσωπο του @el
toolkit label: καταχωρητής συλλογής φυσικό πρόσωπο του @el
label: est une personne catalogueuse d’une collection de ressources de @fr
definition: Met une personne en relation avec un item qui est listé ou inventorié par une personne dans une œuvre agrégative telle qu’une collection d’items ou d’œuvres. @fr
toolkit label: personne catalogueuse d’une collection de ressources de @fr
toolkit definition: Item qui est listé ou inventorié par une personne dans une œuvre agrégative telle qu’une collection d’items ou d’œuvres. @fr
status: Deprecated
label: ir kolekcijas reģistrētājs (persona) @lv
definition: Sasaista personu ar vienību, ko persona uzskaitījusi vai inventarizējusi apkopotā darbā, piemēram, vienību vai darbu kolekcijā. @lv
toolkit label: ir kolekcijas reģistrētājs (persona) @lv
toolkit definition: Vienība, ko persona uzskaitījusi vai inventarizējusi apkopotā darbā, piemēram, vienību vai darbu kolekcijā. @lv
alternative label: personne conservatrice d’une collection de ressources de @fr
has subproperty: P50640

yhteistoimijan kuvaus
status: Published
label: is collective agent described by @en
type: Property
definition: Relates a collective agent to a work that is a description of a collective agent. @en
domain: C10011
sub property of: yhteistoimija aiheena teoksessa
sub property of: toimijan kuvaus
toolkit label: collective agent described by @en
toolkit definition: A work that is a description of a collective agent. @en
has element type: 2
alternative label: described in (collective agent) @en
definition: Liittää yhteistoimijan teokseen, joka kuvailee yhteistoimijaa.
alternative label: kuvattu teoksessa (yhteistoimija)
toolkit label: yhteistoimijan kuvaus
toolkit definition: Teos, joka kuvailee yhteistoimijaa.
label: er kollektiv agent beskrevet i @no
definition: Relaterer en kollektiv agent til et verk som beskriver en kollektiv agent. @no
alternative label: beskrevet i (kollektiv agent) @no
toolkit label: kollektiv agent beskrevet i @no
toolkit definition: Et verk som beskriver en kollektiv agent. @no
label: is collectieve actor beschreven in @nl
definition: Relateert een collectieve actor aan een werk dat een collectieve actor beschrijft. @nl
toolkit label: collectieve actor beschreven in @nl
toolkit definition: Een werk dat een collectieve actor beschrijft. @nl
label: وكيل جماعي موصوف في @ar
definition: يربط وكيلا جماعيا بعمل يصف وكيلا جماعيا. @ar
alternative label: موصوف في (وكيل جماعي ) @ar
toolkit label: وكيل جماعي موصوف في @ar
toolkit definition: عمل يصف وكيل جماعي. @ar
label: és agent col·lectiu descrit per @ca
definition: Relaciona un agent col·lectiu amb una obra que és una descripció d’un agent col·lectiu. @ca
alternative label: descrit en (agent col·lectiu) @ca
toolkit label: agent col·lectiu descrit per @ca
toolkit definition: Obra que és una descripció d’un agent col·lectiu. @ca
definition: Relaterer en kollektiv agent til et værk, som beskriver en kollektiv agent. @da
toolkit label: kollektiv agent beskrevet i @da
toolkit definition: Værk, som beskriver en kollektiv agent. @da
label: kollektiivi kirjeldus @et
definition: Seostab kollektiivi teosega, milles kollektiivi kirjeldatakse. @et
toolkit label: kollektiivi kirjeldus @et
toolkit definition: Teos, milles kollektiivi kirjeldatakse. @et
label: ist gemeinschaftlicher Akteur beschrieben in @de
definition: Setzt einen gemeinschaftlichen Akteur in Beziehung zu einem Werk, das einen gemeinschaftlichen Akteur beschreibt. @de
toolkit label: Gemeinschaftlicher Akteur beschrieben in @de
toolkit definition: Ein Werk, das einen gemeinschaftlichen Akteur beschreibt. @de
label: kollektív ágens leírva a következőben: @hu
definition: Hozzákapcsol egy kollektív ágenst egy műhöz, amely egy kollektív ágenst ír le. @hu
toolkit label: kollektív ágens leírva a következőben: @hu
toolkit definition: Egy mű, amely egy kollektív ágenst ír le. @hu
label: è agente collettivo descritto in @it
definition: Correla un agente collettivo a un'opera che descrive un agente collettivo. @it
alternative label: descritto in (agente collettivo) @it
toolkit label: agente collettivo descritto in @it
toolkit definition: Opera che descrive un agente collettivo. @it
label: είναι συλλογικός φορέας περιγραφόμενος σε @el
alternative label: περιγράφεται σε (συλλογικός φορέας) @el
toolkit label: συλλογικός φορέας περιγραφόμενος σε @el
label: est un agent collectif décrit par @fr
definition: Met un agent collectif en relation avec une œuvre qui consiste en une description d’un agent collectif. @fr
toolkit label: agent collectif décrit par @fr
toolkit definition: Œuvre qui consiste en une description d’un agent collectif. @fr
lexical alias: collectiveAgentDescribedBy.en
label: grupas apraksts @lv
definition: Sasaista grupu ar darbu, kurā aprakstīta konkrētā grupa. @lv
toolkit label: grupas apraksts @lv
toolkit definition: Darbs, kurā aprakstīta konkrētā grupa. @lv
alternative label: Beschrieben in (Gemeinschaftlicher Akteur) @de
alternative label: 被描述于（集体行为者） @zh-hans
label: 是被……描述的集体行为者 @zh-hans
definition: 将一个集体行为者与作为一个集体行为者之描述的一种作品关联起来。 @zh-hans
toolkit label: 被……描述的集体行为者 @zh-hans
toolkit definition: 作为一个集体行为者之描述的一种作品 @zh-hans
alternative label: descrito en (agente colectivo) @es
alternative label: décrit dans (agent collectif) @fr
alternative label: agent collectif décrit dans @fr
alternative label: leírva a következőben (kollektív ágens): @hu
toolkit label: tanımlanan kolektif temsilci @tr
toolkit definition: Kolektif bir temsilcinin tanımı olan bir eser @tr
has subproperty: sukua kuvaava teos
has subproperty: yhteisöä kuvaava teos

kokoelman muodostaja (toimija) kappaleessa
label: is collector agent of (Deprecated) @en
definition: Relates an agent to an item that is brought together by an agent with items from various sources that are arranged, described, or catalogued as a collection. (Deprecated) @en
type: Property
domain: C10002
sub property of: kuraattori (toimija) kappaleelle
lexical alias: collectorAgentOf.en
label: est un agent collectionneur de @fr
definition: Met un agent en relation avec un item qui est regroupé par un agent avec des items de diverses sources qui sont arrangés, décrits ou catalogués comme une collection de ressources. @fr
toolkit label: agent collectionneur de @fr
toolkit definition: Item qui est regroupé par un agent avec des items de diverses sources qui sont arrangés, décrits ou catalogués comme une collection de ressources. @fr
toolkit label: collector agent of (Deprecated) @en
toolkit definition: An item that is brought together by an agent with items from various sources that are arranged, described, or catalogued as a collection. (Deprecated) @en
instruction number: 18.5
label: είναι συλλέκτης φορέας του @el
definition: Συνδέει έναν έφορο, ο οποίος συγκεντρώνει αντικείμενα από διάφορες πηγές, τα οποία εν συνεχεία οργανώνονται, περιγράφονται και καταλογογραφούνται ως μία συλλογή από αντικείμενα, με ένα αντικείμενο. @el
toolkit label: συλλέκτης φορέας του @el
toolkit definition: Ένα τεκμήριο που συνενώνεται με τεκμήρια από διάφορες πηγές τα οποία εν συνεχεία οργανώνονται, περιγράφονται και καταλογογραφούνται ως μία συλλογή. @el
definition: Setzt einen Akteur in Beziehung zu einem Exemplar, das von einem Akteur mit Materialien aus unterschiedlichen Quellen zusammengetragen wird, die dann als Sammlung geordnet, beschrieben oder katalogisiert werden. @de
toolkit label: Akteur als Sammlerin/Sammler von @de
toolkit definition: Ein Exemplar, das von einem Akteur mit Materialien aus unterschiedlichen Quellen zusammengetragen wird, die dann als Sammlung geordnet, beschrieben oder katalogisiert werden. @de
label: er agent, som er samler af @da
definition: Relaterer en agent til et eksemplar, som er sammenført af en agent med eksemplarer fra forskellige kilder, som er arrangeret, beskrevet og katalogiseret som en samling. @da
toolkit label: agent, som er samler af @da
toolkit definition: Eksemplar, som er sammenført af en agent med eksemplarer fra forskellige kilder, som er arrangeret, beskrevet og katalogiseret som en samling. @da
label: és agent col·leccionista de @ca
definition: Relaciona un agent amb un ítem que és aplegat per un agent amb ítems de diverses fonts que s’arrangen, es descriuen o es cataloguen com una col·lecció. @ca
toolkit label: agent col·leccionista de @ca
toolkit definition: Ítem que és aplegat per un agent amb ítems de diverses fonts que s’arrangen, es descriuen o es cataloguen com una col·lecció. @ca
definition: Liittää toimijan kappaleeseen, jonka toimija on koonnut järjestetyksi, kuvailluksi tai luetteloiduksi kokoelmaksi eri lähteistä olevista kappaleista.
toolkit label: kokoelman muodostaja (toimija) kappaleessa
toolkit definition: Kappale, jonka toimija on koonnut osaksi järjestettyä, kuvailtua tai luetteloitua kokoelmaa yhdessä muiden eri lähteistä olevien kappaleiden kanssa.
toolkit label: samler av (agent) @no
toolkit definition: Et eksemplar som er satt sammen av en agent av eksemplarer fra ulike kilder og som deretter arrangeres, beskrives og katalogiseres som en samling. @no
label: ist Akteur als Sammlerin/Sammler von @de
has element type: 2
label: kollektor ágense a következőnek: @hu
definition: Hozzákapcsol egy ágenst egy példányhoz, amely egy ágens különböző forrásokból származó, gyűjteményként rendezett, leírt és katalogizált példányokkal fog össze. @hu
toolkit label: kollektor ágense: @hu
toolkit definition: Egy példány, amelyet egy ágens különböző forrásokból származó, gyűjteményként rendezett, leírt és katalogizált példányokkal fog össze. @hu
alternative label: collector of @en
alternative label: kokoelma
label: er samler av (agent) @no
definition: Relaterer en agent til et eksemplar som er satt sammen av en agent av eksemplarer fra ulike kilder og som deretter arrangeres, beskrives og katalogiseres som en samling. @no
alternative label: samler av @no
label: is verzamelaar-actor van @nl
definition: Relateert een actor aan een item dat samengebracht is door een actor met items van diverse bronnen die gearrangeerd, beschreven of gecatalogiseerd zijn als een verzameling. @nl
toolkit label: verzamelaar-actor van @nl
toolkit definition: Een item dat samengebracht is door een actor met items van diverse bronnen die gearrangeerd, beschreven of gecatalogiseerd zijn als een verzameling. @nl
label: هو وكيل جامع لـ @ar
definition: يربط وكيلا بمفردة جمعها وكيل مع مفردات من مصادر مختلفة رُتبت وُوصفت وفُهرست كمجموعة. @ar
alternative label: جامع لـ @ar
toolkit label: وكيل جامع @ar
toolkit definition: مفردة جمعها وكيل مع مفردات من مصادر مختلفة رُتبت ووُصفت وفُهرست كمجموعة. @ar
alternative label: col·leccionista de @ca
alternative label: samler af @da
label: kogu moodustaja (tegija) eksemplarile @et
definition: Seostab tegija eksemplariga, mille tegija on kokku pannud teiste eri allikatest kogutud eksemplaridega, mis on korrastatud, kirjeldatud ja kataloogitud koguna. @et
alternative label: kogu moodustaja eksemplarile @et
alternative label: koguja eksemplarile @et
toolkit label: kogu moodustaja (tegija) eksemplarile @et
toolkit definition: Eksemplar, mille tegija on kokku pannud teiste eri allikatest kogutud eksemplaridega, mis on korrastatud, kirjeldatud ja kataloogitud koguna. @et
alternative label: kollektora: @hu
label: è collezionista agente di @it
definition: Correla un agente a un item che è raccolto insieme da un agente con un item di varie sorgenti che sono organizzati, descritti e catalogati come una raccolta. @it
alternative label: collezionista di @it
toolkit label: collezionista agente di @it
toolkit definition: Item che è raccolto insieme da agente con item di varie sorgenti che sono organizzati, descritti e catalogati come una raccolta @it
alternative label: συλλέκτης του @el
alternative label: collectionneur de @fr
status: Deprecated
label: ir kolekcionārs (aģents) @lv
definition: Sasaista aģentu ar vienību, ko aģents apkopojis kopā ar citām vienībām no dažādiem avotiem, kas ir sakārtotas, aprakstītas un kataloģizētas kā kolekcija. @lv
toolkit label: ir kolekcionārs (aģents) @lv
toolkit definition: Vienība, ko aģents apkopojis kopā ar citām vienībām no dažādiem avotiem, kas ir sakārtotas, aprakstītas un kataloģizētas kā kolekcija. @lv
alternative label: Sammlerin/Sammler von @de
has subproperty: kokoelman muodostaja (yhteistoimija) kappaleessa
has subproperty: kokoelman muodostaja (henkilö) kappaleessa
has subproperty: P50045

kokoelman muodostaja (yhteistoimija) kappaleessa
label: is collector collective agent of (Deprecated) @en
definition: Relates a collective agent to an item that is brought together by a collective agent with items from various sources that are arranged, described, or catalogued as a collection. (Deprecated) @en
toolkit label: collector collective agent of (Deprecated) @en
toolkit definition: An item that is brought together by a collective agent with items from various sources that are arranged, described, or catalogued as a collection. (Deprecated) @en
type: Property
domain: C10011
has element type: 2
sub property of: kuraattori (yhteistoimija) kappaleessa
sub property of: kokoelman muodostaja (toimija) kappaleessa
definition: Liittää yhteistoimijan kappaleeseen, jonka yhteistoimija on koonnut järjestetyksi, kuvailluksi tai luetteloiduksi kokoelmaksi eri lähteistä olevista kappaleista.
toolkit label: kokoelman muodostaja (yhteistoimija) kappaleessa
toolkit definition: Kappale, jonka yhteistoimija on koonnut osaksi järjestettyä, kuvailtua tai luetteloitua kokoelmaa yhdessä muiden eri lähteistä olevien kappaleiden kanssa.
label: er samler av (kollektiv agent) @no
definition: Relaterer en kollektiv agent til et eksemplar som av en kollektiv agent er satt sammen med eksemplarer fra ulike kilder og som er arrangert, beskrevet eller katalogisert som en samling. @no
toolkit label: samler av (kollektiv agent) @no
toolkit definition: Et eksemplar som av en kollektiv agent er satt sammen med eksemplarer fra ulike kilder og som er arrangert, beskrevet eller katalogisert som en samling. @no
label: is verzamelaar-collectieve actor van @nl
definition: Relateert een collectieve actor aan een item dat samengebracht is door een collectieve actor met items van diverse bronnen die gearrangeerd, beschreven of gecatalogiseerd zijn als een verzameling. @nl
toolkit label: verzamelaar-collectieve actor van @nl
toolkit definition: Een item dat samengebracht is door een collectieve actor met items van diverse bronnen die gearrangeerd, beschreven of gecatalogiseerd zijn als een verzameling. @nl
label: هو وكيل جماعي جامع لـ @ar
definition: يربط وكيلا جامع بمفردة جمعها وكيل جامع مع مفردات من مصادر مختلفة رُتبت وُوصفت وفُهرست كمجموعة. @ar
toolkit label: وكيل جماعي جامع @ar
toolkit definition: مفردة جمعها وكيل جامع مع مفردات من مصادر مختلفة رُتبت وُوصفت وفُهرست كمجموعة. @ar
label: és agent col·lectiu col·leccionista de @ca
definition: Relaciona un agent col·lectiu amb un ítem que és aplegat per un agent col·lectiu amb ítems de diverses fonts que s’arrangen, es descriuen o es cataloguen com una col·lecció. @ca
toolkit label: agent col·lectiu col·leccionista de @ca
toolkit definition: Ítem que és aplegat per un agent col·lectiu amb ítems de diverses fonts que s’arrangen, es descriuen o es cataloguen com una col·lecció. @ca
label: er kollektiv agent, som er samler af @da
definition: Relaterer en kollektiv agent til et eksemplar, som er sammenført af en kollektiv agent med eksemplarer fra forskellige kilder, som er arrangeret, beskrevet og katalogiseret som en samling. @da
toolkit label: kollektiv agent, som er samler af @da
toolkit definition: Eksemplar, som er sammenført af en kollektiv agent med eksemplarer fra forskellige kilder, som er arrangeret, beskrevet og katalogiseret som en samling. @da
label: kogu moodustaja (kollektiiv) eksemplarile @et
definition: Seostab kollektiivi eksemplariga, mille kollektiiv on kokku pannud teiste eri allikatest kogutud eksemplaridega, mis on korrastatud, kirjeldatud ja kataloogitud koguna. @et
toolkit label: kogu moodustaja (kollektiiv) eksemplarile @et
toolkit definition: Eksemplar, mille kollektiiv on kokku pannud teiste eri allikatest kogutud eksemplaridega, mis on korrastatud, kirjeldatud ja kataloogitud koguna. @et
label: ist gemeinschaftlicher Akteur als Sammlerin/Sammler von @de
definition: Setzt einen gemeinschaftlichen Akteur in Beziehung zu einem Exemplar, das von einem gemeinschaftlichen Akteur mit Materialien aus unterschiedlichen Quellen zusammengetragen wird, die dann als Sammlung geordnet, beschrieben oder katalogisiert werden. @de
toolkit label: Gemeinschaftlicher Akteur als Sammlerin/Sammler von @de
toolkit definition: Ein Exemplar, das von einem gemeinschaftlichen Akteur mit Materialien aus unterschiedlichen Quellen zusammengetragen wird, die dann als Sammlung geordnet, beschrieben oder katalogisiert werden. @de
label: kollektor kollektív ágense a következőnek: @hu
definition: Hozzákapcsol egy kollektív ágenst egy példányhoz, amelyet egy kollektív ágens különböző forrásokból származó, gyűjteményként rendezett, leírt és katalogizált példányokkal fog össze. @hu
toolkit label: kollektor kollektív ágense: @hu
toolkit definition: Egy példány, amelyet egy kollektív ágens különböző forrásokból származó, gyűjteményként rendezett, leírt és katalogizált példányokkal fog össze. @hu
label: è collezionista agente collettivo di @it
definition: Correla un agente collettivo a un item messo insieme da un agente collettivo con item da varie fonti che sono organizzati, descritti e catalogati come una collezione. @it
toolkit label: collezionista agente collettivo di @it
toolkit definition: Item messo insieme da un agente collettivo con item da varie fonti che sono organizzati, descritti e catalogati come una collezione. @it
label: είναι συλλέκτης συλλογικός φορέας του @el
toolkit label: συλλέκτης συλλογικός φορέας του @el
label: est un agent collectif collectionneur de @fr
definition: Met un agent collectif en relation avec un item qui est regroupé par un agent collectif avec des items de diverses sources qui sont arrangés, décrits ou catalogués comme une collection de ressources. @fr
toolkit label: agent collectif collectionneur de @fr
toolkit definition: Item qui est regroupé par un agent collectif avec des items de diverses sources qui sont arrangés, décrits ou catalogués comme une collection de ressources. @fr
lexical alias: collectorCollectiveAgentof.en
status: Deprecated
label: ir kolekcionārs (grupa) @lv
definition: Sasaista grupu ar vienību, ko grupa apkopojusi kopā ar citām vienībām no dažādiem avotiem, kas ir sakārtotas, aprakstītas un kataloģizētas kā kolekcija. @lv
toolkit label: ir kolekcionārs (grupa) @lv
toolkit definition: Vienība, ko grupa apkopojusi kopā ar citām vienībām no dažādiem avotiem, kas ir sakārtotas, aprakstītas un kataloģizētas kā kolekcija. @lv
has subproperty: kokoelman muodostaja (yhteisö) kappaleessa
has subproperty: kokoelman muodostaja (suku) kappaleessa
has subproperty: P50786

kokoelman muodostaja (yhteisö) kappaleessa
label: is collector corporate body of (Deprecated) @en
definition: Relates a corporate body to an item that is brought together by a corporate body with items from various sources that are arranged, described, or catalogued as a collection. (Deprecated) @en
toolkit label: collector corporate body of (Deprecated) @en
toolkit definition: An item that is brought together by a corporate body with items from various sources that are arranged, described, or catalogued as a collection. (Deprecated) @en
type: Property
domain: C10005
has element type: 2
sub property of: kuraattori (yhteisö) kappaleessa
sub property of: kokoelman muodostaja (yhteistoimija) kappaleessa
definition: Liittää yhteisön kappaleeseen, jonka yhteisö on koonnut järjestetyksi, kuvailluksi tai luetteloiduksi kokoelmaksi eri lähteistä olevista kappaleista.
toolkit label: kokoelman muodostaja (yhteisö) kappaleessa
toolkit definition: Kappale, jonka yhteisö on koonnut osaksi järjestettyä, kuvailtua tai luetteloitua kokoelmaa yhdessä muiden eri lähteistä olevien kappaleiden kanssa.
label: er samler av (korporasjon) @no
definition: Relaterer en korporasjon til et eksemplar som av en korporasjon er satt sammen med eksemplarer fra ulike kilder og som er arrangert, beskrevet eller katalogisert som en samling. @no
toolkit label: samler av (korporasjon) @no
toolkit definition: Et eksemplar som av en korporasjon er satt sammen med eksemplarer fra ulike kilder og som er arrangert, beskrevet eller katalogisert som en samling. @no
label: is verzamelaar-corporatie van @nl
definition: Relateert een corporatie aan een item dat samengebracht is door een corporatie met items van diverse bronnen die gearrangeerd, beschreven of gecatalogiseerd zijn als een verzameling. @nl
toolkit label: verzamelaar-corporatie van @nl
toolkit definition: Een item dat samengebracht is door een corporatie met items van diverse bronnen die gearrangeerd, beschreven of gecatalogiseerd zijn als een verzameling. @nl
label: هي هيئة جامعة لـ @ar
definition: يربط هيئة بمفردة جمعتها هيئة مع مفردات من مصادر مختلفة رُتبت وُوصفت وفُهرست كمجموعة. @ar
toolkit label: هيئة جامعة @ar
toolkit definition: مفردة جمعتها هيئة مع مفردات من مصادر مختلفة رُتبت وُوصفت وفُهرست كمجموعة. @ar
label: és entitat corporativa col·leccionista de @ca
definition: Relaciona una entitat corporativa amb un ítem que és aplegat per una entitat corporativa amb ítems de diverses fonts que s’arrangen, es descriuen o es cataloguen com una col·lecció. @ca
toolkit label: entitat corporativa col·leccionista de @ca
toolkit definition: Ítem que és aplegat per una entitat corporativa amb ítems de diverses fonts que s’arrangen, es descriuen o es cataloguen com una col·lecció. @ca
label: er korporation, som er samler af @da
definition: Relaterer en korporation til et eksemplar, som er sammenført af en korporation med eksemplarer fra forskellige kilder, som er arrangeret, beskrevet og katalogiseret som en samling. @da
toolkit label: korporation, som er samler af @da
toolkit definition: Eksemplar, som er sammenført af en korporation med eksemplarer fra forskellige kilder, som er arrangeret, beskrevet og katalogiseret som en samling. @da
label: kogu moodustaja (asutus) eksemplarile @et
definition: Seostab asutuse eksemplariga, mille asutus on kokku pannud teiste eri allikatest kogutud eksemplaridega, mis on korrastatud, kirjeldatud ja kataloogitud koguna. @et
toolkit label: kogu moodustaja (asutus) eksemplarile @et
toolkit definition: Eksemplar, mille asutus on kokku pannud teiste eri allikatest kogutud eksemplaridega, mis on korrastatud, kirjeldatud ja kataloogitud koguna. @et
label: ist Körperschaft als Sammlerin/Sammler von @de
definition: Setzt eine Körperschaft in Beziehung zu einem Exemplar, das von einer Körperschaft mit Materialien aus unterschiedlichen Quellen zusammengetragen wird, die dann als Sammlung geordnet, beschrieben oder katalogisiert werden. @de
toolkit label: Körperschaft als Sammlerin/Sammler von @de
toolkit definition: Ein Exemplar, das von einer Körperschaft mit Materialien aus unterschiedlichen Quellen zusammengetragen wird, die dann als Sammlung geordnet, beschrieben oder katalogisiert werden. @de
label: kollektor testülete a következőnek: @hu
definition: Hozzákapcsol egy testületet egy példányhoz, amelyet egy testület különböző forrásokból származó, gyűjteményként rendezett, leírt és katalogizált példányokkal fog össze. @hu
toolkit label: kollektor testülete: @hu
toolkit definition: Egy példány, amelyet egy testület különböző forrásokból származó, gyűjteményként rendezett, leírt és katalogizált példányokkal fog össze. @hu
label: è collezionista ente di @it
definition: Correla un ente a un item messo insieme da un ente con item da varie fonti che sono organizzati, descritti e catalogati come una collezione. @it
toolkit label: collezionista ente di @it
toolkit definition: Item messo insieme da un ente con item di provenienza varia che sono organizzati, descritti e catalogati come una collezione. @it
label: είναι συλλέκτης συλλογικό όργανο του @el
toolkit label: συλλέκτης συλλογικό όργανο του @el
label: est une collectivité collectionneuse de @fr
definition: Met une collectivité en relation avec un item qui est regroupé par une collectivité avec des items de diverses sources qui sont arrangés, décrits ou catalogués comme une collection de ressources. @fr
toolkit label: collectivité collectionneuse de @fr
toolkit definition: Item qui est regroupé par une collectivité avec des items de diverses sources qui sont arrangés, décrits ou catalogués comme une collection de ressources. @fr
lexical alias: collectorCorporateBodyof.en
status: Deprecated
label: ir kolekcionārs (institūcija) @lv
definition: Sasaista institūciju ar vienību, ko institūcija apkopojusi kopā ar citām vienībām no dažādiem avotiem, kas ir sakārtotas, aprakstītas un kataloģizētas kā kolekcija. @lv
toolkit label: ir kolekcionārs (institūcija) @lv
toolkit definition: Vienība, ko institūcija apkopojusi kopā ar citām vienībām no dažādiem avotiem, kas ir sakārtotas, aprakstītas un kataloģizētas kā kolekcija. @lv
has subproperty: P50937

kokoelman muodostaja (suku) kappaleessa
label: is collector family of (Deprecated) @en
definition: Relates a family to an item that is brought together by a family with items from various sources that are arranged, described, or catalogued as a collection. (Deprecated) @en
toolkit label: collector family of (Deprecated) @en
toolkit definition: An item that is brought together by a family with items from various sources that are arranged, described, or catalogued as a collection. (Deprecated) @en
type: Property
domain: C10008
has element type: 2
sub property of: kuraattori (suku) kappaleessa
sub property of: kokoelman muodostaja (yhteistoimija) kappaleessa
definition: Liittää suvun kappaleeseen, jonka suku on koonnut järjestetyksi, kuvailluksi tai luetteloiduksi kokoelmaksi eri lähteistä olevista kappaleista.
toolkit label: kokoelman muodostaja (suku) kappaleessa
toolkit definition: Kappale, jonka suku on koonnut osaksi järjestettyä, kuvailtua tai luetteloitua kokoelmaa yhdessä muiden eri lähteistä olevien kappaleiden kanssa.
label: er samler av (familie) @no
definition: Relaterer en familie til et eksemplar som av en familie er satt sammen med eksemplarer fra ulike kilder og som er arrangert, beskrevet eller katalogisert som en samling. @no
toolkit label: samler av (familie) @no
toolkit definition: Et eksemplar som av en familie er satt sammen med eksemplarer fra ulike kilder og som er arrangert, beskrevet eller katalogisert som en samling. @no
label: is verzamelaar-familie van @nl
definition: Relateert een familie aan een item dat samengebracht is door een familie met items van diverse bronnen die gearrangeerd, beschreven of gecatalogiseerd zijn als een verzameling. @nl
toolkit label: verzamelaar-familie van @nl
toolkit definition: Een item dat samengebracht is door een familie met items van diverse bronnen die gearrangeerd, beschreven of gecatalogiseerd zijn als een verzameling. @nl
label: هي عائلة جامعة لـ @ar
definition: يربط عائلة بمفردة جمعتها عائلة مع مفردات من مصادر مختلفة رُتبت وُوصفت وفُهرست كمجموعة. @ar
toolkit label: عائلة جامعة @ar
toolkit definition: مفردة جمعتها عائلة مع مفردات من مصادر مختلفة يتم ترتيبها و وصفها وفهرستها كمجموعة. @ar
label: és família col·leccionista de @ca
definition: Relaciona una família amb un ítem que és aplegat per una família amb ítems de diverses fonts que s’arrangen, es descriuen o es cataloguen com una col·lecció. @ca
toolkit label: família col·leccionista de @ca
toolkit definition: Ítem que és aplegat per una família amb ítems de diverses fonts que s’arrangen, es descriuen o es cataloguen com una col·lecció. @ca
label: er familie, som er samler af @da
definition: Relaterer en familie til et eksemplar, som er sammenført af en familie med eksemplarer fra forskellige kilder, som er arrangeret, beskrevet eller katalogiseret som en samling. @da
toolkit label: familie, som er samler af @da
toolkit definition: Eksemplar, som er sammenført af en familie med eksemplarer fra forskellige kilder, som er arrangeret, beskrevet eller katalogiseret som en samling. @da
label: kogu moodustaja (perekond) eksemplarile @et
definition: Seostab perekonna eksemplariga, mille perekond on kokku pannud teiste eri allikatest kogutud eksemplaridega, mis on korrastatud, kirjeldatud ja kataloogitud koguna. @et
toolkit label: kogu moodustaja (perekond) eksemplarile @et
toolkit definition: Eksemplar, mille perekond on kokku pannud teiste eri allikatest kogutud eksemplaridega, mis on korrastatud, kirjeldatud ja kataloogitud koguna. @et
label: ist Familie als Sammlerin/Sammler von @de
definition: Setzt eine Familie in Beziehung zu einem Exemplar, das von einer Familie mit Materialien aus unterschiedlichen Quellen zusammengetragen wird, die dann als Sammlung geordnet, beschrieben oder katalogisiert werden. @de
toolkit label: Familie als Sammlerin/Sammler von @de
toolkit definition: Ein Exemplar, das von einer Familie mit Materialien aus unterschiedlichen Quellen zusammengetragen wird, die dann als Sammlung geordnet, beschrieben oder katalogisiert werden. @de
label: kollektor családja a következőnek: @hu
definition: Hozzákapcsol egy családot egy példányhoz, amelyet egy család különböző forrásokból származó, gyűjteményként rendezett, leírt és katalogizált példányokkal fog össze. @hu
toolkit label: kollektor családja: @hu
toolkit definition: Egy példány, amelyet egy család különböző forrásokból származó, gyűjteményként rendezett, leírt és katalogizált példányokkal fog össze. @hu
label: è collezionista famiglia di @it
definition: Correla una famiglia a un item messo insieme da una famiglia con item da varie fonti che sono organizzati, descritti e catalogati come una collezione. @it
toolkit label: collezionista famiglia di @it
toolkit definition: Item messo insieme da una famiglia con item da varie fonti che sono organizzati, descritti e catalogati come una collezione. @it
label: είναι συλλέκτης οικογένεια του @el
definition: Συνδέει μια οικογένεια με ένα αντίτυπο το οποίο ενώνεται από μια οικογένεια με αντίτυπα από διάφορες πηγές που οργανώνονται, περιγράφονται και καταλογογραφούνται ως συλλογή. @el
toolkit label: συλλέκτης οικογένεια του @el
label: est une famille collectionneuse de @fr
definition: Met une famille en relation avec un item qui est regroupé par une famille avec des items de diverses sources qui sont arrangés, décrits ou catalogués comme une collection de ressources. @fr
toolkit label: famille collectionneuse de @fr
toolkit definition: Item qui est regroupé par une famille avec des items de diverses sources qui sont arrangés, décrits ou catalogués comme une collection de ressources. @fr
lexical alias: collectorFamilyof.en
status: Deprecated
label: ir kolekcionārs (dzimta/ģimene) @lv
definition: Sasaista dzimtu/ģimeni ar vienību, ko dzimta/ģimene apkopojusi kopā ar citām vienībām no dažādiem avotiem, kas ir sakārtotas, aprakstītas un kataloģizētas kā kolekcija. @lv
toolkit label: ir kolekcionārs (dzimta/ģimene) @lv
toolkit definition: Vienība, ko dzimta/ģimene apkopojusi kopā ar citām vienībām no dažādiem avotiem, kas ir sakārtotas, aprakstītas un kataloģizētas kā kolekcija. @lv
has subproperty: P51088

kokoelman muodostaja (henkilö) kappaleessa
label: is collector person of (Deprecated) @en
definition: Relates a person to an item that is brought together by a person with items from various sources that are arranged, described, or catalogued as a collection. (Deprecated) @en
toolkit label: collector person of (Deprecated) @en
toolkit definition: An item that is brought together by a person with items from various sources that are arranged, described, or catalogued as a collection. (Deprecated) @en
type: Property
domain: C10004
has element type: 2
sub property of: kuraattori (henkilö) kappaleessa
sub property of: kokoelman muodostaja (toimija) kappaleessa
definition: Liittää henkilön kappaleeseen, jonka henkilö on koonnut järjestetyksi, kuvailluksi tai luetteloiduksi kokoelmaksi eri lähteistä olevista kappaleista.
toolkit label: kokoelman muodostaja (henkilö) kappaleessa
toolkit definition: Kappale, jonka henkilö on koonnut osaksi järjestettyä, kuvailtua tai luetteloitua kokoelmaa yhdessä muiden eri lähteistä olevien kappaleiden kanssa.
label: er samler av (person) @no
definition: Relaterer en person til et eksemplar som av en person er satt sammen med eksemplarer fra ulike kilder og som er arrangert, beskrevet eller katalogisert som en samling. @no
toolkit label: samler av (person) @no
toolkit definition: Et eksemplar som av en person er satt sammen med eksemplarer fra ulike kilder og som er arrangert, beskrevet eller katalogisert som en samling. @no
label: is verzamelaar-persoon van @nl
definition: Relateert een persoon aan een item dat samengebracht is door een persoon met items van diverse bronnen die gearrangeerd, beschreven of gecatalogiseerd zijn als een verzameling. @nl
toolkit label: verzamelaar-persoon van @nl
toolkit definition: Een item dat samengebracht is door een persoon met items van diverse bronnen die gearrangeerd, beschreven of gecatalogiseerd zijn als een verzameling. @nl
label: هو شخص جامع لـ @ar
definition: يربط شخصا بمفردة جمعها وكيل مع مفردات من مصادر مختلفة رُتبت وُوصفت وفُهرست كمجموعة. @ar
toolkit label: شخص جامع @ar
toolkit definition: مفردة جمعها شخص مع مفردات من مصادر مختلفة رُتبت وُوصفت وفُهرست كمجموعة. @ar
label: és persona col·leccionista de @ca
definition: Relaciona una persona amb un ítem que és aplegat per una persona amb ítems de diverses fonts que s’arrangen, es descriuen o es cataloguen com una col·lecció. @ca
toolkit label: persona col·leccionista de @ca
toolkit definition: Ítem que és aplegat per una persona amb ítems de diverses fonts que s’arrangen, es descriuen o es cataloguen com una col·lecció. @ca
label: er person, som er samler af @da
definition: Relaterer en person til et eksemplar, som er sammenført af en person med eksemplarer fra forskellige kilder, som er arrangeret, beskrevet og katalogiseret som en samling. @da
toolkit label: person, som er samler af @da
toolkit definition: Eksemplar, som er sammenført af en person med eksemplarer fra forskellige kilder, som er arrangeret, beskrevet og katalogiseret som en samling. @da
label: kogu moodustaja (isik) eksemplarile @et
definition: Seostab isiku eksemplariga, mille isik on kokku pannud teiste eri allikatest kogutud eksemplaridega, mis on korrastatud, kirjeldatud ja kataloogitud koguna. @et
toolkit label: kogu moodustaja (isik) eksemplarile @et
toolkit definition: Eksemplar, mille isik on kokku pannud teiste eri allikatest kogutud eksemplaridega, mis on korrastatud, kirjeldatud ja kataloogitud koguna. @et
label: ist Person als Sammlerin/Sammler von @de
definition: Setzt eine Person in Beziehung zu einem Exemplar, das von einer Person mit Materialien aus unterschiedlichen Quellen zusammengetragen wird, die dann als Sammlung geordnet, beschrieben oder katalogisiert werden. @de
toolkit label: Person als Sammlerin/Sammler von @de
toolkit definition: Ein Exemplar, das von einer Person mit Materialien aus unterschiedlichen Quellen zusammengetragen wird, die dann als Sammlung geordnet, beschrieben oder katalogisiert werden. @de
label: kollektor személye a következőnek: @hu
definition: Hozzákapcsol egy személyt egy példányhoz, amelyet egy személy különböző forrásokból származó, gyűjteményként rendezett, leírt és katalogizált példányokkal fog össze. @hu
toolkit label: kollektor személye: @hu
toolkit definition: Egy példány, amelyet egy személy különböző forrásokból származó, gyűjteményként rendezett, leírt és katalogizált példányokkal fog össze. @hu
label: è collezionista persona di @it
definition: Correla una persona a un item messo insieme da una persona con item da varie fonti che sono organizzati, descritti e catalogati come una collezione. @it
toolkit label: collezionista persona di @it
toolkit definition: Item messo insieme da una persona con item da varie fonti che sono organizzati, descritti e catalogati come una collezione. @it
label: είναι συλλέκτης φυσικό πρόσωπο του @el
toolkit label: συλλέκτης φυσικό πρόσωπο του @el
label: est une personne collectionneuse de @fr
definition: Met une personne en relation avec un item qui est regroupé par une personne avec des items de diverses sources qui sont arrangés, décrits ou catalogués comme une collection de ressources. @fr
toolkit label: personne collectionneuse de @fr
toolkit definition: Item qui est regroupé par une personne avec des items de diverses sources qui sont arrangés, décrits ou catalogués comme une collection de ressources. @fr
lexical alias: collectorPersonof.en
status: Deprecated
label: ir kolekcionārs (persona) @lv
definition: Sasaista personu ar vienību, ko persona apkopojusi kopā ar citām vienībām no dažādiem avotiem, kas ir sakārtotas, aprakstītas un kataloģizētas kā kolekcija. @lv
toolkit label: ir kolekcionārs (persona) @lv
toolkit definition: Vienība, ko persona apkopojusi kopā ar citām vienībām no dažādiem avotiem, kas ir sakārtotas, aprakstītas un kataloģizētas kā kolekcija. @lv
has subproperty: P50635

kollotypian valmistaja (toimija) manifestaatiossa
status: Published
label: is collotyper agent of @en
definition: Relates an agent to a manifestation that involves a responsibility of an agent for preparing a hardened film of gelatin or other colloid that has ink-receptive and ink-repellent surfaces and that is used to make prints using a photomechanical process. @en
type: Property
domain: C10002
lexical alias: collotyperAgentOf.en
label: est un agent phototypeur de @fr
definition: Met un agent en relation avec une manifestation qui comporte une responsabilité de la part d’un agent consistant à préparer un film durci de gélatine ou d’un autre colloïde présentant des surfaces réceptives et répulsives à l’encre et servant à réaliser des images imprimées à l’aide d’un procédé photomécanique. @fr
toolkit label: agent phototypeur de @fr
toolkit definition: Manifestation qui comporte une responsabilité de la part d’un agent consistant à préparer un film durci de gélatine ou d’un autre colloïde présentant des surfaces réceptives et répulsives à l’encre et servant à réaliser des images imprimées à l’aide d’un procédé photomécanique. @fr
toolkit label: collotyper agent of @en
toolkit definition: A manifestation that involves a responsibility of an agent for preparing a hardened film of gelatin or other colloid that has ink-receptive and ink-repellent surfaces and that is used to make prints using a photomechanical process. @en
instruction number: 18.5
label: είναι κατασκευαστής κολλοτυπίας φορέας του @el
definition: Συνδέει έναν φορέα, ο οποίος εμπλέκεται στην κατασκευή μιας εκδήλωσης μέσω της χρήσης μιας φωτομηχανικής διαδικασίας για τη δημιουργία εκτυπώσεων κατευθείαν από ένα σκληρυμένο φιλμ ζελατίνης ή άλλο κολλοειδές, το οποίο έχει μελανο-δεκτικές και μελανο-απωθητικές επιφάνειες, με μια εκδήλωση. @el
toolkit label: κατασκευαστής κολλοτυπίας φορέας του @el
toolkit definition: Μια εκδήλωση που κατασκευάζεται από έναν φορέα υπεύθυνο για τη χρήση μιας φωτομηχανικής διαδικασίας για τη δημιουργία εκτυπώσεων κατευθείαν από ένα σκληρυμένο φιλμ ζελατίνης ή άλλο κολλοειδές, το οποίο έχει μελανο-δεκτικές και μελανο-απωθητικές επιφάνειες. @el
definition: Setzt einen Akteur in Beziehung zu einer Manifestation, bei der ein Akteur für die Verwendung eines fotomechanischen Verfahrens zur Herstellung von Abzügen direkt von einem gehärteten Film aus Gelatine oder einem anderen Kolloid, der druckerfarbenaufnehmende und -abweisende Oberflächen aufweist, verantwortlich ist. @de
toolkit label: Akteur als Lichtdruckerin/Lichtdrucker von @de
toolkit definition: Eine Manifestation, bei der ein Akteur für die Verwendung eines fotomechanischen Verfahrens zur Herstellung von Abzügen direkt von einem gehärteten Film aus Gelatine oder einem anderen Kolloid, der druckerfarbenaufnehmende und -abweisende Oberflächen aufweist, verantwortlich ist. @de
label: er agent, som er lystrykker af @da
definition: Relaterer en agent til en manifestation, som involverer en agents ansvar for en fotomekanisk proces, hvorved der laves tryk direkte fra et hærdet gelatinelag eller andet kolloid, som har blækmodtagelige og blækafvisende overflader. @da
toolkit label: agent, som er lystrykker af @da
toolkit definition: Manifestation, som involverer en agents ansvar for en fotomekanisk proces, hvorved der laves tryk direkte fra et hærdet gelatinelag eller andet kolloid, som har blækmodtagelige og blækafvisende overflader. @da
label: és agent fototipista de @ca
definition: Relaciona un agent amb una manifestació que implica una responsabilitat d’un agent en la preparació d’una pel·lícula endurida de gelatina o d’un altre col·loide que té superfícies que accepten o rebutgen la tinta i que s’usa per fer gravats usant un procés fotomecànic. @ca
toolkit label: agent fototipista de @ca
toolkit definition: Manifestació que implica una responsabilitat d’un agent en la preparació d’una pel·lícula endurida de gelatina o d’un altre col·loide que té superfícies que accepten o rebutgen la tinta i que s’usa per fer gravats usant un procés fotomecànic. @ca
definition: Liittää toimijan manifestaatioon, jonka valmistamisesta toimija on vastuussa tekemällä vedoksia suoraan kovettuneelta gelatiinifilmiltä tai muulta materiaalilta, jossa on mustetta imeviä ja hylkiviä pintoja.
toolkit label: kollotypian valmistaja (toimija) manifestaatiossa
toolkit definition: Manifestaatio, jonka valmistamisesta toimija on vastuussa tekemällä vedoksia suoraan kovettuneelta gelatiinifilmiltä tai muulta materiaalilta, jossa on mustetta imeviä ja hylkiviä pintoja.
toolkit label: lystrykker av (agent) @no
toolkit definition: En manifestasjon som involverer ansvar for en agent i form av å bruke en fotomekanisk prosess for å lage kopier direkte fra en stivnet film av gelatin eller et annet kolloid som har overflater som er mottagelige for blekk og motstandige mot blekk. @no
label: ist Akteur als Lichtdruckerin/Lichtdrucker von @de
has element type: 2
label: fénynyomatkészítő ágense a következőnek: @hu
definition: Hozzákapcsol egy ágenst egy megjelenési formához, amelyhez hozzátartozik egy ágens felelőssége nyomtatványok fotómechanikai eljárással történő közvetlen előállításáért, amihez festékfelvevő és festéktaszító felülettel rendelkező zselatin vagy más kolloid megkeményedett filmjét használja. @hu
toolkit label: fénynyomatkészítő ágense: @hu
toolkit definition: Egy megjelenési forma, amelyhez hozzátartozik egy ágens felelőssége nyomtatványok fotómechanikai eljárással történő közvetlen előállításáért, amihez festékfelvevő és festéktaszító felülettel rendelkező zselatin vagy más kolloid megkeményedett filmjét használja. @hu
alternative label: collotyper of @en
alternative label: valmistajana kollotypioinnissa
label: er lystrykker av (agent) @no
definition: Relaterer en agent til en manifestasjon som involverer ansvar for en agent i form av å bruke en fotomekanisk prosess for å lage kopier direkte fra en stivnet film av gelatin eller et annet kolloid som har overflater som er mottagelige for blekk og motstandige mot blekk. @no
alternative label: lystrykker av @no
label: is lichtdrukker-actor van @nl
definition: Relateert een actor aan een manifestatie die met zich meebrengt een verantwoordelijkheid van een actor voor het gebruiken van een fotomechanisch proces voor het maken van afdrukken direct vanaf een verharde film van gelatine of ander colloïde dat inktopnemende en inktafstotende oppervlakken heeft. @nl
toolkit label: lichtdrukker-actor van @nl
toolkit definition: Een manifestatie die met zich meebrengt een verantwoordelijkheid van een actor voor het gebruiken van een fotomechanisch proces voor het maken van afdrukken direct vanaf een verharde film van gelatine of ander colloïde dat inktopnemende en inktafstotende oppervlakken heeft. @nl
label: هو وكيل طبّاع صور فوتوغرافية @ar
definition: يربط وكيلا بتجسيدة تنطوي على مسئولية وكيل عن استخدام عمليات ميكانيكية ضوئية لإنتاج المطبوعات مباشرة من فيلم صلد من الجيلاتين أو من غيره من المواد الغروية التي تحتوي على أسطح مستقبلة أو طاردة للحبر. @ar
alternative label: طبّاع صور فوتوغرافية لـ @ar
toolkit label: وكيل طبّاع صور فوتوغرافية @ar
toolkit definition: تجسيدة تنطوي على مسئولية وكيل عن استخدام عمليات ميكانيكية ضوئية لإنتاج المطبوعات مباشرة من فيلم صلد من الجيلاتين أو غيره من المواد الغروية التي تحتوي على أسطح مستقبلة أو طاردة للحبر. @ar
alternative label: fototipista de @ca
alternative label: lystrykker af @da
label: kollotüübi valmistaja (tegija) kehastuses @et
definition: Seostab tegija kehastusega, mis sisaldab tegija vastutust fotomehaanilises protsessis tõmmiste tegemise eest otse želatiini või muu kolloidi tahkunud kihilt, mille pind osalt seob värvainet, osalt ei seo. @et
alternative label: kollotüübi valmistaja kehastuses @et
toolkit label: kollotüübi valmistaja (tegija) kehastuses @et
toolkit definition: Kehastus, mis sisaldab tegija vastutust fotomehaanilises protsessis tõmmiste tegemise eest otse želatiini või muu kolloidi tahkunud kihilt, mille pind osalt seob värvainet, osalt ei seo. @et
alternative label: fénynyomatkészítője: @hu
label: è collotipista agente di @it
definition: Correla un agente a una manifestazione che implica la responsabilità di un agente per l'utilizzo di un processo fotomeccanico per ottenere stampe direttamente da una pellicola indurita di gelatina o altro colloide che abbia superfici recettive e repellenti all'inchiostro. @it
alternative label: fototipografo di @it
toolkit label: collotipista agente di @it
toolkit definition: Manifestazione che implica la responsabilità di un agente per l'utilizzo di un processo fotomeccanico per ottenere stampe direttamente da una pellicola indurita di gelatina o altro colloide che abbia superfici recettive e repellenti all'inchiostro. @it
alternative label: κατασκευαστής κολλοτυπίας του @el
label: ir fotogravieris (aģents) @lv
definition: Sasaista aģentu ar manifestāciju, kas ietver aģenta atbildību par fotomehānisku procesu, lai izgatavotu izdrukas tieši no plates, kas pārklāta ar gaismjutīga hromželatīna slāni vai citu koloīdu, kuram ir tinti piesaistošas un tinti atgrūdošas virsmas. @lv
toolkit label: ir fotogravieris (aģents) @lv
toolkit definition: Manifestācija, kas ietver aģenta atbildību par fotomehānisku procesu, lai izgatavotu izdrukas tieši no plates, kas pārklāta ar gaismjutīga hromželatīna slāni vai citu koloīdu, kuram ir tinti piesaistošas un tinti atgrūdošas virsmas. @lv
sub property of: kuvalaatan valmistaja (toimija) manifestaatiossa
alternative label: Lichtdrucker von @de
alternative label: ……的珂罗版制作者 @zh-hans
label: 是……的珂罗版制作者行为者 @zh-hans
toolkit label: ……的珂罗版制作者行为者 @zh-hans
toolkit definition: 涉及利用一面吸墨而另一面不吸墨的明胶或其他硬胶片进行影印的一个行为者的责任的一种载体表现 @zh-hans
toolkit label: taş baskıcı temsilcisi @tr
toolkit definition: Mürekkep alıcı ve mürekkep tutmayan yüzeylere sahip olan ve bir fotomekanik süreç kullanarak baskı yapmak için kullanılan sertleştirilmiş bir jelatin filmi veya diğer jelleri hazırlamakla görevli temsilcinin sorumluluğunu içeren bir gösterim. @tr
has subproperty: kollotypian valmistaja (yhteistoimija) manifestaatiossa

kollotypian valmistaja (yhteistoimija) manifestaatiossa
status: Published
label: is collotyper collective agent of @en
lexical alias: collotyperCollectiveAgentOf.en
definition: Relates a collective agent to a manifestation that involves a responsibility of a collective agent for preparing a hardened film of gelatin or other colloid that has ink-receptive and ink-repellent surfaces and that is used to make prints using a photomechanical process. @en
toolkit label: collotyper collective agent of @en
toolkit definition: A manifestation that involves a responsibility of a collective agent for preparing a hardened film of gelatin or other colloid that has ink-receptive and ink-repellent surfaces and that is used to make prints using a photomechanical process. @en
type: Property
domain: C10011
has element type: 2
sub property of: kollotypian valmistaja (toimija) manifestaatiossa
definition: Liittää yhteistoimijan manifestaatioon, jonka valmistamisesta yhteistoimija on vastuussa tekemällä vedoksia suoraan kovettuneelta gelatiinifilmiltä tai muulta materiaalilta, jossa on mustetta imeviä ja hylkiviä pintoja.
toolkit label: kollotypian valmistaja (yhteistoimija) manifestaatiossa
toolkit definition: Manifestaatio, jonka valmistamisesta yhteistoimija on vastuussa tekemällä vedoksia suoraan kovettuneelta gelatiinifilmiltä tai muulta materiaalilta, jossa on mustetta imeviä ja hylkiviä pintoja.
label: er lystrykker for (kollektiv agent) @no
definition: Relaterer en kollektiv agent til en manifestasjon som involverer et ansvar for en kollektiv agent i form av bruk av en fotomekanisk prosess for å lage kopier direkte fra en stivnet film av gelatin eller et annet kolloid som har overflater som er mottagelige for blekk og motstandige mot blekk. @no
toolkit label: lystrykker for (kollektiv agent) @no
toolkit definition: En manifestasjon som involverer et ansvar for en kollektiv agent i form av bruk av en fotomekanisk prosess for å lage kopier direkte fra en stivnet film av gelatin eller et annet kolloid som har overflater som er mottagelige for blekk og motstandige mot blekk. @no
label: is lichtdrukker-collectieve actor van @nl
definition: Relateert een collectieve actor aan een manifestatie die met zich meebrengt een verantwoordelijkheid van een collectieve actor voor het gebruiken van een fotomechanisch proces voor het maken van afdrukken direct vanaf een verharde film van gelatine of ander colloïde dat inktopnemende en inktafstotende oppervlakken heeft. @nl
toolkit label: lichtdrukker-collectieve actor van @nl
toolkit definition: Een manifestatie die met zich meebrengt een verantwoordelijkheid van een collectieve actor voor het gebruiken van een fotomechanisch proces voor het maken van afdrukken direct vanaf een verharde film van gelatine of ander colloïde dat inktopnemende en inktafstotende oppervlakken heeft. @nl
label: هو وكيل جماعي طبّاع صور فوتوغرافية لـ @ar
definition: يربط وكيلا جماعيا بتجسيدة تنطوي على مسئولية وكيل جماعي عن استخدام عمليات ميكانيكية ضوئية لإنتاج المطبوعات مباشرة من فيلم صلد من الجيلاتين أو غيره من المواد الغروية التي تحتوي على أسطح مستقبلة أو طاردة للحبر. @ar
toolkit label: وكيل جماعي طبّاع صور فوتوغرافية @ar
toolkit definition: تجسيدة تنطوي على مسئولية وكيل جماعي عن استخدام عمليات ميكانيكية ضوئية لإنتاج المطبوعات مباشرة من فيلم صلد من الجيلاتين أو غيره من المواد الغروية التي تحتوي على أسطح مستقبلة أو طاردة للحبر. @ar
label: és agent col·lectiu fototipista de @ca
definition: Relaciona un agent col·lectiu amb una manifestació que implica una responsabilitat d’un agent col·lectiu en la preparació d’una pel·lícula endurida de gelatina o d’un altre col·loide que té superfícies que accepten o rebutgen la tinta i que s'usa per fer gravats usant un procés fotomecànic. @ca
toolkit label: agent col·lectiu fototipista de @ca
toolkit definition: Manifestació que implica una responsabilitat d’un agent col·lectiu en la preparació d’una pel·lícula endurida de gelatina o d’un altre col·loide que té superfícies que accepten o rebutgen la tinta i que s'usa per fer gravats usant un procés fotomecànic. @ca
label: er kollektiv agent, som er lystrykker af @da
definition: Relaterer en kollektiv agent til en manifestation, som involverer en kollektiv agents ansvar for en fotomekanisk proces, hvorved der laves tryk direkte fra et hærdet gelatinelag eller andet kolloid, som har blækmodtagelige og blækafvisende overflader. @da
toolkit label: kollektiv agent, som er lystrykker af @da
toolkit definition: Manifestation, som involverer en kollektiv agents ansvar for en fotomekanisk proces, hvorved der laves tryk direkte fra et hærdet gelatinelag eller andet kolloid, som har blækmodtagelige og blækafvisende overflader. @da
label: kollotüübi valmistaja (kollektiiv) kehastuses @et
definition: Seostab kollektiivi kehastusega, mis sisaldab kollektiivi vastutust fotomehaanilises protsessis tõmmiste tegemise eest otse želatiini või muu kolloidi tahkunud kihilt, mille pind osalt seob värvainet, osalt ei seo. @et
toolkit label: kollotüübi valmistaja (kollektiiv) kehastuses @et
toolkit definition: Kehastus, mis sisaldab kollektiivi vastutust fotomehaanilises protsessis tõmmiste tegemise eest otse želatiini või muu kolloidi tahkunud kihilt, mille pind osalt seob värvainet, osalt ei seo. @et
label: ist gemeinschaftlicher Akteur als Lichtdruckerin/Lichtdrucker von @de
definition: Setzt einen gemeinschaftlichen Akteur in Beziehung zu einer Manifestation, bei der ein gemeinschaftlicher Akteur für die Verwendung eines fotomechanischen Verfahrens zur Herstellung von Abzügen direkt von einem gehärteten Film aus Gelatine oder einem anderen Kolloid, der druckerfarbenaufnehmende und -abweisende Oberflächen aufweist, verantwortlich ist. @de
toolkit label: Gemeinschaftlicher Akteur als Lichtdruckerin/Lichtdrucker von @de
toolkit definition: Eine Manifestation, bei der ein gemeinschaftlicher Akteur für die Verwendung eines fotomechanischen Verfahrens zur Herstellung von Abzügen direkt von einem gehärteten Film aus Gelatine oder einem anderen Kolloid, der druckerfarbenaufnehmende und -abweisende Oberflächen aufweist, verantwortlich ist. @de
label: fénynyomatkészítő kollektív ágense a következőnek: @hu
definition: Hozzákapcsol egy kollektív ágenst egy megjelenési formához, amelyhez hozzátartozik egy kollektív ágens felelőssége nyomtatványok fotómechanikai eljárással történő közvetlen előállításáért, amihez festékfelvevő és festéktaszító felülettel rendelkező zselatin vagy más kolloid megkeményedett filmjét használja. @hu
toolkit label: fénynyomatkészítő kollektív ágense: @hu
toolkit definition: Egy megjelenési forma, amelyhez hozzátartozik egy kollektív ágens felelőssége nyomtatványok fotómechanikai eljárással történő közvetlen előállításáért, amihez festékfelvevő és festéktaszító felülettel rendelkező zselatin vagy más kolloid megkeményedett filmjét használja. @hu
label: είναι κατασκευαστής κολλοτυπίας συλλογικός φορέας του @el
toolkit label: κατασκευαστής κολλοτυπίας συλλογικός φορέας του @el
label: est un agent collectif phototypeur de @fr
definition: Met un agent collectif en relation avec une manifestation qui comporte une responsabilité de la part d’un agent collectif consistant à préparer un film durci de gélatine ou d’un autre colloïde présentant des surfaces réceptives et répulsives à l’encre et servant à réaliser des images imprimées à l’aide d’un procédé photomécanique. @fr
toolkit label: agent collectif phototypeur de @fr
toolkit definition: Manifestation qui comporte une responsabilité de la part d’un agent collectif consistant à préparer un film durci de gélatine ou d’un autre colloïde présentant des surfaces réceptives et répulsives à l’encre et servant à réaliser des images imprimées à l’aide d’un procédé photomécanique. @fr
label: ir fotogravieris (grupa) @lv
definition: Sasaista grupu ar manifestāciju, kas ietver grupas atbildību par fotomehānisku procesu, lai izgatavotu izdrukas tieši no plates, kas pārklāta ar gaismjutīga hromželatīna slāni vai citu koloīdu, kuram ir tinti piesaistošas un tinti atgrūdošas virsmas. @lv
toolkit label: ir fotogravieris (grupa) @lv
toolkit definition: Manifestācija, kas ietver grupas atbildību par fotomehānisku procesu, lai izgatavotu izdrukas tieši no plates, kas pārklāta ar gaismjutīga hromželatīna slāni vai citu koloīdu, kuram ir tinti piesaistošas un tinti atgrūdošas virsmas. @lv
alternative label: collotypist collective agent of @en
sub property of: kuvalaatan valmistaja (yhteistoimija) manifestaatiossa
alternative label: -
alternative label: ……的珂罗版制作者集体行为者 @zh-hans
label: 是……的珂罗版制作者集体行为者 @zh-hans
definition: 将一个集体行为者与涉及利用一面吸墨而另一面不吸墨的明胶或其他硬胶片进行影印的一个集体行为者的责任的一种载体表现关联起来。 @zh-hans
toolkit label: ……的珂罗版制作者集体行为者 @zh-hans
toolkit definition: 涉及利用一面吸墨而另一面不吸墨的明胶或其他硬胶片进行影印的一个集体行为者的责任的一种载体表现 @zh-hans
alternative label: agente colectivo calotipista de @es
alternative label: agent collectif collotypiste de @fr
alternative label: taş baskı uzmanı kolektif temsilcisi @tr
label: kolotip baskıcı kolektif temsilcisidir @tr
definition: Kolektif bir temsilciyi, mürekkep alıcı ve mürekkep itici yüzeylere sahip ve bir fotomekanik işlem kullanarak baskı yapmak için kullanılan sertleştirilmiş bir jelatin veya diğer kolloid filmini hazırlamak için kolektif bir temsilcinin sorumluluğunu içeren bir gösterimle ilişkilendirir. @tr
toolkit label: taş baskıcı kolektif temsilcisi @tr
toolkit definition: Mürekkep alıcı ve mürekkep itici yüzeylere sahip olan ve fotomekanik bir işlem kullanarak baskı yapmak için kullanılan sertleştirilmiş bir jelatin veya diğer kolloid filmini hazırlamak için kolektif bir temsilcinin sorumluluğunu içeren bir gösterim. @tr
has subproperty: kollotypian valmistaja (yhteisö) manifestaatiossa
has subproperty: kollotypian valmistaja (suku) manifestaatiossa
has subproperty: P50661

kollotypian valmistaja (yhteisö) manifestaatiossa
status: Published
label: is collotyper corporate body of @en
lexical alias: collotyperCorporateBodyOf.en
definition: Relates a corporate body to a manifestation that involves a responsibility of a corporate body for preparing a hardened film of gelatin or other colloid that has ink-receptive and ink-repellent surfaces and that is used to make prints using a photomechanical process. @en
toolkit label: collotyper corporate body of @en
toolkit definition: A manifestation that involves a responsibility of a corporate body for preparing a hardened film of gelatin or other colloid that has ink-receptive and ink-repellent surfaces and that is used to make prints using a photomechanical process. @en
type: Property
domain: C10005
has element type: 2
sub property of: kollotypian valmistaja (yhteistoimija) manifestaatiossa
definition: Liittää yhteisön manifestaatioon, jonka valmistamisesta yhteisö on vastuussa tekemällä vedoksia suoraan kovettuneelta gelatiinifilmiltä tai muulta materiaalilta, jossa on mustetta imeviä ja hylkiviä pintoja.
toolkit label: kollotypian valmistaja (yhteisö) manifestaatiossa
toolkit definition: Manifestaatio, jonka valmistamisesta yhteisö on vastuussa tekemällä vedoksia suoraan kovettuneelta gelatiinifilmiltä tai muulta materiaalilta, jossa on mustetta imeviä ja hylkiviä pintoja.
label: er lystrykker for (korporasjon) @no
definition: Relaterer en korporasjon til en manifestasjon som involverer et ansvar for en korporasjon i form av bruk av en fotomekanisk prosess for å lage kopier direkte fra en stivnet film av gelatin eller et annet kolloid som har overflater som er mottagelige for blekk og motstandige mot blekk. @no
toolkit label: lystrykker for (korporasjon) @no
toolkit definition: En manifestasjon som involverer et ansvar for en korporasjon i form av bruk av en fotomekanisk prosess for å lage kopier direkte fra en stivnet film av gelatin eller et annet kolloid som har overflater som er mottagelige for blekk og motstandige mot blekk. @no
label: is lichtdrukker-corporatie van @nl
definition: Relateert een corporatie aan een manifestatie die met zich meebrengt een verantwoordelijkheid van een corporatie voor het gebruiken van een fotomechanisch proces voor het maken van afdrukken direct vanaf een verharde film van gelatine of ander colloïde dat inktopnemende en inktafstotende oppervlakken heeft. @nl
toolkit label: lichtdrukker-corporatie van @nl
toolkit definition: Een manifestatie die met zich meebrengt een verantwoordelijkheid van een corporatie voor het gebruiken van een fotomechanisch proces voor het maken van afdrukken direct vanaf een verharde film van gelatine of ander colloïde dat inktopnemende en inktafstotende oppervlakken heeft. @nl
label: هي هيئة طبّاعة صور فوتوغرافية لـ @ar
definition: يربط هيئة بتجسيدة تنطوي على مسئولية هيئة عن استخدام عمليات ميكانيكية ضوئية لإنتاج المطبوعات مباشرة من فيلم صلد من الجيلاتين أو غيره من المواد الغروية التي تحتوي على أسطح مستقبلة أو طاردة للحبر. @ar
toolkit label: هيئة طبّاعة لصور فوتوغرافية @ar
toolkit definition: تجسيدة تنطوي على مسئولية هيئة عن استخدام عمليات ميكانيكية ضوئية لإنتاج المطبوعات مباشرة من فيلم صلد من الجيلاتين أو غيره من المواد الغروية التي تحتوي على أسطح مستقبلة أو طاردة للحبر. @ar
label: és entitat corporativa fototipista de @ca
definition: Relaciona una entitat corporativa amb una manifestació que implica una responsabilitat d’una entitat corporativa en la preparació d’una pel·lícula endurida de gelatina o d’un altre col·loide que té superfícies que accepten o rebutgen la tinta i que s’usa per fer gravats usant un procés fotomecànic. @ca
toolkit label: entitat corporativa fototipista de @ca
toolkit definition: Manifestació que implica una responsabilitat d’una entitat corporativa en la preparació d’una pel·lícula endurida de gelatina o d’un altre col·loide que té superfícies que accepten o rebutgen la tinta i que s’usa per fer gravats usant un procés fotomecànic. @ca
label: er korporation, som er lystrykker af @da
definition: Relaterer en korporation til en manifestation, som involverer en korporations ansvar for en fotomekanisk proces, hvorved der laves tryk direkte fra et hærdet gelatinelag eller andet kolloid, som har blækmodtagelige og blækafvisende overflader. @da
toolkit label: korporation, som er lystrykker af @da
toolkit definition: Manifestation, som involverer en korporations ansvar for en fotomekanisk proces, hvorved der laves tryk direkte fra et hærdet gelatinelag eller andet kolloid, som har blækmodtagelige og blækafvisende overflader. @da
label: kollotüübi valmistaja (asutus) kehastuses @et
definition: Seostab asutuse kehastusega, mis sisaldab asutuse vastutust fotomehaanilises protsessis tõmmiste tegemise eest otse želatiini või muu kolloidi tahkunud kihilt, mille pind osalt seob värvainet, osalt ei seo. @et
toolkit label: kollotüübi valmistaja (asutus) kehastuses @et
toolkit definition: Kehastus, mis sisaldab asutuse vastutust fotomehaanilises protsessis tõmmiste tegemise eest otse želatiini või muu kolloidi tahkunud kihilt, mille pind osalt seob värvainet, osalt ei seo. @et
label: ist Körperschaft als Lichtdruckerin/Lichtdrucker von @de
definition: Setzt eine Körperschaft in Beziehung zu einer Manifestation, bei der eine Körperschaft für die Verwendung eines fotomechanischen Verfahrens zur Herstellung von Abzügen direkt von einem gehärteten Film aus Gelatine oder einem anderen Kolloid, der druckerfarbenaufnehmende und -abweisende Oberflächen aufweist, verantwortlich ist. @de
toolkit label: Körperschaft als Lichtdruckerin/Lichtdrucker von @de
toolkit definition: Eine Manifestation, bei der eine Körperschaft für die Verwendung eines fotomechanischen Verfahrens zur Herstellung von Abzügen direkt von einem gehärteten Film aus Gelatine oder einem anderen Kolloid, der druckerfarbenaufnehmende und -abweisende Oberflächen aufweist, verantwortlich ist. @de
label: fénynynomatkészítő testülete a következőnek: @hu
definition: Hozzákapcsol egy testületet egy megjelenési formához, amelyhez hozzátartozik egy testület felelőssége nyomtatványok fotómechanikai eljárással történő közvetlen előállításáért, amihez festékfelvevő és festéktaszító felülettel rendelkező zselatin vagy más kolloid megkeményedett filmjét használja. @hu
toolkit label: fénynyomatkészítő testülete: @hu
toolkit definition: Egy megjelenési forma, amelyhez hozzátartozik egy testület felelőssége nyomtatványok fotómechanikai eljárással történő közvetlen előállításáért, amihez festékfelvevő és festéktaszító felülettel rendelkező zselatin vagy más kolloid megkeményedett filmjét használja. @hu
label: è collotipista ente di @it
definition: Correla un ente a una manifestazione che implica una responsabilità di un ente per l'utilizzo di un processo fotomeccanico per ottenere stampe direttamente da una pellicola indurita di gelatina o altro colloide che abbia superfici recettive e repellenti all'inchiostro. @it
toolkit label: collotipista ente di @it
toolkit definition: Manifestazione che implica una responsabilità di un ente per l'utilizzo di un processo fotomeccanico per ottenere stampe direttamente da una pellicola indurita di gelatina o altro colloide che abbia superfici recettive e repellenti all'inchiostro. @it
label: είναι κατασκευαστής κολλοτυπίας συλλογικό όργανο του @el
toolkit label: κατασκευαστής κολλοτυπίας συλλογικό όργανο του @el
label: est une collectivité phototypeuse de @fr
definition: Met une collectivité en relation avec une manifestation qui comporte une responsabilité de la part d’une collectivité consistant à préparer un film durci de gélatine ou d’un autre colloïde présentant des surfaces réceptives et répulsives à l’encre et servant à réaliser des images imprimées à l’aide d’un procédé photomécanique. @fr
toolkit label: collectivité phototypeuse de @fr
toolkit definition: Manifestation qui comporte une responsabilité de la part d’une collectivité consistant à préparer un film durci de gélatine ou d’un autre colloïde présentant des surfaces réceptives et répulsives à l’encre et servant à réaliser des images imprimées à l’aide d’un procédé photomécanique. @fr
label: ir fotogravieris (institūcija) @lv
definition: Sasaista institūciju ar manifestāciju, kas ietver institūcijas atbildību par fotomehānisku procesu, lai izgatavotu izdrukas tieši no plates, kas pārklāta ar gaismjutīga hromželatīna slāni vai citu koloīdu, kuram ir tinti piesaistošas un tinti atgrūdošas virsmas. @lv
toolkit label: ir fotogravieris (institūcija) @lv
toolkit definition: Manifestācija, kas ietver institūcijas atbildību par fotomehānisku procesu, lai izgatavotu izdrukas tieši no plates, kas pārklāta ar gaismjutīga hromželatīna slāni vai citu koloīdu, kuram ir tinti piesaistošas un tinti atgrūdošas virsmas. @lv
alternative label: collotypist corporate body of @en
sub property of: kuvalaatan valmistaja (yhteisö) manifestaatiossa
alternative label: -
alternative label: ……的珂罗版制作者团体 @zh-hans
label: 是……的珂罗版制作者团体 @zh-hans
definition: 将一个团体与涉及利用一面吸墨而另一面不吸墨的明胶或其他硬胶片进行影印的一个团体的责任的一种载体表现关联起来。 @zh-hans
toolkit label: ……的珂罗版制作者团体 @zh-hans
toolkit definition: 涉及利用一面吸墨而另一面不吸墨的明胶或其他硬胶片进行影印的一个团体的责任的一种载体表现 @zh-hans
alternative label: organismo corporativo colotipista de @es
alternative label: collectivité collotypiste de @fr
alternative label: taş baskı uzmanı tüzel kişisi @tr
label: kolotip baskıcı tüzel kişisidir @tr
definition: Bir tüzel kişiyi, bir fotomekanik işlem kullanarak baskı yapmak için kullanılan, mürekkep alıcı ve mürekkep itici yüzeylere sahip sertleştirilmiş bir jelatin veya diğer kolloid filmini hazırlama sorumluluğunu içeren bir gösterim ile ilişkilendirir. @tr
toolkit label: taş baskıcı tüzel kişisi @tr
toolkit definition: Mürekkep alıcı ve mürekkep itici yüzeylere sahip olan ve fotomekanik bir işlem kullanarak baskılar yapmak için kullanılan sertleştirilmiş bir jelatin veya diğer kolloid filmi hazırlamak için tüzel bir kişinin sorumluluğunu içeren bir gösteriö. @tr
has subproperty: P50812

kollotypian valmistaja (suku) manifestaatiossa
status: Published
label: is collotyper family of @en
lexical alias: collotyperFamilyOf.en
definition: Relates a family to a manifestation that involves a responsibility of a family for preparing a hardened film of gelatin or other colloid that has ink-receptive and ink-repellent surfaces and that is used to make prints using a photomechanical process. @en
toolkit label: collotyper family of @en
toolkit definition: A manifestation that involves a responsibility of a family for preparing a hardened film of gelatin or other colloid that has ink-receptive and ink-repellent surfaces and that is used to make prints using a photomechanical process. @en
type: Property
domain: C10008
has element type: 2
sub property of: kollotypian valmistaja (yhteistoimija) manifestaatiossa
definition: Liittää suvun manifestaatioon, jonka valmistamisesta suku on vastuussa tekemällä vedoksia suoraan kovettuneelta gelatiinifilmiltä tai muulta materiaalilta, jossa on mustetta imeviä ja hylkiviä pintoja.
toolkit label: kollotypian valmistaja (suku) manifestaatiossa
toolkit definition: Manifestaatio, jonka valmistamisesta suku on vastuussa tekemällä vedoksia suoraan kovettuneelta gelatiinifilmiltä tai muulta materiaalilta, jossa on mustetta imeviä ja hylkiviä pintoja.
label: er lystrykker for (familie) @no
definition: Relaterer en familie til en manifestasjon som involverer et ansvar for en familie i form av bruk av en fotomekanisk prosess for å lage kopier direkte fra en stivnet film av gelatin eller et annet kolloid som har overflater som er mottagelige for blekk og motstandige mot blekk. @no
toolkit label: lystrykker for (familie) @no
toolkit definition: En manifestasjon som involverer et ansvar for en familie i form av bruk av en fotomekanisk prosess for å lage kopier direkte fra en stivnet film av gelatin eller et annet kolloid som har overflater som er mottagelige for blekk og motstandige mot blekk. @no
label: is lichtdrukker-familie van @nl
definition: Relateert een familie aan een manifestatie die met zich meebrengt een verantwoordelijkheid van een familie voor het gebruiken van een fotomechanisch proces voor het maken van afdrukken direct vanaf een verharde film van gelatine of ander colloïde dat inktopnemende en inktafstotende oppervlakken heeft. @nl
toolkit label: lichtdrukker-familie van @nl
toolkit definition: Een manifestatie die met zich meebrengt een verantwoordelijkheid van een familie voor het gebruiken van een fotomechanisch proces voor het maken van afdrukken direct vanaf een verharde film van gelatine of ander colloïde dat inktopnemende en inktafstotende oppervlakken heeft. @nl
label: هي عائلة طبّاعة صور فوتوغرافية لـ @ar
definition: يربط عائلة بتجسيدة تنطوي على مسئولية عائلة عن استخدام عمليات ميكانيكية ضوئية لإنتاج المطبوعات مباشرة من فيلم صلد من الجيلاتين أو غيره من المواد الغروية التي تحتوي على أسطح مستقبلة أو طاردة للحبر. @ar
toolkit label: عائلة طبّاعة صور فوتوغرافية @ar
toolkit definition: تجسيدة تنطوي على مسئولية عائلة عن استخدام عمليات ميكانيكية ضوئية لإنتاج المطبوعات مباشرة من فيلم صلد من الجيلاتين أو غيره من المواد الغروية التي تحتوي على أسطح مستقبلة أو طاردة للحبر. @ar
label: és família fototipista de @ca
definition: Relaciona una família amb una manifestació que implica una responsabilitat d’una família en la preparació d’una pel·lícula endurida de gelatina o d’un altre col·loide que té superfícies que accepten o rebutgen la tinta i que s’usa per fer gravats usant un procés fotomecànic. @ca
toolkit label: família fototipista de @ca
toolkit definition: Manifestació que implica una responsabilitat d’una família en la preparació d’una pel·lícula endurida de gelatina o d’un altre col·loide que té superfícies que accepten o rebutgen la tinta i que s’usa per fer gravats usant un procés fotomecànic. @ca
label: er familie, som er lystrykker af @da
definition: Relaterer en familie til en manifestation, som involverer en families ansvar for en fotomekanisk proces, hvorved der laves tryk direkte fra et hærdet gelatinelag eller andet kolloid, som har blækmodtagelige og blækafvisende overflader. @da
toolkit label: familie, som er lystrykker af @da
toolkit definition: Manifestation, som involverer en families ansvar for en fotomekanisk proces, hvorved der laves tryk direkte fra et hærdet gelatinelag eller andet kolloid, som har blækmodtagelige og blækafvisende overflader. @da
label: kollotüübi valmistaja (perekond) kehastuses @et
definition: Seostab perekonna kehastusega, mis sisaldab perekonna vastutust fotomehaanilises protsessis tõmmiste tegemise eest otse želatiini või muu kolloidi tahkunud kihilt, mille pind osalt seob värvainet, osalt ei seo. @et
toolkit label: kollotüübi valmistaja (perekond) kehastuses @et
toolkit definition: Kehastus, mis sisaldab perekonna vastutust fotomehaanilises protsessis tõmmiste tegemise eest otse želatiini või muu kolloidi tahkunud kihilt, mille pind osalt seob värvainet, osalt ei seo. @et
label: ist Familie als Lichtdruckerin/Lichtdrucker von @de
definition: Setzt eine Familie in Beziehung zu einer Manifestation, bei der eine Familie für die Verwendung eines fotomechanischen Verfahrens zur Herstellung von Abzügen direkt von einem gehärteten Film aus Gelatine oder einem anderen Kolloid, der druckerfarbenaufnehmende und -abweisende Oberflächen aufweist, verantwortlich ist. @de
toolkit label: Familie als Lichtdruckerin/Lichtdrucker von @de
toolkit definition: Eine Manifestation, bei der eine Familie für die Verwendung eines fotomechanischen Verfahrens zur Herstellung von Abzügen direkt von einem gehärteten Film aus Gelatine oder einem anderen Kolloid, der druckerfarbenaufnehmende und -abweisende Oberflächen aufweist, verantwortlich ist. @de
label: fénynyomatkészítő családja a következőnek: @hu
definition: Hozzákapcsol egy családot egy megjelenési formához, amelyhez hozzátartozik egy család felelőssége nyomtatványok fotómechanikai eljárással történő közvetlen előállításáért, amihez festékfelvevő és festéktaszító felülettel rendelkező zselatin vagy más kolloid megkeményedett filmjét használja. @hu
toolkit label: fénynyomatkészítő családja: @hu
toolkit definition: Egy megjelenési forma, amelyhez hozzátartozik egy család felelőssége nyomtatványok fotómechanikai eljárással történő közvetlen előállításáért, amihez festékfelvevő és festéktaszító felülettel rendelkező zselatin vagy más kolloid megkeményedett filmjét használja. @hu
label: è collotipista famiglia di @it
definition: Correla una famiglia a una manifestazione che implica una responsabilità di una famiglia per l'utilizzo di un processo fotomeccanico per ottenere stampe direttamente da una pellicola indurita di gelatina o altro colloide che abbia superfici recettive e repellenti all'inchiostro. @it
toolkit label: collotipista famiglia di @it
toolkit definition: Manifestazione che implica una responsabilità di una famiglia per l'utilizzo di un processo fotomeccanico per ottenere stampe direttamente da una pellicola indurita di gelatina o altro colloide che abbia superfici recettive e repellenti all'inchiostro. @it
label: είναι κατασκευαστής κολλοτυπίας οικογένεια του @el
toolkit label: κατασκευαστής κολλοτυπίας οικογένεια του @el
label: est une famille phototypeuse de @fr
definition: Met une famille en relation avec une manifestation qui comporte une responsabilité de la part d’une famille consistant à préparer un film durci de gélatine ou d’un autre colloïde présentant des surfaces réceptives et répulsives à l’encre et servant à réaliser des images imprimées à l’aide d’un procédé photomécanique. @fr
toolkit label: famille phototypeuse de @fr
toolkit definition: Manifestation qui comporte une responsabilité de la part d’une famille consistant à préparer un film durci de gélatine ou d’un autre colloïde présentant des surfaces réceptives et répulsives à l’encre et servant à réaliser des images imprimées à l’aide d’un procédé photomécanique. @fr
label: ir fotogravieris (dzimta/ģimene) @lv
definition: Sasaista dzimtu/ģimeni ar manifestāciju, kas ietver dzimtas/ģimenes atbildību par fotomehānisku procesu, lai izgatavotu izdrukas tieši no plates, kas pārklāta ar gaismjutīga hromželatīna slāni vai citu koloīdu, kuram ir tinti piesaistošas un tinti atgrūdošas virsmas. @lv
toolkit label: ir fotogravieris (dzimta/ģimene) @lv
toolkit definition: Manifestācija, kas ietver dzimtas/ģimenes atbildību par fotomehānisku procesu, lai izgatavotu izdrukas tieši no plates, kas pārklāta ar gaismjutīga hromželatīna slāni vai citu koloīdu, kuram ir tinti piesaistošas un tinti atgrūdošas virsmas. @lv
alternative label: collotypist family of @en
sub property of: kuvalaatan valmistaja (suku) manifestaatiossa
alternative label: -
alternative label: ……的珂罗版制作者家族 @zh-hans
label: 是……的珂罗版制作者家族 @zh-hans
definition: 将一个家族与涉及利用一面吸墨而另一面不吸墨的明胶或其他硬胶片进行影印的一个家族的责任的一种载体表现关联起来。 @zh-hans
toolkit label: ……的珂罗版制作者家族 @zh-hans
toolkit definition: 涉及利用一面吸墨而另一面不吸墨的明胶或其他硬胶片进行影印的一个家族的责任的一种载体表现 @zh-hans
alternative label: familia colotipista de @es
alternative label: famille collotypiste de @fr
alternative label: taş baskı uzmanı ailesi @tr
label: kolotip baskıcı ailesidir @tr
definition: Bir aileyi, ailenin mürekkep alıcı ve mürekkep itici yüzeylere sahip olan ve fotomekanik bir işlem kullanarak baskı yapmak için kullanılan sertleştirilmiş jelatin veya başka bir kolloid filmin hazırlanması sorumluluğunu içeren gösterimle ilişkilendirir. @tr
toolkit label: taş baskıcı aile @tr
toolkit definition: Bir ailenin mürekkep alıcı ve mürekkep itici yüzeylere sahip olan ve fotomekanik bir işlem kullanarak baskı yapmak için kullanılan sertleştirilmiş jelatin veya başka bir kolloid filmin hazırlanması sorumluluğunu içeren bir gösterim. @tr
has subproperty: P50963

kollotypian valmistaja (henkilö) manifestaatiossa
status: Published
label: is collotyper person of @en
lexical alias: collotyperPersonOf.en
definition: Relates a person to a manifestation that involves a responsibility of a person for preparing a hardened film of gelatin or other colloid that has ink-receptive and ink-repellent surfaces and that is used to make prints using a photomechanical process. @en
toolkit label: collotyper person of @en
toolkit definition: A manifestation that involves a responsibility of a person for preparing a hardened film of gelatin or other colloid that has ink-receptive and ink-repellent surfaces and that is used to make prints using a photomechanical process. @en
type: Property
domain: C10004
has element type: 2
sub property of: kollotypian valmistaja (toimija) manifestaatiossa
definition: Liittää henkilön manifestaatioon, jonka valmistamisesta henkilö on vastuussa tekemällä vedoksia suoraan kovettuneelta gelatiinifilmiltä tai muulta materiaalilta, jossa on mustetta imeviä ja hylkiviä pintoja.
toolkit label: kollotypian valmistaja (henkilö) manifestaatiossa
toolkit definition: Manifestaatio, jonka valmistamisesta henkilö on vastuussa tekemällä vedoksia suoraan kovettuneelta gelatiinifilmiltä tai muulta materiaalilta, jossa on mustetta imeviä ja hylkiviä pintoja.
label: er lystrykker for (person) @no
definition: Relaterer en person til en manifestasjon som involverer et ansvar for en person i form av bruk av en fotomekanisk prosess for å lage kopier direkte fra en stivnet film av gelatin eller et annet kolloid som har overflater som er mottagelige for blekk og motstandige mot blekk. @no
toolkit label: lystrykker for (person) @no
toolkit definition: En manifestasjon som involverer et ansvar for en person i form av bruk av en fotomekanisk prosess for å lage kopier direkte fra en stivnet film av gelatin eller et annet kolloid som har overflater som er mottagelige for blekk og motstandige mot blekk. @no
label: is lichtdrukker-persoon van @nl
definition: Relateert een persoon aan een manifestatie die met zich meebrengt een verantwoordelijkheid van een persoon voor het gebruiken van een fotomechanisch proces voor het maken van afdrukken direct vanaf een verharde film van gelatine of ander colloïde dat inktopnemende en inktafstotende oppervlakken heeft. @nl
toolkit label: lichtdrukker-persoon van @nl
toolkit definition: Een manifestatie die met zich meebrengt een verantwoordelijkheid van een persoon voor het gebruiken van een fotomechanisch proces voor het maken van afdrukken direct vanaf een verharde film van gelatine of ander colloïde dat inktopnemende en inktafstotende oppervlakken heeft. @nl
label: هو وكيل طبّاع صور فوتوغرافية لـ @ar
definition: يربط شخصا بتجسيدة تنطوي على مسئولية شخص عن استخدام عمليات ميكانيكية ضوئية لإنتاج المطبوعات مباشرة من فيلم صلد من الجيلاتين أو غيره من المواد الغروية التي تحتوي على أسطح مستقبلة أو طاردة للحبر. @ar
toolkit label: وكيل طبّاع صور فوتوغرافية @ar
toolkit definition: تجسيدة تنطوي على مسئولية شخص عن استخدام عمليات ميكانيكية ضوئية لإنتاج المطبوعات مباشرة من فيلم صلد من الجيلاتين أو غيره من المواد الغروية التي تحتوي على أسطح مستقبلة أو طاردة للحبر. @ar
label: és persona fototipista de @ca
definition: Relaciona una persona amb una manifestació que implica una responsabilitat d’una persona en la preparació d’una pel·lícula endurida de gelatina o d’un altre col·loide que té superfícies que accepten o rebutgen la tinta i que s'usa per fer gravats usant un procés fotomecànic. @ca
toolkit label: persona fototipista de @ca
toolkit definition: Manifestació que implica una responsabilitat d’una persona en la preparació d’una pel·lícula endurida de gelatina o d’un altre col·loide que té superfícies que accepten o rebutgen la tinta i que s'usa per fer gravats usant un procés fotomecànic. @ca
label: er person, som er lystrykker af @da
definition: Relaterer en person til en manifestation, som involverer en persons ansvar for en fotomekanisk proces, hvorved der laves tryk direkte fra et hærdet gelatinelag eller andet kolloid, som har blækmodtagelige og blækafvisende overflader. @da
toolkit label: person, som er lystrykker af @da
toolkit definition: Manifestation, som involverer en persons ansvar for en fotomekanisk proces, hvorved der laves tryk direkte fra et hærdet gelatinelag eller andet kolloid, som har blækmodtagelige og blækafvisende overflader. @da
label: kollotüübi valmistaja (isik) kehastuses @et
definition: Seostab isiku kehastusega, mis sisaldab isiku vastutust fotomehaanilises protsessis tõmmiste tegemise eest otse želatiini või muu kolloidi tahkunud kihilt, mille pind osalt seob värvainet, osalt ei seo. @et
toolkit label: kollotüübi valmistaja (isik) kehastuses @et
toolkit definition: Kehastus, mis sisaldab isiku vastutust fotomehaanilises protsessis tõmmiste tegemise eest otse želatiini või muu kolloidi tahkunud kihilt, mille pind osalt seob värvainet, osalt ei seo. @et
label: ist Person als Lichtdruckerin/Lichtdrucker von @de
definition: Setzt eine Person in Beziehung zu einer Manifestation, bei der eine Person für die Verwendung eines fotomechanischen Verfahrens zur Herstellung von Abzügen direkt von einem gehärteten Film aus Gelatine oder einem anderen Kolloid, der druckerfarbenaufnehmende und -abweisende Oberflächen aufweist, verantwortlich ist. @de
toolkit label: Person als Lichtdruckerin/Lichtdrucker von @de
toolkit definition: Eine Manifestation, bei der eine Person für die Verwendung eines fotomechanischen Verfahrens zur Herstellung von Abzügen direkt von einem gehärteten Film aus Gelatine oder einem anderen Kolloid, der druckerfarbenaufnehmende und -abweisende Oberflächen aufweist, verantwortlich ist. @de
label: fénynyomatkészítő személye a következőnek: @hu
definition: Hozzákapcsol egy személyt egy megjelenési formához, amelyhez hozzátartozik egy személy felelőssége nyomtatványok fotómechanikai eljárással történő közvetlen előállításáért, amihez festékfelvevő és festéktaszító felülettel rendelkező zselatin vagy más kolloid megkeményedett filmjét használja. @hu
toolkit label: fénynyomatkészítő személye: @hu
toolkit definition: Egy megjelenési forma, amelyhez hozzátartozik egy személy felelőssége nyomtatványok fotómechanikai eljárással történő közvetlen előállításáért, amihez festékfelvevő és festéktaszító felülettel rendelkező zselatin vagy más kolloid megkeményedett filmjét használja. @hu
label: είναι κατασκευαστής κολλοτυπίας φυσικό πρόσωπο του @el
toolkit label: κατασκευαστής κολλοτυπίας φυσικό πρόσωπο του @el
label: est une personne phototypeuse de @fr
definition: Met une personne en relation avec une manifestation qui comporte une responsabilité de la part d’une personne consistant à préparer un film durci de gélatine ou d’un autre colloïde présentant des surfaces réceptives et répulsives à l’encre et servant à réaliser des images imprimées à l’aide d’un procédé photomécanique. @fr
toolkit label: personne phototypeuse de @fr
toolkit definition: Manifestation qui comporte une responsabilité de la part d’une personne consistant à préparer un film durci de gélatine ou d’un autre colloïde présentant des surfaces réceptives et répulsives à l’encre et servant à réaliser des images imprimées à l’aide d’un procédé photomécanique. @fr
label: ir fotogravieris (persona) @lv
definition: Sasaista personu ar manifestāciju, kas ietver personas atbildību par fotomehānisku procesu, lai izgatavotu izdrukas tieši no plates, kas pārklāta ar gaismjutīga hromželatīna slāni vai citu koloīdu, kuram ir tinti piesaistošas un tinti atgrūdošas virsmas. @lv
toolkit label: ir fotogravieris (persona) @lv
toolkit definition: Manifestācija, kas ietver personas atbildību par fotomehānisku procesu, lai izgatavotu izdrukas tieši no plates, kas pārklāta ar gaismjutīga hromželatīna slāni vai citu koloīdu, kuram ir tinti piesaistošas un tinti atgrūdošas virsmas. @lv
alternative label: collotypist person of @en
sub property of: kuvalaatan valmistaja (henkilö) manifestaatiossa
alternative label: -
alternative label: ……的珂罗版制作者个人 @zh-hans
label: 是……的珂罗版制作者个人 @zh-hans
definition: 将一个个人与涉及利用一面吸墨而另一面不吸墨的明胶或其他硬胶片进行影印的一个个人的责任的一种载体表现关联起来。 @zh-hans
toolkit label: ……的珂罗版制作者个人 @zh-hans
toolkit definition: 涉及利用一面吸墨而另一面不吸墨的明胶或其他硬胶片进行影印的一个个人的责任的一种载体表现 @zh-hans
alternative label: persona calotipista de @es
alternative label: personne collotypiste de @fr
alternative label: taş baskı uzmanı @tr
label: kolotip baskıcı kişisidir @tr
definition: Bir kişiyi, kişinin mürekkep alıcı ve mürekkep itici yüzeylere sahip olan ve fotomekanik bir işlem kullanarak baskı yapmak için kullanılan sertleştirilmiş jelatin veya başka bir kolloid filmin hazırlanması sorumluluğunu içeren gösterimle ilişkilendirir. @tr
toolkit label: taş baskıcı @tr
toolkit definition: Bir kişinin mürekkep alıcı ve mürekkep itici yüzeylere sahip olan ve fotomekanik bir işlem kullanarak baskı yapmak için kullanılan sertleştirilmiş jelatin veya başka bir kolloid filmin hazırlanması sorumluluğunu içeren bir gösterim. @tr
has subproperty: P50510

värittäjä (toimija) ekspressiossa
status: Published
type: Property
label: is colourist agent of @en
lexical alias: colouristAgentOf.en
definition: Relates an agent to an expression that includes a contribution by an agent of applying colour to drawings, prints, photographs, maps, moving images, and other visual content. @en
domain: C10002
toolkit label: colourist agent of @en
toolkit definition: An expression that includes a contribution by an agent of applying colour to drawings, prints, photographs, maps, moving images, and other visual content. @en
instruction number: 18.5
sub property of: yhdistymään osallinen toimija ekspressiossa
label: είναι επιχρωματιστής φορέας του @el
definition: Συνδέει έναν φορέα, ο οποίος συνεισφέρει σε μια έκφραση ενός έργου μέσω της εφαρμογής χρωμάτων στα σχέδια, τα σκίτσα, τις εκτυπώσεις, τις φωτογραφίες, τους χάρτες, τις κινητές εικόνες κ.λπ., με μια έκφραση. @el
toolkit label: επιχρωματιστής φορέας του @el
toolkit definition: Μια έκφραση ενός έργου που ενσωματώνει τη συνεισφορά της εφαρμογής χρωμάτων στα σχέδια, τα σκίτσα, τις εκτυπώσεις, τις φωτογραφίες, τους χάρτες, τις κινητές εικόνες κ.λπ. @el
definition: Setzt einen Akteur in Beziehung zu einer Expression, zu der ein Akteur beiträgt, indem er Farben auf Zeichnungen, Drucke, Fotografien, Karten, Bewegtbilder und so weiter aufbringt. @de
toolkit label: Akteur als Koloristin/Kolorist von @de
toolkit definition: Eine Expression, zu der ein Akteur beiträgt, indem er Farben auf Zeichnungen, Drucke, Fotografien, Karten, Bewegtbilder und so weiter aufbringt. @de
label: er agent, som er farvelægger af @da
definition: Relaterer en agent til et udtryk, som omfatter en agents bidrag ved at farvelægge tegninger, tryk, fotos, kort, levende billeder og andet visuelt indhold. @da
toolkit label: agent, som er farvelægger af @da
toolkit definition: Udtryk, som omfatter en agents bidrag ved at farvelægge tegninger, tryk, fotos, kort, levende billeder og andet visuelt indhold. @da
label: és agent colorista de @ca
definition: Relaciona un agent amb una expressió que inclou una contribució d’un agent aplicant color a dibuixos, gravats, fotografies, mapes, imatges en moviment i a qualsevol altre contingut visual. @ca
toolkit label: agent colorista de @ca
toolkit definition: Expressió que inclou una contribució d’un agent aplicant color a dibuixos, gravats, fotografies, mapes, imatges en moviment i a qualsevol altre contingut visual. @ca
definition: Liittää toimijan ekspressioon, jonka tekemiseen toimija osallistuu värittämällä piirustuksia, vedoksia, valokuvia, karttoja, elokuvia tms.
toolkit label: värittäjä (toimija) ekspressiossa
toolkit definition: Ekspressio, jonka tekemiseen toimija osallistuu värittämällä piirustuksia, vedoksia, valokuvia, karttoja, elokuvia tms.
toolkit label: fargelegger av (agent) @no
toolkit definition: Et uttrykk som inkluderer et bidrag fra en agent i form av å fargelegge tegninger, trykk, fotografier, kart, levende bilder og annet visuelt innhold. @no
label: ist Akteur als Koloristin/Kolorist von @de
label: est un agent coloriste de @fr
definition: Met un agent en relation avec une expression qui intègre une contribution de la part d’un agent consistant à appliquer de la couleur à des dessins, des images imprimées, des photographies, des cartes, des images animées et d’autres contenus visuels. @fr
toolkit label: agent coloriste de @fr
toolkit definition: Expression qui intègre une contribution de la part d’un agent consistant à appliquer de la couleur à des dessins, des images imprimées, des photographies, des cartes, des images animées et d’autres contenus visuels. @fr
has element type: 2
alternative label: colorist of @en
label: colorist ágense a következőnek: @hu
definition: Hozzákapcsol egy ágenst egy kifejezési formához, amely magában foglalja egy ágens közreműködését szín felhordásában rajzokra, nyomtatványokra, fényképekre, térképekre, mozgóképekre és más vizuális tartalmakra. @hu
toolkit label: colorist ágense a következőnek: @hu
toolkit definition: Egy kifejezési forma, amely magában foglalja egy ágens közreműködését szín felhordásában rajzokra, nyomtatványokra, fényképekre, térképekre, mozgóképekre és más vizuális tartalmakra. @hu
alternative label: colourist of @en
alternative label: colorist agent of @en
label: er fargelegger av (agent) @no
definition: Relaterer en agent til et uttrykk som inkluderer et bidrag fra en agent i form av å fargelegge tegninger, trykk, fotografier, kart, levende bilder og annet visuelt innhold. @no
alternative label: fargelegger av @no
label: is inkleurder-actor van @nl
definition: Relateert een actor aan een expressie die omvat een bijdrage door een actor door toevoegen van kleur aan tekeningen, afdrukken, foto's, kaarten, bewegende beelden en andere visuele content. @nl
toolkit label: inkleurder-actor van @nl
toolkit definition: Een expressie die omvat een bijdrage door een actor door toevoegen van kleur aan tekeningen, afdrukken, foto's, kaarten, bewegende beelden en andere visuele content. @nl
label: هو وكيل فني تلوين لـ @ar
definition: يربط وكيلا بتعبيرة تتضمن إسهام وكيل بتلوين الرسومات، والمطبوعات، والصور الفوتوغرافية، والخرائط، والصور المتحركة، وأي محتوى مرئي آخر. @ar
alternative label: وكيل فني تلوين لـ @ar
toolkit label: وكيل فني تلوين @ar
toolkit definition: تعبيرة تتضمن إسهام وكيل في تلوين رسومات، ومطبوعات، وصور فوتوغرافية، وخرائط، وصور متحركة، وأي محتوى مرئي آخر. @ar
alternative label: farvelægger af @da
label: koloreerija (tegija) väljenduses @et
definition: Seostab tegija väljendusega, millesse tegija on andnud panuse, värvides joonistusi, tõmmiseid, fotosid, kaarte, liikuvaid pilte ja muud visuaalset sisu. @et
alternative label: koloreerija väljenduses @et
toolkit label: koloreerija (tegija) väljenduses @et
toolkit definition: Väljendus, millesse tegija on andnud panuse, värvides joonistusi, tõmmiseid, fotosid, kaarte, liikuvaid pilte ja muud visuaalset sisu. @et
label: è colorista agente di @it
definition: Correla un agente a un'espressione che comprende un contributo da parte di un agente nell'applicare colore a disegni, stampe, fotografie, mappe, immagini in movimento e altri contenuti visivi. @it
alternative label: colorista di @it
toolkit label: colorista agente di @it
toolkit definition: Espressione che comprende un contributo da parte di un agente nell'applicare colore a disegni, stampe, fotografie, mappe, immagini in movimento e altri contenuti visivi. @it
alternative label: επιχρωματιστής του @el
alternative label: κολορίστας του @el
alternative label: coloriste de @fr
label: ir kolorists (aģents) @lv
definition: Sasaista aģentu ar izteiksmi, kas ietver aģenta ieguldījumu, izkrāsojot zīmējumu, gravīru, fotogrāfiju, karšu, kustīgo attēlu, u. tml. @lv
toolkit label: ir kolorists (aģents) @lv
toolkit definition: Izteiksme, kas ietver aģenta ieguldījumu, izkrāsojot zīmējumu, gravīru, fotogrāfiju, karšu, kustīgo attēlu, u. tml. @lv
alternative label: Akteur als Coloristin/Colorist von @de
label: 是……的着色者行为者 @zh-hans
toolkit label: ……的着色者行为者 @zh-hans
toolkit definition: 包括将颜色施加于图画、印刷品、照片、地图、动态图像和其他视觉内容上的一个行为者的贡献的一种内容表达 @zh-hans
toolkit label: renklendirici temsilcisi @tr
toolkit definition: Çizimlere, baskılara, fotoğraflara, haritalara, hareketli resimlere ve diğer görsel içeriğe renk uygulamaları yapan bir temsilcinin katkısını içeren bir anlatım. @tr
has subproperty: värittäjä (yhteistoimija) ekspressiossa

värittäjä (yhteistoimija) ekspressiossa
status: Published
label: is colourist collective agent of @en
lexical alias: colouristCollectiveAgentOf.en
definition: Relates a collective agent to an expression that includes a contribution by a collective agent of applying colour to drawings, prints, photographs, maps, moving images, and other visual content. @en
toolkit label: colourist collective agent of @en
toolkit definition: An expression that includes a contribution by a collective agent of applying colour to drawings, prints, photographs, maps, moving images, and other visual content. @en
type: Property
domain: C10011
has element type: 2
sub property of: yhdistymään osallinen yhteistoimija ekspressiossa
sub property of: värittäjä (toimija) ekspressiossa
definition: Liittää yhteistoimijan ekspressioon, jossa yhteistoimija on osallisena värittämällä piirustuksia, vedoksia, valokuvia, karttoja, elokuvia tms.
toolkit label: värittäjä (yhteistoimija) ekspressiossa
toolkit definition: Ekspressio, jossa yhteistoimija on osallisena värittämällä piirustuksia, vedoksia, valokuvia, karttoja, elokuvia tms.
label: er fargelegger for (kollektiv agent) @no
definition: Relaterer en kollektiv agent til et uttrykk som inkluderer et bidrag fra en kollektiv agent i form av fargelegge tegninger, trykk, fotografier, kart, levende bilder og annet visuelt materiale. @no
toolkit label: fargelegger for (kollektiv agent) @no
toolkit definition: Et uttrykk som inkluderer et bidrag fra en kollektiv agent i form av fargelegge tegninger, trykk, fotografier, kart, levende bilder og annet visuelt materiale. @no
alternative label: colorist collective agent of @en
label: is inkleurder-collectieve actor van @nl
definition: Relateert een collectieve actor aan een expressie die omvat een bijdrage door een collectieve actor door toevoegen van kleur aan tekeningen, afdrukken, foto's, kaarten, bewegende beelden en andere visuele content. @nl
toolkit label: inkleurder-collectieve actor van @nl
toolkit definition: Een expressie die omvat een bijdrage door een collectieve actor door toevoegen van kleur aan tekeningen, afdrukken, foto's, kaarten, bewegende beelden en andere visuele content. @nl
label: هو وكيل جماعي فني تلوين لـ @ar
definition: يربط وكيلا جماعيا بتعبيرة تتضمن إسهام وكيل جماعي في تلوين رسومات، ومطبوعات، وصور فوتوغرافية، وخرائط، وصور متحركة، وأي محتوى مرئي آخر. @ar
toolkit label: وكيل جماعي فني تلوين لـ @ar
toolkit definition: تعبيرة تتضمن إسهام وكيل جماعي في تلوين رسومات، ومطبوعات، وصور فوتوغرافية، وخرائط، وصور متحركة، وأي محتوى مرئي آخر. @ar
label: és agent col·lectiu colorista de @ca
definition: Relaciona un agent col·lectiu amb una expressió que inclou una contribució d’un agent col·lectiu aplicant color a dibuixos, gravats, fotografies, mapes, imatges en moviment i a qualsevol altre contingut visual. @ca
toolkit label: agent col·lectiu colorista de @ca
toolkit definition: Expressió que inclou una contribució d’un agent col·lectiu aplicant color a dibuixos, gravats, fotografies, mapes, imatges en moviment i a qualsevol altre contingut visual. @ca
label: er kollektiv agent, som er farvelægger af @da
definition: Relaterer en kollektiv agent til et udtryk, som omfatter en kollektiv agents bidrag ved at farvelægge tegninger, tryk, fotos, kort, levende billeder og andet visuelt indhold. @da
toolkit label: kollektiv agent, som er farvelægger af @da
toolkit definition: Udtryk, som omfatter en kollektiv agents bidrag ved at farvelægge tegninger, tryk, fotos, kort, levende billeder og andet visuelt indhold. @da
label: koloreerija (kollektiiv) väljenduses @et
definition: Seostab kollektiivi väljendusega, millesse kollektiiv on andnud panuse, värvides joonistusi, tõmmiseid, fotosid, kaarte, liikuvaid pilte ja muud visuaalset sisu. @et
toolkit label: koloreerija (kollektiiv) väljenduses @et
toolkit definition: Väljendus, millesse kollektiiv on andnud panuse, värvides joonistusi, tõmmiseid, fotosid, kaarte, liikuvaid pilte ja muud visuaalset sisu. @et
label: ist gemeinschaftlicher Akteur als Koloristin/Kolorist von @de
definition: Setzt einen gemeinschaftlichen Akteur in Beziehung zu einer Expression, zu der ein gemeinschaftlicher Akteur beiträgt, indem er Farben auf Zeichnungen, Drucke, Fotografien, Karten, Bewegtbilder und so weiter aufbringt. @de
toolkit label: Gemeinschaftlicher Akteur als Koloristin/Kolorist von @de
toolkit definition: Eine Expression, zu der ein gemeinschaftlicher Akteur beiträgt, indem er Farben auf Zeichnungen, Drucke, Fotografien, Karten, Bewegtbilder und so weiter aufbringt. @de
label: colorist kollektív ágense a következőnek: @hu
definition: Hozzákapcsol egy kollektív ágenst egy kifejezési formához, amely magában foglalja egy kollektív ágens közreműködését szín felhordásában rajzokra, nyomtatványokra, fényképekre, térképekre, mozgóképekre és más vizuális tartalmakra. @hu
toolkit label: colorist kollektív ágense: @hu
toolkit definition: Egy kifejezési forma, amely magában foglalja egy kollektív ágens közreműködését szín felhordásában rajzokra, nyomtatványokra, fényképekre, térképekre, mozgóképekre és más vizuális tartalmakra. @hu
label: è colorista agente collettivo di @it
definition: Correla un agente collettivo a un'espressione che comprende un contributo di un agente collettivo nell'applicazione di colore a disegni, stampe, fotografie, mappe, immagini in movimento e altri contenuti visivi. @it
toolkit label: colorista agente collettivo di @it
toolkit definition: Espressione che comprende un contributo di un agente collettivo nell'applicazione di colore a disegni, stampe, fotografie, mappe, immagini in movimento e altri contenuti visivi. @it
label: είναι επιχρωματιστής συλλογικός φορέας του @el
toolkit label: επιχρωματιστής συλλογικός φορέας του @el
label: est un agent collectif coloriste de @fr
definition: Met un agent collectif en relation avec une expression qui intègre une contribution de la part d’un agent collectif consistant à appliquer de la couleur à des dessins, des images imprimées, des photographies, des cartes, des images animées et d’autres contenus visuels. @fr
toolkit label: agent collectif coloriste de @fr
toolkit definition: Expression qui intègre une contribution de la part d’un agent collectif consistant à appliquer de la couleur à des dessins, des images imprimées, des photographies, des cartes, des images animées et d’autres contenus visuels. @fr
label: ir kolorists (grupa) @lv
definition: Sasaista grupu ar izteiksmi, kas ietver grupas ieguldījumu, izkrāsojot zīmējumu, gravīru, fotogrāfiju, karšu, kustīgo attēlu, u. tml. @lv
toolkit label: ir kolorists (grupa) @lv
toolkit definition: Izteiksme, kas ietver grupas ieguldījumu, izkrāsojot zīmējumu, gravīru, fotogrāfiju, karšu, kustīgo attēlu, u. tml. @lv
alternative label: وكيل جماعي جامع لـ @ar
alternative label: -
alternative label: ……的着色者集体行为者 @zh-hans
label: 是……的着色者集体行为者 @zh-hans
definition: 将一个集体行为者与包括将颜色施加于图画、印刷品、照片、地图、动态图像和其他视觉内容上的一个集体行为者的贡献的一种内容表达关联起来。 @zh-hans
toolkit label: ……的着色者集体行为者 @zh-hans
toolkit definition: 包括将颜色施加于图画、印刷品、照片、地图、动态图像和其他视觉内容上的一个集体行为者的贡献的一种内容表达 @zh-hans
alternative label: agente colectivo colorista de @es
alternative label: színező kollektív ágense: @hu
alternative label: renklendirici kolektif temsilcisi @tr
label: renklendirici kolektif temsilcisidir @tr
definition: Kolektif bir temsilciyi, kollektif bir temsilcinin çizimlere, baskılara, fotoğraflara, haritalara, hareketli görüntülere ve diğer görsel içeriğe renk uygulama katkısını içeren bir anlatımla ilişkilendirir. @tr
toolkit label: renklendirici kolektif temsilcisi @tr
toolkit definition: Çizimlere, baskılara, fotoğraflara, haritalara, hareketli görüntülere ve diğer görsel içeriğe kolektif bir temsilcinin renk uygulama katkısını içeren bir anlatım. @tr
has subproperty: värittäjä (yhteisö) ekspressiossa
has subproperty: värittäjä (suku) ekspressiossa
has subproperty: P50722

värittäjä (yhteisö) ekspressiossa
status: Published
label: is colourist corporate body of @en
lexical alias: colouristCorporateBodyOf.en
definition: Relates a corporate body to an expression that includes a contribution by a corporate body of applying colour to drawings, prints, photographs, maps, moving images, and other visual content. @en
toolkit label: colourist corporate body of @en
toolkit definition: An expression that includes a contribution by a corporate body of applying colour to drawings, prints, photographs, maps, moving images, and other visual content. @en
type: Property
domain: C10005
has element type: 2
sub property of: yhdistymään osallinen yhteisö ekspressiossa
sub property of: värittäjä (yhteistoimija) ekspressiossa
definition: Liittää yhteisön ekspressioon, jossa yhteisö on osallisena värittämällä piirustuksia, vedoksia, valokuvia, karttoja, elokuvia tms.
toolkit label: värittäjä (yhteisö) ekspressiossa
toolkit definition: Ekspressio, jossa yhteisö on osallisena värittämällä piirustuksia, vedoksia, valokuvia, karttoja, elokuvia tms.
label: er fargelegger for (korporasjon) @no
definition: Relaterer en korporasjon til et uttrykk som inkluderer et bidrag fra en korporasjon i form av fargelegge tegninger, trykk, fotografier, kart, levende bilder og annet visuelt materiale. @no
toolkit label: fargelegger for (korporasjon) @no
toolkit definition: Et uttrykk som inkluderer et bidrag fra en korporasjon i form av fargelegge tegninger, trykk, fotografier, kart, levende bilder og annet visuelt materiale. @no
alternative label: colorist corporate body of @en
label: is inkleurder-corporatie van @nl
definition: Relateert een corporatie aan een expressie die omvat een bijdrage door een corporatie door toevoegen van kleur aan tekeningen, afdrukken, foto's, kaarten, bewegende beelden en andere visuele content. @nl
toolkit label: inkleurder-corporatie van @nl
toolkit definition: Een expressie die omvat een bijdrage door een corporatie door toevoegen van kleur aan tekeningen, afdrukken, foto's, kaarten, bewegende beelden en andere visuele content. @nl
label: هي هيئة فني تلوين لـ @ar
definition: يربط هيئة بتعبيرة تتضمن إسهام هيئة في تلوين رسومات، ومطبوعات، وصور فوتوغرافية، وخرائط، وصور متحركة، وأي محتوى مرئي آخر. @ar
toolkit label: هيئة فني تلوين @ar
toolkit definition: تعبيرة تتضمن إسهام هيئة بتلوين الرسومات، والمطبوعات، والصور الفوتوغرافية، والخرائط، والصور المتحركة، وأي محتوى مرئي آخر. @ar
label: és entitat corporativa colorista de @ca
definition: Relaciona una entitat corporativa amb una expressió que inclou una contribució d’una entitat corporativa aplicant color a dibuixos, gravats, fotografies, mapes, imatges en moviment i a qualsevol altre contingut visual. @ca
toolkit label: entitat corporativa colorista de @ca
toolkit definition: Expressió que inclou una contribució d’una entitat corporativa aplicant color a dibuixos, gravats, fotografies, mapes, imatges en moviment i a qualsevol altre contingut visual. @ca
label: er korporation, som er farvelægger af @da
definition: Relaterer en korporation til et udtryk, som omfatter en korporations bidrag ved at farvelægge tegninger, tryk, fotos, kort, levende billeder og andet visuelt indhold. @da
toolkit label: korporation, som er farvelægger af @da
toolkit definition: Udtryk, som omfatter en korporations bidrag ved at farvelægge tegninger, tryk, fotos, kort, levende billeder og andet visuelt indhold. @da
label: koloreerija (asutus) väljenduses @et
definition: Seostab asutuse väljendusega, millesse asutus on andnud panuse, värvides joonistusi, tõmmiseid, fotosid, kaarte, liikuvaid pilte ja muud visuaalset sisu. @et
toolkit label: koloreerija (asutus) väljenduses @et
toolkit definition: Väljendus, millesse asutus on andnud panuse, värvides joonistusi, tõmmiseid, fotosid, kaarte, liikuvaid pilte ja muud visuaalset sisu. @et
label: ist Körperschaft als Koloristin/Kolorist von @de
definition: Setzt eine Körperschaft in Beziehung zu einer Expression, zu der eine Körperschaft beiträgt, indem sie Farben auf Zeichnungen, Drucke, Fotografien, Karten, Bewegtbilder und so weiter aufbringt. @de
toolkit label: Körperschaft als Koloristin/Kolorist von @de
toolkit definition: Eine Expression, zu der eine Körperschaft beiträgt, indem sie Farben auf Zeichnungen, Drucke, Fotografien, Karten, Bewegtbilder und so weiter aufbringt. @de
label: colorist testülete a következőnek: @hu
definition: Hozzákapcsol egy testületet egy kifejezési formához, amely magában foglalja egy testület közreműködését szín felhordásában rajzokra, nyomtatványokra, fényképekre, térképekre, mozgóképekre és más vizuális tartalmakra. @hu
toolkit label: colorist testülete: @hu
toolkit definition: Egy kifejezési forma, amely magában foglalja egy testület közreműködését szín felhordásában rajzokra, nyomtatványokra, fényképekre, térképekre, mozgóképekre és más vizuális tartalmakra. @hu
label: è colorista ente di @it
definition: Correla un ente a un'espressione che comprende un contributo di un ente nell'applicazione di colore a disegni, stampe, fotografie, mappe, immagini in movimento e altri contenuti visivi. @it
toolkit label: colorista ente di @it
toolkit definition: Espressione che comprende un contributo di un ente nell'applicazione di colore a disegni, stampe, fotografie, mappe, immagini in movimento e altri contenuti visivi. @it
label: είναι επιχρωματιστής συλλογικό όργανο του @el
toolkit label: επιχρωματιστής συλλογικό όργανο του @el
label: est une collectivité coloriste de @fr
definition: Met une collectivité en relation avec une expression qui intègre une contribution de la part d’une collectivité consistant à appliquer de la couleur à des dessins, des images imprimées, des photographies, des cartes, des images animées et d’autres contenus visuels. @fr
toolkit label: collectivité coloriste de @fr
toolkit definition: Expression qui intègre une contribution de la part d’une collectivité consistant à appliquer de la couleur à des dessins, des images imprimées, des photographies, des cartes, des images animées et d’autres contenus visuels. @fr
label: ir kolorists (institūcija) @lv
definition: Sasaista institūciju ar izteiksmi, kas ietver institūcijas ieguldījumu, izkrāsojot zīmējumu, gravīru, fotogrāfiju, karšu, kustīgo attēlu, u. tml. @lv
toolkit label: ir kolorists (institūcija) @lv
toolkit definition: Izteiksme, kas ietver institūcijas ieguldījumu, izkrāsojot zīmējumu, gravīru, fotogrāfiju, karšu, kustīgo attēlu, u. tml. @lv
alternative label: هيئة مسئولة عن التلوين @ar
alternative label: -
alternative label: ……的着色者团体 @zh-hans
label: 是……的着色者团体 @zh-hans
definition: 将一个团体与包括将颜色施加于图画、印刷品、照片、地图、动态图像和其他视觉内容上的一个团体的贡献的一种内容表达关联起来。 @zh-hans
toolkit label: ……的着色者团体 @zh-hans
toolkit definition: 包括将颜色施加于图画、印刷品、照片、地图、动态图像和其他视觉内容上的一个团体的贡献的一种内容表达 @zh-hans
alternative label: colorista de @es
alternative label: színező testülete: @hu
alternative label: renklendirici tüzel kişisi @tr
label: renklendirici tüzel kişisidir @tr
definition: Bir tüzel kişiyi, bir tüzel kişinin çizimlere, baskılara, fotoğraflara, haritalara, hareketli görüntülere ve diğer görsel içeriğe renk uygulama katkısını içeren bir anlatımla ilişkilendirir. @tr
toolkit label: renklendirici tüzel kişisi @tr
toolkit definition: Çizimlere, baskılara, fotoğraflara, haritalara, hareketli görüntülere ve diğer görsel içeriklere renk uygulama konusunda tüzel bir kişinin katkısını içeren bir anlatım. @tr
has subproperty: P50873

värittäjä (suku) ekspressiossa
status: Published
label: is colourist family of @en
lexical alias: colouristFamilyOf.en
definition: Relates a family to an expression that includes a contribution by a family of applying colour to drawings, prints, photographs, maps, moving images, and other visual content. @en
toolkit label: colourist family of @en
toolkit definition: An expression that includes a contribution by a family of applying colour to drawings, prints, photographs, maps, moving images, and other visual content. @en
type: Property
domain: C10008
has element type: 2
sub property of: yhdistymään osallinen suku ekspressiossa
sub property of: värittäjä (yhteistoimija) ekspressiossa
definition: Liittää suvun ekspressioon, jossa suku on osallisena värittämällä piirustuksia, vedoksia, valokuvia, karttoja, elokuvia tms.
toolkit label: värittäjä (suku) ekspressiossa
toolkit definition: Ekspressio, jossa suku on osallisena värittämällä piirustuksia, vedoksia, valokuvia, karttoja, elokuvia tms.
label: er fargelegger for (familie) @no
definition: Relaterer en familie til et uttrykk som inkluderer et bidrag fra en familie i form av fargelegge tegninger, trykk, fotografier, kart, levende bilder og annet visuelt materiale. @no
toolkit label: fargelegger for (familie) @no
toolkit definition: Et uttrykk som inkluderer et bidrag fra en familie i form av fargelegge tegninger, trykk, fotografier, kart, levende bilder og annet visuelt materiale. @no
alternative label: colorist family of @en
label: is inkleurder-familie van @nl
definition: Relateert een familie aan een expressie die omvat een bijdrage door een familie door toevoegen van kleur aan tekeningen, afdrukken, foto's, kaarten, bewegende beelden en andere visuele content. @nl
toolkit label: inkleurder-familie van @nl
toolkit definition: Een expressie die omvat een bijdrage door een familie door toevoegen van kleur aan tekeningen, afdrukken, foto's, kaarten, bewegende beelden en andere visuele content. @nl
label: هي عائلة مسئولة عن تلوين لـ @ar
definition: يربط عائلة بتعبيرة تتضمن إسهام عائلة في تلوين رسومات، ومطبوعات، وصور فوتوغرافية، وخرائط، وصور متحركة، وأي محتوى مرئي آخر. @ar
toolkit label: عائلة مسئولة عن تلوين لـ @ar
toolkit definition: تعبيرة تتضمن إسهام عائلة في تلوين الرسومات، والمطبوعات، والصور الفوتوغرافية، والخرائط، والصور المتحركة، وأي محتوى مرئي آخر. @ar
label: és família colorista de @ca
definition: Relaciona una família amb una expressió que inclou una contribució d’una família aplicant color a dibuixos, gravats, fotografies, mapes, imatges en moviment i a qualsevol altre contingut visual. @ca
toolkit label: família colorista de @ca
toolkit definition: Expressió que inclou una contribució d’una família aplicant color a dibuixos, gravats, fotografies, mapes, imatges en moviment i a qualsevol altre contingut visual. @ca
label: er familie, som er farvelægger af @da
definition: Relaterer en familie til et udtryk, som omfatter en families bidrag ved at farvelægge tegninger, tryk, fotos, kort, levende billeder og andet visuelt indhold. @da
toolkit label: familie, som er farvelægger af @da
toolkit definition: Udtryk, som omfatter en families bidrag ved at farvelægge tegninger, tryk, fotos, kort, levende billeder og andet visuelt indhold. @da
label: koloreerija (perekond) väljenduses @et
definition: Seostab perekonna väljendusega, millesse perekond on andnud panuse, värvides joonistusi, tõmmiseid, fotosid, kaarte, liikuvaid pilte ja muud visuaalset sisu. @et
toolkit label: koloreerija (perekond) väljenduses @et
toolkit definition: Väljendus, millesse perekond on andnud panuse, värvides joonistusi, tõmmiseid, fotosid, kaarte, liikuvaid pilte ja muud visuaalset sisu. @et
label: ist Familie als Koloristin/Kolorist von @de
definition: Setzt eine Familie in Beziehung zu einer Expression, zu der eine Familie beiträgt, indem sie Farben auf Zeichnungen, Drucke, Fotografien, Karten, Bewegtbildern und so weiter aufbringt. @de
toolkit label: Familie als Koloristin/Kolorist von @de
toolkit definition: Eine Expression, zu der eine Familie beiträgt, indem sie Farben auf Zeichnungen, Drucke, Fotografien, Karten, Bewegtbildern und so weiter aufbringt. @de
label: colorist családja a következőnek: @hu
definition: Hozzákapcsol egy családot egy kifejezési formához, amely magában foglalja egy család közreműködését szín felhordásában rajzokra, nyomtatványokra, fényképekre, térképekre, mozgóképekre és más vizuális tartalmakra. @hu
toolkit label: colorist családja: @hu
toolkit definition: Egy kifejezési forma, amely magában foglalja egy család közreműködését szín felhordásában rajzokra, nyomtatványokra, fényképekre, térképekre, mozgóképekre és más vizuális tartalmakra. @hu
label: è colorista famiglia di @it
definition: Correla una famiglia a un'espressione che comprende un contributo di una famiglia nell'applicazione di colore a disegni, stampe, fotografie, mappe, immagini in movimento e altri contenuti visivi. @it
toolkit label: colorista famiglia di @it
toolkit definition: Espressione che comprende un contributo di una famiglia nell'applicazione di colore a disegni, stampe, fotografie, mappe, immagini in movimento e altri contenuti visivi. @it
label: είναι επιχρωματιστής οικογένεια του @el
toolkit label: επιχρωματιστής οικογένεια του @el
label: est une famille coloriste de @fr
definition: Met une famille en relation avec une expression qui intègre une contribution de la part d’une famille consistant à appliquer de la couleur à des dessins, des images imprimées, des photographies, des cartes, des images animées et d’autres contenus visuels. @fr
toolkit label: famille coloriste de @fr
toolkit definition: Expression qui intègre une contribution de la part d’une famille consistant à appliquer de la couleur à des dessins, des images imprimées, des photographies, des cartes, des images animées et d’autres contenus visuels. @fr
label: ir kolorists (dzimta/ģimene) @lv
definition: Sasaista dzimtu/ģimeni ar izteiksmi, kas ietver dzimtas/ģimenes ieguldījumu, izkrāsojot zīmējumu, gravīru, fotogrāfiju, karšu, kustīgo attēlu, u. tml. @lv
toolkit label: ir kolorists (dzimta/ģimene) @lv
toolkit definition: Izteiksme, kas ietver dzimtas/ģimenes ieguldījumu, izkrāsojot zīmējumu, gravīru, fotogrāfiju, karšu, kustīgo attēlu, u. tml. @lv
alternative label: عائلة مسئولة عن تلوين لـ @ar
alternative label: Familie als Coloristin/Colorist von @de
alternative label: -
alternative label: ……的着色者家族 @zh-hans
label: 是……的着色者家族 @zh-hans
definition: 将一个家族与包括将颜色施加于图画、印刷品、照片、地图、动态图像和其他视觉内容上的一个家族的贡献的一种内容表达关联起来。 @zh-hans
toolkit label: ……的着色者家族 @zh-hans
toolkit definition: 包括将颜色施加于图画、印刷品、照片、地图、动态图像和其他视觉内容上的一个家族的贡献的一种内容表达 @zh-hans
alternative label: colorista de @es
alternative label: színező családja: @hu
alternative label: renklendirici ailesi @tr
label: renklendirici ailesidir @tr
definition: Bir aile ile çizimlere, baskılara, fotoğraflara, haritalare, hareketli resimlere ve diğer görsel içeriğe renk uygulamaları yaparak katkı yapan aileyi içeren anlatımla ilişkilendirir. @tr
toolkit label: renklendirici ailesi @tr
toolkit definition: Çizimlere, baskılara, fotoğraflara, haritalara, hareketli resimlere ve diğer görsel içeriğe renk uygulamaları yapan bir ailenin katkısını içeren bir anlatım. @tr
has subproperty: P51024

värittäjä (henkilö) ekspressiossa
status: Published
label: is colourist person of @en
lexical alias: colouristPersonOf.en
definition: Relates a person to an expression that includes a contribution by a person of applying colour to drawings, prints, photographs, maps, moving images, and other visual content. @en
toolkit label: colourist person of @en
toolkit definition: An expression that includes a contribution by a person of applying colour to drawings, prints, photographs, maps, moving images, and other visual content. @en
type: Property
domain: C10004
has element type: 2
sub property of: yhdistymään osallinen henkilö ekspressiossa
sub property of: värittäjä (toimija) ekspressiossa
definition: Liittää henkilön ekspressioon, jossa henkilö on osallisena värittämällä piirustuksia, vedoksia, valokuvia, karttoja, elokuvia tms.
toolkit label: värittäjä (henkilö) ekspressiossa
toolkit definition: Ekspressio, jossa henkilö on osallisena värittämällä piirustuksia, vedoksia, valokuvia, karttoja, elokuvia tms.
label: er fargelegger for (person) @no
definition: Relaterer en person til et uttrykk som inkluderer et bidrag fra en person i form av fargelegge tegninger, trykk, fotografier, kart, levende bilder og annet visuelt materiale. @no
toolkit label: fargelegger for (person) @no
toolkit definition: Et uttrykk som inkluderer et bidrag fra en person i form av fargelegge tegninger, trykk, fotografier, kart, levende bilder og annet visuelt materiale. @no
alternative label: colorist person of @en
label: is inkleurder-persoon van @nl
definition: Relateert een persoon aan een expressie die omvat een bijdrage door een persoon door toevoegen van kleur aan tekeningen, afdrukken, foto's, kaarten, bewegende beelden en andere visuele content. @nl
toolkit label: inkleurder-persoon van @nl
toolkit definition: Een expressie die omvat een bijdrage door een persoon door toevoegen van kleur aan tekeningen, afdrukken, foto's, kaarten, bewegende beelden en andere visuele content. @nl
label: هو شخص فني تلوين لـ @ar
definition: يربط شخصا بتعبيرة تتضمن إسهام شخص في تلوين رسومات، ومطبوعات، وصور فوتوغرافية، وخرائط، وصور متحركة، وأي محتوى مرئي آخر. @ar
toolkit label: شخص فني تلوين لـ (هجاء بريطاني) @ar
toolkit definition: تعبيرة تتضمن إسهام شخص بتلوين الرسومات، والمطبوعات، والصور الفوتوغرافية، والخرائط، والصور المتحركة، وأي محتوى مرئي آخر. @ar
label: és persona colorista de @ca
definition: Relaciona una persona amb una expressió que inclou una contribució d’una persona aplicant color a dibuixos, gravats, fotografies, mapes, imatges en moviment i a qualsevol altre contingut visual. @ca
toolkit label: persona colorista de @ca
toolkit definition: Expressió que inclou una contribució d’una persona aplicant color a dibuixos, gravats, fotografies, mapes, imatges en moviment i a qualsevol altre contingut visual. @ca
label: er person, som er farvelægger af @da
definition: Relaterer en person til et udtryk, som omfatter en persons bidrag ved at farvelægge tegninger, tryk, fotos, kort, levende billeder og andet visuelt indhold. @da
toolkit label: person, som er farvelægger af @da
toolkit definition: Udtryk, som omfatter en persons bidrag ved at farvelægge tegninger, tryk, fotos, kort, levende billeder og andet visuelt indhold. @da
label: koloreerija (isik) väljenduses @et
definition: Seostab isiku väljendusega, millesse isik on andnud panuse, värvides joonistusi, tõmmiseid, fotosid, kaarte, liikuvaid pilte ja muud visuaalset sisu. @et
toolkit label: koloreerija (isik) väljenduses @et
toolkit definition: Väljendus, millesse isik on andnud panuse, värvides joonistusi, tõmmiseid, fotosid, kaarte, liikuvaid pilte ja muud visuaalset sisu. @et
label: ist Person als Koloristin/Kolorist von @de
definition: Setzt eine Person in Beziehung zu einer Expression, zu der eine Person beiträgt, indem sie Farben auf Zeichnungen, Drucke, Fotografien, Karten, Bewegtbilder und so weiter aufbringt. @de
toolkit label: Person als Koloristin/Kolorist von @de
toolkit definition: Eine Expression, zu der eine Person beiträgt, indem sie Farben auf Zeichnungen, Drucke, Fotografien, Karten, Bewegtbilder und so weiter aufbringt. @de
label: colorist személye a következőnek: @hu
definition: Hozzákapcsol egy személyt egy kifejezési formához, amely magában foglalja egy személy közreműködését szín felhordásában rajzokra, nyomtatványokra, fényképekre, térképekre, mozgóképekre és más vizuális tartalmakra. @hu
toolkit label: colorist személye: @hu
toolkit definition: Egy kifejezési forma, amely magában foglalja egy személy közreműködését szín felhordásában rajzokra, nyomtatványokra, fényképekre, térképekre, mozgóképekre és más vizuális tartalmakra. @hu
label: è colorista persona di @it
definition: Correla una persona a un'espressione che comprende un contributo di una persona nell'applicazione di colore a disegni, stampe, fotografie, mappe, immagini in movimento e altri contenuti visivi. @it
toolkit label: colorista persona di @it
toolkit definition: Espressione che comprende un contributo di una persona nell'applicazione di colore a disegni, stampe, fotografie, mappe, immagini in movimento e altri contenuti visivi. @it
label: είναι επιχρωματιστής φυσικό πρόσωπο του @el
toolkit label: επιχρωματιστής φυσικό πρόσωπο του @el
label: est une personne coloriste de @fr
definition: Met une personne en relation avec une expression qui intègre une contribution de la part d’une personne consistant à appliquer de la couleur à des dessins, des images imprimées, des photographies, des cartes, des images animées et d’autres contenus visuels. @fr
toolkit label: personne coloriste de @fr
toolkit definition: Expression qui intègre une contribution de la part d’une personne consistant à appliquer de la couleur à des dessins, des images imprimées, des photographies, des cartes, des images animées et d’autres contenus visuels. @fr
label: ir kolorists (persona) @lv
definition: Sasaista personu ar izteiksmi, kas ietver personas ieguldījumu, izkrāsojot zīmējumu, gravīru, fotogrāfiju, karšu, kustīgo attēlu, u. tml. @lv
toolkit label: ir kolorists (persona) @lv
toolkit definition: Izteiksme, kas ietver personas ieguldījumu, izkrāsojot zīmējumu, gravīru, fotogrāfiju, karšu, kustīgo attēlu, u. tml. @lv
alternative label: شخص فني تلوين لـ (هجاء أمريكي) @ar
alternative label: person, som er farvelægger af @da
alternative label: Person als Coloristin/Colorist von @de
alternative label: -
alternative label: ……的着色者个人 @zh-hans
label: 是……的着色者个人 @zh-hans
definition: 将一个个人与包括将颜色施加于图画、印刷品、照片、地图、动态图像和其他视觉内容上的一个个人的贡献的一种内容表达关联起来。 @zh-hans
toolkit label: ……的着色者个人 @zh-hans
toolkit definition: 包括将颜色施加于图画、印刷品、照片、地图、动态图像和其他视觉内容上的一个个人的贡献的一种内容表达 @zh-hans
alternative label: colorista de @es
alternative label: színező személye: @hu
alternative label: renklendirici @tr
label: renklendirici kişisidir @tr
definition: Bir kişiyi çizimlere, baskılara, fotoğraflara, haritalara, hareketli görüntülere ve diğer görsel içeriğe renk uygulama katkısını içeren bir anlatımla ilişkilendirir. @tr
toolkit label: renklendirici @tr
toolkit definition: Çizimlere, baskılara, fotoğraflara, haritalara, hareketli resimlere ve diğer görsel içeriğe renk uygulamaları yapan bir kişinin katkısını içeren bir anlatım. @tr
has subproperty: P50571

kommentaattori (toimija) ekspressiossa
status: Published
label: is commentator agent of @en
definition: Relates an agent to an expression that includes a contribution by an agent of providing interpretation, analysis, or a discussion of the subject matter on a recording, film, or other audiovisual medium. @en
type: Property
domain: C10002
sub property of: esittäjä (toimija) ekspressiossa
lexical alias: commentatorAgentOf.en
label: est un agent commentateur de @fr
definition: Met un agent en relation avec une expression qui intègre une contribution de la part d’un agent consistant à fournir une interprétation, une analyse ou une explication du sujet sur un enregistrement, un film ou un autre support audiovisuel. @fr
toolkit label: agent commentateur de @fr
toolkit definition: Expression qui intègre une contribution de la part d’un agent consistant à fournir une interprétation, une analyse ou une explication du sujet sur un enregistrement, un film ou un autre support audiovisuel. @fr
toolkit label: commentator agent of @en
toolkit definition: An expression that includes a contribution by an agent of providing interpretation, analysis, or a discussion of the subject matter on a recording, film, or other audiovisual medium. @en
instruction number: 18.5
label: είναι σχολιαστής φορέας του @el
definition: Συνδέει έναν εκτελεστή, ο οποίος συνεισφέρει σε μια έκφραση ενός έργου μέσω της ερμηνείας, ανάλυσης ή συζήτησης ενός θέματος σχετικά με μια ηχογράφηση, ταινία ή άλλο οπτικοακουστικό μέσο, με μια έκφραση. @el
toolkit label: σχολιαστής φορέας του @el
toolkit definition: Μια έκφραση ενός έργου που ενσωματώνει τη συνεισφορά της ερμηνείας, ανάλυσης ή συζήτησης ενός θέματος μιας ηχογράφησης, μιας ταινίας ή άλλου οπτικοακουστικού μέσου. @el
definition: Setzt einen Akteur in Beziehung zu einer Expression, zu der ein Akteur beiträgt, indem er in einer Aufnahme, in einem Film oder in einem anderen audiovisuellen Medium eine Interpretation, eine Analyse oder eine Diskussion des Themas präsentiert. @de
toolkit label: Akteur als Kommentatorin/Kommentator von @de
toolkit definition: Eine Expression, zu der ein Akteur beiträgt, indem er in einer Aufnahme, in einem Film oder in einem anderen audiovisuellen Medium eine Interpretation, eine Analyse oder eine Diskussion des Themas präsentiert. @de
label: er agent, som er kommentator af @da
definition: Relaterer en agent til et udtryk, som omfatter en agents bidrag ved at stå for fortolkning, analyse eller diskussion af det emne, som behandles i en optagelse, film eller andet audiovisuelt medium. @da
toolkit label: agent, som er kommentator af @da
toolkit definition: Udtryk, som omfatter en agents bidrag ved at stå for fortolkning, analyse eller diskussion af det emne, som behandles i en optagelse, film eller andet audiovisuelt medium. @da
label: és agent comentarista de @ca
definition: Relaciona un agent amb una expressió que inclou una contribució d’un agent proporcionant l’opinió, l’anàlisi o una explicació del tema d’un enregistrament, una pel·lícula o de qualsevol altre suport audiovisual. @ca
toolkit label: agent comentarista de @ca
toolkit definition: Expressió que inclou una contribució d’un agent proporcionant l’opinió, l’anàlisi o una explicació del tema d’un enregistrament, una pel·lícula o de qualsevol altre suport audiovisual. @ca
definition: Liittää toimijan ekspressioon, jonka tekemiseen toimija osallistuu tulkitsemalla tai analysoimalla äänitteen, elokuvan tai muun audiovisuaalisen aineiston aihetta tai keskustelemalla siitä.
toolkit label: kommentaattori (toimija) ekspressiossa
toolkit definition: Ekspressio, jonka tekemiseen toimija osallistuu tulkitsemalla tai analysoimalla äänitteen, elokuvan tai muun audiovisuaalisen aineiston aihetta tai keskustelemalla siitä.
toolkit label: kommentator for (agent) @no
toolkit definition: Et uttrykk som inkluderer et bidrag fra en agent i form av å tilføre tolkning, analyse eller drøfting av temaet for et opptak, en film eller et annet audiovisuelt medium. @no
label: ist Akteur als Kommentatorin/Kommentator von @de
has element type: 2
label: kommentátor ágense a következőnek: @hu
definition: Hozzákapcsol egy ágenst egy kifejezési formához, amely magában foglalja egy ágens közreműködését tolmácsolásban, elemzésben vagy a téma megvitatásában egy felvételen, filmen vagy más audiovizuális médiumon. @hu
toolkit label: kommentátor ágense: @hu
toolkit definition: Egy kifejezési forma, amely magában foglalja egy ágens közreműködését tolmácsolásban, elemzésben vagy a téma megvitatásában egy felvételen, filmen vagy más audiovizuális médiumon. @hu
alternative label: commentator of @en
alternative label: kommentaattorina ohjelmassa
label: er kommentator for (agent) @no
definition: Relaterer en agent til et uttrykk som inkluderer et bidrag fra en agent i form av å tilføre tolkning, analyse eller drøfting av temaet for et opptak, en film eller et annet audiovisuelt medium. @no
alternative label: kommentator for @no
label: is commentator-actor van @nl
definition: Relateert een actor aan een expressie die omvat een bijdrage door een actor door het verlenen van uitleg, analyse of een discussie over het onderwerp op een opname, film of ander audiovisueel medium. @nl
toolkit label: commentator-actor van @nl
toolkit definition: Een expressie die omvat een bijdrage door een actor door het verlenen van uitleg, analyse of een discussie over het onderwerp op een opname, film of ander audiovisueel medium. @nl
label: هو وكيل مُعلِق على @ar
definition: يربط وكيلا بتعبيرة تتضمن إسهام وكيل بتقديم تفسيرللموضوع، أو تحليله، أو مناقشته على تسجيل أوعلى فيلم، أو على أي وسيط سمعي بصري آخر. @ar
alternative label: معلق @ar
toolkit label: وكيل معلق @ar
toolkit definition: تعبيرة تتضمن إسهام وكيل في تقديم تفسير للموضوع، أو تحليله، أو مناقشته في تسجيل أو في فيلم، أو أي وسيط سمعي بصري آخر. @ar
alternative label: comentarista de @ca
alternative label: kommentator af @da
label: kommentaator (tegija) väljenduses @et
definition: Seostab tegija väljendusega, millesse tegija on andnud panuse, tõlgendades või analüüsides salvestuse, filmi või muu audiovisuaalse meediumi ainestikku või arutledes selle üle. @et
alternative label: kommentaator väljenduses @et
toolkit label: kommentaator (tegija) väljenduses @et
toolkit definition: Väljendus, millesse tegija on andnud panuse, tõlgendades või analüüsides salvestuse, filmi või muu audiovisuaalse meediumi ainestikku või arutledes selle üle. @et
alternative label: kommentátora: @hu
label: è commentatore agente di @it
definition: Correla un agente a un'espressione che include un contributo da parte di un agente nel fornire interpretazione, analisi o discussione dell'argomento di una registrazione, film o altro mezzo audiovisivo. @it
alternative label: commentatore di @it
toolkit label: commentatore agente di @it
toolkit definition: Espressione che include un contributo da parte di un agente nel fornire interpretazione, analisi o discussione dell'argomento di una registrazione, film o altro mezzo audiovisivo. @it
alternative label: σχολιαστής του @el
alternative label: commentateur de @fr
label: ir komentators (aģents) @lv
definition: Sasaista aģentu ar izteiksmi, kas ietver aģenta ieguldījumu, sniedzot interpretāciju, analīzi vai diskusiju par tēmu ierakstā, filmā vai citā audiovizuālā vidē. @lv
toolkit label: ir komentators (aģents) @lv
toolkit definition: Izteiksme, kas ietver aģenta ieguldījumu, sniedzot interpretāciju, analīzi vai diskusiju par tēmu ierakstā, filmā vai citā audiovizuālā vidē. @lv
alternative label: Kommentator von @de
alternative label: ……的解说员 @zh-hans
toolkit label: ……的解说员行为者 @zh-hans
toolkit definition: 包括有提供关于录像、电影或其他视听媒介中的主要内容之解释、分析或讨论的一个行为者的贡献的一种内容表达 @zh-hans
toolkit label: yorumcu temsilcisi @tr
toolkit definition: Bir kayıtta, filmde veya diğer görsel-işitsel ortamda konuya ilişkin yorum, analiz veya tartışma sağlayan bir temsilcinin katkısını içeren bir anlatım. @tr
has subproperty: kommentaattori (yhteistoimija) ekspressiossa

kommentaattori (yhteistoimija) ekspressiossa
status: Published
label: is commentator collective agent of @en
lexical alias: commentatorCollectiveAgentOf.en
definition: Relates a collective agent to an expression that includes a contribution by a collective agent of providing interpretation, analysis, or a discussion of the subject matter on a recording, film, or other audiovisual medium. @en
toolkit label: commentator collective agent of @en
toolkit definition: An expression that includes a contribution by a collective agent of providing interpretation, analysis, or a discussion of the subject matter on a recording, film, or other audiovisual medium. @en
type: Property
domain: C10011
has element type: 2
sub property of: esittäjä (yhteistoimija) ekspressiossa
sub property of: kommentaattori (toimija) ekspressiossa
definition: Liittää yhteistoimijan ekspressioon, jonka tekemisessä yhteistoimija on osallisena tulkitsemalla tai analysoimalla äänitteen, elokuvan tai muun audiovisuaalisen aineiston aihetta tai keskustelemalla siitä.
toolkit label: kommentaattori (yhteistoimija) ekspressiossa
toolkit definition: Ekspressio, jonka tekemisessä yhteistoimija on osallisena tulkitsemalla tai analysoimalla äänitteen, elokuvan tai muun audiovisuaalisen aineiston aihetta tai keskustelemalla siitä.
label: er kommentator for (kollektiv agent) @no
definition: Relaterer en kollektiv agent til et uttrykk som inkluderer et bidrag fra en kollektiv agent i form av å tilføre tolkning, analyse eller drøfting av temaet for et opptak, en film eller et annet audiovisuelt medium. @no
toolkit label: kommentator for (kollektiv agent) @no
toolkit definition: Et uttrykk som inkluderer et bidrag fra en kollektiv agent i form av å tilføre tolkning, analyse eller drøfting av temaet for et opptak, en film eller et annet audiovisuelt medium. @no
label: is commentator-collectieve actor van @nl
definition: Relateert een collectieve actor aan een expressie die omvat een bijdrage door een collectieve actor door het verlenen van uitleg, analyse of een discussie over het onderwerp op een opname, film of ander audiovisueel medium. @nl
toolkit label: commentator-collectieve actor van @nl
toolkit definition: Een expressie die omvat een bijdrage door een collectieve actor door het verlenen van uitleg, analyse of een discussie over het onderwerp op een opname, film of ander audiovisueel medium. @nl
label: هو وكيل جماعي معلق لـ @ar
definition: يربط وكيلا جماعيا بتعبيرة تتضمن إسهام وكيل جماعي في تقديم تفسير للموضوع، أو تحليله، أو مناقشته في تسجيل أو في فيلم، أو أي وسيط سمعي بصري آخر. @ar
toolkit label: وكيل جماعي معلق @ar
toolkit definition: تعبيرة تتضمن إسهام وكيل جماعي في تقديم تفسير للموضوع، أو تحليله، أو مناقشته في تسجيل أو في فيلم، أو أي وسيط سمعي بصري آخر. @ar
label: és agent col·lectiu comentarista de @ca
definition: Relaciona un agent col·lectiu amb una expressió que inclou una contribució d’un agent col·lectiu proporcionant l’opinió, l’anàlisi o una explicació del tema d’un enregistrament, una pel·lícula o de qualsevol altre suport audiovisual. @ca
toolkit label: agent col·lectiu comentarista de @ca
toolkit definition: Expressió que inclou una contribució d’un agent col·lectiu proporcionant l’opinió, l’anàlisi o una explicació del tema d’un enregistrament, una pel·lícula o de qualsevol altre suport audiovisual. @ca
label: er kollektiv agent, som er kommentator af @da
definition: Relaterer en kollektiv agent til et udtryk, som omfatter en kollektiv agents bidrag ved at stå for fortolkning, analyse eller diskussion af det emne, som behandles i en optagelse, film eller andet audiovisuelt medium. @da
toolkit label: kollektiv agent, som er kommentator af @da
toolkit definition: Udtryk, som omfatter en kollektiv agents bidrag ved at stå for fortolkning, analyse eller diskussion af det emne, som behandles i en optagelse, film eller andet audiovisuelt medium. @da
label: kommentaator (kollektiiv) väljenduses @et
definition: Seostab kollektiivi väljendusega, millesse kollektiiv on andnud panuse, tõlgendades või analüüsides salvestuse, filmi või muu audiovisuaalse meediumi ainestikku või arutledes selle üle. @et
toolkit label: kommentaator (kollektiiv) väljenduses @et
toolkit definition: Väljendus, millesse kollektiiv on andnud panuse, tõlgendades või analüüsides salvestuse, filmi või muu audiovisuaalse meediumi ainestikku või arutledes selle üle. @et
label: ist gemeinschaftlicher Akteur als Kommentatorin/Kommentator von @de
definition: Setzt einen gemeinschaftlichen Akteur in Beziehung zu einer Expression, zu der ein gemeinschaftlicher Akteur beiträgt, indem er in einer Aufnahme, in einem Film oder in einem anderen audiovisuellen Medium eine Interpretation, eine Analyse oder eine Diskussion des Themas präsentiert. @de
toolkit label: Gemeinschaftlicher Akteur als Kommentatorin/Kommentator von @de
toolkit definition: Eine Expression, zu der ein gemeinschaftlicher Akteur beiträgt, indem er in einer Aufnahme, in einem Film oder in einem anderen audiovisuellen Medium eine Interpretation, eine Analyse oder eine Diskussion des Themas präsentiert. @de
label: kommentátor kollektív ágense a következőnek: @hu
definition: Hozzákapcsol egy kollektív ágenst egy kifejezési formához, amely magában foglalja egy kollektív ágens közreműködését tolmácsolásban, elemzésben vagy a téma megvitatásában egy felvételen, filmen vagy más audiovizuális médiumon. @hu
toolkit label: kommentátor kollektív ágense: @hu
toolkit definition: Egy kifejezési forma, amely magában foglalja egy kollektív ágens közreműködését tolmácsolásban, elemzésben vagy a téma megvitatásában egy felvételen, filmen vagy más audiovizuális médiumon. @hu
label: è commentatore agente collettivo di @it
definition: Correla un agente collettivo a un'espressione che comprende un contributo di un agente collettivo nel fornire interpretazione, analisi o discussione dell'argomento di una registrazione, film o altro mezzo audiovisivo. @it
toolkit label: commentatore agente collettivo di @it
toolkit definition: Espressione che comprende un contributo di un agente collettivo nel fornire interpretazione, analisi o discussione dell'argomento di una registrazione, film o altro mezzo audiovisivo. @it
label: είναι σχολιαστής συλλογικός φορέας του @el
toolkit label: σχολιαστής συλλογικός φορέας του @el
label: est un agent collectif commentateur de @fr
definition: Met un agent collectif en relation avec une expression qui intègre une contribution de la part d’un agent collectif consistant à fournir une interprétation, une analyse ou une explication du sujet sur un enregistrement, un film ou un autre support audiovisuel. @fr
toolkit label: agent collectif commentateur de @fr
toolkit definition: Expression qui intègre une contribution de la part d’un agent collectif consistant à fournir une interprétation, une analyse ou une explication du sujet sur un enregistrement, un film ou un autre support audiovisuel. @fr
label: ir komentators (grupa) @lv
definition: Sasaista grupu ar izteiksmi, kas ietver grupas ieguldījumu, sniedzot interpretāciju, analīzi vai diskusiju par tēmu ierakstā, filmā vai citā audiovizuālā vidē. @lv
toolkit label: ir komentators (grupa) @lv
toolkit definition: Izteiksme, kas ietver grupas ieguldījumu, sniedzot interpretāciju, analīzi vai diskusiju par tēmu ierakstā, filmā vai citā audiovizuālā vidē. @lv
label: 是……的解说员集体行为者 @zh-hans
definition: 将一个集体行为者与包括有提供关于录像、电影或其他视听媒介中的主要内容之解释、分析或讨论的一个集体行为者的贡献的一种内容表达关联起来。 @zh-hans
toolkit label: ……的解说员集体行为者 @zh-hans
toolkit definition: 包括有提供关于录像、电影或其他视听媒介中的主要内容之解释、分析或讨论的一个集体行为者的贡献的一种内容表达 @zh-hans
label: yorumcu kolektif temsilcisidir @tr
definition: Kolektif bir temsilciyi, bir kayıt, film veya başka bir görsel-işitsel ortamda konunun yorumunu, analizini veya tartışmasını sağlayan kolektif bir temsilcinin katkısını içeren bir anlatım ile ilişkilendirir. @tr
toolkit label: yorumcu kolektif temsilcisi @tr
toolkit definition: Bir kayıtta, filmde veya diğer görsel-işitsel ortamda konuya ilişkin yorum, analiz veya tartışma sağlayan kolektif bir temsilcinin katkısını içeren bir anlatım. @tr
has subproperty: kommentaattori (yhteisö) ekspressiossa
has subproperty: kommentaattori (suku) ekspressiossa
has subproperty: P50757

kommentaattori (yhteisö) ekspressiossa
status: Published
label: is commentator corporate body of @en
lexical alias: commentatorCorporateBodyOf.en
definition: Relates a corporate body to an expression that includes a contribution by a corporate body of providing interpretation, analysis, or a discussion of the subject matter on a recording, film, or other audiovisual medium. @en
toolkit label: commentator corporate body of @en
toolkit definition: An expression that includes a contribution by a corporate body of providing interpretation, analysis, or a discussion of the subject matter on a recording, film, or other audiovisual medium. @en
type: Property
domain: C10005
has element type: 2
sub property of: esittäjä (yhteisö) ekspressiossa
sub property of: kommentaattori (yhteistoimija) ekspressiossa
definition: Liittää yhteisön ekspressioon, jonka tekemisessä yhteisö on osallisena tulkitsemalla tai analysoimalla äänitteen, elokuvan tai muun audiovisuaalisen aineiston aihetta tai keskustelemalla siitä.
toolkit label: kommentaattori (yhteisö) ekspressiossa
toolkit definition: Ekspressio, jonka tekemisessä yhteisö on osallisena tulkitsemalla tai analysoimalla äänitteen, elokuvan tai muun audiovisuaalisen aineiston aihetta tai keskustelemalla siitä.
label: er kommentator for (korporasjon) @no
definition: Relaterer en korporasjon til et uttrykk som inkluderer et bidrag fra en korporasjon i form av å tilføre tolkning, analyse eller drøfting av temaet for et opptak, en film eller et annet audiovisuelt medium. @no
toolkit label: kommentator for (korporasjon) @no
toolkit definition: Et uttrykk som inkluderer et bidrag fra en korporasjon i form av å tilføre tolkning, analyse eller drøfting av temaet for et opptak, en film eller et annet audiovisuelt medium. @no
label: is commentator-corporatie van @nl
definition: Relateert een corporatie aan een expressie die omvat een bijdrage door een corporatie door het verlenen van uitleg, analyse of een discussie over het onderwerp op een opname, film of ander audiovisueel medium. @nl
toolkit label: commentator-corporatie van @nl
toolkit definition: Een expressie die omvat een bijdrage door een corporatie door het verlenen van uitleg, analyse of een discussie over het onderwerp op een opname, film of ander audiovisueel medium. @nl
label: هي هيئة مسئولة عن التعليق لـ @ar
definition: يربط هيئة بتعبيرة تتضمن إسهام هيئة في تقديم تفسير للموضوع، أو تحليله، أو مناقشته في تسجيل أو في فيلم، أو أي وسيط سمعي بصري آخر. @ar
toolkit label: هيئة مسئولة عن التعليق @ar
toolkit definition: تعبيرة تتضمن إسهام هيئة في تقديم تفسير للموضوع، أو تحليله، أو مناقشته في تسجيل أو في فيلم، أو أي وسيط سمعي بصري آخر. @ar
label: és entitat corporativa comentarista de @ca
definition: Relaciona una entitat corporativa amb una expressió que inclou una contribució d’una entitat corporativa proporcionant l’opinió, l’anàlisi o una explicació del tema d’un enregistrament, una pel·lícula o de qualsevol altre suport audiovisual. @ca
toolkit label: entitat corporativa comentarista de @ca
toolkit definition: Expressió que inclou una contribució d’una entitat corporativa proporcionant l’opinió, l’anàlisi o una explicació del tema d’un enregistrament, una pel·lícula o de qualsevol altre suport audiovisual. @ca
label: er korporation, som er kommentator af @da
definition: Relaterer en korporation til et udtryk, som omfatter en korporations bidrag ved at stå for fortolkning, analyse eller diskussion af det emne, som behandles i en optagelse, film eller andet audiovisuelt medium. @da
toolkit label: korporation, som er kommentator af @da
toolkit definition: Udtryk, som omfatter en korporations bidrag ved at stå for fortolkning, analyse eller diskussion af det emne, som behandles i en optagelse, film eller andet audiovisuelt medium. @da
label: kommentaator (asutus) väljenduses @et
definition: Seostab asutuse väljendusega, millesse asutus on andnud panuse, tõlgendades või analüüsides salvestuse, filmi või muu audiovisuaalse meediumi ainestikku või arutledes selle üle. @et
toolkit label: kommentaator (asutus) väljenduses @et
toolkit definition: Väljendus, millesse asutus on andnud panuse, tõlgendades või analüüsides salvestuse, filmi või muu audiovisuaalse meediumi ainestikku või arutledes selle üle. @et
label: ist Körperschaft als Kommentatorin/Kommentator von @de
definition: Setzt eine Körperschaft in Beziehung zu einer Expression, zu der eine Körperschaft beiträgt, indem sie in einer Aufnahme, in einem Film oder in einem anderen audiovisuellen Medium eine Interpretation, eine Analyse oder eine Diskussion des Themas präsentiert. @de
toolkit label: Körperschaft als Kommentatorin/Kommentator von @de
toolkit definition: Eine Expression, zu der eine Körperschaft beiträgt, indem sie in einer Aufnahme, in einem Film oder in einem anderen audiovisuellen Medium eine Interpretation, eine Analyse oder eine Diskussion des Themas präsentiert. @de
label: kommentátor testülete a következőnek: @hu
definition: Hozzákapcsol egy testületet egy kifejezési formához, amely magában foglalja a testület közreműködését tolmácsolásban, elemzésben vagy a téma megvitatásában egy felvételen, filmen vagy más audiovizuális médiumon. @hu
toolkit label: kommentátor testülete: @hu
toolkit definition: Egy kifejezési forma, amely magában foglalja egy testület közreműködését tolmácsolásban, elemzésben vagy a téma megvitatásában egy felvételen, filmen vagy más audiovizuális médiumon. @hu
label: è commentatore ente di @it
definition: Correla un ente a un'espressione che comprende un contributo di un ente nel fornire interpretazione, analisi o discussione dell'argomento di una registrazione, film o altro mezzo audiovisivo. @it
toolkit label: commentatore ente di @it
toolkit definition: Espressione che comprende un contributo di un ente nel fornire interpretazione, analisi o discussione dell'argomento di una registrazione, film o altro mezzo audiovisivo. @it
label: είναι σχολιαστής συλλογικό όργανο του @el
toolkit label: σχολιαστής συλλογικό όργανο του @el
label: est une collectivité commentatrice de @fr
definition: Met une collectivité en relation avec une expression qui intègre une contribution de la part d’une collectivité consistant à fournir une interprétation, une analyse ou une explication du sujet sur un enregistrement, un film ou un autre support audiovisuel. @fr
toolkit label: collectivité commentatrice de @fr
toolkit definition: Expression qui intègre une contribution de la part d’une collectivité consistant à fournir une interprétation, une analyse ou une explication du sujet sur un enregistrement, un film ou un autre support audiovisuel. @fr
label: ir komentators (institūcija) @lv
definition: Sasaista institūciju ar izteiksmi, kas ietver institūcijas ieguldījumu, sniedzot interpretāciju, analīzi vai diskusiju par tēmu ierakstā, filmā vai citā audiovizuālā vidē. @lv
toolkit label: ir komentators (institūcija) @lv
toolkit definition: Izteiksme, kas ietver institūcijas ieguldījumu, sniedzot interpretāciju, analīzi vai diskusiju par tēmu ierakstā, filmā vai citā audiovizuālā vidē. @lv
label: 是……的解说员团体 @zh-hans
definition: 将一个团体与包括有提供关于录像、电影或其他视听媒介中的主要内容之解释、分析或讨论的一个团体的贡献的一种内容表达关联起来。 @zh-hans
toolkit label: ……的解说员团体 @zh-hans
toolkit definition: 包括有提供关于录像、电影或其他视听媒介中的主要内容之解释、分析或讨论的一个团体的贡献的一种内容表达 @zh-hans
label: yorumcu tüzel kişisidir @tr
definition: Bir tüzel kişiyi, bir kayıtta, filmde veya diğer görsel-işitsel ortamlarda konunun yorumunu, analizini veya tartışmasını sağlayan bir tüzel kişinin katkısını içeren bir anlatımla ilişkilendirir. @tr
toolkit label: yorumcu tüzel kişisi @tr
toolkit definition: Bir kayıt, film veya başka bir görsel-işitsel ortamda konunun yorumunu, analizini veya tartışmasını sağlayan tüzel bir kişinin katkısını içeren bir anlatım. @tr
has subproperty: P50908

kommentaattori (suku) ekspressiossa
status: Published
label: is commentator family of @en
lexical alias: commentatorFamilyOf.en
definition: Relates a family to an expression that includes a contribution by a family of providing interpretation, analysis, or a discussion of the subject matter on a recording, film, or other audiovisual medium. @en
toolkit label: commentator family of @en
toolkit definition: An expression that includes a contribution by a family of providing interpretation, analysis, or a discussion of the subject matter on a recording, film, or other audiovisual medium. @en
type: Property
domain: C10008
has element type: 2
sub property of: esittäjä (suku) ekspressiossa
sub property of: kommentaattori (yhteistoimija) ekspressiossa
definition: Liittää suvun ekspressioon, jonka tekemisessä suku on osallisena tulkitsemalla tai analysoimalla äänitteen, elokuvan tai muun audiovisuaalisen aineiston aihetta tai keskustelemalla siitä.
toolkit label: kommentaattori (suku) ekspressiossa
toolkit definition: Ekspressio, jonka tekemisessä suku on osallisena tulkitsemalla tai analysoimalla äänitteen, elokuvan tai muun audiovisuaalisen aineiston aihetta tai keskustelemalla siitä.
label: er kommentator for (familie) @no
definition: Relaterer en familie til et uttrykk som inkluderer et bidrag fra en familie i form av å tilføre tolkning, analyse eller drøfting av temaet for et opptak, en film eller et annet audiovisuelt medium. @no
toolkit label: kommentator for (familie) @no
toolkit definition: Et uttrykk som inkluderer et bidrag fra en familie i form av å tilføre tolkning, analyse eller drøfting av temaet for et opptak, en film eller et annet audiovisuelt medium. @no
label: is commentator-familie van @nl
definition: Relateert een familie aan een expressie die omvat een bijdrage door een familie door het verlenen van uitleg, analyse of een discussie over het onderwerp op een opname, film of ander audiovisueel medium. @nl
toolkit label: commentator-familie van @nl
toolkit definition: Een expressie die omvat een bijdrage door een familie door het verlenen van uitleg, analyse of een discussie over het onderwerp op een opname, film of ander audiovisueel medium. @nl
label: هي عائلة مسئولة عن التعليق لـ @ar
definition: يربط عائلة بتعبيرة تتضمن إسهام عائلة في تقديم تفسير للموضوع، أو تحليله، أو مناقشته في تسجيل أو في فيلم، أو أي وسيط سمعي بصري آخر. @ar
toolkit label: عائلة مسئولة عن التعليق @ar
toolkit definition: تعبيرة تتضمن إسهام عائلة في تقديم تفسير للموضوع، أو تحليله، أو مناقشته في تسجيل أو في فيلم، أو أي وسيط سمعي بصري آخر. @ar
label: és família comentarista de @ca
definition: Relaciona una família amb una expressió que inclou una contribució d’una família proporcionant l’opinió, l’anàlisi o una explicació del tema d’un enregistrament, una pel·lícula o de qualsevol altre suport audiovisual. @ca
toolkit label: família comentarista de @ca
toolkit definition: Expressió que inclou una contribució d’una família proporcionant l’opinió, l’anàlisi o una explicació del tema d’un enregistrament, una pel·lícula o de qualsevol altre suport audiovisual. @ca
label: er familie, som er kommentator af @da
definition: Relaterer en familie til et udtryk, som omfatter en families bidrag ved at stå for fortolkning, analyse eller diskussion af det emne, som behandles i en optagelse, film eller andet audiovisuelt medium. @da
toolkit label: familie, som er kommentator af @da
toolkit definition: Udtryk, som omfatter en families bidrag ved at stå for fortolkning, analyse eller diskussion af det emne, som behandles i en optagelse, film eller andet audiovisuelt medium. @da
label: kommentaator (perekond) väljenduses @et
definition: Seostab perekonna väljendusega, millesse perekond on andnud panuse, tõlgendades või analüüsides salvestuse, filmi või muu audiovisuaalse meediumi ainestikku või arutledes selle üle. @et
toolkit label: kommentaator (perekond) väljenduses @et
toolkit definition: Väljendus, millesse perekond on andnud panuse, tõlgendades või analüüsides salvestuse, filmi või muu audiovisuaalse meediumi ainestikku või arutledes selle üle. @et
label: ist Familie als Kommentatorin/Kommentator von @de
definition: Setzt eine Familie in Beziehung zu einer Expression, zu der eine Familie beiträgt, indem sie in einer Aufnahme, in einem Film oder in einem anderen audiovisuellen Medium eine Interpretation, eine Analyse oder eine Diskussion des Themas präsentiert. @de
toolkit label: Familie als Kommentatorin/Kommentator von @de
toolkit definition: Eine Expression, zu der eine Familie beiträgt, indem sie in einer Aufnahme, in einem Film oder in einem anderen audiovisuellen Medium eine Interpretation, eine Analyse oder eine Diskussion des Themas präsentiert. @de
label: kommentátor családja a következőnek: @hu
definition: Hozzákapcsol egy családot egy kifejezési formához, amely magában foglalja egy család közreműködését tolmácsolásban, elemzésben vagy a téma megvitatásában egy felvételen, filmen vagy más audiovizuális médiumon. @hu
toolkit label: kommentátor családja: @hu
toolkit definition: Egy kifejezési forma, amely magában foglalja egy család közreműködését tolmácsolásban, elemzésben vagy a téma megvitatásában egy felvételen, filmen vagy más audiovizuális médiumon. @hu
label: è commentatore famiglia di @it
definition: Correla una famiglia a un'espressione che comprende un contributo di una famiglia nel fornire interpretazione, analisi o discussione dell'argomento di una registrazione, film o altro mezzo audiovisivo. @it
toolkit label: commentatore famiglia di @it
toolkit definition: Espressione che comprende un contributo di una famiglia nel fornire interpretazione, analisi o discussione dell'argomento di una registrazione, film o altro mezzo audiovisivo. @it
label: είναι σχολιαστής οικογένεια του @el
toolkit label: σχολιαστής οικογένεια του @el
label: est une famille commentatrice de @fr
definition: Met une famille en relation avec une expression qui intègre une contribution de la part d’une famille consistant à fournir une interprétation, une analyse ou une explication du sujet sur un enregistrement, un film ou un autre support audiovisuel. @fr
toolkit label: famille commentatrice de @fr
toolkit definition: Expression qui intègre une contribution de la part d’une famille consistant à fournir une interprétation, une analyse ou une explication du sujet sur un enregistrement, un film ou un autre support audiovisuel. @fr
label: ir komentators (dzimta/ģimene) @lv
definition: Sasaista dzimtu/ģimeni ar izteiksmi, kas ietver dzimtas/ģimenes ieguldījumu, sniedzot interpretāciju, analīzi vai diskusiju par tēmu ierakstā, filmā vai citā audiovizuālā vidē. @lv
toolkit label: ir komentators (dzimta/ģimene) @lv
toolkit definition: Izteiksme, kas ietver dzimtas/ģimenes ieguldījumu, sniedzot interpretāciju, analīzi vai diskusiju par tēmu ierakstā, filmā vai citā audiovizuālā vidē. @lv
label: 是……的解说员家族 @zh-hans
definition: 将一个家族与包括有提供关于录像、电影或其他视听媒介中的主要内容之解释、分析或讨论的一个家族的贡献的一种内容表达关联起来。 @zh-hans
toolkit label: ……的解说员家族 @zh-hans
toolkit definition: 包括有提供关于录像、电影或其他视听媒介中的主要内容之解释、分析或讨论的一个家族的贡献的一种内容表达 @zh-hans
label: yorumcu ailesidir @tr
definition: Bir aileyi, bir kayıtta, filmde veya diğer görsel-işitsel ortamlarda konunun yorumlanması, analizi veya tartışılması konusunda bir ailenin katkısını içeren bir anlatımla ilişkilendirir. @tr
toolkit label: yorumcu ailesi @tr
toolkit definition: Bir kayıtta, filmde veya diğer görsel-işitsel ortamda konuya ilişkin yorum, analiz veya tartışma sağlayan bir ailenin katkısını içeren bir anlatım. @tr
has subproperty: P51059

kommentaattori (henkilö) ekspressiossa
status: Published
label: is commentator person of @en
lexical alias: commentatorPersonOf.en
definition: Relates a person to an expression that includes a contribution by a person of providing interpretation, analysis, or a discussion of the subject matter on a recording, film, or other audiovisual medium. @en
toolkit label: commentator person of @en
toolkit definition: An expression that includes a contribution by a person of providing interpretation, analysis, or a discussion of the subject matter on a recording, film, or other audiovisual medium. @en
type: Property
domain: C10004
has element type: 2
sub property of: esittäjä (henkilö) ekspressiossa
sub property of: kommentaattori (toimija) ekspressiossa
definition: Liittää henkilön ekspressioon, jonka tekemisessä henkilö on osallisena tulkitsemalla tai analysoimalla äänitteen, elokuvan tai muun audiovisuaalisen aineiston aihetta tai keskustelemalla siitä.
toolkit label: kommentaattori (henkilö) ekspressiossa
toolkit definition: Ekspressio, jonka tekemisessä henkilö on osallisena tulkitsemalla tai analysoimalla äänitteen, elokuvan tai muun audiovisuaalisen aineiston aihetta tai keskustelemalla siitä.
label: er kommentator for (person) @no
definition: Relaterer en person til et uttrykk som inkluderer et bidrag fra en person i form av å tilføre tolkning, analyse eller drøfting av temaet for et opptak, en film eller et annet audiovisuelt medium. @no
toolkit label: kommentator for (person) @no
toolkit definition: Et uttrykk som inkluderer et bidrag fra en person i form av å tilføre tolkning, analyse eller drøfting av temaet for et opptak, en film eller et annet audiovisuelt medium. @no
label: is commentator-persoon van @nl
definition: Relateert een persoon aan een expressie die omvat een bijdrage door een persoon door het verlenen van uitleg, analyse of een discussie over het onderwerp op een opname, film of ander audiovisueel medium. @nl
toolkit label: commentator-persoon van @nl
toolkit definition: Een expressie die omvat een bijdrage door een persoon door het verlenen van uitleg, analyse of een discussie over het onderwerp op een opname, film of ander audiovisueel medium. @nl
label: هو شخص معلق لـ @ar
definition: يربط شخصا بتعبيرة تتضمن إسهام شخص في تقديم تفسير للموضوع، أو تحليله، أو مناقشته في تسجيل أو في فيلم، أو أي وسيط سمعي بصري آخر. @ar
toolkit label: شخص مُعلِق @ar
toolkit definition: تعبيرة تتضمن إسهام شخص في تقديم تفسير للموضوع، أو تحليله، أو مناقشته في تسجيل أو في فيلم، أو أي وسيط سمعي بصري آخر. @ar
label: és persona comentarista de @ca
definition: Relaciona una persona amb una expressió que inclou una contribució d’una persona proporcionant l’opinió, l’anàlisi o una explicació del tema d’un enregistrament, una pel·lícula o de qualsevol altre suport audiovisual. @ca
toolkit label: persona comentarista de @ca
toolkit definition: Expressió que inclou una contribució d’una persona proporcionant l’opinió, l’anàlisi o una explicació del tema d’un enregistrament, una pel·lícula o de qualsevol altre suport audiovisual. @ca
label: er person, som er kommentator af @da
definition: Relaterer en person til et udtryk, som omfatter en persons bidrag ved at stå for fortolkning, analyse eller diskussion af det emne, som behandles i en optagelse, film eller andet audiovisuelt medium. @da
toolkit label: person, som er kommentator af @da
toolkit definition: Udtryk, som omfatter en persons bidrag ved at stå for fortolkning, analyse eller diskussion af det emne, som behandles i en optagelse, film eller andet audiovisuelt medium. @da
label: kommentaator (isik) väljenduses @et
definition: Seostab isiku väljendusega, millesse isik on andnud panuse, tõlgendades või analüüsides salvestuse, filmi või muu audiovisuaalse meediumi ainestikku või arutledes selle üle. @et
toolkit label: kommentaator (isik) väljenduses @et
toolkit definition: Väljendus, millesse isik on andnud panuse, tõlgendades või analüüsides salvestuse, filmi või muu audiovisuaalse meediumi ainestikku või arutledes selle üle. @et
label: ist Person als Kommentatorin/Kommentator von @de
definition: Setzt eine Person in Beziehung zu einer Expression, zu der eine Person beiträgt, indem sie in einer Aufnahme, in einem Film oder in einem anderen audiovisuellen Medium eine Interpretation, eine Analyse oder eine Diskussion des Themas präsentiert. @de
toolkit label: Person als Kommentatorin/Kommentator von @de
toolkit definition: Eine Expression, zu der eine Person beiträgt, indem sie in einer Aufnahme, in einem Film oder in einem anderen audiovisuellen Medium eine Interpretation, eine Analyse oder eine Diskussion des Themas präsentiert. @de
label: kommentátor személye a következőnek: @hu
definition: Hozzákapcsol egy személyt egy kifejezési formához, amely magában foglalja egy személy közreműködését tolmácsolásban, elemzésben vagy a téma megvitatásában egy felvételen, filmen vagy más audiovizuális médiumon. @hu
toolkit label: kommentátor személye: @hu
toolkit definition: Egy kifejezési forma, amely magában foglalja egy személy közreműködését tolmácsolásban, elemzésben vagy a téma megvitatásában egy felvételen, filmen vagy más audiovizuális médiumon. @hu
label: è commentatore persona di @it
definition: Correla una persona a un'espressione che comprende un contributo di una persona nel fornire interpretazione, analisi o discussione dell'argomento di una registrazione, film o altro mezzo audiovisivo. @it
toolkit label: commentatore persona di @it
toolkit definition: Espressione che comprende un contributo di una persona nel fornire interpretazione, analisi o discussione dell'argomento di una registrazione, film o altro mezzo audiovisivo. @it
label: είναι σχολιαστής φυσικό πρόσωπο του @el
toolkit label: σχολιαστής φυσικό πρόσωπο του @el
label: est une personne commentatrice de @fr
definition: Met une personne en relation avec une expression qui intègre une contribution de la part d’une personne consistant à fournir une interprétation, une analyse ou une explication du sujet sur un enregistrement, un film ou un autre support audiovisuel. @fr
toolkit label: personne commentatrice de @fr
toolkit definition: Expression qui intègre une contribution de la part d’une personne consistant à fournir une interprétation, une analyse ou une explication du sujet sur un enregistrement, un film ou un autre support audiovisuel. @fr
label: ir komentators (persona) @lv
definition: Sasaista personu ar izteiksmi, kas ietver personas ieguldījumu, sniedzot interpretāciju, analīzi vai diskusiju par tēmu ierakstā, filmā vai citā audiovizuālā vidē. @lv
toolkit label: ir komentators (persona) @lv
toolkit definition: Izteiksme, kas ietver personas ieguldījumu, sniedzot interpretāciju, analīzi vai diskusiju par tēmu ierakstā, filmā vai citā audiovizuālā vidē. @lv
label: 是……的解说员个人 @zh-hans
definition: 将一个个人与包括有提供关于录像、电影或其他视听媒介中的主要内容之解释、分析或讨论的一个个人的贡献的一种内容表达关联起来。 @zh-hans
toolkit label: ……的解说员个人 @zh-hans
toolkit definition: 包括有提供关于录像、电影或其他视听媒介中的主要内容之解释、分析或讨论的一个个人的贡献的一种内容表达 @zh-hans
label: yorumcu kişisidir @tr
definition: Bir kişiyi, bir kayıt, film veya başka bir görsel-işitsel ortamda konuyla ilgili yorum, analiz veya tartışma sağlayan bir kişinin katkısını içeren bir anlatımla ilişkilendirir. @tr
toolkit label: yorumcu @tr
toolkit definition: Bir kayıtta, filmde veya diğer görsel-işitsel ortamda konuya ilişkin yorum, analiz veya tartışma sağlayan bir kişinin katkısını içeren bir anlatım. @tr
has subproperty: P50606

toimeksiantaja (toimija) teoksessa
status: Published
type: Property
label: is commissioning agent of @en
definition: Relates an agent to a work that involves a responsibility of an agent for commissioning a work. @en
domain: C10002
toolkit label: commissioning agent of @en
toolkit definition: A work that involves a responsibility of an agent for commissioning a work. @en
instruction number: 18.5
sub property of: toimijaan liittyvä teos
label: είναι αναθέτον όργανο φορέας του @el
definition: Συνδέει έναν φορέα υπεύθυνο για την ανάθεση ενός έργου, με ένα έργο. @el
toolkit label: αναθέτον όργανο φορέας του @el
toolkit definition: Ένα έργο που περιλαμβάνει την ευθύνη για την ανάθεση ενός έργου. @el
definition: Setzt einen Akteur in Beziehung zu einem Werk, bei dem ein Akteur dafür verantwortlich ist, ein Werk in Auftrag zu geben. @de
toolkit label: Akteur als Auftraggeberin/Auftraggeber von @de
toolkit definition: Ein Werk, bei dem ein Akteur dafür verantwortlich ist, ein Werk in Auftrag zu geben. @de
label: er agent, som er opgavestiller af @da
definition: Relaterer en agent til et værk, som involverer en agents ansvar for at bestille et værk. @da
toolkit label: agent, som er opgavestiller af @da
toolkit definition: Værk, som involverer en agents ansvar for at bestille et værk. @da
label: és agent comitent de @ca
definition: Relaciona un agent amb una obra que implica una responsabilitat d’un agent d’encarregar una obra. @ca
toolkit label: agent comitent de @ca
toolkit definition: Obra que implica una responsabilitat d’un agent d’encarregar una obra. @ca
definition: Liittää toimijan teokseen, jossa toimija on vastuussa teoksen teettämisestä.
toolkit label: toimeksiantaja (toimija) teoksessa
toolkit definition: Teos, jossa toimija on vastuussa teoksen teettämisestä.
toolkit label: oppdragsgiver for (agent) @no
toolkit definition: Et verk som involverer ansvar for en agent i form av å gi et verk som oppdrag. @no
label: ist Akteur als Auftraggeberin/Auftraggeber von @de
label: est un agent commanditaire de @fr
definition: Met un agent en relation avec une œuvre qui comporte une responsabilité de la part d’un agent consistant à commander une œuvre. @fr
toolkit label: agent commanditaire de @fr
toolkit definition: Œuvre qui comporte une responsabilité de la part d’un agent consistant à commander une œuvre. @fr
has element type: 2
label: megrendelő ágense a következőnek: @hu
definition: Hozzákapcsol egy ágenst egy műhöz, amelyhez hozzátartozik egy ágens felelőssége egy mű megrendeléséért. @hu
toolkit label: megrendelő ágense: @hu
toolkit definition: Egy mű, amelyhez hozzátartozik egy ágens felelőssége egy mű megrendeléséért. @hu
alternative label: commissioning body of @en
alternative label: teettäjänä teokselle
label: er oppdragsgiver for (agent) @no
definition: Relaterer en agent til et verk som involverer ansvar for en agent i form av å gi et verk som oppdrag. @no
alternative label: oppdragsgiver for @no
lexical alias: commissioningAgentOf.en
label: is opdrachtgever-actor van @nl
definition: Relateert een actor aan een werk dat met zich meebrengt een verantwoordelijkheid van een actor voor opdracht geven tot een werk. @nl
toolkit label: opdrachtgever-actor van @nl
toolkit definition: Een werk dat met zich meebrengt een verantwoordelijkheid van een actor voor opdracht geven tot een werk. @nl
label: هو وكيل جهة تكليف بـ @ar
definition: يربط وكيلا بعمل يترتب عليه مسئولية وكيل عن إصدار تكليف بعمل. @ar
alternative label: جهة تكليف @ar
toolkit label: وكيل جهة تكليف بـ @ar
toolkit definition: عمل يترتب عليه مسئولية وكيل عن إصدار تكليف بعمل. @ar
alternative label: comitent de @ca
alternative label: opgavestiller af @da
label: tellija (tegija) teoses @et
definition: Seostab tegija teosega, mis sisaldab tegija vastutust teose tellimise eest. @et
alternative label: tellija teoses @et
toolkit label: tellija (tegija) teoses @et
toolkit definition: Teos, mis sisaldab tegija vastutust teose tellimise eest. @et
alternative label: megrendelője: @hu
label: è committente agente di @it
definition: Correla un agente a un'opera che implica la responsabilità di un agente nella committenza di un'opera. @it
alternative label: committente di @it
toolkit label: ente committente agente di @it
toolkit definition: Opera che implica la responsabilità di un agente nella committenza di un'opera. @it
alternative label: αναθέτον όργανο του @el
alternative label: commanditaire de @fr
label: ir pasūtītājs (aģents) @lv
definition: Sasaista aģentu ar darbu, kas ietver aģenta atbildību par darba pasūtīšanu. @lv
toolkit label: ir pasūtītājs (aģents) @lv
toolkit definition: Darbs, kas ietver aģenta atbildību par darba pasūtīšanu. @lv
alternative label: Auftraggeber von @de
alternative label: ……的委托团体 @zh-hans
toolkit label: ……的委托行为者 @zh-hans
toolkit definition: 涉及委托一种作品的一个行为者的责任的一种作品 @zh-hans
toolkit label: görevlendiren temsilci @tr
toolkit definition: Bir eser için bir temsilcinin sorumluluğunu içeren bir çalışma. @tr
has subproperty: toimeksiantaja (yhteistoimija) teoksessa

toimeksiantaja (yhteistoimija) teoksessa
status: Published
label: is commissioning collective agent of @en
definition: Relates a collective agent to a work that involves a responsibility of a collective agent for commissioning a work. @en
toolkit label: commissioning collective agent of @en
toolkit definition: A work that involves a responsibility of a collective agent for commissioning a work. @en
type: Property
domain: C10011
has element type: 2
sub property of: yhteistoimijaan liittyvä teos
sub property of: toimeksiantaja (toimija) teoksessa
definition: Liittää yhteistoimijan teokseen, jossa yhteistoimija on vastuussa teoksen teettämisestä.
toolkit label: toimeksiantaja (yhteistoimija) teoksessa
toolkit definition: Teos, jossa yhteistoimija on vastuussa teoksen teettämisestä.
label: er oppdragsgiver for (kollektiv agent) @no
definition: Relaterer en kollektiv agent til et verk som involverer et ansvar for en kollektiv agent i form av å bestille et verk. @no
toolkit label: oppdragsgiver for (kollektiv agent) @no
toolkit definition: Et verk som involverer et ansvar for en kollektiv agent i form av å bestille et verk. @no
lexical alias: commissioningCollectiveAgentOf.en
label: is opdrachtgever-collectieve actor van @nl
definition: Relateert een collectieve actor aan een werk dat met zich meebrengt een verantwoordelijkheid van een collectieve actor voor opdracht geven tot een werk. @nl
toolkit label: opdrachtgever-collectieve actor van @nl
toolkit definition: Een werk dat met zich meebrengt een verantwoordelijkheid van een collectieve actor voor opdracht geven tot een werk. @nl
label: هو وكيل جماعي جهة تكليف لـ @ar
definition: يربط وكيلا جماعيا بعمل ينطوي على مسئوليته عن إصدار التكليف بعمل. @ar
toolkit label: وكيل جماعي جهة تكليف بـ @ar
toolkit definition: عمل ينطوي على مسئولية وكيل جماعي عن إصدار التكليف بعمل. @ar
label: és agent col·lectiu comitent de @ca
definition: Relaciona un agent col·lectiu amb una obra que implica una responsabilitat d’un agent col·lectiu d’encarregar una obra. @ca
toolkit label: agent col·lectiu comitent de @ca
toolkit definition: Obra que implica una responsabilitat d’un agent col·lectiu d’encarregar una obra. @ca
label: er kollektiv agent, som er opgavestiller af @da
definition: Relaterer en kollektiv agent til et værk, som involverer en kollektiv agents ansvar for at bestille et værk. @da
toolkit label: kollektiv agent, som er opgavestiller af @da
toolkit definition: Værk, som involverer en kollektiv agents ansvar for at bestille et værk. @da
label: tellija (kollektiiv) teoses @et
definition: Seostab kollektiivi teosega, mis sisaldab kollektiivi vastutust teose tellimise eest. @et
toolkit label: tellija (kollektiiv) teoses @et
toolkit definition: Teos, mis sisaldab kollektiivi vastutust teose tellimise eest. @et
label: ist gemeinschaftlicher Akteur als Auftraggeberin/Auftraggeber von @de
definition: Setzt einen gemeinschaftlichen Akteur in Beziehung zu einem Werk, bei dem ein gemeinschaftlicher Akteur dafür verantwortlich ist, ein Werk in Auftrag zu geben. @de
toolkit label: Gemeinschaftlicher Akteur als Auftraggeberin/Auftraggeber von @de
toolkit definition: Ein Werk, bei dem ein gemeinschaftlicher Akteur dafür verantwortlich ist, ein Werk in Auftrag zu geben. @de
label: megrendelő kollektív ágense a következőnek: @hu
definition: Hozzákapcsol egy kollektív ágenst egy műhöz, amelyhez hozzátartozik egy kollektív ágens felelőssége egy mű megrendeléséért. @hu
toolkit label: megrendelő kollektív ágense: @hu
toolkit definition: Egy mű, amelyhez hozzátartozik egy kollektív ágens felelőssége egy mű megrendeléséért. @hu
label: è ente committente agente collettivo di @it
definition: Correla un agente collettivo a un'opera che implica una responsabilità di un agente collettivo nella committenza di un'opera. @it
toolkit label: ente committente agente collettivo di @it
toolkit definition: Opera che implica una responsabilità di un agente collettivo nella committenza di un'opera. @it
label: είναι προσληφθέν όργανο συλλογικός φορέας του @el
toolkit label: προσληφθέν όργανο συλλογικός φορέας του @el
label: est un agent collectif commanditaire de @fr
definition: Met un agent collectif en relation avec une œuvre qui comporte une responsabilité de la part d’un agent collectif consistant à commander une œuvre. @fr
toolkit label: agent collectif commanditaire de @fr
toolkit definition: Œuvre qui comporte une responsabilité de la part d’un agent collectif consistant à commander une œuvre. @fr
label: ir pasūtītājs (grupa) @lv
definition: Sasaista grupu ar darbu, kas ietver grupas atbildību par darba pasūtīšanu. @lv
toolkit label: ir pasūtītājs (grupa) @lv
toolkit definition: Darbs, kas ietver grupas atbildību par darba pasūtīšanu. @lv
label: 是……的委托集体行为者 @zh-hans
definition: 将一个集体行为者与涉及委托一种作品的一个集体行为者的责任的一种作品关联起来。 @zh-hans
toolkit label: ……的委托集体行为者 @zh-hans
toolkit definition: 涉及委托一种作品的一个集体行为者的责任的一种作品 @zh-hans
label: görevlendiren kolektif temsilcisidir @tr
definition: Kolektif bir temsilciyi, bir işi işletmekle görevli kolektif temsilcinin sorumluluğunu içeren bir eser ile ilişkilendirir. @tr
toolkit label: görevlendiren kolektif temsilci @tr
toolkit definition: Bir eserin görevlendirilmesi için kolektif temsilcinin sorumluluğunu içeren bir eser. @tr
has subproperty: toimeksiantaja (yhteisö) teoksessa
has subproperty: toimeksiantaja (suku) teoksessa
has subproperty: P50689

toimeksiantaja (yhteisö) teoksessa
status: Published
label: is commissioning corporate body of @en
definition: Relates a corporate body to a work that involves a responsibility of a corporate body for commissioning a work. @en
toolkit label: commissioning corporate body of @en
toolkit definition: A work that involves a responsibility of a corporate body for commissioning a work. @en
type: Property
domain: C10005
has element type: 2
sub property of: toimeksiantaja (yhteistoimija) teoksessa
definition: Liittää yhteisön teokseen, jossa yhteisö on vastuussa teoksen teettämisestä.
toolkit label: toimeksiantaja (yhteisö) teoksessa
toolkit definition: Teos, jossa yhteisö on vastuussa teoksen teettämisestä.
label: er oppdragsgiver for (korporasjon) @no
definition: Relaterer en korporasjon til et verk som involverer et ansvar for en korporasjon i form av å bestille et verk. @no
toolkit label: oppdragsgiver for (korporasjon) @no
toolkit definition: Et verk som involverer et ansvar for en korporasjon i form av å bestille et verk. @no
sub property of: yhteisöön liittyvä teos
lexical alias: commissioningCorporateBodyOf.en
label: is opdrachtgever-corporatie van @nl
definition: Relateert een corporatie aan een werk dat met zich meebrengt een verantwoordelijkheid van een corporatie voor opdracht geven tot een werk. @nl
toolkit label: opdrachtgever-corporatie van @nl
toolkit definition: Een werk dat met zich meebrengt een verantwoordelijkheid van een corporatie voor opdracht geven tot een werk. @nl
label: هي هيئة جهة تكليف لـ @ar
definition: يربط هيئة بعمل يترتب عليه مسئولية هيئة عن إصدار التكليف بعمل. @ar
toolkit label: هيئة جهة تكليف بـ @ar
toolkit definition: عمل يترتب عليه مسئولية هيئة عن إصدار التكليف بعمل. @ar
label: és entitat comitent de @ca
definition: Relaciona una entitat corporativa amb una obra que implica una responsabilitat d’una entitat corporativa d’encarregar una obra. @ca
toolkit label: entitat comitent de @ca
toolkit definition: Obra que implica una responsabilitat d’una entitat corporativa d’encarregar una obra. @ca
label: er korporation, som er opgavestiller af @da
definition: Relaterer en korporation til et værk, som involverer en korporations ansvar for at bestille et værk. @da
toolkit label: korporation, som er opgavestiller af @da
toolkit definition: Værk, som involverer en korporations ansvar for at bestille et værk. @da
label: tellija (asutus) teoses @et
definition: Seostab asutuse teosega, mis sisaldab asutuse vastutust teose tellimise eest. @et
toolkit label: tellija (asutus) teoses @et
toolkit definition: Teos, mis sisaldab asutuse vastutust teose tellimise eest. @et
label: ist Körperschaft als Auftraggeberin/Auftraggeber von @de
definition: Setzt eine Körperschaft in Beziehung zu einem Werk, bei dem eine Körperschaft dafür verantwortlich ist, ein Werk in Auftrag zu geben. @de
toolkit label: Körperschaft als Auftraggeberin/Auftraggeber von @de
toolkit definition: Ein Werk, bei dem eine Körperschaft dafür verantwortlich ist, ein Werk in Auftrag zu geben. @de
label: megrendelő testülete a következőnek: @hu
definition: Hozzákapcsol egy testületet egy műhöz, amelyhez hozzátartozik egy testület felelőssége egy mű megrendeléséért. @hu
toolkit label: megrendelő testülete: @hu
toolkit definition: Egy mű, amelyhez hozzátartozik egy testület felelőssége egy mű megrendeléséért. @hu
label: è ente committente ente di @it
definition: Correla un ente a un'opera che implica una responsabilità di un ente per la committenza di un'opera. @it
toolkit label: ente committente ente di @it
toolkit definition: Opera che implica una responsabilità di un ente per la committenza di un'opera. @it
label: είναι προσληφθέν όργανο συλλογικό όργανο του @el
toolkit label: προσληφθέν όργανο συλλογικό όργανο του @el
label: est une collectivité commanditaire de @fr
definition: Met une collectivité en relation avec une œuvre qui comporte une responsabilité de la part d’une collectivité consistant à commander une œuvre. @fr
toolkit label: collectivité commanditaire de @fr
toolkit definition: Œuvre qui comporte une responsabilité de la part d’une collectivité consistant à commander une œuvre. @fr
label: ir pasūtītājs (institūcija) @lv
definition: Sasaista institūciju ar darbu, kas ietver institūcijas atbildību par darba pasūtīšanu. @lv
toolkit label: ir pasūtītājs (institūcija) @lv
toolkit definition: Darbs, kas ietver institūcijas atbildību par darba pasūtīšanu. @lv
label: 是……的委托团体 @zh-hans
definition: 将一个团体与涉及委托一种作品的一个团体的责任的一种作品关联起来。 @zh-hans
toolkit label: ……的委托团体 @zh-hans
toolkit definition: 涉及委托一种作品的一个团体的责任的一种作品 @zh-hans
label: görevlendiren tüzel kişisidir @tr
definition: Bir tüzel kişiyi, bir işin yaptırılması için bir tüzel kişinin sorumluluğunu içeren bir eserle ilişkilendirir. @tr
toolkit label: görevlendiren tüzel kişi @tr
toolkit definition: Bir eser için bir tüzel kişinin sorumluluğunu içeren bir çalışma. @tr
has subproperty: P50840

toimeksiantaja (suku) teoksessa
status: Published
label: is commissioning family of @en
definition: Relates a family to a work that involves a responsibility of a family for commissioning a work. @en
toolkit label: commissioning family of @en
toolkit definition: A work that involves a responsibility of a family for commissioning a work. @en
type: Property
domain: C10008
has element type: 2
sub property of: sukuun liittyvä teos
sub property of: toimeksiantaja (yhteistoimija) teoksessa
definition: Liittää suvun teokseen, jossa suku on vastuussa teoksen teettämisestä.
toolkit label: toimeksiantaja (suku) teoksessa
toolkit definition: Teos, jossa suku on vastuussa teoksen teettämisestä.
label: er oppdragsgiver for (familie) @no
definition: Relaterer en familie til et verk som involverer et ansvar for en familie i form av å bestille et verk. @no
toolkit label: oppdragsgiver for (familie) @no
toolkit definition: Et verk som involverer et ansvar for en familie i form av å bestille et verk. @no
lexical alias: commissioningFamilyOf.en
label: is opdrachtgever-familie van @nl
definition: Relateert een familie aan een werk dat met zich meebrengt een verantwoordelijkheid van een familie voor opdracht geven tot een werk. @nl
toolkit label: opdrachtgever-familie van @nl
toolkit definition: Een werk dat met zich meebrengt een verantwoordelijkheid van een familie voor opdracht geven tot een werk. @nl
label: هي عائلة جهة تكليف لـ @ar
definition: يربط عائلة بعمل يترتب عليه مسئولية عائلة عن التكليف بعمل. @ar
toolkit label: عائلة جهة تكليف @ar
toolkit definition: عمل يترتب عليه مسئولية عائلة عن إصدار لتكليف بعمل. @ar
label: és família comitent de @ca
definition: Relaciona una família amb una obra que implica una responsabilitat d’una família d’encarregar una obra. @ca
toolkit label: família comitent de @ca
toolkit definition: Obra que implica una responsabilitat d’una família d’encarregar una obra. @ca
label: er familie, som er opgavestiller af @da
definition: Relaterer en familie til et værk, som involverer en families ansvar for at bestille et værk. @da
toolkit label: familie, som er opgavestiller af @da
toolkit definition: Værk, som involverer en families ansvar for at bestille et værk. @da
label: tellija (perekond) teoses @et
definition: Seostab perekonna teosega, mis sisaldab perekonna vastutust teose tellimise eest. @et
toolkit label: tellija (perekond) teoses @et
toolkit definition: Teos, mis sisaldab perekonna vastutust teose tellimise eest. @et
label: ist Familie als Auftraggeberin/Auftraggeber von @de
definition: Setzt eine Familie in Beziehung zu einem Werk, bei dem eine Familie dafür verantwortlich ist, ein Werk in Auftrag zu geben. @de
toolkit label: Familie als Auftraggeberin/Auftraggeber von @de
toolkit definition: Ein Werk, bei dem eine Familie dafür verantwortlich ist, ein Werk in Auftrag zu geben. @de
label: megrendelő családja a következőnek: @hu
definition: Hozzákapcsol egy családot egy műhöz, amelyhez hozzátartozik egy család felelőssége egy mű megrendeléséért. @hu
toolkit label: megrendelő családja: @hu
toolkit definition: Egy mű, amelyhez hozzátartozik egy család felelőssége egy mű megrendeléséért. @hu
label: è ente committente famiglia di @it
definition: Correla una famiglia a un'opera che implica una responsabilità di una famiglia per la committenza di un'opera. @it
toolkit label: ente committente famiglia di @it
toolkit definition: Opera che implica una responsabilità di una famiglia per la committenza di un'opera. @it
label: είναι προσληφθέν όργανο οικογένεια του @el
toolkit label: προσληφθέν όργανο οικογένεια του @el
label: est une famille commanditaire de @fr
definition: Met une famille en relation avec une œuvre qui comporte une responsabilité de la part d’une famille consistant à commander une œuvre. @fr
toolkit label: famille commanditaire de @fr
toolkit definition: Œuvre qui comporte une responsabilité de la part d’une famille consistant à commander une œuvre. @fr
label: ir pasūtītājs (dzimta/ģimene) @lv
definition: Sasaista dzimtu/ģimeni ar darbu, kas ietver dzimtas/ģimenes atbildību par darba pasūtīšanu. @lv
toolkit label: ir pasūtītājs (dzimta/ģimene) @lv
toolkit definition: Darbs, kas ietver dzimtas/ģimenes atbildību par darba pasūtīšanu. @lv
label: 是……的委托家族 @zh-hans
definition: 将一个家族与涉及委托一种作品的一个家族的责任的一种作品关联起来。 @zh-hans
toolkit label: ……的委托家族 @zh-hans
toolkit definition: 涉及委托一种作品的一个家族的责任的一种作品 @zh-hans
label: görevlendiren ailesidir @tr
definition: Bir aileyi, bir işi işletmeye almak için bir ailenin sorumluluğunu içeren bir eserle ilişkilendirir. @tr
toolkit label: görevlendiren aile @tr
toolkit definition: Bir eser için bir ailenin sorumluluğunu içeren bir çalışma. @tr
has subproperty: P50991

toimeksiantaja (henkilö) teoksessa
status: Published
label: is commissioning person of @en
definition: Relates a person to a work that involves a responsibility of a person for commissioning a work. @en
toolkit label: commissioning person of @en
toolkit definition: A work that involves a responsibility of a person for commissioning a work. @en
type: Property
domain: C10004
has element type: 2
sub property of: henkilöön liittyvä teos
sub property of: toimeksiantaja (toimija) teoksessa
definition: Liittää henkilön teokseen, jossa henkilö on vastuussa teoksen teettämisestä.
toolkit label: toimeksiantaja (henkilö) teoksessa
toolkit definition: Teos, jossa henkilö on vastuussa teoksen teettämisestä.
label: er oppdragsgiver for (person) @no
definition: Relaterer en person til et verk som involverer et ansvar for en person i form av å bestille et verk. @no
toolkit label: oppdragsgiver for (person) @no
toolkit definition: Et verk som involverer et ansvar for en person i form av å bestille et verk. @no
lexical alias: commissioningPersonOf.en
label: is opdrachtgever-persoon van @nl
definition: Relateert een persoon aan een werk dat met zich meebrengt een verantwoordelijkheid van een persoon voor opdracht geven tot een werk. @nl
toolkit label: opdrachtgever-persoon van @nl
toolkit definition: Een werk dat met zich meebrengt een verantwoordelijkheid van een persoon voor opdracht geven tot een werk. @nl
label: هو شخص جهة تكليف لـ @ar
definition: يربط شخصا بعمل يترتب عليه مسئولية شخص عن التكليف بعمل. @ar
toolkit label: شخص جهة تكليف @ar
toolkit definition: عمل يترتب عليه مسئولية شخص عن إصدار التكليف بعمل @ar
label: és persona comitent de @ca
definition: Relaciona una persona amb una obra que implica una responsabilitat d’una persona d’encarregar una obra. @ca
toolkit label: persona comitent de @ca
toolkit definition: Obra que implica una responsabilitat d’una persona d’encarregar una obra. @ca
label: er person, som er opgavestiller af @da
definition: Relaterer en person til et værk, som involverer en persons ansvar for at bestille et værk. @da
toolkit label: person, som er opgavestiller af @da
toolkit definition: Værk, som involverer en persons ansvar for at bestille et værk. @da
label: tellija (isik) teoses @et
definition: Seostab isiku teosega, mis sisaldab isiku vastutust teose tellimise eest. @et
toolkit label: tellija (isik) teoses @et
toolkit definition: Teos, mis sisaldab isiku vastutust teose tellimise eest. @et
label: ist Person als Auftraggeberin/Auftraggeber von @de
definition: Setzt eine Person in Beziehung zu einem Werk, bei dem eine Person dafür verantwortlich ist, ein Werk in Auftrag zu geben. @de
toolkit label: Person als Auftraggeberin/Auftraggeber von @de
toolkit definition: Ein Werk, bei dem eine Person dafür verantwortlich ist, ein Werk in Auftrag zu geben. @de
label: megrendelő személye a következőnek: @hu
definition: Hozzákapcsol egy személyt egy műhöz, amelyhez hozzátartozik egy személy felelőssége egy mű megrendeléséért. @hu
toolkit label: megrendelő személye: @hu
toolkit definition: Egy mű, amelyhez hozzátartozik egy személy felelőssége egy mű megrendeléséért. @hu
label: è ente committente persona di @it
definition: Correla una persona a un'opera che implica una responsabilità di una persona nella committenza di un'opera. @it
toolkit label: ente committente persona di @it
toolkit definition: Opera che implica una responsabilità di una persona nella committenza di un'opera. @it
label: είναι προσληφθέν όργανο φυσικό πρόσωπο του @el
toolkit label: αναθέτων όργανο φυσικό πρόσωπο του @el
label: est une personne commanditaire de @fr
definition: Met une personne en relation avec une œuvre qui comporte une responsabilité de la part d’une personne consistant à commander une œuvre. @fr
toolkit label: personne commanditaire de @fr
toolkit definition: Œuvre qui comporte une responsabilité de la part d’une personne consistant à commander une œuvre. @fr
label: ir pasūtītājs (persona) @lv
definition: Sasaista personu ar darbu, kas ietver personas atbildību par darba pasūtīšanu. @lv
toolkit label: ir pasūtītājs (persona) @lv
toolkit definition: Darbs, kas ietver personas atbildību par darba pasūtīšanu. @lv
label: 是……的委托个人 @zh-hans
definition: 将一个个人与涉及委托一种作品的一个个人的责任的一种作品关联起来。 @zh-hans
toolkit label: ……的委托个人 @zh-hans
toolkit definition: 涉及委托一种作品的一个个人的责任的一种作品 @zh-hans
label: görevlendiren kişisidir @tr
definition: Bir kişiyi, görevlendirmek için kişinin sorumluluğunu içeren bir eserle ilişkilendirir. @tr
toolkit label: görevlendiren kişi @tr
toolkit definition: Bir eser için bir kişinin sorumluluğunu içeren bir çalışma. @tr
has subproperty: P50538

kokoaja (toimija) teoksessa
status: Published
label: is compiler agent of @en
definition: Relates an agent to a work that involves a responsibility of an agent for creating a metadata description set. @en
type: Property
domain: C10002
lexical alias: compilerAgentOf.en
label: est un agent compilateur de @fr
definition: Met un agent en relation avec une œuvre qui comporte une responsabilité de la part d’un agent consistant à créer un ensemble de métadonnées descriptives. @fr
toolkit label: agent compilateur de @fr
toolkit definition: Œuvre qui comporte une responsabilité de la part d’un agent consistant à créer un ensemble de métadonnées descriptives. @fr
toolkit label: compiler agent of @en
toolkit definition: A work that involves a responsibility of an agent for creating a metadata description set. @en
see also: toimittajana aineistossa
instruction number: 18.5
label: είναι συμπιλητής φορέας του @el
definition: Συνδέει έναν φορέα υπεύθυνο για τη δημιουργία ενός νέου έργου, όπως μιας βιβλιογραφίας ή ενός οδηγού μέσω της επιλογής, της οργάνωσης, της συλλογής και της επιμέλειας δεδομένων, πληροφοριών κ.λπ. @el
toolkit label: συμπιλητής φορέας του @el
toolkit definition: Ένα έργο που περιλαμβάνει την ευθύνη της δημιουργίας ενός νέου έργου, όπως μιας βιβλιογραφίας ή ενός οδηγού μέσω της επιλογής, της οργάνωσης, της συλλογής και της επιμέλειας δεδομένων, πληροφοριών κ.λπ. @el
definition: Setzt einen Akteur in Beziehung zu einem Werk, bei dem ein Akteur für das Selektieren, Gliedern, Aggregieren und Editieren von Daten und Informationen für ein Werk, zum Beispiel einer Bibliografie oder eines Verzeichnisses, verantwortlich ist. @de
toolkit label: Akteur als Zusammenstellende/Zusammenstellender von @de
toolkit definition: Ein Werk, bei dem ein Akteur für das Selektieren, Gliedern, Aggregieren und Editieren von Daten und Informationen für ein Werk, zum Beispiel einer Bibliografie oder eines Verzeichnisses, verantwortlich ist. @de
label: er agent, som er kompilator af @da
definition: Relaterer en agent til et værk, som involverer en agents ansvar for at udvælge, arrangere, sammenlægge og redigere data og information til et værk, såsom en bibliografi eller en fortegnelse. @da
toolkit label: agent, som er kompilator af @da
toolkit definition: Værk, som involverer en agents ansvar for at udvælge, arrangere, sammenlægge og redigere data og information til et værk, såsom en bibliografi eller en fortegnelse. @da
label: és agent compilador de @ca
definition: Relaciona un agent amb una obra que implica una responsabilitat d’un agent en la creació d’un conjunt de descripció de metadades. @ca
toolkit label: agent compilador de @ca
toolkit definition: Obra que implica una responsabilitat d’un agent en la creació d’un conjunt de descripció de metadades. @ca
definition: Liittää toimijan teokseen, jossa toimija on vastuussa metatietokokonaisuuden luomisesta.
toolkit label: kokoaja (toimija) teoksessa
toolkit definition: Teos, jossa toimija on vastuussa metatietokokonaisuuden luomisesta.
toolkit label: utarbeider av (agent) @no
toolkit definition: Et verk som involverer ansvar for en agent i form av å velge ut, arrangere, samle og redigere data og informasjon for et verk som en bibliografi eller en fortegnelse. @no
label: ist Akteur als Zusammenstellende/Zusammenstellender von @de
has element type: 2
label: összeállító ágense a következőnek: @hu
definition: Hozzákapcsol egy ágenst egy műhöz, amelyhez hozzátartozik egy ágens felelőssége a kiválasztásáért, elrendezésért, aggregálásért, adatok és információk szerkesztéséért egy olyan mű számára, mint egy bibliográfia vagy egy címtár. @hu
toolkit label: összeállító ágense: @hu
toolkit definition: Egy mű, amelyhez hozzátartozik egy ágens felelőssége a kiválasztásáért, elrendezésért, aggregálásért, adatok és információk szerkesztéséért egy olyan mű számára, mint egy bibliográfia vagy egy címtár. @hu
scope note: A metadata description set includes a bibliography of works, expressions, or manifestations, a directory of agents and places, and an analytic finding aid. @en
alternative label: compiler of @en
scope note: Metatietokokonaisuus kattaa teosten, ekspressioiden tai manifestaatioiden bibliografian, toimija- tai paikkahakemiston ja analyyttisen luettelon.
alternative label: kokoajana teoksessa
label: er utarbeider av (agent) @no
definition: Relaterer en agent til et verk som involverer ansvar for en agent i form av å velge ut, arrangere, samle og redigere data og informasjon for et verk som en bibliografi eller en fortegnelse. @no
scope note: Det å redigere eller gjøre innholdet av et uttrykk av et verk klarere, eller velge ut og kombinere uttrykk av verk eller deler av verk, er ikke inkludert. @no
alternative label: utarbeider av @no
label: is samensteller-actor van @nl
definition: Relateert een actor aan een werk dat met zich meebrengt een verantwoordelijkheid van een actor voor selecteren, arrangeren, verzamelen en redigeren van data en informatie voor een werk zoals een bibliografie of een adresboek. @nl
scope note: Herzien of verduidelijken van de inhoud van een expressie van een werk en selecteren en combineren van expressies van werken of delen van werken zijn uitgesloten. @nl
toolkit label: samensteller-actor van @nl
toolkit definition: Een werk dat met zich meebrengt een verantwoordelijkheid van een actor voor selecteren, arrangeren, verzamelen en redigeren van data en informatie voor een werk zoals een bibliografie of een adresboek. @nl
label: وكيل جامع لـ @ar
definition: يربط وكيلا بعمل يترتب عليه مسئولية وكيل عن اختيار بيانات ومعلومات للعمل وترتيبها وتجميعها وتحريرها في ببليوجرافيا أو في دليل. @ar
scope note: يُستبعد من ذلك مراجعة أو توضيح محتوى تعبيرة لعمل، واختيار وجمع التعبيرات من أعمال أو من أجزاء من أعمال. @ar
alternative label: جامع @ar
toolkit label: وكيل جامع @ar
toolkit definition: عمل يترتب عليه مسئولية وكيل عن اختيار بيانات ومعلومات للعمل وترتيبها وتجميعها وتحريرها في ببليوجرافيا أو في دليل. @ar
scope note: Un conjunt de descripció de metadades inclou una bibliografia d’obres, expressions o manifestacions, un directori d’agents i llocs, i un instrument de descripció analític. @ca
alternative label: compilador de @ca
scope note: Revidering eller klarlægning af indholdet af et udtryk af et værk, og udvælgelse og sammensætning af udtryk for værker eller dele af værker, er ikke omfattet. @da
alternative label: kompilator af @da
label: koostaja (tegija) teoses @et
definition: Seostab tegija teosega, mis sisaldab tegija vastutust andmete ja info valimise, korrastamise, koondamise ja toimetamise eest teose, nt bibliograafia või teatmiku jaoks. @et
scope note: Ei hõlma teose väljenduse sisu läbivaatamist ja parandamist ega teoste või nende osade väljenduste väljavalimist ja kokkupanemist. @et
alternative label: koostaja teoses @et
toolkit label: koostaja (tegija) teoses @et
toolkit definition: Teos, mis sisaldab tegija vastutust andmete ja info valimise, korrastamise, koondamise ja toimetamise eest teose, nt bibliograafia või teatmiku jaoks. @et
scope note: Darunter fallen keine Überarbeitungen oder Erläuterungen des Inhalts einer Expression eines Werks und die Auswahl und Zusammenstellung von Expressionen von Werken oder Teilen von Werken. @de
scope note: összeállítója: @hu
alternative label: Nem tartozik ide sem egy mű kifejezési formájának tartalmi felülvizsgálata vagy tisztázása, sem a művek vagy műrészek kifejezési formáinak kiválasztása és összeállítása. @hu
label: è compilatore agente di @it
definition: Correla un agente a un'opera che implica una responsabilità di un agente nella selezione, disposizione, aggregazione e redazione di dati e informazioni per un'opera come una bibliografia o una directory. @it
scope note: Sono escluse la revisione e il chiarire il contenuto di un'espressione di un'opera e selezionare e mettere insieme le espressioni delle opere o parti di opere. @it
alternative label: compilatore di @it
toolkit label: compilatore agente di @it
toolkit definition: Opera che implica una responsabilità di un agente nella selezione, disposizione, aggregazione e redazione di dati e informazioni per un'opera come una bibliografia o una directory. @it
scope note: Δεν περιλαμβάνονται η αναθεώρηση ή η αποσαφήνιση του περιεχομένου μιας έκφρασης ενός έργου και η επιλογή και η συγκέντρωση των εκφράσεων των έργων ή των μερών των έργων. @el

kokoaja (yhteistoimija) teoksessa
status: Published
label: is compiler collective agent of @en
lexical alias: compilerCollectiveAgentOf.en
definition: Relates a collective agent to a work that involves a responsibility of a collective agent for creating a metadata description set. @en
toolkit label: compiler collective agent of @en
toolkit definition: A work that involves a responsibility of a collective agent for creating a metadata description set. @en
type: Property
domain: C10011
has element type: 2
sub property of: kokoaja (toimija) teoksessa
scope note: A metadata description set includes a bibliography of works, expressions, or manifestations, a directory of agents and places, and an analytic finding aid. @en
definition: Liittää yhteistoimijan teokseen, jossa yhteistoimija on vastuussa metatietokokonaisuuden luomisesta.
scope note: Metatietokokonaisuus kattaa teosten, ekspressioiden tai manifestaatioiden bibliografian, toimija- tai paikkahakemiston ja analyyttisen luettelon.
toolkit label: kokoaja (yhteistoimija) teoksessa
toolkit definition: Teos, jossa yhteistoimija on vastuussa metatietokokonaisuuden luomisesta.
label: er utarbeider for (kollektiv agent) @no
definition: Relaterer en kollektiv agent til et verk som involverer et ansvar for en kollektiv agent i form av utvelgelse, arrangering, samling og redigering av data og informasjon for et verk slik som en bibliografi eller en katalog. @no
scope note: Det å redigere innholdet i et uttrykk av et verk eller gjøre det klarere, eller velge ut og kombinere uttrykk av et verk eller deler av et verk, er ikke inkludert. @no
toolkit label: utarbeider for (kollektiv agent) @no
toolkit definition: Et verk som involverer et ansvar for en kollektiv agent i form av utvelgelse, arrangering, samling og redigering av data og informasjon for et verk slik som en bibliografi eller en katalog. @no
label: is samensteller-collectieve actor van @nl
definition: Relateert een collectieve actor aan een werk dat met zich meebrengt een verantwoordelijkheid van een collectieve actor voor selecteren, arrangeren, verzamelen en redigeren van data en informatie voor een werk zoals een bibliografie of een adresboek. @nl
scope note: Herzien of verduidelijken van de inhoud van een expressie van een werk en selecteren en combineren van expressies van werken of delen van werken zijn uitgesloten. @nl
toolkit label: samensteller-collectieve actor van @nl
toolkit definition: Een werk dat met zich meebrengt een verantwoordelijkheid van een collectieve actor voor selecteren, arrangeren, verzamelen en redigeren van data en informatie voor een werk zoals een bibliografie of een adresboek. @nl
label: هو وكيل جماعي جامع لـ @ar
definition: يربط وكيلا جماعيا بعمل يترتب عليه مسئولية وكيل جماعي عن اختيار البيانات والمعلومات للعمل وترتيبها وتجميعها وتحريرها في ببليوجرافية أو في دليل. @ar
scope note: يُستبعد من ذلك مراجعة أو توضيح محتوى تعبيرة لعمل، واختيار وجمع التعبيرات من أعمال أو من أجزاء من أعمال. @ar
toolkit label: وكيل جماعي جامع @ar
toolkit definition: عمل يترتب عليه مسئولية وكيل جماعي عن اختيار البيانات والمعلومات للعمل وترتيبها وتجميعها وتحريرها في ببليوجرافية أو في دليل. @ar
label: és agent col·lectiu compilador de @ca
definition: Relaciona un agent col·lectiu amb una obra que implica una responsabilitat d’un agent col·lectiu en la creació d’un conjunt de descripció de metadades. @ca
scope note: Un conjunt de descripció de metadades inclou una bibliografia d’obres, expressions o manifestacions, un directori d'agents i llocs i un instrument de descripció analític. @ca
toolkit label: agent col·lectiu compilador de @ca
toolkit definition: Obra que implica una responsabilitat d’un agent col·lectiu en la creació d’un conjunt de descripció de metadades. @ca
label: er kollektiv agent, som er kompilator af @da
definition: Relaterer en kollektiv agent til et værk, som involverer en kollektiv agents ansvar for at udvælge, arrangere, sammenlægge og redigere data og information til et værk, såsom en bibliografi eller en fortegnelse. @da
scope note: Revidering eller klarlægning af indholdet af et udtryk af et værk, og udvælgelse og sammensætning af udtryk for værker eller dele af værker, er ikke omfattet. @da
toolkit label: kollektiv agent, som er kompilator af @da
toolkit definition: Værk, som involverer en kollektiv agents ansvar for at udvælge, arrangere, sammenlægge og redigere data og information til et værk, såsom en bibliografi eller en fortegnelse. @da
label: koostaja (kollektiiv) teoses @et
definition: Seostab kollektiivi teosega, mis sisaldab kollektiivi vastutust andmete ja info valimise, korrastamise, koondamise ja toimetamise eest teose, nt bibliograafia või teatmiku jaoks. @et
scope note: Ei hõlma teose väljenduse sisu läbivaatamist ja parandamist ega teoste või nende osade väljenduste väljavalimist ja kokkupanemist. @et
toolkit label: koostaja (kollektiiv) teoses @et
toolkit definition: Teos, mis sisaldab kollektiivi vastutust andmete ja info valimise, korrastamise, koondamise ja toimetamise eest teose, nt bibliograafia või teatmiku jaoks. @et
label: ist gemeinschaftlicher Akteur als Zusammenstellende/Zusammenstellender von @de
definition: Setzt einen gemeinschaftlichen Akteur in Beziehung zu einem Werk, bei dem ein gemeinschaftlicher Akteur für das Selektieren, Gliedern, Aggregieren und Editieren von Daten und Informationen für ein Werk, zum Beispiel einer Bibliografie oder eines Verzeichnisses, verantwortlich ist. @de
scope note: Darunter fallen keine Überarbeitungen oder Erläuterungen des Inhalts einer Expression eines Werks und die Auswahl und Zusammenstellung von Expressionen von Werken oder Teilen von Werken. @de
toolkit label: Gemeinschaftlicher Akteur als Zusammenstellende/Zusammenstellender von @de
toolkit definition: Ein Werk, bei dem ein gemeinschaftlicher Akteur für das Selektieren, Gliedern, Aggregieren und Editieren von Daten und Informationen für ein Werk, zum Beispiel einer Bibliografie oder eines Verzeichnisses, verantwortlich ist. @de
label: összeállító kollektív ágense a következőnek: @hu
definition: Hozzákapcsol egy kollektív ágenst egy műhöz, amelyhez hozzátartozik egy kollektív ágens felelőssége a kiválasztásáért, elrendezésért, aggregálásért, adatok és információk szerkesztéséért egy olyan mű számára, mint egy bibliográfia vagy egy címtár. @hu
scope note: Nem tartozik ide sem egy mű kifejezési formájának tartalmi felülvizsgálata vagy tisztázása, sem a művek vagy műrészek kifejezési formáinak kiválasztása és összeállítása. @hu
toolkit label: összeállító kollektív ágense: @hu
toolkit definition: Egy mű, amelyhez hozzátartozik egy kollektív ágens felelőssége a kiválasztásáért, elrendezésért, aggregálásért, adatok és információk szerkesztéséért egy olyan mű számára, mint egy bibliográfia vagy egy címtár. @hu
label: è compilatore agente collettivo di @it
definition: Correla un agente collettivo a un'opera che implica una responsabilità di un agente collettivo nella selezione, disposizione, aggregazione e redazione di dati e informazioni per un'opera come una bibliografia o una directory. @it
scope note: Sono escluse la revisione o chiarimento del contenuto di un'espressione di un'opera e la selezione e raccolta di espressioni di opere o parti di opere. @it
toolkit label: compilatore agente collettivo di @it
toolkit definition: Opera che implica una responsabilità di un agente collettivo nella selezione, disposizione, aggregazione e redazione di dati e informazioni per un'opera come una bibliografia o una directory. @it
label: είναι συμπιλητής συλλογικός φορέας του @el
toolkit label: συμπιλητής συλλογικός φορέας του @el
label: est un agent collectif compilateur de @fr
definition: Met un agent collectif en relation avec une œuvre qui comporte une responsabilité de la part d’un agent collectif consistant à créer un ensemble de métadonnées descriptives. @fr
scope note: Un ensemble de métadonnées descriptives comprend une bibliographie d’œuvres, d’expressions ou de manifestations, un répertoire d’agents et de lieux ainsi qu’un instrument de recherche analytique. @fr
toolkit label: agent collectif compilateur de @fr
toolkit definition: Œuvre qui comporte une responsabilité de la part d’un agent collectif consistant à créer un ensemble de métadonnées descriptives. @fr
sub property of: aggregaattori (yhteistoimija) teoksessa
label: ir sastādītājs (grupa) @lv
definition: Sasaista grupu ar darbu, kas ietver grupas atbildību par datu un informācijas atlasi, sakārtošanu, apkopošanu un rediģēšanu tādam darbam kā bibliogrāfija vai rādītājs. @lv
toolkit label: ir sastādītājs (grupa) @lv
toolkit definition: Darbs, kas ietver grupas atbildību par datu un informācijas atlasi, sakārtošanu, apkopošanu un rediģēšanu tādam darbam kā bibliogrāfija vai rādītājs. @lv
scope note: Neietver satura pārskatīšanu vai precizēšanu, viena vai vairāku radītāju darbu vai to daļu atlasi vai apvienošanu. @lv
label: 是……的编纂者集体行为者 @zh-hans
definition: 将一个集体行为者与涉及创建一个元数据描述集的一个集体行为者的责任的一种作品关联起来。 @zh-hans
toolkit label: ……的编纂者集体行为者 @zh-hans
toolkit definition: 涉及创建一个元数据描述集的一个集体行为者的责任的一种作品 @zh-hans
scope note: 元数据描述集包括作品、内容表达或载体表现的书目、行为者和地点的名录、以及分析查询工具。 @zh-hans
label: derleyici kolektif temsilcisidir @tr

kokoaja (yhteisö) teoksessa
status: Published
label: is compiler corporate body of @en
lexical alias: compilerCorporateBodyOf.en
definition: Relates a corporate body to a work that involves a responsibility of a corporate body for creating a metadata description set. @en
toolkit label: compiler corporate body of @en
toolkit definition: A work that involves a responsibility of a corporate body for creating a metadata description set. @en
type: Property
domain: C10005
has element type: 2
sub property of: kokoaja (yhteistoimija) teoksessa
scope note: A metadata description set includes a bibliography of works, expressions, or manifestations, a directory of agents and places, and an analytic finding aid. @en
definition: Liittää yhteisön teokseen, jossa yhteisö on vastuussa metatietokokonaisuuden luomisesta.
scope note: Metatietokokonaisuus kattaa teosten, ekspressioiden tai manifestaatioiden bibliografian, toimija- tai paikkahakemiston ja analyyttisen luettelon.
toolkit label: kokoaja (yhteisö) teoksessa
toolkit definition: Teos, jossa yhteisö on vastuussa metatietokokonaisuuden luomisesta.
label: er utarbeider for (korporasjon) @no
definition: Relaterer en korporasjon til et verk som involverer et ansvar for en korporasjon i form av utvelgelse, arrangering, samling og redigering av data og informasjon for et verk slik som en bibliografi eller en katalog. @no
scope note: Det å redigere innholdet i et uttrykk av et verk eller gjøre det klarere, eller velge ut og kombinere uttrykk av et verk eller deler av et verk, er ikke inkludert. @no
toolkit label: utarbeider for (korporasjon) @no
toolkit definition: Et verk som involverer et ansvar for en korporasjon i form av utvelgelse, arrangering, samling og redigering av data og informasjon for et verk slik som en bibliografi eller en katalog. @no
label: is samensteller-corporatie van @nl
definition: Relateert een corporatie aan een werk dat met zich meebrengt een verantwoordelijkheid van een corporatie voor selecteren, arrangeren, verzamelen en redigeren van data en informatie voor een werk zoals een bibliografie of een adresboek. @nl
scope note: Herzien of verduidelijken van de inhoud van een expressie van een werk en selecteren en combineren van expressies van werken of delen van werken zijn uitgesloten. @nl
toolkit label: samensteller-corporatie van @nl
toolkit definition: Een werk dat met zich meebrengt een verantwoordelijkheid van een corporatie voor selecteren, arrangeren, verzamelen en redigeren van data en informatie voor een werk zoals een bibliografie of een adresboek. @nl
label: هي هيئة جامعة لـ @ar
definition: يربط هيئة بعمل يترتب عليه مسئولية هيئة عن اختيار البيانات والمعلومات للعمل وترتيبها وتجميعها وتحريرها في ببليوجرافية أو في دليل. @ar
scope note: يُستبعد من ذلك مراجعة أو توضيح محتوى تعبيرة لعمل، واختيار وجمع التعبيرات من أعمال أو من أجزاء من أعمال. @ar
toolkit label: هيئة جامعة @ar
toolkit definition: عمل يترتب عليه مسئولية هيئة عن اختيار البيانات والمعلومات للعمل وترتيبها وتجميعها وتحريرها في ببليوجرافية أو في دليل. @ar
label: és entitat corporativa compiladora de @ca
definition: Relaciona una entitat corporativa amb una obra que implica una responsabilitat d’una entitat corporativa en la creació d’un conjunt de descripció de metadades. @ca
scope note: Un conjunt de descripció de metadades inclou una bibliografia d’obres, expressions o manifestacions, un directori d'agents i llocs i un instrument de descripció analític. @ca
toolkit label: entitat corporativa compiladora de @ca
toolkit definition: Obra que implica una responsabilitat d’una entitat corporativa en la creació d’un conjunt de descripció de metadades. @ca
label: er korporation, som er kompilator af @da
definition: Relaterer en korporation til et værk, som involverer en korporations ansvar for at udvælge, arrangere, sammenlægge og redigere data og information til et værk, såsom en bibliografi eller en fortegnelse. @da
scope note: Revidering eller klarlægning af indholdet af et udtryk af et værk, og udvælgelse og sammensætning af udtryk for værker eller dele af værker, er ikke omfattet. @da
toolkit label: korporation, som er kompilator af @da
toolkit definition: Værk, som involverer en korporations ansvar for at udvælge, arrangere, sammenlægge og redigere data og information til et værk, såsom en bibliografi eller en fortegnelse. @da
label: koostaja (asutus) teoses @et
definition: Seostab asutuse teosega, mis sisaldab asutuse vastutust andmete ja info valimise, korrastamise, koondamise ja toimetamise eest teose, nt bibliograafia või teatmiku jaoks. @et
scope note: Ei hõlma teose väljenduse sisu läbivaatamist ja parandamist ega teoste või nende osade väljenduste väljavalimist ja kokkupanemist. @et
toolkit label: koostaja (asutus) teoses @et
toolkit definition: Teos, mis sisaldab asutuse vastutust andmete ja info valimise, korrastamise, koondamise ja toimetamise eest teose, nt bibliograafia või teatmiku jaoks. @et
label: ist Körperschaft als Zusammenstellende/Zusammenstellender von @de
definition: Setzt eine Körperschaft in Beziehung zu einem Werk, bei dem eine Körperschaft für das Selektieren, Gliedern, Aggregieren und Editieren von Daten und Informationen für ein Werk, zum Beispiel einer Bibliografie oder eines Verzeichnisses, verantwortlich ist. @de
scope note: Darunter fallen keine Überarbeitungen oder Erläuterungen des Inhalts einer Expression eines Werks und die Auswahl und Zusammenstellung von Expressionen von Werken oder Teilen von Werken. @de
toolkit label: Körperschaft als Zusammenstellende/Zusammenstellender von @de
toolkit definition: Ein Werk, bei dem eine Körperschaft für das Selektieren, Gliedern, Aggregieren und Editieren von Daten und Informationen für ein Werk, zum Beispiel einer Bibliografie oder eines Verzeichnisses, verantwortlich ist. @de
label: összeállító testülete a következőnek: @hu
definition: Hozzákapcsol egy testületet egy műhöz, amelyhez hozzátartozik egy testület felelőssége a kiválasztásáért, elrendezésért, aggregálásért, adatok és információk szerkesztéséért egy olyan mű számára, mint egy bibliográfia vagy egy címtár. @hu
scope note: Nem tartozik ide sem egy mű kifejezési formájának tartalmi felülvizsgálata vagy tisztázása, sem a művek vagy műrészek kifejezési formáinak kiválasztása és összeállítása. @hu
toolkit label: összeállító testülete: @hu
toolkit definition: Egy mű, amelyhez hozzátartozik egy testület felelőssége a kiválasztásáért, elrendezésért, aggregálásért, adatok és információk szerkesztéséért egy olyan mű számára, mint egy bibliográfia vagy egy címtár @hu
label: è compilatore ente di @it
definition: Correla un ente a un'opera che implica una responsabilità di un ente per selezionare, disporre, aggregare e redazionare dati e informazioni per un'opera come una bibliografia o una directory. @it
scope note: Sono esclusi la revisione o chiarimento del contenuto di un'espressione di un'opera e la selezione e raccolta di espressioni di opere o parti di opere. @it
toolkit label: compilatore ente di @it
toolkit definition: Opera che implica una responsabilità di un ente per selezionare, disporre, aggregare e redazionare dati e informazioni per un'opera come una bibliografia o una directory. @it
label: είναι συμπιλητής συλλογικό όργανο του @el
scope note: Δεν περιλαμβάνονται η αναθεώρηση ή η αποσαφήνιση του περιεχομένου μιας έκφρασης ενός έργου και η επιλογή και η συγκέντρωση των εκφράσεων των έργων ή των μερών των έργων. @el
toolkit label: συμπιλητής συλλογικό όργανο του @el
label: est une collectivité compilatrice de @fr
definition: Met une collectivité en relation avec une œuvre qui comporte une responsabilité de la part d’une collectivité consistant à créer un ensemble de métadonnées descriptives. @fr
scope note: Un ensemble de métadonnées descriptives comprend une bibliographie d’œuvres, d’expressions ou de manifestations, un répertoire d’agents et de lieux ainsi qu’un instrument de recherche analytique. @fr
toolkit label: collectivité compilatrice de @fr
toolkit definition: Œuvre qui comporte une responsabilité de la part d’une collectivité consistant à créer un ensemble de métadonnées descriptives. @fr
sub property of: aggregaattori (yhteisö) teoksessa
label: ir sastādītājs (institūcija) @lv
definition: Sasaista institūciju ar darbu, kas ietver institūcijas atbildību par datu un informācijas atlasi, sakārtošanu, apkopošanu un rediģēšanu tādam darbam kā bibliogrāfija vai rādītājs. @lv
toolkit label: ir sastādītājs (institūcija) @lv
toolkit definition: Darbs, kas ietver institūcijas atbildību par datu un informācijas atlasi, sakārtošanu, apkopošanu un rediģēšanu tādam darbam kā bibliogrāfija vai rādītājs. @lv
scope note: Neietver satura pārskatīšanu vai precizēšanu, viena vai vairāku radītāju darbu vai to daļu atlasi vai apvienošanu. @lv
label: 是……的编纂者团体 @zh-hans
definition: 将一个团体与涉及创建一个元数据描述集的一个团体的责任的一种作品关联起来。 @zh-hans
toolkit label: ……的编纂者团体 @zh-hans
toolkit definition: 涉及创建一个元数据描述集的一个团体的责任的一种作品 @zh-hans
scope note: 元数据描述集包括作品、内容表达或载体表现的书目、行为者和地点的名录、以及分析查询工具。 @zh-hans

kokoaja (suku) teoksessa
status: Published
label: is compiler family of @en
lexical alias: compilerFamilyOf.en
definition: Relates a family to a work that involves a responsibility of a family for creating a metadata description set. @en
toolkit label: compiler family of @en
toolkit definition: A work that involves a responsibility of a family for creating a metadata description set. @en
type: Property
domain: C10008
has element type: 2
sub property of: kokoaja (yhteistoimija) teoksessa
scope note: A metadata description set includes a bibliography of works, expressions, or manifestations, a directory of agents and places, and an analytic finding aid. @en
definition: Liittää suvun teokseen, jossa suku on vastuussa metatietokokonaisuuden luomisesta.
scope note: Metatietokokonaisuus kattaa teosten, ekspressioiden tai manifestaatioiden bibliografian, toimija- tai paikkahakemiston ja analyyttisen luettelon.
toolkit label: kokoaja (suku) teoksessa
toolkit definition: Teos, jossa suku on vastuussa metatietokokonaisuuden luomisesta.
label: er utarbeider for (familie) @no
definition: Relaterer en familie til et verk som involverer et ansvar for en familie i form av utvelgelse, arrangering, samling og redigering av data og informasjon for et verk slik som en bibliografi eller en katalog. @no
scope note: Det å redigere innholdet i et uttrykk av et verk eller gjøre det klarere, eller velge ut og kombinere uttrykk av et verk eller deler av et verk, er ikke inkludert. @no
toolkit label: utarbeider for (familie) @no
toolkit definition: Et verk som involverer et ansvar for en familie i form av utvelgelse, arrangering, samling og redigering av data og informasjon for et verk slik som en bibliografi eller en katalog. @no
label: is samensteller-familie van @nl
definition: Relateert een familie aan een werk dat met zich meebrengt een verantwoordelijkheid van een familie voor selecteren, arrangeren, verzamelen en redigeren van data en informatie voor een werk zoals een bibliografie of een adresboek. @nl
scope note: Herzien of verduidelijken van de inhoud van een expressie van een werk en selecteren en combineren van expressies van werken of delen van werken zijn uitgesloten. @nl
toolkit label: samensteller-familie van @nl
toolkit definition: Een werk dat met zich meebrengt een verantwoordelijkheid van een familie voor selecteren, arrangeren, verzamelen en redigeren van data en informatie voor een werk zoals een bibliografie of een adresboek. @nl
label: هي عائلة جامعة لـ @ar
definition: يربط عائلة بعمل يترتب عليه مسئولية عائلة عن اختيار البيانات والمعلومات للعمل وترتيبها وتجميعها وتحريرها في ببليوجرافية أو في دليل. @ar
scope note: يُستبعد من ذلك مراجعة أو توضيح محتوى تعبيرة لعمل، واختيار وجمع التعبيرات من أعمال أو من أجزاء من أعمال. @ar
toolkit label: عائلة جامعة @ar
toolkit definition: عمل يترتب عليه مسئولية عائلة عن اختيار البيانات والمعلومات للعمل وترتيبها وتجميعها وتحريرها في ببليوجرافية أو في دليل. @ar
label: és família compiladora de @ca
definition: Relaciona una família amb una obra que implica una responsabilitat d’una família en la creació d’un conjunt de descripció de metadades. @ca
scope note: Un conjunt de descripció de metadades inclou una bibliografia d’obres, expressions o manifestacions, un directori d’agents i llocs, i un instrument de descripció analític. @ca
toolkit label: família compiladora de @ca
toolkit definition: Obra que implica una responsabilitat d’una família en la creació d’un conjunt de descripció de metadades. @ca
label: er familie, som er kompilator af @da
definition: Relaterer en familie til et værk, som involverer en families ansvar for at udvælge, arrangere, sammenlægge og redigere data og information til et værk, såsom en bibliografi eller en fortegnelse. @da
scope note: Revidering eller klarlægning af indholdet af et udtryk af et værk, og udvælgelse og sammensætning af udtryk for værker eller dele af værker, er ikke omfattet. @da
toolkit label: familie, som er kompilator af @da
toolkit definition: Værk, som involverer en families ansvar for at udvælge, arrangere, sammenlægge og redigere data og information til et værk, såsom en bibliografi eller en fortegnelse. @da
label: koostaja (perekond) teoses @et
definition: Seostab perekonna teosega, mis sisaldab perekonna vastutust andmete ja info valimise, korrastamise, koondamise ja toimetamise eest teose, nt bibliograafia või teatmiku jaoks. @et
scope note: Ei hõlma teose väljenduse sisu läbivaatamist ja parandamist ega teoste või nende osade väljenduste väljavalimist ja kokkupanemist. @et
toolkit label: koostaja (perekond) teoses @et
toolkit definition: Teos, mis sisaldab perekonna vastutust andmete ja info valimise, korrastamise, koondamise ja toimetamise eest teose, nt bibliograafia või teatmiku jaoks. @et
label: ist Familie als Zusammenstellende/Zusammenstellender von @de
definition: Setzt eine Familie in Beziehung zu einem Werk, bei dem eine Familie für das Selektieren, Gliedern, Aggregieren und Editieren von Daten und Informationen für ein Werk, zum Beispiel einer Bibliografie oder eines Verzeichnisses, verantwortlich ist. @de
scope note: Darunter fallen keine Überarbeitungen oder Erläuterungen des Inhalts einer Expression eines Werks und die Auswahl und Zusammenstellung von Expressionen von Werken oder Teilen von Werken. @de
toolkit label: Familie als Zusammenstellende/Zusammenstellender von @de
toolkit definition: Ein Werk, bei dem eine Familie für das Selektieren, Gliedern, Aggregieren und Editieren von Daten und Informationen für ein Werk, zum Beispiel einer Bibliografie oder eines Verzeichnisses, verantwortlich ist. @de
label: összeállító családja a következőnek: @hu
definition: Hozzákapcsol egy családot egy műhöz, amelyhez hozzátartozik egy család felelőssége a kiválasztásáért, elrendezésért, aggregálásért, adatok és információk szerkesztéséért egy olyan mű számára, mint egy bibliográfia vagy egy címtár. @hu
scope note: Nem tartozik ide sem egy mű kifejezési formájának tartalmi felülvizsgálata vagy tisztázása, sem a művek vagy műrészek kifejezési formáinak kiválasztása és összeállítása. @hu
toolkit label: összeállító családja: @hu
toolkit definition: Egy mű, amelyhez hozzátartozik egy család felelőssége a kiválasztásáért, elrendezésért, aggregálásért, adatok és információk szerkesztéséért egy olyan mű számára, mint egy bibliográfia vagy egy címtár. @hu
label: è compilatore famiglia di @it
definition: Correla una famiglia a un'opera che implica una responsabilità di una famiglia per selezionare, disporre, aggregare e redazionare dati e informazioni per un'opera come una bibliografia o una directory. @it
scope note: Sono esclusi la revisione o chiarimento del contenuto di un'espressione di un'opera e la selezione e raccolta di espressioni di opere o parti di opere. @it
toolkit label: compilatore famiglia di @it
toolkit definition: Opera che implica una responsabilità di una famiglia per selezionare, disporre, aggregare e redazionare dati e informazioni per un'opera come una bibliografia o una directory. @it
label: είναι συμπιλητής οικογένεια του @el
scope note: Δεν περιλαμβάνονται η αναθεώρηση ή η αποσαφήνιση του περιεχομένου μιας έκφρασης ενός έργου και η επιλογή και η συγκέντρωση των εκφράσεων των έργων ή των μερών των έργων. @el
toolkit label: συμπιλητής οικογένεια του @el
label: est une famille compilatrice de @fr
definition: Met une famille en relation avec une œuvre qui comporte une responsabilité de la part d’une famille consistant à créer un ensemble de métadonnées descriptives. @fr
scope note: Un ensemble de métadonnées descriptives comprend une bibliographie d’œuvres, d’expressions ou de manifestations, un répertoire d’agents et de lieux ainsi qu’un instrument de recherche analytique. @fr
toolkit label: famille compilatrice de @fr
toolkit definition: Œuvre qui comporte une responsabilité de la part d’une famille consistant à créer un ensemble de métadonnées descriptives. @fr
sub property of: aggregaattori (suku) teoksessa
label: ir sastādītājs (dzimta/ģimene) @lv
definition: Sasaista dzimtu/ģimeni ar darbu, kas ietver dzimtas/ģimenes atbildību par datu un informācijas atlasi, sakārtošanu, apkopošanu un rediģēšanu tādam darbam kā bibliogrāfija vai rādītājs. @lv
toolkit label: ir sastādītājs (dzimta/ģimene) @lv
toolkit definition: Darbs, kas ietver dzimtas/ģimenes atbildību par datu un informācijas atlasi, sakārtošanu, apkopošanu un rediģēšanu tādam darbam kā bibliogrāfija vai rādītājs. @lv
scope note: Neietver satura pārskatīšanu vai precizēšanu, viena vai vairāku radītāju darbu vai to daļu atlasi vai apvienošanu. @lv
label: 是……的编纂者家族 @zh-hans
definition: 将一个家族与涉及创建一个元数据描述集的一个家族的责任的一种作品关联起来。 @zh-hans
toolkit label: ……的编纂者家族 @zh-hans
toolkit definition: 涉及创建一个元数据描述集的一个家族的责任的一种作品 @zh-hans
scope note: 元数据描述集包括作品、内容表达或载体表现的书目、行为者和地点的名录、以及分析查询工具。 @zh-hans

kokoaja (henkilö) teoksessa
status: Published
label: is compiler person of @en
lexical alias: compilerPersonOf.en
definition: Relates a person to a work that involves a responsibility of a person for creating a metadata description set. @en
toolkit label: compiler person of @en
toolkit definition: A work that involves a responsibility of a person for creating a metadata description set. @en
type: Property
domain: C10004
has element type: 2
sub property of: kokoaja (toimija) teoksessa
scope note: A metadata description set includes a bibliography of works, expressions, or manifestations, a directory of agents and places, and an analytic finding aid. @en
definition: Liittää henkilön teokseen, jossa henkilö on vastuussa metatietokokonaisuuden luomisesta.
scope note: Metatietokokonaisuus kattaa teosten, ekspressioiden tai manifestaatioiden bibliografian, toimija- tai paikkahakemiston ja analyyttisen luettelon.
toolkit label: kokoaja (henkilö) teoksessa
toolkit definition: Teos, jossa henkilö on vastuussa metatietokokonaisuuden luomisesta.
label: er utarbeider for (person) @no
definition: Relaterer en person til et verk som involverer et ansvar for en person i form av utvelgelse, arrangering, samling og redigering av data og informasjon for et verk slik som en bibliografi eller en katalog. @no
scope note: Det å redigere innholdet i et uttrykk av et verk eller gjøre det klarere, eller velge ut og kombinere uttrykk av et verk eller deler av et verk, er ikke inkludert. @no
toolkit label: utarbeider for (person) @no
toolkit definition: Et verk som involverer et ansvar for en person i form av utvelgelse, arrangering, samling og redigering av data og informasjon for et verk slik som en bibliografi eller en katalog. @no
label: is samensteller-persoon van @nl
definition: Relateert een persoon aan een werk dat met zich meebrengt een verantwoordelijkheid van een persoon voor selecteren, arrangeren, verzamelen en redigeren van data en informatie voor een werk zoals een bibliografie of een adresboek. @nl
scope note: Herzien of verduidelijken van de inhoud van een expressie van een werk en selecteren en combineren van expressies van werken of delen van werken zijn uitgesloten. @nl
toolkit label: samensteller-persoon van @nl
toolkit definition: Een werk dat met zich meebrengt een verantwoordelijkheid van een persoon voor selecteren, arrangeren, verzamelen en redigeren van data en informatie voor een werk zoals een bibliografie of een adresboek. @nl
label: هو شخص جامع لـ @ar
definition: يربط شخصا بعمل يترتب عليه مسئولية شخص عن اختيار البيانات والمعلومات للعمل وترتيبها وتجميعها وتحريرها في ببليوجرافية أو في دليل. @ar
scope note: يُستبعد من ذلك مراجعة أو توضيح محتوى تعبيرة لعمل، واختيار وجمع التعبيرات من أعمال أو من أجزاء من أعمال. @ar
toolkit label: شخص جامع لـ @ar
toolkit definition: عمل يترتب عليه مسئولية شخص عن اختيار البيانات والمعلومات للعمل وترتيبها وتجميعها وتحريرها في ببليوجرافية أو في دليل. @ar
label: és persona compiladora de @ca
definition: Relaciona una persona amb una obra que implica una responsabilitat d’una persona en la creació d’un conjunt de creació de metadades. @ca
scope note: Un conjunt de descripció de metadades inclou una bibliografia d’obres, expressions o manifestacions, un directori d'agents i llocs i un instrument de descripció analític. @ca
toolkit label: persona compiladora de @ca
toolkit definition: Obra que implica una responsabilitat d’una persona en la creació un conjunt de descripció de metadades. @ca
label: er person, som er kompilator af @da
definition: Relaterer en person til et værk, som involverer en persons ansvar for at udvælge, arrangere, sammenlægge og redigere data og information til et værk, såsom en bibliografi eller en fortegnelse. @da
scope note: Revidering eller klarlægning af indholdet af et udtryk af et værk, og udvælgelse og sammensætning af udtryk for værker eller dele af værker, er ikke omfattet. @da
toolkit label: person, som er kompilator af @da
toolkit definition: Værk, som involverer en persons ansvar for at udvælge, arrangere, sammenlægge og redigere data og information til et værk, såsom en bibliografi eller en fortegnelse. @da
label: koostaja (isik) teoses @et
definition: Seostab isiku teosega, mis sisaldab isiku vastutust andmete ja info valimise, korrastamise, koondamise ja toimetamise eest teose, nt bibliograafia või teatmiku jaoks. @et
scope note: Ei hõlma teose väljenduse sisu läbivaatamist ja parandamist ega teoste või nende osade väljenduste väljavalimist ja kokkupanemist. @et
toolkit label: koostaja (isik) teoses @et
toolkit definition: Teos, mis sisaldab isiku vastutust andmete ja info valimise, korrastamise, koondamise ja toimetamise eest teose, nt bibliograafia või teatmiku jaoks. @et
label: ist Person als Zusammenstellende/Zusammenstellender von @de
definition: Setzt eine Person in Beziehung zu einem Werk, bei dem eine Person für das Selektieren, Gliedern, Aggregieren und Editieren von Daten und Informationen für ein Werk, zum Beispiel einer Bibliografie oder eines Verzeichnisses, verantwortlich ist. @de
scope note: Darunter fallen keine Überarbeitungen oder Erläuterungen des Inhalts einer Expression eines Werks und die Auswahl und Zusammenstellung von Expressionen von Werken oder Teilen von Werken. @de
toolkit label: Person als Zusammenstellende/Zusammenstellender von @de
toolkit definition: Ein Werk, bei dem eine Person für das Selektieren, Gliedern, Zusammentragen und Editieren von Daten und Informationen für ein Werk, zum Beispiel einer Bibliografie oder eines Verzeichnisses, verantwortlich ist. @de
label: összeállító személye a következőnek: @hu
definition: Hozzákapcsol egy személyt egy műhöz, amelyhez hozzátartozik egy személy felelőssége a kiválasztásáért, elrendezésért, aggregálásért, adatok és információk szerkesztéséért egy olyan mű számára, mint egy bibliográfia vagy egy címtár. @hu
scope note: Nem tartozik ide sem egy mű kifejezési formájának tartalmi felülvizsgálata vagy tisztázása, sem a művek vagy műrészek kifejezési formáinak kiválasztása és összeállítása. @hu
toolkit label: összeállító személye: @hu
toolkit definition: Egy mű, amelyhez hozzátartozik egy személy felelőssége a kiválasztásáért, elrendezésért, aggregálásért, adatok és információk szerkesztéséért egy olyan mű számára, mint egy bibliográfia vagy egy címtár. @hu
label: è compilatore persona di @it
definition: Correla una persona a un'opera che implica una responsabilità di una persona nella selezione, disposizione, aggregazione e redazione di dati e informazioni per un'opera come una bibliografia o una directory. @it
scope note: Sono escluse la revisione o chiarimento del contenuto di un'espressione di un'opera e la selezione e raccolta di espressioni di opere o parti di opere. @it
toolkit label: compilatore persona di @it
toolkit definition: Opera che implica una responsabilità di una persona nella selezione, disposizione, aggregazione e redazione di dati e informazioni per un'opera come una bibliografia o una directory. @it
label: είναι συμπιλητής φυσικό πρόσωπο του @el
toolkit label: συμπιλητής φυσικό πρόσωπο του @el
label: est une personne compilatrice de @fr
definition: Met une personne en relation avec une œuvre qui comporte une responsabilité de la part d’une personne consistant à créer un ensemble de métadonnées descriptives. @fr
scope note: Un ensemble de métadonnées descriptives comprend une bibliographie d’œuvres, d’expressions ou de manifestations, un répertoire d’agents et de lieux ainsi qu’un instrument de recherche analytique. @fr
toolkit label: personne compilatrice de @fr
toolkit definition: Œuvre qui comporte une responsabilité de la part d’une personne consistant à créer un ensemble de métadonnées descriptives. @fr
sub property of: aggregaattori (henkilö) teoksessa
label: ir sastādītājs (persona) @lv
definition: Sasaista personu ar darbu, kas ietver personas atbildību par datu un informācijas atlasi, sakārtošanu, apkopošanu un rediģēšanu tādam darbam kā bibliogrāfija vai rādītājs. @lv
toolkit label: ir sastādītājs (persona) @lv
toolkit definition: Darbs, kas ietver personas atbildību par datu un informācijas atlasi, sakārtošanu, apkopošanu un rediģēšanu tādam darbam kā bibliogrāfija vai rādītājs. @lv
scope note: Neietver satura pārskatīšanu vai precizēšanu, viena vai vairāku radītāju darbu vai to daļu atlasi vai apvienošanu. @lv
label: 是……的编纂者个人 @zh-hans
definition: 将一个个人与涉及创建一个元数据描述集的个人的责任的一种作品关联起来。 @zh-hans
toolkit label: ……的编纂者个人 @zh-hans
toolkit definition: 涉及创建一个元数据描述集的个人的责任的一种作品 @zh-hans
scope note: 元数据描述集包括作品、内容表达或载体表现的书目、行为者和地点的名录、以及分析查询工具。 @zh-hans
label: derleyici kişisidir @tr

teoksen säveltäjä (toimija) musiikkiteoksessa
status: Published
label: is composer agent of work of @en
definition: Relates an agent to a work that involves a responsibility of an agent for creating a musical work. @en
type: Property
domain: C10002
sub property of: teoksen tekijä (toimija) teoksessa
lexical alias: composerAgentOfWorkOf.en
label: est un agent compositeur d’une œuvre de @fr
definition: Met un agent en relation avec une œuvre qui comporte une responsabilité de la part d’un agent consistant à créer une œuvre musicale. @fr
toolkit label: agent compositeur d’une œuvre de @fr
toolkit definition: Œuvre qui comporte une responsabilité de la part d’un agent consistant à créer une œuvre musicale. @fr
toolkit label: composer agent of work of @en
toolkit definition: A work that involves a responsibility of an agent for creating a musical work. @en
instruction number: 18.5
label: είναι συνθέτης φορέας του έργου του @el
definition: Συνδέει έναν φορέα υπεύθυνο για τη δημιουργία ενός μουσικού έργου, με ένα έργο. @el
toolkit label: συνθέτης φορέας του έργου του @el
toolkit definition: Ένα μουσικό έργο που περιλαμβάνει την ευθύνη ενός φορέα για μουσική. @el
definition: Setzt einen Akteur in Beziehung zu einem Musikwerk, bei dem ein Akteur für die Musik verantwortlich ist. @de
toolkit label: Akteur als Komponistin/Komponist eines Werks von @de
toolkit definition: Ein Musikwerk, bei dem ein Akteur für die Musik verantwortlich ist. @de
label: er agent, som er komponist af værk af @da
definition: Relaterer en agent til et værk, der er et musikværk, som involverer en agents ansvar for musik. @da
toolkit label: agent, som er komponist af værk af @da
toolkit definition: Værk, der er et musikværk, som involverer en agents ansvar for musik. @da
label: és agent compositor d’una obra de @ca
definition: Relaciona un agent amb una obra que implica una responsabilitat d’un agent en la creació d’una obra musical. @ca
toolkit label: agent compositor d’una obra de @ca
toolkit definition: Obra que implica una responsabilitat d’un agent en la creació d’una obra musical. @ca
definition: Liittää toimijan teokseen, joka on musiikkiteos, jonka luomisesta toimija on vastuussa.
toolkit label: teoksen säveltäjä (toimija) musiikkiteoksessa
toolkit definition: Teos, joka on musiikkiteos, jonka luomisesta toimija on vastuussa.
toolkit label: komponist av (agent) @no
toolkit definition: Et musikalsk verk som involverer ansvar for en agent i form av musikk. @no
label: ist Akteur als Komponistin/Komponist eines Werks von @de
has element type: 2
label: zeneszerző ágense a következő műnek: @hu
definition: Hozzákapcsol egy ágenst egy zeneműhöz, amelyhez hozzátartozik egy ágens felelőssége a zenéért. @hu
toolkit label: zeneszerző ágense a következő műnek: @hu
toolkit definition: Egy zenemű, amelyhez hozzátartozik egy ágens felelőssége a zenéért. @hu
alternative label: composer of @en
alternative label: sävellys
label: er komponist av (agent) @no
definition: Relaterer en agent til et musikalsk verk som involverer ansvar for en agent i form av musikk. @no
alternative label: komponist av @no
label: is componist-actor van werk van @nl
definition: Relateert een actor aan een muziekwerk dat met zich meebrengt een verantwoordelijkheid van een actor voor muziek. @nl
toolkit label: componist-actor van werk van @nl
toolkit definition: Een werk dat is een muziekwerk dat met zich meebrengt een verantwoordelijkheid van een actor voor muziek. @nl
label: هو وكيل ملحن عمل لـ @ar
definition: يربط وكيلا بعمل موسيقي يترتب عليه مسئولية وكيل عن الموسيقى. @ar
alternative label: ملحن لـ @ar
toolkit label: وكيل ملحن عمل @ar
toolkit definition: عمل موسيقي يترتب عليه مسئولية وكيل عن الموسيقى. @ar
alternative label: compositor de @ca
alternative label: komponist af værk af @da
label: teose helilooja (tegija) teoses @et
definition: Seostab tegija muusikateosega, mis sisaldab tegija vastutust muusika loomise eest. @et
alternative label: teose helilooja teoses @et
toolkit label: teose helilooja (tegija) teoses @et
toolkit definition: Muusikateos, mis sisaldab tegija vastutust muusika loomise eest. @et
label: è compositore agente di @it
definition: Correla un agente a un'opera musicale che implica una responsabilità di un agente per la musica. @it
alternative label: compositore di @it
toolkit label: compositore agente di opera di @it
toolkit definition: Opera musicale che implica una responsabilità di un agente per la musica. @it
alternative label: συνθέτης του έργου του @el
alternative label: compositeur de @fr
label: ir komponists (aģents) darbam @lv
definition: Sasaista aģentu ar mūzikas darbu, kas ietver aģenta atbildību par mūzikas radīšanu. @lv
toolkit label: ir komponists (aģents) darbam @lv
toolkit definition: Mūzikas darbs, kas ietver aģenta atbildību par mūzikas radīšanu. @lv
alternative label: Komponistin/Komponist von @de
alternative label: ……的作曲者 @zh-hans
label: 是……的作品的作曲者行为者 @zh-hans
toolkit label: ……的作品的作曲者行为者 @zh-hans
toolkit definition: 涉及创作一种音乐作品的一个行为者的责任的一种作品 @zh-hans
toolkit label: eserin besteci temsilcisi @tr
toolkit definition: Bir müzik eseri yaratmak için bir temsilcinin sorumluluğunu içeren bir eser. @tr
has subproperty: teoksen säveltäjä (yhteistoimija) musiikkiteoksessa

teoksen säveltäjä (yhteistoimija) musiikkiteoksessa
status: Published
label: is composer collective agent of work of @en
lexical alias: composerCollectiveAgentOfWorkOf.en
definition: Relates a collective agent to a work that involves a responsibility of a collective agent for creating a musical work. @en
toolkit label: composer collective agent of work of @en
toolkit definition: A work that involves a responsibility of a collective agent for creating a musical work. @en
type: Property
domain: C10011
has element type: 2
sub property of: teoksen tekijä (yhteistoimija) teoksessa
sub property of: teoksen säveltäjä (toimija) musiikkiteoksessa
definition: Liittää yhteistoimijan teokseen, joka on musiikkiteos, jonka luomisesta yhteistoimija on vastuussa.
toolkit label: teoksen säveltäjä (yhteistoimija) musiikkiteoksessa
toolkit definition: Teos, joka on musiikkiteos, jonka luomisesta yhteistoimija on vastuussa.
label: er komponist for verk for (kollektiv agent) @no
definition: Relaterer en kollektiv agent til et musikalsk verk som involverer et ansvar for en kollektiv agent i form av musikk. @no
toolkit label: komponist for verk for (kollektiv agent) @no
toolkit definition: Et musikalsk verk som involverer et ansvar for en kollektiv agent i form av musikk. @no
label: is componist-collectieve actor van werk van @nl
definition: Relateert een collectieve actor aan een werk dat is een muziekwerk dat met zich meebrengt een verantwoordelijkheid van een collectieve actor voor muziek. @nl
toolkit label: componist-collectieve actor van werk van @nl
toolkit definition: Een werk dat is een muziekwerk dat met zich meebrengt een verantwoordelijkheid van een collectieve actor voor muziek. @nl
label: هو وكيل جماعي ملحن عمل لـ @ar
definition: يربط وكيلا جماعيا بعمل موسيقي يترتب عليه مسئولية وكيل جماعي عن الموسيقى. @ar
toolkit label: وكيل جماعي ملحن عمل @ar
toolkit definition: عمل موسيقي يترتب عليه مسئولية وكيل جماعي عن الموسيقى. @ar
label: és agent col·lectiu compositor d’una obra de @ca
definition: Relaciona un agent col·lectiu amb una obra que implica una responsabilitat d’un agent col·lectiu en la creació d’una obra musical. @ca
toolkit label: agent col·lectiu compositor d’una obra de @ca
toolkit definition: Obra que implica una responsabilitat d’un agent col·lectiu en la creació d’una obra musical. @ca
label: er kollektiv agent, som er komponist af værk af @da
definition: Relaterer en kollektiv agent til et værk, som er et musikværk, som involverer en kollektiv agents ansvar for musik. @da
toolkit label: kollektiv agent, som er komponist af værk af @da
toolkit definition: Værk, som er et musikværk, som involverer en kollektiv agents ansvar for musik. @da
label: teose helilooja (kollektiiv) teoses @et
definition: Seostab kollektiivi muusikateosega, mis sisaldab kollektiivi vastutust muusika loomise eest. @et
toolkit label: teose helilooja (kollektiiv) teoses @et
toolkit definition: Muusikateos, mis sisaldab kollektiivi vastutust muusika loomise eest. @et
label: ist gemeinschaftlicher Akteur als Komponistin/Komponist eines Werks von @de
definition: Setzt einen gemeinschaftlichen Akteur in Beziehung zu einem Musikwerk, bei dem ein gemeinschaftlicher Akteur für die Musik verantwortlich ist. @de
toolkit label: Gemeinschaftlicher Akteur als Komponistin/Komponist eines Werks von @de
toolkit definition: Ein Musikwerk, bei dem ein gemeinschaftlicher Akteur für die Musik verantwortlich ist. @de
label: zeneszerző kollektív ágense a következő műnek: @hu
definition: Hozzákapcsol egy kollektív ágenst egy zeneműhöz, amelyhez hozzátartozik egy kollektív ágens felelőssége a zenéért. @hu
toolkit label: zeneszerző kollektív ágense a következő műnek: @hu
toolkit definition: Egy zenemű, amelyhez hozzátartozik egy kollektív ágens felelőssége a zenéért. @hu
label: è compositore agente collettivo di opera di @it
definition: Correla un agente collettivo a un'opera musicale che implica una responsabilità di un agente collettivo per la musica. @it
toolkit label: compositore agente collettivo di opera di @it
toolkit definition: Opera musicale che implica una responsabilità di un agente collettivo per la musica. @it
label: είναι συνθέτης συλλογικός φορέας του έργου του @el
toolkit label: συνθέτης συλλογικός φορέας του έργου του @el
label: est un agent collectif compositeur d’une œuvre de @fr
definition: Met un agent collectif en relation avec une œuvre qui comporte une responsabilité de la part d’un agent collectif consistant à créer une œuvre musicale. @fr
toolkit label: agent collectif compositeur d’une œuvre de @fr
toolkit definition: Œuvre qui comporte une responsabilité de la part d’un agent collectif consistant à créer une œuvre musicale. @fr
label: ir komponists (grupa) darbam @lv
definition: Sasaista grupu ar darbu, kas ir mūzikas darbs, kas ietver grupas atbildību par mūzikas radīšanu. @lv
toolkit label: ir komponists (grupa) darbam @lv
toolkit definition: Darbs, kas ir mūzikas darbs, kas ietver grupas atbildību par mūzikas radīšanu. @lv
label: 是……的作品的作曲者集体行为者 @zh-hans
definition: 将一个具体行为者与涉及创作一种音乐作品的一个集体行为者的责任的一种作品关联起来。 @zh-hans
toolkit label: ……的作品的作曲者集体行为者 @zh-hans
toolkit definition: 涉及创作一种音乐作品的一个集体行为者的责任的一种作品 @zh-hans
label: eserinin besteci kolektif temsilcisidir @tr
definition: Kolektif bir temsilciyi, bir müzik eseri oluşturmak için kolektif bir temsilcinin sorumluluğunu içeren bir eserle ilişkilendirir. @tr
toolkit label: eserin besteci kolektif temsilcisi @tr
toolkit definition: Bir müzik eseri oluşturmak için kolektif bir temsilcinin sorumluluğunu içeren bir eser. @tr
has subproperty: teoksen säveltäjä (yhteisö) musiikkiteoksessa
has subproperty: teoksen säveltäjä (suku) musiikkiteoksessa
has subproperty: P50673

teoksen säveltäjä (yhteisö) musiikkiteoksessa
status: Published
label: is composer corporate body of work of @en
lexical alias: composerCorporateBodyOfWorkOf.en
definition: Relates a corporate body to a work that involves a responsibility of a corporate body for creating a musical work. @en
toolkit label: composer corporate body of work of @en
toolkit definition: A work that involves a responsibility of a corporate body for creating a musical work. @en
type: Property
domain: C10005
has element type: 2
sub property of: teoksen tekijä (yhteisö) teoksessa
sub property of: teoksen säveltäjä (yhteistoimija) musiikkiteoksessa
definition: Liittää yhteisön teokseen, joka on musiikkiteos, jonka luomisesta yhteisö on vastuussa.
toolkit label: teoksen säveltäjä (yhteisö) musiikkiteoksessa
toolkit definition: Teos, joka on musiikkiteos, jonka luomisesta yhteisö on vastuussa.
label: er komponist for verk for (korporasjon) @no
definition: Relaterer en korporasjon til et musikalsk verk som involverer et ansvar for en korporasjon i form av musikk. @no
toolkit label: komponist for verk for (korporasjon) @no
toolkit definition: Et musikalsk verk som involverer et ansvar for en korporasjon i form av musikk. @no
label: is componist-corporatie van werk van @nl
definition: Relateert een corporatie aan een werk dat is een muziekwerk dat met zich meebrengt een verantwoordelijkheid van een corporatie voor muziek. @nl
toolkit label: componist-corporatie van werk van @nl
toolkit definition: Een werk dat is een muziekwerk dat met zich meebrengt een verantwoordelijkheid van een corporatie voor muziek. @nl
label: هي هيئة مسئولة عن تلحين عمل لـ @ar
definition: يربط هيئة بعمل موسيقي يترتب عليه مسئولية هيئة عن الموسيقى. @ar
toolkit label: هيئة مسئولة عن تلحين عمل لـ @ar
toolkit definition: عمل موسيقي يترتب عليه مسئولية هيئة عن الموسيقى. @ar
label: és entitat corporativa compositora d’una obra de @ca
definition: Relaciona una entitat corporativa amb una obra que implica una responsabilitat d’una entitat corporativa en la creació d’una obra musical. @ca
toolkit label: entitat corporativa compositora d’una obra de @ca
toolkit definition: Obra que implica una responsabilitat d’una entitat corporativa en la creació d’una obra musical. @ca
label: er korporation, som er komponist af værk af @da
definition: Relaterer en korporation til et værk, som er et musikværk, som involverer en korporations ansvar for musik. @da
toolkit label: korporation, som er komponist af værk af @da
toolkit definition: Værk, som er et musikværk, som involverer en korporations ansvar for musik. @da
label: teose helilooja (asutus) teoses @et
definition: Seostab asutuse muusikateosega, mis sisaldab asutuse vastutust muusika loomise eest. @et
toolkit label: teose helilooja (asutus) teoses @et
toolkit definition: Muusikateos, mis sisaldab asutuse vastutust muusika loomise eest. @et
label: ist Körperschaft als Komponistin/Komponist eines Werks von @de
definition: Setzt eine Körperschaft in Beziehung zu einem Musikwerk, bei dem eine Körperschaft für die Musik verantwortlich ist. @de
toolkit label: Körperschaft als Komponistin/Komponist eines Werks von @de
toolkit definition: Ein Musikwerk, bei dem eine Körperschaft für die Musik verantwortlich ist. @de
label: zeneszerző testülete a következő műnek: @hu
definition: Hozzákapcsol egy testületet egy zeneműhöz, amelyhez hozzátartozik egy testület felelőssége a zenéért. @hu
toolkit label: zeneszerző testülete a következő műnek: @hu
toolkit definition: Egy zenemű, amelyhez hozzátartozik egy testület felelőssége a zenéért. @hu
label: è compositore ente di opera di @it
definition: Correla un ente a un'opera musicale che implica una responsabilità di un ente per la musica. @it
toolkit label: compositore ente di opera di @it
toolkit definition: Opera musicale che implica una responsabilità di un ente per la musica. @it
label: είναι συνθέτης συλλογικό όργανο του έργου του @el
toolkit label: συνθέτης συλλογικό όργανο του έργου του @el
label: est une collectivité compositrice d’une œuvre de @fr
definition: Met une collectivité en relation avec une œuvre qui comporte une responsabilité de la part d’une collectivité consistant à créer une œuvre musicale. @fr
toolkit label: collectivité compositrice d’une œuvre de @fr
toolkit definition: Œuvre qui comporte une responsabilité de la part d’une collectivité consistant à créer une œuvre musicale. @fr
label: ir komponists (institūcija) darbam @lv
definition: Sasaista institūciju ar darbu, kas ir mūzikas darbs, kas ietver institūcijas atbildību par mūzikas radīšanu. @lv
toolkit label: ir komponists (institūcija) darbam @lv
toolkit definition: Darbs, kas ir mūzikas darbs, kas ietver institūcijas atbildību par mūzikas radīšanu. @lv
label: 是……的作品的作曲者团体 @zh-hans
definition: 将一个团体与涉及创作一种音乐作品的一个团体的责任的一种作品关联起来。 @zh-hans
toolkit label: ……的作品的作曲者团体 @zh-hans
toolkit definition: 涉及创作一种音乐作品的一个团体的责任的一种作品 @zh-hans
label: eserinin besteci tüzel kişisidir @tr
definition: Bir tüzel kişiyi, bir müzik eseri yaratmak için bir tüzel kişiliğin sorumluluğunu içeren bir eserle ilişkilendirir. @tr
toolkit label: eserin besteci tüzel kişisi @tr
toolkit definition: Bir müzik eseri yaratmak için bir tüzel kişiliğin sorumluluğunu içeren bir eser. @tr
has subproperty: P50824

teoksen säveltäjä (suku) musiikkiteoksessa
status: Published
label: is composer family of work of @en
lexical alias: composerFamilyOfWorkOf.en
definition: Relates a family to a work that involves a responsibility of a family for creating a musical work. @en
toolkit label: composer family of work of @en
toolkit definition: A work that involves a responsibility of a family for creating a musical work. @en
type: Property
domain: C10008
has element type: 2
sub property of: teoksen tekijä (suku) teoksessa
sub property of: teoksen säveltäjä (yhteistoimija) musiikkiteoksessa
definition: Liittää suvun teokseen, joka on musiikkiteos, jonka luomisesta suku on vastuussa.
toolkit label: teoksen säveltäjä (suku) musiikkiteoksessa
toolkit definition: Teos, joka on musiikkiteos, jonka luomisesta suku on vastuussa.
label: er komponist for verk for (familie) @no
definition: Relaterer en familie til et musikalsk verk som involverer et ansvar for en familie i form av musikk. @no
toolkit label: komponist for verk for (familie) @no
toolkit definition: Et musikalsk verk som involverer et ansvar for en familie i form av musikk. @no
label: is componist-familie van werk van @nl
definition: Relateert een familie aan een werk dat is een muziekwerk dat met zich meebrengt een verantwoordelijkheid van een familie voor muziek. @nl
toolkit label: componist-familie van werk van @nl
toolkit definition: Een werk dat is een muziekwerk dat met zich meebrengt een verantwoordelijkheid van een familie voor muziek. @nl
label: هي عائلة مسئولة عن تلحين عمل لـ @ar
definition: يربط عائلة بعمل موسيقي يترتب عليه مسئولية عائلة عن الموسيقى. @ar
toolkit label: عائلة مسئولة عن تلحين عمل @ar
toolkit definition: عمل موسيقي يترتب عليه مسئولية عائلة عن الموسيقى. @ar
label: és família compositora d’una obra de @ca
definition: Relaciona una família amb una obra que implica una responsabilitat d’una família en la creació d’una obra musical. @ca
toolkit label: família compositora d’una obra de @ca
toolkit definition: Obra que implica una responsabilitat d’una família en la creació d’una obra musical. @ca
label: er familie, som er komponist af værk af @da
definition: Relaterer en familie til et værk, som er et musikværk, som involverer en families ansvar for musik. @da
toolkit label: familie, som er komponist af værk af @da
toolkit definition: Værk, som er et musikværk, som involverer en families ansvar for musik. @da
label: teose helilooja (perekond) teoses @et
definition: Seostab perekonna muusikateosega, mis sisaldab perekonna vastutust muusika loomise eest. @et
toolkit label: teose helilooja (perekond) teoses @et
toolkit definition: Muusikateos, mis sisaldab perekonna vastutust muusika loomise eest. @et
label: ist Familie als Komponistin/Komponist eines Werks von @de
definition: Setzt eine Familie in Beziehung zu einem Musikwerk, bei dem eine Familie für die Musik verantwortlich ist. @de
toolkit label: Familie als Komponistin/Komponist eines Werks von @de
toolkit definition: Ein Musikwerk, bei dem eine Familie für die Musik verantwortlich ist. @de
label: zeneszerző családja a következő műnek: @hu
definition: Hozzákapcsol egy családot egy zeneműhöz, amelyhez hozzátartozik egy család felelőssége a zenéért. @hu
toolkit label: zeneszerző családja a következő műnek: @hu
toolkit definition: Egy zenemű, amelyhez hozzátartozik egy család felelőssége a zenéért. @hu
label: è compositore famiglia di opera di @it
definition: Correla una famiglia a un'opera musicale che implica una responsabilità di una famiglia per la musica. @it
toolkit label: compositore famiglia di opera di @it
toolkit definition: Opera musicale che implica una responsabilità di una famiglia per la musica. @it
label: είναι συνθέτης οικογένεια του έργου του @el
toolkit label: συνθέτης οικογένεια του έργου του @el
label: est une famille compositrice d’une œuvre de @fr
definition: Met une famille en relation avec une œuvre qui comporte une responsabilité de la part d’une famille consistant à créer une œuvre musicale. @fr
toolkit label: famille compositrice d’une œuvre de @fr
toolkit definition: Œuvre qui comporte une responsabilité de la part d’une famille consistant à créer une œuvre musicale. @fr
label: ir komponists (dzimta/ģimene) darbam @lv
definition: Sasaista dzimtu/ģimeni ar darbu, kas ir mūzikas darbs, kas ietver dzimtas/ģimenes atbildību par mūzikas radīšanu. @lv
toolkit label: ir komponists (dzimta/ģimene) darbam @lv
toolkit definition: Darbs, kas ir mūzikas darbs, kas ietver dzimtas/ģimenes atbildību par mūzikas radīšanu. @lv
label: 是……的作品的作曲者家族 @zh-hans
definition: 将一个家族与涉及创作一种音乐作品的一个家族的责任的一种作品关联起来。 @zh-hans
toolkit label: ……的作品的作曲者家族 @zh-hans
toolkit definition: 涉及创作一种音乐作品的一个家族的责任的一种作品 @zh-hans
label: eserinin besteci ailesidir @tr
definition: Bir aileyi, bir müzik eseri yaratma sorumluluğunu içeren bir eserle ilişkilendirir. @tr
toolkit label: eserin besteci ailesi @tr
toolkit definition: Bir müzik eseri yaratmak için bir ailenin sorumluluğunu içeren bir eser. @tr
has subproperty: P50975

teoksen säveltäjä (henkilö) musiikkiteoksessa
status: Published
label: is composer person of work of @en
lexical alias: composerPersonOfWorkOf.en
definition: Relates a person to a work that involves a responsibility of a person for creating a musical work. @en
toolkit label: composer person of work of @en
toolkit definition: A work that involves a responsibility of a person for creating a musical work. @en
type: Property
domain: C10004
has element type: 2
sub property of: teoksen tekijä (henkilö) teoksessa
sub property of: teoksen säveltäjä (toimija) musiikkiteoksessa
definition: Liittää henkilön teokseen, joka on musiikkiteos, jonka luomisesta henkilö on vastuussa.
toolkit label: teoksen säveltäjä (henkilö) musiikkiteoksessa
toolkit definition: Teos, joka on musiikkiteos, jonka luomisesta henkilö on vastuussa.
label: er komponist for verk for (person) @no
definition: Relaterer en person til et musikalsk verk som involverer et ansvar for en person i form av musikk. @no
toolkit label: komponist for verk for (person) @no
toolkit definition: Et musikalsk verk som involverer et ansvar for en person i form av musikk. @no
label: is componist-persoon van werk van @nl
definition: Relateert een persoon aan een werk dat is een muziekwerk dat met zich meebrengt een verantwoordelijkheid van een persoon voor muziek. @nl
toolkit label: componist-persoon van werk van @nl
toolkit definition: Een werk dat is een muziekwerk dat met zich meebrengt een verantwoordelijkheid van een persoon voor muziek. @nl
label: هو شخص ملحن عمل لـ @ar
definition: يربط شخصا بعمل موسيقي يترتب عليه مسئولية شخص عن الموسيقى. @ar
toolkit label: شخص ملحن عمل @ar
toolkit definition: عمل عبارة عن عمل موسيقي يترتب عليه تحمل شخص المسئولية عن الموسيقى. @ar
label: és persona compositora d’una obra de @ca
definition: Relaciona una persona amb una obra que implica una responsabilitat d’una persona en la creació d’una obra musical. @ca
toolkit label: persona compositora d’una obra de @ca
toolkit definition: Obra que implica un responsabilitat d’una persona en la creació d’una obra musical. @ca
label: er person, som er komponist af værk af @da
definition: Relaterer en person til et værk, som er et musikværk, som involverer en persons ansvar for musik. @da
toolkit label: person, som er komponist af værk af @da
toolkit definition: Værk, som er et musikværk, som involverer en persons ansvar for musik. @da
label: teose helilooja (isik) teoses @et
definition: Seostab isiku muusikateosega, mis sisaldab isiku vastutust muusika loomise eest. @et
toolkit label: teose helilooja (isik) teoses @et
toolkit definition: Muusikateos, mis sisaldab isiku vastutust muusika loomise eest. @et
label: ist Person als Komponistin/Komponist eines Werks von @de
definition: Setzt eine Person in Beziehung zu einem Musikwerk, bei dem eine Person für die Musik verantwortlich ist. @de
toolkit label: Person als Komponistin/Komponist eines Werks von @de
toolkit definition: Ein Musikwerk, bei dem eine Person für die Musik verantwortlich ist. @de
label: zeneszerző személye a következő műnek: @hu
definition: Hozzákapcsol egy személyt egy zeneműhöz, amelyhez hozzátartozik egy személy felelőssége a zenéért. @hu
toolkit label: zeneszerző személye a következő műnek: @hu
toolkit definition: Egy zenemű, amelyhez hozzátartozik egy személy felelőssége a zenéért. @hu
label: è compositore persona di opera di @it
definition: Correla una persona a un'opera musicale che implica una responsabilità di una persona per la musica. @it
toolkit label: compositore persona di opera di @it
toolkit definition: Opera musicale che implica una responsabilità di una persona per la musica. @it
label: είναι συνθέτης φυσικό πρόσωπο του έργου του @el
toolkit label: συνθέτης φυσικό πρόσωπο του έργου του @el
label: est une personne compositrice d’une œuvre de @fr
definition: Met une personne en relation avec une œuvre qui comporte une responsabilité de la part d’une personne consistant à créer une œuvre musicale. @fr
toolkit label: personne compositrice d’une œuvre de @fr
toolkit definition: Œuvre qui comporte une responsabilité de la part d’une personne consistant à créer une œuvre musicale. @fr
label: ir komponists (persona) darbam @lv
definition: Sasaista personu ar darbu, kas ir mūzikas darbs, kas ietver personas atbildību par mūzikas radīšanu. @lv
toolkit label: ir komponists (persona) darbam @lv
toolkit definition: Mūzikas darbs, kas ietver personas atbildību par mūzikas radīšanu. @lv
label: 是……的作品的作曲者个人 @zh-hans
definition: 将一个个人与涉及创作一种音乐作品的一个个人的责任的一种作品关联起来。 @zh-hans
toolkit label: ……的作品的作曲者个人 @zh-hans
toolkit definition: 涉及创作一种音乐作品的一个个人的责任的一种作品 @zh-hans
label: eserinin besteci kişisidir @tr
definition: Bir kişiyi, kişinin bir müzik eseri yaratma sorumluluğunu içeren bir eserle ilişkilendirir. @tr
toolkit label: eserin bestecisi @tr
toolkit definition: Bir müzik eseri yaratmak için bir kişinin sorumluluğunu içeren bir eser. @tr
has subproperty: P50522

johtaja (toimija) ekspressiossa
status: Published
label: is conductor agent of @en
definition: Relates an agent to an expression that includes a contribution by an agent of leading a performing group in a musical or dramatic presentation. @en
type: Property
domain: C10002
sub property of: esittäjä (toimija) ekspressiossa
lexical alias: conductorAgentOf.en
label: est un agent chef musical de @fr
definition: Met un agent en relation avec une expression qui intègre une contribution de la part d’un agent consistant à diriger un groupe d’interprètes dans une présentation musicale ou dramatique. @fr
toolkit label: agent chef musical de @fr
toolkit definition: Expression qui intègre une contribution de la part d’un agent consistant à diriger un groupe d’interprètes dans une présentation musicale ou dramatique. @fr
toolkit label: conductor agent of @en
toolkit definition: An expression that includes a contribution by an agent of leading a performing group in a musical or dramatic presentation. @en
instruction number: 18.5
label: είναι διευθυντής ορχήστρας φορέας του @el
definition: Συνδέει έναν εκτελεστή, ο οποίος συνεισφέρει στην έκφραση ενός μουσικού έργου μέσω της καθοδήγησης μιας ομάδας εκτελεστών σε μια μουσική ή δραματική παρουσίαση κ.λπ., με μια έκφραση. @el
toolkit label: διευθυντής ορχήστρας φορέας του @el
toolkit definition: Μια έκφραση ενός μουσικού έργου που ενσωματώνει τη συνεισφορά της διεύθυνσης ενός συνόλου σε μια μουσική ή δραματική παρουσίαση κ.λπ. @el
definition: Setzt einen Akteur in Beziehung zu einer Expression, zu der ein Akteur beiträgt, indem er ein aufführendes Ensemble in einer musikalischen oder dramatischen Darbietung leitet. @de
toolkit label: Akteur als Dirigentin/Dirigent von @de
toolkit definition: Eine Expression, zu der ein Akteur beiträgt, indem er ein aufführendes Ensemble in einer musikalischen oder dramatischen Darbietung leitet. @de
label: er agent, som er dirigent af @da
definition: Relaterer en agent til et udtryk, som omfatter en agents bidrag ved at lede en udøvende gruppe i en musikalsk eller dramatisk præsentation. @da
toolkit label: agent, som er dirigent af @da
toolkit definition: Udtryk, som omfatter en agents bidrag ved at lede en udøvende gruppe i en musikalsk eller dramatisk præsentation. @da
label: és agent director d’orquestra de @ca
definition: Relaciona un agent amb una expressió que inclou una contribució d’un agent dirigint un grup d’intèrprets en una representació musical o dramàtica. @ca
toolkit label: agent director d’orquestra de @ca
toolkit definition: Expressió que inclou una contribució d’un agent dirigint un grup d’intèrprets en una representació musical o dramàtica. @ca
definition: Liittää toimijan ekspressioon, jonka tekemiseen toimija osallistuu johtamalla esiintyjäryhmän esiintymistä musiikki- tai näytelmäesityksessä.
toolkit label: johtaja (toimija) ekspressiossa
toolkit definition: Ekspressio, jonka tekemiseen toimija osallistuu johtamalla esiintyjäryhmän esiintymistä musiikki- tai näytelmäesityksessä.
toolkit label: dirigent for (agent) @no
toolkit definition: Et uttrykk som inkluderer et bidrag fra en agent i form av å lede en gruppe med utøvere i en musikalsk eller dramatisk forestilling etc. @no
label: ist Akteur als Dirigentin/Dirigent von @de
has element type: 2
label: karmester ágense a következőnek: @hu
definition: Hozzákapcsol egy ágenst egy kifejezési formához, amely magában foglalja egy zenei vagy drámai bemutatóban előadói csoportot vezető ágens közreműködését. @hu
toolkit label: karmester ágense: @hu
toolkit definition: Egy kifejezési forma, amely magában foglalja egy zenei vagy drámai bemutatóban előadói csoportot vezető ágens közreműködését. @hu
alternative label: conductor of @en
alternative label: johtaja ekspressiossa
label: er dirigent for (agent) @no
definition: Relaterer en agent til et uttrykk som inkluderer et bidrag fra en agent i form av å lede en gruppe med utøvere i en musikalsk eller dramatisk forestilling etc. @no
alternative label: dirigent for @no
label: is dirigent-actor van @nl
definition: Relateert een actor aan een expressie die omvat een bijdrage van een actor door het leiden van een uitvoerende groep in een muziek- of dramapresentatie. @nl
toolkit label: dirigent-actor van @nl
toolkit definition: Een expressie die omvat een bijdrage van een actor door het leiden van een uitvoerende groep in een muziek- of dramapresentatie. @nl
label: هو وكيل مايسترو لـ @ar
definition: يربط وكيلا بتعبيرة تتضمن إسهام وكيل في قيادة فرقة عزف في عرض موسيقي أو درامي. @ar
alternative label: مايسترو لـ @ar
toolkit label: وكيل قائد فرقة موسيقية لـ @ar
toolkit definition: تعبيرة تتضمن إسهام وكيل في قيادة فرقة عزف في عرض موسيقي أو درامي. @ar
alternative label: director d’orquestra de @ca
alternative label: dirigent af @da
label: dirigent (tegija) väljenduses @et
definition: Seostab tegija väljendusega, millesse tegija on andnud panuse, juhatades muusika- või draamaetenduse esitusrühma. @et
alternative label: dirigent väljenduses @et
toolkit label: dirigent (tegija) väljenduses @et
toolkit definition: Väljendus, millesse tegija on andnud panuse, juhatades muusika- või draamaetenduse esitusrühma. @et
alternative label: karmestere: @hu
label: è direttore agente di @it
definition: Correla un agente a un'espressione che include un contributo da parte di un agente che guida un organico in una rappresentazione musicale o teatrale. @it
alternative label: direttore di @it
toolkit label: direttore agente di @it
toolkit definition: Espressione che include un contributo da parte di un agente che guida un organico in una rappresentazione musicale o teatrale. @it
alternative label: διευθυντής ορχήστρας του @el
alternative label: chef musical de @fr
label: ir diriģents (aģents) @lv
definition: Sasaista aģentu ar izteiksmi, kas ietver aģenta ieguldījumu, vadot izpildītāju grupu muzikālā vai dramatiskā uzvedumā. @lv
toolkit label: ir diriģents (aģents) @lv
toolkit definition: Izteiksme, kas ietver aģenta ieguldījumu, vadot izpildītāju grupu muzikālā vai dramatiskā uzvedumā. @lv
alternative label: Dirigent von @de
alternative label: ……的指挥 @zh-hans
toolkit label: ……的指挥行为者 @zh-hans
toolkit definition: 包括有领导音乐或戏剧呈现的表演团体的一个行为者的贡献的一种内容表达 @zh-hans
toolkit label: orkestra şefi temsilcisi @tr
toolkit definition: Müzikal veya dramatik bir sunumda bir performans grubuna liderlik eden bir temsilcinin katkısını içeren bir anlatım. @tr
has subproperty: kuoronjohtaja (toimija) ekspressiossa

johtaja (yhteistoimija) ekspressiossa
status: Published
label: is conductor collective agent of @en
lexical alias: conductorCollectiveAgentOf.en
definition: Relates a collective agent to an expression that includes a contribution by a collective agent of leading a performing group in a musical or dramatic presentation. @en
toolkit label: conductor collective agent of @en
toolkit definition: An expression that includes a contribution by a collective agent of leading a performing group in a musical or dramatic presentation. @en
type: Property
domain: C10011
has element type: 2
sub property of: esittäjä (yhteistoimija) ekspressiossa
sub property of: johtaja (toimija) ekspressiossa
definition: Liittää yhteistoimijan ekspressioon, jonka tekemisessä yhteistoimija on osallisena johtamalla esiintyjäryhmän esiintymistä musiikki- tai näytelmäesityksessä.
toolkit label: johtaja (yhteistoimija) ekspressiossa
toolkit definition: Ekspressio, jonka tekemisessä yhteistoimija on osallisena johtamalla esiintyjäryhmän esiintymistä musiikki- tai näytelmäesityksessä.
label: er dirigent for (kollektiv agent) @no
definition: Relaterer en kollektiv agent til et uttrykk som inkluderer et bidrag fra en kollektiv agent i form av ledelse av en gruppe med utøvere i en musikalsk eller dramatisk forestilling. @no
toolkit label: dirigent for (kollektiv agent) @no
toolkit definition: Et uttrykk som inkluderer et bidrag fra en kollektiv agent i form av ledelse av en gruppe med utøvere i en musikalsk eller dramatisk forestilling. @no
label: is dirigent-collectieve actor van @nl
definition: Relateert een collectieve actor aan een expressie die omvat een bijdrage van een collectieve actor door het leiden van een uitvoerende groep in een muziek- of dramapresentatie. @nl
toolkit label: dirigent-collectieve actor van @nl
toolkit definition: Een expressie die omvat een bijdrage van een collectieve actor door het leiden van een uitvoerende groep in een muziek- of dramapresentatie. @nl
label: هو وكيل جماعي قائد فرقة موسيقية لـ @ar
definition: يربط وكيلا جماعيا بتعبيرة تتضمن إسهام وكيل جماعي في قيادة فرقة عزف في عرض موسيقي أو درامي. @ar
toolkit label: وكيل جماعي قائد فرقة موسيقية @ar
toolkit definition: تعبيرة تتضمن إسهام وكيل جماعي في قيادة فرقة عزف في عرض موسيقي أو درامي. @ar
label: és agent col·lectiu director d’orquestra de @ca
definition: Relaciona un agent col·lectiu amb una expressió que inclou una contribució d’un agent col·lectiu dirigint un grup d’intèrprets en una representació musical o dramàtica. @ca
toolkit label: agent col·lectiu director d’orquestra de @ca
toolkit definition: Expressió que inclou una contribució d’un agent col·lectiu dirigint un grup d’intèrprets en una representació musical o dramàtica. @ca
label: er kollektiv agent, som er dirigent af @da
definition: Relaterer en kollektiv agent til et udtryk, som omfatter en kollektiv agents bidrag ved at lede en udøvende gruppe i en musikalsk eller dramatisk præsentation. @da
toolkit label: kollektiv agent, som er dirigent af @da
toolkit definition: Udtryk, som omfatter en kollektiv agents bidrag ved at lede en udøvende gruppe i en musikalsk eller dramatisk præsentation. @da
label: dirigent (kollektiiv) väljenduses @et
definition: Seostab kollektiivi väljendusega, millesse kollektiiv on andnud panuse, juhatades muusika- või draamaetenduse esitusrühma. @et
toolkit label: dirigent (kollektiiv) väljenduses @et
toolkit definition: Väljendus, millesse kollektiiv on andnud panuse, juhatades muusika- või draamaetenduse esitusrühma. @et
label: ist gemeinschaftlicher Akteur als Dirigentin/Dirigent von @de
definition: Setzt einen gemeinschaftlichen Akteur in Beziehung zu einer Expression, zu der ein gemeinschaftlicher Akteur beiträgt, indem er ein aufführendes Ensemble in einer musikalischen oder dramatischen Darbietung leitet. @de
toolkit label: Gemeinschaftlicher Akteur als Dirigentin/Dirigent von @de
toolkit definition: Eine Expression, zu der ein gemeinschaftlicher Akteur beiträgt, indem er ein aufführendes Ensemble in einer musikalischen oder dramatischen Darbietung leitet. @de
label: karmester kollektív ágense a következőnek: @hu
definition: Hozzákapcsol egy kollektív ágenst egy kifejezési formához, amely magában foglalja egy zenei vagy drámai bemutatóban, előadói csoportot vezető kollektív ágens közreműködését. @hu
toolkit label: karmester kollektív ágense: @hu
toolkit definition: Egy kifejezési forma, amely magában foglalja egy zenei vagy drámai bemutatóban, előadói csoportot vezető kollektív ágens közreműködését. @hu
label: è direttore agente collettivo di @it
definition: Correla un agente collettivo a un'espressione che comprende un contributo di un agente collettivo nella conduzione di un gruppo che si esibisce in una presentazione musicale o drammatica. @it
toolkit label: direttore agente collettivo di @it
toolkit definition: Espressione che comprende un contributo di un agente collettivo nella conduzione di un gruppo che si esibisce in una presentazione musicale o drammatica. @it
label: είναι διευθυντής ορχήστρας συλλογικός φορέας του @el
toolkit label: διευθυντής ορχήστρας συλλογικός φορέας του @el
label: est un agent collectif chef musical de @fr
definition: Met un agent collectif en relation avec une expression qui intègre une contribution de la part d’un agent collectif consistant à diriger un groupe d’interprètes dans une présentation musicale ou dramatique. @fr
toolkit label: agent collectif chef musical de @fr
toolkit definition: Expression qui intègre une contribution de la part d’un agent collectif consistant à diriger un groupe d’interprètes dans une présentation musicale ou dramatique. @fr
label: ir diriģents (grupa) @lv
definition: Sasaista grupu ar izteiksmi, kas ietver grupas ieguldījumu, vadot izpildītāju grupu muzikālā vai dramatiskā uzvedumā. @lv
toolkit label: ir diriģents (grupa) @lv
toolkit definition: Izteiksme, kas ietver grupas ieguldījumu, vadot izpildītāju grupu muzikālā vai dramatiskā uzvedumā. @lv
label: 是……的指挥集体行为者 @zh-hans
definition: 将一个集体行为者与包括领导音乐或戏剧呈现的表演团体的一个集体行为者的贡献的一种内容表达关联起来。 @zh-hans
toolkit label: ……的指挥集体行为者 @zh-hans
toolkit definition: 包括领导音乐或戏剧呈现的表演团体的一个集体行为者的贡献的一种内容表达 @zh-hans
label: orkestra şefi kolektif temsilcisidir @tr
definition: Koleklif bir temsilciyi, müzikal veya dramatik bir sunumda performans gösteren bir gruba liderlik eden kolektif bir temsilcinin katkısını içeren bir anlatımla ilişkilendirir. @tr
toolkit label: orkestra şefi kolektif temsilcisi @tr
toolkit definition: Müzikal veya dramatik bir gösteride, bir performans gruba liderlik eden kolektif bir temsilcinin katkısını içeren bir anlatım. @tr
has subproperty: kuoronjohtaja (yhteistoimija) ekspressiossa
has subproperty: johtaja (yhteisö) ekspressiossa
has subproperty: johtaja (suku) ekspressiossa
has subproperty: kapellimestari (yhteistoimija) ekspressiossa
has subproperty: P50743

johtaja (yhteisö) ekspressiossa
status: Published
label: is conductor corporate body of @en
lexical alias: conductorCorporateBodyOf.en
definition: Relates a corporate body to an expression that includes a contribution by a corporate body of leading a performing group in a musical or dramatic presentation. @en
toolkit label: conductor corporate body of @en
toolkit definition: An expression that includes a contribution by a corporate body of leading a performing group in a musical or dramatic presentation. @en
type: Property
domain: C10005
has element type: 2
sub property of: esittäjä (yhteisö) ekspressiossa
sub property of: johtaja (yhteistoimija) ekspressiossa
definition: Liittää yhteisön ekspressioon, jonka tekemisessä yhteisö on osallisena johtamalla esiintyjäryhmän esiintymistä musiikki- tai näytelmäesityksessä.
toolkit label: johtaja (yhteisö) ekspressiossa
toolkit definition: Ekspressio, jonka tekemisessä yhteisö on osallisena johtamalla esiintyjäryhmän esiintymistä musiikki- tai näytelmäesityksessä.
label: er dirigent for (korporasjon) @no
definition: Relaterer en korporasjon til et uttrykk som inkluderer et bidrag fra en korporasjon i form av ledelse av en gruppe med utøvere i en musikalsk eller dramatisk forestilling. @no
toolkit label: dirigent for (korporasjon) @no
toolkit definition: Et uttrykk som inkluderer et bidrag fra en korporasjon i form av ledelse av en gruppe med utøvere i en musikalsk eller dramatisk forestilling. @no
label: is dirigent-corporatie van @nl
definition: Relateert een corporatie aan een expressie die omvat een bijdrage van een corporatie door het leiden van een uitvoerende groep in een muziek- of dramapresentatie. @nl
toolkit label: dirigent-corporatie van @nl
toolkit definition: Een expressie die omvat een bijdrage van een corporatie door het leiden van een uitvoerende groep in een muziek- of dramapresentatie. @nl
label: هي هيئة تقود فرقة موسيقية لـ @ar
definition: يربط هيئة بتعبيرة تتضمن إسهام هيئة في قيادة فرقة عزف في عرض موسيقي أو درامي. @ar
toolkit label: هيئة تقود لفرقة موسيقية @ar
toolkit definition: تعبيرة تتضمن إسهام هيئة في قيادة فرقة عزف في عرض موسيقي أو درامي. @ar
label: és entitat corporativa directora d’orquestra de @ca
definition: Relaciona una entitat corporativa amb una expressió que inclou una contribució d’una entitat corporativa dirigint un grup d’intèrprets en una representació musical o dramàtica. @ca
toolkit label: entitat corporativa directora d’orquestra de @ca
toolkit definition: Expressió que inclou una contribució d’una entitat corporativa dirigint un grup d’intèrprets en una representació musical o dramàtica. @ca
label: er korporation, som er dirigent af @da
definition: Relaterer en korporation til et udtryk, som omfatter en korporations bidrag ved at lede en udøvende gruppe i en musikalsk eller dramatisk præsentation. @da
toolkit label: korporation, som er dirigent af @da
toolkit definition: Udtryk, som omfatter en korporations bidrag ved at lede en udøvende gruppe i en musikalsk eller dramatisk præsentation. @da
label: dirigent (asutus) väljenduses @et
definition: Seostab asutuse väljendusega, millesse asutus on andnud panuse, juhatades muusika- või draamaetenduse esitusrühma. @et
toolkit label: dirigent (asutus) väljenduses @et
toolkit definition: Väljendus, millesse asutus on andnud panuse, juhatades muusika- või draamaetenduse esitusrühma. @et
label: ist Körperschaft als Dirigentin/Dirigent von @de
definition: Setzt eine Körperschaft in Beziehung zu einer Expression, zu der eine Körperschaft beiträgt, indem sie ein ausführendes Ensemble in einer musikalischen oder dramatischen Darbietung leitet. @de
toolkit label: Körperschaft als Dirigentin/Dirigent von @de
toolkit definition: Eine Expression, zu der eine Körperschaft beiträgt, indem sie ein ausführendes Ensemble in einer musikalischen oder dramatischen Darbietung leitet. @de
label: karmester testülete a következőnek: @hu
definition: Hozzákapcsol egy testületet egy kifejezési formához, amely magában foglalja egy zenei vagy drámai bemutatóban, előadói csoportot vezető testület közreműködését. @hu
toolkit label: karmester testülete: @hu
toolkit definition: Egy kifejezési forma, amely magában foglalja egy zenei vagy drámai bemutatóban, előadói csoportot vezető testület közreműködését. @hu
label: è direttore ente di @it
definition: Correla un ente a un'espressione che include un contributo di un ente nella conduzione di un gruppo che si esibisce in una presentazione musicale o drammatica. @it
toolkit label: direttore ente di @it
toolkit definition: Espressione che include un contributo di un ente nella conduzione di un gruppo che si esibisce in una presentazione musicale o drammatica. @it
label: είναι διευθυντής ορχήστρας συλλογικό όργανο του @el
toolkit label: διευθυντής ορχήστρας συλλογικό όργανο του @el
label: est une collectivité chef musicale de @fr
definition: Met une collectivité en relation avec une expression qui intègre une contribution de la part d’une collectivité consistant à diriger un groupe d’interprètes dans une présentation musicale ou dramatique. @fr
toolkit label: collectivité chef musicale de @fr
toolkit definition: Expression qui intègre une contribution de la part d’une collectivité consistant à diriger un groupe d’interprètes dans une présentation musicale ou dramatique. @fr
label: ir diriģents (institūcija) @lv
definition: Sasaista institūciju ar izteiksmi, kas ietver institūcijas ieguldījumu, vadot izpildītāju grupu muzikālā vai dramatiskā uzvedumā. @lv
toolkit label: ir diriģents (institūcija) @lv
toolkit definition: Izteiksme, kas ietver institūcijas ieguldījumu, vadot izpildītāju grupu muzikālā vai dramatiskā uzvedumā. @lv
label: 是……的指挥团体 @zh-hans
definition: 将一个团体与包括领导音乐或戏剧呈现的表演团体的一个团体的贡献的一种内容表达关联起来。 @zh-hans
toolkit label: ……的指挥团体 @zh-hans
toolkit definition: 包括领导音乐或戏剧呈现的表演团体的一个团体的贡献的一种内容表达 @zh-hans
label: orkestra şefi tüzel kişisidir @tr
definition: Bir tüzel kişiyi, müzikal veya dramatik bir sunumda performans gösteren bir gruba liderlik eden bir tüzel kişinin katkısını içeren bir anlatımla ilişkilendirir. @tr
toolkit label: orkestra şefi tüzel kişisi @tr
toolkit definition: Bir müzikal veya dramatik bir sunumda bir performans grubuna liderlik eden tüzel bir kişinin katkısını içeren bir anlatım. @tr
has subproperty: kuoronjohtaja (yhteisö) ekspressiossa
has subproperty: kapellimestari (yhteisö) ekspressiossa
has subproperty: P50894

johtaja (suku) ekspressiossa
status: Published
label: is conductor family of @en
lexical alias: conductorFamilyOf.en
definition: Relates a family to an expression that includes a contribution by a family of leading a performing group in a musical or dramatic presentation. @en
toolkit label: conductor family of @en
toolkit definition: An expression that includes a contribution by a family of leading a performing group in a musical or dramatic presentation. @en
type: Property
domain: C10008
has element type: 2
sub property of: esittäjä (suku) ekspressiossa
sub property of: johtaja (yhteistoimija) ekspressiossa
definition: Liittää suvun ekspressioon, jonka tekemisessä suku on osallisena johtamalla esiintyjäryhmän esiintymistä musiikki- tai näytelmäesityksessä.
toolkit label: johtaja (suku) ekspressiossa
toolkit definition: Ekspressio, jonka tekemisessä suku on osallisena johtamalla esiintyjäryhmän esiintymistä musiikki- tai näytelmäesityksessä.
label: er dirigent for (familie) @no
definition: Relaterer en familie til et uttrykk som inkluderer et bidrag fra en familie i form av ledelse av en gruppe med utøvere i en musikalsk eller dramatisk forestilling. @no
toolkit label: dirigent for (familie) @no
toolkit definition: Et uttrykk som inkluderer et bidrag fra en familie i form av ledelse av en gruppe med utøvere i en musikalsk eller dramatisk forestilling. @no
label: is dirigent-familie van @nl
definition: Relateert een familie aan een expressie die omvat een bijdrage van een familie door het leiden van een uitvoerende groep in een muziek- of dramapresentatie. @nl
toolkit label: dirigent-familie van @nl
toolkit definition: Een expressie die omvat een bijdrage van een familie door het leiden van een uitvoerende groep in een muziek- of dramapresentatie. @nl
label: هي عائلة تقود فرقة موسيقية لـ @ar
definition: يربط عائلة بتعبيرة تتضمن إسهام عائلة في قيادة فرقة عزف في عرض موسيقي أو درامي. @ar
toolkit label: عائلة تقود فرقة موسيقية لـ @ar
toolkit definition: تعبيرة تتضمن إسهام عائلة في قيادة فرقة عزف في عرض موسيقي أو درامي. @ar
label: és família directora d’orquestra de @ca
definition: Relaciona una família amb una expressió que inclou una contribució d’una família dirigint un grup d’intèrprets en una representació musical o dramàtica. @ca
toolkit label: família directora d’orquestra de @ca
toolkit definition: Expressió que inclou una contribució d’una família dirigint un grup d’intèrprets en una representació musical o dramàtica. @ca
label: er familie, som er dirigent af @da
definition: Relaterer en familie til et udtryk, som omfatter en families bidrag ved at lede en udøvende gruppe i en musikalsk eller dramatisk præsentation. @da
toolkit label: familie, som er dirigent af @da
toolkit definition: Udtryk, som omfatter en families bidrag ved at lede en udøvende gruppe i en musikalsk eller dramatisk præsentation. @da
label: dirigent (perekond) väljenduses @et
definition: Seostab perekonna väljendusega, millesse perekond on andnud panuse, juhatades muusika- või draamaetenduse esitusrühma. @et
toolkit label: dirigent (perekond) väljenduses @et
toolkit definition: Väljendus, millesse perekond on andnud panuse, juhatades muusika- või draamaetenduse esitusrühma. @et
label: ist Familie als Dirigentin/Dirigent von @de
definition: Setzt eine Familie in Beziehung zu einer Expression, zu der eine Familie beiträgt, indem sie ein aufführendes Ensemble in einer musikalischen oder dramatischen Darbietung leitet. @de
toolkit label: Familie als Dirigentin/Dirigent von @de
toolkit definition: Eine Expression, zu der eine Familie beiträgt, indem sie ein aufführendes Ensemble in einer musikalischen oder dramatischen Darbietung leitet. @de
label: karmester családja a következőnek: @hu
definition: Hozzákapcsol egy családot egy kifejezési formához, amely magában foglalja egy zenei vagy drámai bemutatóban, előadói csoportot vezető család közreműködését. @hu
toolkit label: karmester családja: @hu
toolkit definition: Egy kifejezési forma, amely magában foglalja egy zenei vagy drámai bemutatóban, előadói csoportot vezető család közreműködését. @hu
label: è direttore famiglia di @it
definition: Correla una famiglia a un'espressione che comprende un contributo di una famiglia nella conduzione di un gruppo che si esibisce in una presentazione musicale o drammatica. @it
toolkit label: direttore famiglia di @it
toolkit definition: Espressione che comprende un contributo di una famiglia nella conduzione di un gruppo che si esibisce in una presentazione musicale o drammatica. @it
label: είναι διευθυντής ορχήστρας οικογένεια του @el
toolkit label: διευθυντής ορχήστρας οικογένεια του @el
label: est une famille chef musicale de @fr
definition: Met une famille en relation avec une expression qui intègre une contribution de la part d’une famille consistant à diriger un groupe d’interprètes dans une présentation musicale ou dramatique. @fr
toolkit label: famille chef musicale de @fr
toolkit definition: Expression qui intègre une contribution de la part d’une famille consistant à diriger un groupe d’interprètes dans une présentation musicale ou dramatique. @fr
label: ir diriģents (dzimta/ģimene) @lv
definition: Sasaista dzimtu/ģimeni ar izteiksmi, kas ietver dzimtas/ģimenes ieguldījumu, vadot izpildītāju grupu muzikālā vai dramatiskā uzvedumā. @lv
toolkit label: ir diriģents (dzimta/ģimene) @lv
toolkit definition: Izteiksme, kas ietver dzimtas/ģimenes ieguldījumu, vadot izpildītāju grupu muzikālā vai dramatiskā uzvedumā. @lv
label: 是……的指挥家族 @zh-hans
definition: 将一个家族与包括有领导音乐或戏剧呈现的表演团体的一个家族的贡献的一种内容表达关联起来。 @zh-hans
toolkit label: ……的指挥家族 @zh-hans
toolkit definition: 包括有领导音乐或戏剧呈现的表演团体的一个家族的贡献的一种内容表达 @zh-hans
label: orkestra şefi ailesidir @tr
definition: Bir aileyi, müzikal veya dramatik bir sunumda bir performans grubuna liderlik eden bir ailenin katkısını içeren bir anlatımla ilişkilendirir. @tr
toolkit label: orkestra şefi ailesi @tr
toolkit definition: Müzikal veya dramatik bir sunumda bir performans grubuna liderlik eden bir ailenin katkısını içeren bir anlatım. @tr
has subproperty: kuoronjohtaja (suku) ekspressiossa
has subproperty: kapellimestari (suku) ekspressiossa
has subproperty: P51045

johtaja (henkilö) ekspressiossa
status: Published
label: is conductor person of @en
lexical alias: conductorPersonOf.en
definition: Relates a person to an expression that includes a contribution by a person of leading a performing group in a musical or dramatic presentation. @en
toolkit label: conductor person of @en
toolkit definition: An expression that includes a contribution by a person of leading a performing group in a musical or dramatic presentation. @en
type: Property
domain: C10004
has element type: 2
sub property of: esittäjä (henkilö) ekspressiossa
sub property of: johtaja (toimija) ekspressiossa
definition: Liittää henkilön ekspressioon, jonka tekemisessä henkilö on osallisena johtamalla esiintyjäryhmän esiintymistä musiikki- tai näytelmäesityksessä.
toolkit label: johtaja (henkilö) ekspressiossa
toolkit definition: Ekspressio, jonka tekemisessä henkilö on osallisena johtamalla esiintyjäryhmän esiintymistä musiikki- tai näytelmäesityksessä.
label: er dirigent for (person) @no
definition: Relaterer en person til et uttrykk som inkluderer et bidrag fra en person i form av ledelse av en gruppe med utøvere i en musikalsk eller dramatisk forestilling. @no
toolkit label: dirigent for (person) @no
toolkit definition: Et uttrykk som inkluderer et bidrag fra en person i form av ledelse av en gruppe med utøvere i en musikalsk eller dramatisk forestilling. @no
label: is dirigent-persoon van @nl
definition: Relateert een persoon aan een expressie die omvat een bijdrage van een persoon door het leiden van een uitvoerende groep in een muziek- of dramapresentatie. @nl
toolkit label: dirigent-persoon van @nl
toolkit definition: Een expressie die omvat een bijdrage van een persoon door het leiden van een uitvoerende groep in een muziek- of dramapresentatie. @nl
label: هو شخص قائد فرقة موسيقية لـ @ar
definition: يربط شخصا بتعبيرة تتضمن إسهام شخص في قيادة فرقة عزف في عرض موسيقي أو درامي. @ar
toolkit label: شخص قائد فرقة موسيقية @ar
toolkit definition: تعبيرة تتضمن إسهام شخص في قيادة فرقة عزف في عرض موسيقي أو درامي. @ar
label: és persona directora d’orquestra de @ca
definition: Relaciona una persona amb una expressió que inclou una contribució d’una persona dirigint un grup d’intèrprets en una representació musical o dramàtica. @ca
toolkit label: persona directora d’orquestra de @ca
toolkit definition: Expressió que inclou una contribució d’una persona dirigint un grup d’intèrprets en una representació musical o dramàtica. @ca
label: er person, som er dirigent af @da
definition: Relaterer en person til et udtryk, som omfatter en persons bidrag ved at lede en udøvende gruppe i en musikalsk eller dramatisk præsentation. @da
toolkit label: person, som er dirigent af @da
toolkit definition: Udtryk, som omfatter en persons bidrag ved at lede en udøvende gruppe i en musikalsk eller dramatisk præsentation. @da
label: dirigent (isik) väljenduses @et
definition: Seostab isiku väljendusega, millesse isik on andnud panuse, juhatades muusika- või draamaetenduse esitusrühma. @et
toolkit label: dirigent (isik) väljenduses @et
toolkit definition: Väljendus, millesse isik on andnud panuse, juhatades muusika- või draamaetenduse esitusrühma. @et
label: ist Person als Dirigentin/Dirigent von @de
definition: Setzt eine Person in Beziehung zu einer Expression, zu der eine Person beiträgt, indem sie ein aufführendes Ensemble in einer musikalischen oder dramatischen Darbietung leitet. @de
toolkit label: Person als Dirigentin/Dirigent von @de
toolkit definition: Eine Expression, zu der eine Person beiträgt, indem sie ein aufführendes Ensemble in einer musikalischen oder dramatischen Darbietung leitet. @de
label: karmester személye a következőnek: @hu
definition: Hozzákapcsol egy személyt egy kifejezési formához, amely magában foglalja egy zenei vagy drámai bemutatóban, előadói csoportot vezető személy közreműködését. @hu
toolkit label: karmester személye: @hu
toolkit definition: Egy kifejezési forma, amely magában foglalja egy zenei vagy drámai bemutatóban, előadói csoportot vezető személy közreműködését. @hu
label: è direttore persona di @it
definition: Correla una persona a un'espressione che comprende un contributo di una persona nella conduzione di un gruppo che si esibisce in una presentazione musicale o drammatica. @it
toolkit label: direttore persona di @it
toolkit definition: Espressione che comprende un contributo di una persona nella conduzione di un gruppo che si esibisce in una presentazione musicale o drammatica. @it
label: είναι διευθυντής ορχήστρας φυσικό πρόσωπο του @el
toolkit label: διευθυντής ορχήστρας φυσικό πρόσωπο του @el
label: est une personne chef musicale de @fr
definition: Met une personne en relation avec une expression qui intègre une contribution de la part d’une personne consistant à diriger un groupe d’interprètes dans une présentation musicale ou dramatique. @fr
toolkit label: personne chef musicale de @fr
toolkit definition: Expression qui intègre une contribution de la part d’une personne consistant à diriger un groupe d’interprètes dans une présentation musicale ou dramatique. @fr
label: ir diriģents (persona) @lv
definition: Sasaista personu ar izteiksmi, kas ietver personas ieguldījumu, vadot izpildītāju grupu muzikālā vai dramatiskā uzvedumā. @lv
toolkit label: ir diriģents (persona) @lv
toolkit definition: Izteiksme, kas ietver personas ieguldījumu, vadot izpildītāju grupu muzikālā vai dramatiskā uzvedumā. @lv
label: 是……的指挥个人 @zh-hans
definition: 将一个个人与包括领导音乐或戏剧呈现的表演团体的一个个人的贡献的一种内容表达关联起来。 @zh-hans
toolkit label: ……的指挥个人 @zh-hans
toolkit definition: 包括领导音乐或戏剧呈现的表演团体的一个个人的贡献的一种内容表达 @zh-hans
label: orekstra şefi kişisidir @tr
definition: Bir kişiyi, müzikal veya dramatik bir sunumda bir gösteri grubuna liderlik eden bir kişinin katkısını içeren bir anlatımla ilişkilendirir. @tr
toolkit label: orkestra şefi @tr
toolkit definition: Müzikal veya dramatik bir sunumda bir performans grubuna liderlik eden bir kişinin katkısını içeren bir anlatım. @tr
has subproperty: kuoronjohtaja (henkilö) ekspressiossa
has subproperty: kapellimestari (henkilö) ekspressiossa
has subproperty: P50592

asiantuntija (toimija) teoksessa
status: Published
label: is consultant agent of @en
definition: Relates an agent to a work that involves a responsibility of an agent for providing consultation services, and often making recommendations, to a creator of a work. @en
type: Property
domain: C10002
sub property of: toimijaan liittyvä teos
lexical alias: consultantAgentOf.en
label: est un agent consultant de @fr
definition: Met un agent en relation avec une œuvre qui comporte une responsabilité de la part d’un agent consistant à fournir des services de consultation et souvent à faire des recommandations à un créateur d’une œuvre. @fr
toolkit label: agent consultant de @fr
toolkit definition: Œuvre qui comporte une responsabilité de la part d’un agent consistant à fournir des services de consultation et souvent à faire des recommandations à un créateur d’une œuvre. @fr
toolkit label: consultant agent of @en
toolkit definition: A work that involves a responsibility of an agent for providing consultation services, and often making recommendations, to a creator of a work. @en
instruction number: 18.5
label: είναι σύμβουλος φορέας του @el
definition: Συνδέει έναν φορέα που παρέχει υπηρεσίες συμβουλευτικής και συχνά κάνει συστάσεις σε κάποιον άλλον φορέα, ο οποίος αναπαρίσταται ως ο δημιουργός ενός έργου, με ένα έργο. @el
toolkit label: σύμβουλος φορέας του @el
toolkit definition: Ένα έργο που περιλαμβάνει την ευθύνη της παροχής υπηρεσιών συμβουλευτικής και συχνά κάνει συστάσεις σε κάποιον άλλον φορέα, ο οποίος αναπαρίσταται ως ο δημιουργός ενός έργου. @el
definition: Setzt einen Akteur in Beziehung zu einem Werk, bei dem ein Akteur einer geistigen Schöpferin/einem geistigen Schöpfer eines Werks Beratungsdienste anbietet und Empfehlungen macht. @de
toolkit label: Akteur als Beraterin/Berater von @de
toolkit definition: Ein Werk, bei dem ein Akteur einer geistigen Schöpferin/einem geistigen Schöpfer Beratungsdienste anbietet und häufig Empfehlungen macht. @de
label: er agent, som er rådgiver af @da
definition: Relaterer en agent til et værk, som involverer en agents ansvar for at yde rådgivning og ofte komme med anbefalinger til et ophav til et værk. @da
toolkit label: agent, som er rådgiver af @da
toolkit definition: Værk, som involverer en agents ansvar for at yde rådgivning og ofte komme med anbefalinger til et ophav til et værk. @da
label: és agent consultor de @ca
definition: Relaciona un agent amb una obra que implica una responsabilitat d’un agent proporcionant serveis d’assessorament, i que sovint fa recomanacions, a un creador d’una obra. @ca
toolkit label: agent consultor de @ca
toolkit definition: Obra que implica una responsabilitat d’un agent proporcionant serveis d’assessorament, i que sovint fa recomanacions, a un creador d’una obra. @ca
definition: Liittää toimijan teokseen, jossa toimija on vastuussa asiantuntijapalveluiden tarjoamisesta ja suositusten antamisesta teoksen tekijälle.
toolkit label: asiantuntija (toimija) teoksessa
toolkit definition: Teos, jossa toimija on vastuussa asiantuntijapalveluiden tarjoamisesta ja suositusten antamisesta teoksen tekijälle.
toolkit label: konsulent for (agent) @no
toolkit definition: Et verk som involverer ansvar for en agent i form av å levere konsulenttjenester og ofte å gi anbefalinger til en opphaver av et verk. @no
label: ist Akteur als Beraterin/Berater von @de
has element type: 2
label: tanácsadó ágense a következőnek: @hu
definition: Hozzákapcsol egy ágenst egy műhöz, amelyhez hozzátartozik egy ágens felelőssége tanácsadó szolgáltatásért és gyakran egy mű létrehozójának tett javaslatokért is. @hu
toolkit label: tanácsadó ágense: @hu
toolkit definition: Egy mű, amelyhez hozzátartozik egy ágens felelőssége tanácsadó szolgáltatásért és gyakran egy mű létrehozójának tett javaslatokért is. @hu
alternative label: consultant of @en
alternative label: asiantuntijana teoksessa
label: er konsulent for (agent) @no
definition: Relaterer en agent til et verk som involverer ansvar for en agent i form av å levere konsulenttjenester og ofte å gi anbefalinger til en opphaver av et verk. @no
alternative label: konsulent for @no
label: is consultant-actor van @nl
definition: Relateert een actor aan een werk dat met zich meebrengt een verantwoordelijkheid van een actor voor het leveren van diensten van raadgeving, en vaak het doen van aanbevelingen, aan een maker van een werk. @nl
toolkit label: consultant-actor van @nl
toolkit definition: Een werk dat met zich meebrengt een verantwoordelijkheid van een actor voor het leveren van diensten van raadgeving, en vaak het doen van aanbevelingen, aan een maker van een werk. @nl
label: هو وكيل مرسل إليه لـ @ar
definition: يربط وكيلا بعمل يترتب عليه مسئولية وكيل عن تقديم خدمات استشارية، وغالبا ما يقدم مقترحات إلى منشئ عمل. @ar
alternative label: استشاري @ar
toolkit label: هو وكيل مرسل إليه لـ @ar
toolkit definition: يربط وكيلا بعمل يترتب عليه مسئولية وكيل عن تقديم خدمات استشارية، وغالبا ما يقدم مقترحات إلى منشئ عمل. @ar
alternative label: consultor de @ca
alternative label: rådgiver af @da
label: konsultant (tegija) teoses @et
definition: Seostab tegija teosega, mis sisaldab tegija vastutust konsultatsiooni ja sageli ka soovituste andmise eest teose autorile. @et
alternative label: konsultant teoses @et
toolkit label: konsultant (tegija) teoses @et
toolkit definition: Teos, mis sisaldab tegija vastutust konsultatsiooni ja sageli ka soovituste andmise eest teose autorile. @et
alternative label: tanácsadója: @hu
label: è consulente agente di @it
definition: Correla un agente a un'opera che implica la responsabilità di un agente nel fornire servizi di consulenza, spesso facendo raccomandazioni, al creatore dell'opera. @it
alternative label: consulente di @it
toolkit label: consulenteagente di @it
toolkit definition: Opera che implica la responsabilità di un agente nel fornire servizi di consulenza, spesso facendo raccomandazioni, al creatore dell'opera. @it
alternative label: σύμβουλος του @el
alternative label: consultant de @fr
label: ir konsultants (aģents) @lv
definition: Sasaista aģentu ar darbu, kas ietver aģenta atbildību par konsultāciju pakalpojumu un ieteikumu sniegšanu citam aģentam, kas ir darba radītājs. @lv
toolkit label: ir konsultants (aģents) @lv
toolkit definition: Darbs, kas ietver aģenta atbildību par konsultāciju pakalpojumu un ieteikumu sniegšanu citam aģentam, kas ir darba radītājs. @lv
alternative label: Berater von @de
alternative label: ……的顾问 @zh-hans
toolkit label: ……的顾问行为者 @zh-hans
toolkit definition: 涉及向作品创作者提供咨询服务并经常提供建议的一个行为者的责任的一种作品 @zh-hans
toolkit label: danışman temsilcisi @tr
toolkit definition: Bir eserin yaratıcısına danışmanlık hizmetleri sağlama ve genellikle tavsiyelerde bulunma konusunda bir temsilcinin sorumluluğunu içeren bir eser. @tr
has subproperty: asiantuntija (yhteistoimija) teoksessa

asiantuntija (yhteistoimija) teoksessa
status: Published
label: is consultant collective agent of @en
lexical alias: consultantCollectiveAgentOf.en
definition: Relates a collective agent to a work that involves a responsibility of a collective agent for providing consultation services, and often making recommendations, to a creator of a work. @en
toolkit label: consultant collective agent of @en
toolkit definition: A work that involves a responsibility of a collective agent for providing consultation services, and often making recommendations, to a creator of a work. @en
type: Property
domain: C10011
has element type: 2
sub property of: yhteistoimijaan liittyvä teos
sub property of: asiantuntija (toimija) teoksessa
definition: Liittää yhteistoimijan teokseen, jossa yhteistoimija on vastuussa asiantuntijapalveluiden tarjoamisesta ja suositusten antamisesta teoksen tekijälle.
toolkit label: asiantuntija (yhteistoimija) teoksessa
toolkit definition: Teos, jossa yhteistoimija on vastuussa asiantuntijapalveluiden tarjoamisesta ja suositusten antamisesta teoksen tekijälle.
label: er konsulent for (kollektiv agent) @no
definition: Relaterer en kollektiv agent til et verk som involverer et ansvar for en kollektiv agent i form av å levere konsulenttjenester og ofte gi anbefalinger til en skaper av et verk. @no
toolkit label: konsulent for (kollektiv agent) @no
toolkit definition: Et verk som involverer et ansvar for en kollektiv agent i form av å levere konsulenttjenester og ofte gi anbefalinger til en skaper av et verk. @no
label: is consultant-collectieve actor van @nl
definition: Relateert een collectieve actor aan een werk dat met zich meebrengt een verantwoordelijkheid van een collectieve actor voor het leveren van diensten van raadgeving, en vaak het doen van aanbevelingen, aan een maker van een werk. @nl
toolkit label: consultant-collectieve actor van @nl
toolkit definition: Een werk dat met zich meebrengt een verantwoordelijkheid van een collectieve actor voor het leveren van diensten van raadgeving, en vaak het doen van aanbevelingen, aan een maker van een werk. @nl
label: هو وكيل جماعي استشاري لـ @ar
definition: يربط وكيلا جماعيا بعمل ينطوي على مسئوليته عن تقديم خدمات استشارية، وغالبا ما يقدم مقترحات إلى منشئ عمل. @ar
toolkit label: وكيل جماعي استشاري @ar
toolkit definition: عمل يترتب عليه مسئولية وكيل جماعي عن تقديم خدمات استشارية، وغالبا ما يقدم مقترحات إلى منشئ عمل @ar
label: és agent col·lectiu consultor de @ca
definition: Relaciona un agent col·lectiu amb una obra que implica una responsabilitat d’un agent col·lectiu proporcionant serveis d’assessorament, i que sovint fa recomanacions, a un creador d’una obra. @ca
toolkit label: agent col·lectiu consultor de @ca
toolkit definition: Obra que implica una responsabilitat d’un agent col·lectiu proporcionant serveis d’assessorament, i que sovint fa recomanacions, a un creador d’una obra. @ca
label: er kollektiv agent, som er rådgiver af @da
definition: Relaterer en kollektiv agent til et værk, som involverer en kollektiv agents ansvar for at yde rådgivning og ofte komme med anbefalinger til et ophav til et værk. @da
toolkit label: kollektiv agent, som er rådgiver af @da
toolkit definition: Værk, som involverer en kollektiv agents ansvar for at yde rådgivning og ofte komme med anbefalinger til et ophav til et værk. @da
label: konsultant (kollektiiv) teoses @et
definition: Seostab kollektiivi teosega, mis sisaldab kollektiivi vastutust konsultatsiooni ja sageli ka soovituste andmise eest teose autorile. @et
toolkit label: konsultant (kollektiiv) teoses @et
toolkit definition: Teos, mis sisaldab kollektiivi vastutust konsultatsiooni ja sageli ka soovituste andmise eest teose autorile. @et
label: ist gemeinschaftlicher Akteur als Beraterin/Berater von @de
definition: Setzt einen gemeinschaftlichen Akteur in Beziehung zu einem Werk, bei dem ein gemeinschaftlicher Akteur einer geistigen Schöpferin/einem geistigen Schöpfer eines Werks Beratungsdienste anbietet und Empfehlungen macht. @de
toolkit label: Gemeinschaftlicher Akteur als Beraterin/Berater von @de
toolkit definition: Ein Werk, bei dem ein gemeinschaftlicher Akteur einer geistigen Schöpferin/einem geistigen Schöpfer eines Werks Beratungsdienste anbietet und Empfehlungen macht. @de
label: tanácsadó kollektív ágense a következőnek: @hu
definition: Hozzákapcsol egy kollektív ágenst egy műhöz, amelyhez hozzátartozik egy kollektív ágens felelőssége tanácsadó szolgáltatásért és gyakran egy mű létrehozójának tett javaslatokért is. @hu
toolkit label: tanácsadó kollektív ágense: @hu
toolkit definition: Egy mű, amelyhez hozzátartozik egy kollektív ágens felelőssége tanácsadó szolgáltatásért és gyakran egy mű létrehozójának tett javaslatokért is. @hu
label: è consulente agente collettivo di @it
definition: Correla un agente collettivo a un'opera che implica una responsabilità di un agente collettivo nel fornire servizi di consulenza e spesso raccomandazioni a un creatore di un'opera. @it
toolkit label: consulente agente collettivo di @it
toolkit definition: Opera che implica una responsabilità di un agente collettivo nel fornire servizi di consulenza e spesso raccomandazioni a un creatore di un'opera. @it
label: είναι σύμβουλος συλλογικός φορέας του @el
toolkit label: σύμβουλος συλλογικός φορέας του @el
label: est un agent collectif consultant de @fr
definition: Met un agent collectif en relation avec une œuvre qui comporte une responsabilité de la part d’un agent collectif consistant à fournir des services de consultation et souvent à faire des recommandations à un créateur d’une œuvre. @fr
toolkit label: agent collectif consultant de @fr
toolkit definition: Œuvre qui comporte une responsabilité de la part d’un agent collectif consistant à fournir des services de consultation et souvent à faire des recommandations à un créateur d’une œuvre. @fr
label: ir konsultants (grupa) @lv
definition: Sasaista grupu ar darbu, kas ietver grupas atbildību par konsultāciju pakalpojumu un ieteikumu sniegšanu citam aģentam, kas ir darba radītājs. @lv
toolkit label: ir konsultants (grupa) @lv
toolkit definition: Darbs, kas ietver grupas atbildību par konsultāciju pakalpojumu un ieteikumu sniegšanu citam aģentam, kas ir darba radītājs. @lv
label: 是……的顾问集体行为者 @zh-hans
definition: 将一个集体行为者与涉及向作品创作者提供咨询服务并经常提供建议的一个集体行为者的责任的一种作品关联起来。 @zh-hans
toolkit label: ……的顾问集体行为者 @zh-hans
toolkit definition: 涉及向作品创作者提供咨询服务并经常提供建议的一个集体行为者的责任的一种作品 @zh-hans
label: danışman kollektif temsilcisidir @tr
definition: Kolektif bir temsilciyi, bir eserin yaratıcısına danışma hizmetleri sağlama ve genellikle tavsiyelerde bulunma sorumluluğunu içeren bir eserle ilişkilendirir. @tr
toolkit label: danışman kolektif temsilcisi @tr
toolkit definition: Bir eserin yaratıcısına danışma hizmetleri sağlamak ve genellikle tavsiyelerde bulunmak için kollektif bir temsilcinin sorumluluğunu içeren bir eser. @tr
has subproperty: asiantuntija (yhteisö) teoksessa
has subproperty: asiantuntija (suku) teoksessa
has subproperty: P50707

asiantuntija (yhteisö) teoksessa
status: Published
label: is consultant corporate body of @en
lexical alias: consultantCorporateBodyOf.en
definition: Relates a corporate body to a work that involves a responsibility of a corporate body for providing consultation services, and often making recommendations, to a creator of a work. @en
toolkit label: consultant corporate body of @en
toolkit definition: A work that involves a responsibility of a corporate body for providing consultation services, and often making recommendations, to a creator of a work. @en
type: Property
domain: C10005
has element type: 2
sub property of: teoksen tekijä (yhteisö) teoksessa
sub property of: asiantuntija (yhteistoimija) teoksessa
definition: Liittää yhteisön teokseen, jossa yhteisö on vastuussa asiantuntijapalveluiden tarjoamisesta ja suositusten antamisesta teoksen tekijälle.
toolkit label: asiantuntija (yhteisö) teoksessa
toolkit definition: Teos, jossa yhteisö on vastuussa asiantuntijapalveluiden tarjoamisesta ja suositusten antamisesta teoksen tekijälle.
label: er konsulent for (korporasjon) @no
definition: Relaterer en korporasjon til et verk som involverer et ansvar for en korporasjon i form av å levere konsulenttjenester og ofte gi anbefalinger til en skaper av et verk. @no
toolkit label: konsulent for (korporasjon) @no
toolkit definition: Et verk som involverer et ansvar for en korporasjon i form av å levere konsulenttjenester og ofte gi anbefalinger til en skaper av et verk. @no
label: is consultant-corporatie van @nl
definition: Relateert een corporatie aan een werk dat met zich meebrengt een verantwoordelijkheid van een corporatie voor het leveren van diensten van raadgeving, en vaak het doen van aanbevelingen, aan een maker van een werk. @nl
toolkit label: consultant-corporatie van @nl
toolkit definition: Een werk dat met zich meebrengt een verantwoordelijkheid van een corporatie voor het leveren van diensten van raadgeving, en vaak het doen van aanbevelingen, aan een maker van een werk. @nl
label: هي هيئة استشارية لـ @ar
definition: يربط هيئة بعمل يترتب عليه مسئولية هيئة عن تقديم خدمات استشارية، وغالبا ما تقدم مقترحات إلى منشئ عمل. @ar
toolkit label: هيئة استشارية @ar
toolkit definition: عمل يترتب عليه مسئولية هيئة عن تقديم خدمات استشارية، وغالبا ما يقدم مقترحات إلى منشئ عمل. @ar
label: és entitat corporativa consultora de @ca
definition: Relaciona una entitat corporativa amb una obra que implica una responsabilitat d’una entitat corporativa proporcionant serveis d’assessorament, i que sovint fa recomanacions, a un creador d’una obra. @ca
toolkit label: entitat corporativa consultora de @ca
toolkit definition: Obra que implica una responsabilitat d’una entitat corporativa proporcionant serveis d’assessorament, i que sovint fa recomanacions, a un creador d’una obra. @ca
label: er korporation, som er rådgiver af @da
definition: Relaterer en korporation til et værk, som involverer en korporations ansvar for at yde rådgivning og ofte komme med anbefalinger til et ophav til et værk. @da
toolkit label: korporation, som er rådgiver af @da
toolkit definition: Værk, som involverer en korporations ansvar for at yde rådgivning og ofte komme med anbefalinger til et ophav til et værk. @da
label: konsultant (asutus) teoses @et
definition: Seostab asutuse teosega, mis sisaldab asutuse vastutust konsultatsiooni ja sageli ka soovituste andmise eest teose autorile. @et
toolkit label: konsultant (asutus) teoses @et
toolkit definition: Teos, mis sisaldab asutuse vastutust konsultatsiooni ja sageli ka soovituste andmise eest teose autorile. @et
label: ist Körperschaft als Beraterin/Berater von @de
definition: Setzt eine Körperschaft in Beziehung zu einem Werk, bei dem eine Körperschaft einer geistigen Schöpferin/einem geistigen Schöpfer eines Werks Beratungsdienste anbietet und Empfehlungen macht. @de
toolkit label: Körperschaft als Beraterin/Berater von @de
toolkit definition: Ein Werk, bei dem eine Körperschaft einer geistigen Schöpferin/einem geistigen Schöpfer eines Werks Beratungsdienste anbietet und Empfehlungen macht. @de
label: tanácsadó testülete a következőnek: @hu
definition: Hozzákapcsol egy testületet egy műhöz, amelyhez hozzátartozik egy testület felelőssége tanácsadó szolgáltatásért és gyakran egy mű létrehozójának tett javaslatokért is. @hu
toolkit label: tanácsadó testülete: @hu
toolkit definition: Egy mű, amelyhez hozzátartozik egy testület felelőssége tanácsadó szolgáltatásért és gyakran egy mű létrehozójának tett javaslatokért is. @hu
label: è consulente ente di @it
definition: Correla un ente a un'opera che implica una responsabilità di un ente per fornire servizi di consulenza e spesso raccomandazioni a un creatore di un'opera. @it
toolkit label: consulente ente di @it
toolkit definition: Opera che implica una responsabilità di un ente per fornire servizi di consulenza e spesso raccomandazioni a un creatore di un'opera. @it
label: είναι σύμβουλος συλλογικό όργανο του @el
toolkit label: σύμβουλος συλλογικό όργανο του @el
label: est une collectivité consultante de @fr
definition: Met une collectivité en relation avec une œuvre qui comporte une responsabilité de la part d’une collectivité consistant à fournir des services de consultation et souvent à faire des recommandations à un créateur d’une œuvre. @fr
toolkit label: collectivité consultante de @fr
toolkit definition: Œuvre qui comporte une responsabilité de la part d’une collectivité consistant à fournir des services de consultation et souvent à faire des recommandations à un créateur d’une œuvre. @fr
label: ir konsultants (institūcija) @lv
definition: Sasaista institūciju ar darbu, kas ietver institūcijas atbildību par konsultāciju pakalpojumu un ieteikumu sniegšanu citam aģentam, kas ir darba radītājs. @lv
toolkit label: ir konsultants (institūcija) @lv
toolkit definition: Darbs, kas ietver institūcijas atbildību par konsultāciju pakalpojumu un ieteikumu sniegšanu citam aģentam, kas ir darba radītājs. @lv
label: 是……的顾问团体 @zh-hans
definition: 将一个团体与涉及向作品创作者提供咨询服务并经常提供建议的一个团体的责任的一种作品关联起来。 @zh-hans
toolkit label: ……的顾问团体 @zh-hans
toolkit definition: 涉及向作品创作者提供咨询服务并经常提供建议的一个团体的责任的一种作品 @zh-hans
label: danışman tüzel kişisidir @tr
definition: Bir tüzel kişiyi, bir eserin yaratıcısına danışma hizmetleri sağlama ve genellikle tavsiyelerde bulunma sorumluluğunu içeren bir eserle ilişkilendirir. @tr
toolkit label: danışman tüzel kişisi @tr
toolkit definition: Bir eserin yaratıcısına danışmanlık hizmetleri sağlama ve genellikle tavsiyelerde bulunma konusunda bir tüzel kişinin sorumluluğunu içeren bir eser. @tr
has subproperty: P50858

asiantuntija (suku) teoksessa
status: Published
label: is consultant family of @en
lexical alias: consultantFamilyOf.en
definition: Relates a family to a work that involves a responsibility of a family for providing consultation services, and often making recommendations, to a creator of a work. @en
toolkit label: consultant family of @en
toolkit definition: A work that involves a responsibility of a family for providing consultation services, and often making recommendations, to a creator of a work. @en
type: Property
domain: C10008
has element type: 2
sub property of: sukuun liittyvä teos
sub property of: asiantuntija (yhteistoimija) teoksessa
definition: Liittää suvun teokseen, jossa suku on vastuussa asiantuntijapalveluiden tarjoamisesta ja suositusten antamisesta teoksen tekijälle.
toolkit label: asiantuntija (suku) teoksessa
toolkit definition: Teos, jossa suku on vastuussa asiantuntijapalveluiden tarjoamisesta ja suositusten antamisesta teoksen tekijälle.
label: er konsulent for (familie) @no
definition: Relaterer en familie til et verk som involverer et ansvar for en familie i form av å levere konsulenttjenester og ofte gi anbefalinger til en skaper av et verk. @no
toolkit label: konsulent for (familie) @no
toolkit definition: Et verk som involverer et ansvar for en familie i form av å levere konsulenttjenester og ofte gi anbefalinger til en skaper av et verk. @no
label: is consultant-familie van @nl
definition: Relateert een familie aan een werk dat met zich meebrengt een verantwoordelijkheid van een familie voor het leveren van diensten van raadgeving, en vaak het doen van aanbevelingen, aan een maker van een werk. @nl
toolkit label: consultant-familie van @nl
toolkit definition: Een werk dat met zich meebrengt een verantwoordelijkheid van een familie voor het leveren van diensten van raadgeving, en vaak het doen van aanbevelingen, aan een maker van een werk. @nl
label: هي عائلة استشارية لـ @ar
definition: يربط عائلة بعمل يترتب عليه مسئولية عائلة عن تقديم خدمات استشارية، وغالبا ما تقدم مقترحات إلى منشئ عمل. @ar
toolkit label: عائلة استشارية @ar
toolkit definition: عمل يترتب عليه مسئولية عائلة عن تقديم خدمات استشارية، وغالبا ما تقدم مقترحات إلى منشئ عمل. @ar
label: és família consultora de @ca
definition: Relaciona una família amb una obra que implica una responsabilitat d’una família proporcionant serveis d’assessorament, i que sovint fa recomanacions, a un creador d’una obra. @ca
toolkit label: família consultora de @ca
toolkit definition: Obra que implica una responsabilitat d’una família proporcionant serveis d’assessorament, i que sovint fa recomanacions, a un creador d’una obra. @ca
label: er familie, som er rådgiver af @da
definition: Relaterer en familie til et værk, som involverer en families ansvar for at yde rådgivning og ofte komme med anbefalinger til et ophav til et værk. @da
toolkit label: familie, som er rådgiver af @da
toolkit definition: Værk, som involverer en families ansvar for at yde rådgivning og ofte komme med anbefalinger til et ophav til et værk. @da
label: konsultant (perekond) teoses @et
definition: Seostab perekonna teosega, mis sisaldab perekonna vastutust konsultatsiooni ja sageli ka soovituste andmise eest teose autorile. @et
toolkit label: konsultant (perekond) teoses @et
toolkit definition: Teos, mis sisaldab perekonna vastutust konsultatsiooni ja sageli ka soovituste andmise eest teose autorile. @et
label: ist Familie als Beraterin/Berater von @de
definition: Setzt eine Familie in Beziehung zu einem Werk, bei dem eine Familie einer geistigen Schöpferin/einem geistigen Schöpfer eines Werks Beratungsdienste anbietet und Empfehlungen macht. @de
toolkit label: Familie als Beraterin/Berater von @de
toolkit definition: Ein Werk, bei dem eine Familie einer geistigen Schöpferin/einem geistigen Schöpfer eines Werks Beratungsdienste anbietet und Empfehlungen macht. @de
label: tanácsadó családja a következőnek: @hu
definition: Hozzákapcsol egy családot egy műhöz, amelyhez hozzátartozik egy család felelőssége tanácsadó szolgáltatásért és gyakran egy mű létrehozójának tett javaslatokért is. @hu
toolkit label: tanácsadó családja: @hu
toolkit definition: Egy mű, amelyhez hozzátartozik egy család felelőssége tanácsadó szolgáltatásért és gyakran egy mű létrehozójának tett javaslatokért is. @hu
label: è consulente famiglia di @it
definition: Correla una famiglia a un'opera che implica una responsabilità di una famiglia per fornire servizi di consulenza e spesso raccomandazioni a un creatore di un'opera. @it
toolkit label: consulente famiglia di @it
toolkit definition: Opera che implica una responsabilità di una famiglia per fornire servizi di consulenza e spesso raccomandazioni a un creatore di un'opera. @it
label: είναι σύμβουλος οικογένεια του @el
toolkit label: σύμβουλος οικογένεια του @el
label: est une famille consultante de @fr
definition: Met une famille en relation avec une œuvre qui comporte une responsabilité de la part d’une famille consistant à fournir des services de consultation et souvent à faire des recommandations à un créateur d’une œuvre. @fr
toolkit label: famille consultante de @fr
toolkit definition: Œuvre qui comporte une responsabilité de la part d’une famille consistant à fournir des services de consultation et souvent à faire des recommandations à un créateur d’une œuvre. @fr
label: ir konsultants (dzimta/ģimene) @lv
definition: Sasaista dzimtu/ģimeni ar darbu, kas ietver dzimtas/ģimenes atbildību par konsultāciju pakalpojumu un ieteikumu sniegšanu citam aģentam, kas ir darba radītājs. @lv
toolkit label: ir konsultants (dzimta/ģimene) @lv
toolkit definition: Darbs, kas ietver dzimtas/ģimenes atbildību par konsultāciju pakalpojumu un ieteikumu sniegšanu citam aģentam, kas ir darba radītājs. @lv
label: 是……的顾问家族 @zh-hans
definition: 将一个家族与涉及向作品创作者提供咨询服务并经常提供建议的一个家族的责任的一种作品关联起来。 @zh-hans
toolkit label: ……的顾问家族 @zh-hans
toolkit definition: 涉及向作品创作者提供咨询服务并经常提供建议的一个家族的责任的一种作品 @zh-hans
label: danışman ailesidir @tr
definition: Bir aileyi, danışmanlık hizmetleri sunma ve genellikle bir eserin yaratıcısına önerilerde bulunma sorumluluğunu içeren bir eserle ilişkilendirir. @tr
toolkit label: danışman ailesi @tr
toolkit definition: Bir eserin yaratıcısına danışmanlık hizmetleri sağlama ve genellikle tavsiyelerde bulunma konusunda bir ailenin sorumluluğunu içeren bir eser. @tr
has subproperty: P51009

asiantuntija (henkilö) teoksessa
status: Published
label: is consultant person of @en
lexical alias: consultantPersonOf.en
definition: Relates a person to a work that involves a responsibility of a person for providing consultation services, and often making recommendations, to a creator of a work. @en
toolkit label: consultant person of @en
toolkit definition: A work that involves a responsibility of a person for providing consultation services, and often making recommendations, to a creator of a work. @en
type: Property
domain: C10004
has element type: 2
sub property of: henkilöön liittyvä teos
sub property of: asiantuntija (toimija) teoksessa
definition: Liittää henkilön teokseen, jossa henkilö on vastuussa asiantuntijapalveluiden tarjoamisesta ja suositusten antamisesta teoksen tekijälle.
toolkit label: asiantuntija (henkilö) teoksessa
toolkit definition: Teos, jossa henkilö on vastuussa asiantuntijapalveluiden tarjoamisesta ja suositusten antamisesta teoksen tekijälle.
label: er konsulent for (person) @no
definition: Relaterer en person til et verk som involverer et ansvar for en person i form av å levere konsulenttjenester og ofte gi anbefalinger til en skaper av et verk. @no
toolkit label: konsulent for (person) @no
toolkit definition: Et verk som involverer et ansvar for en person i form av å levere konsulenttjenester og ofte gi anbefalinger til en skaper av et verk. @no
label: is consultant-persoon van @nl
definition: Relateert een persoon aan een werk dat met zich meebrengt een verantwoordelijkheid van een persoon voor het leveren van diensten van raadgeving, en vaak het doen van aanbevelingen, aan een maker van een werk. @nl
toolkit label: consultant-persoon van @nl
toolkit definition: Een werk dat met zich meebrengt een verantwoordelijkheid van een persoon voor het leveren van diensten van raadgeving, en vaak het doen van aanbevelingen, aan een maker van een werk. @nl
label: هو شخص استشاري لـ @ar
definition: يربط شخصا بعمل يترتب عليه مسئولية شخص عن تقديم خدمات استشارية، وغالبا ما يقدم مقترحات إلى منشئ عمل. @ar
toolkit label: شخص استشاري @ar
toolkit definition: عمل يترتب عليه مسئولية شخص عن تقديم خدمات استشارية، وغالبا ما يقدم مقترحات إلى منشئ عمل. @ar
label: és persona consultora de @ca
definition: Relaciona una persona amb una obra que implica una responsabilitat d’una persona proporcionant serveis d’assessorament, i que sovint fa recomanacions, a un creador d’una obra. @ca
toolkit label: persona consultora de @ca
toolkit definition: Obra que implica una responsabilitat d’una persona proporcionant serveis d’assessorament, i que sovint fa recomanacions, a un creador d’una obra. @ca
label: er person, som er rådgiver af @da
definition: Relaterer en person til et værk, som involverer en persons ansvar for at yde rådgivning og ofte komme med anbefalinger til et ophav til et værk. @da
toolkit label: person, som er rådgiver af @da
toolkit definition: Værk, som involverer en persons ansvar for at yde rådgivning og ofte komme med anbefalinger til et ophav til et værk. @da
label: konsultant (isik) teoses @et
definition: Seostab isiku teosega, mis sisaldab isiku vastutust konsultatsiooni ja sageli ka soovituste andmise eest teose autorile. @et
toolkit label: konsultant (isik) teoses @et
toolkit definition: Teos, mis sisaldab isiku vastutust konsultatsiooni ja sageli ka soovituste andmise eest teose autorile. @et
label: ist Person als Beraterin/Berater von @de
definition: Setzt eine Person in Beziehung zu einem Werk, bei dem eine Person einer geistigen Schöpferin/einem geistigen Schöpfer eines Werks Beratungsdienste anbietet und Empfehlungen macht. @de
toolkit label: Person als Beraterin/Berater von @de
toolkit definition: Ein Werk, bei dem eine Person einer geistigen Schöpferin/einem geistigen Schöpfer eines Werks Beratungsdienste anbietet und Empfehlungen macht. @de
label: tanácsadó személye a következőnek: @hu
definition: Hozzákapcsol egy személyt egy műhöz, amelyhez hozzátartozik egy személy felelőssége tanácsadó szolgáltatásért és gyakran egy mű létrehozójának tett javaslatokért is. @hu
toolkit label: tanácsadó személye: @hu
toolkit definition: Egy mű, amelyhez hozzátartozik egy személy felelőssége tanácsadó szolgáltatásért és gyakran egy mű létrehozójának tett javaslatokért is. @hu
label: è consulente persona di @it
definition: Correla una persona a un'opera che implica una responsabilità di una persona nel fornire servizi di consulenza e spesso raccomandazioni a un creatore di un'opera. @it
toolkit label: consulente persona di @it
toolkit definition: Opera che implica una responsabilità di una persona nel fornire servizi di consulenza e spesso raccomandazioni a un creatore di un'opera. @it
label: είναι σύμβουλος φυσικό πρόσωπο του @el
toolkit label: σύμβουλος φυσικό πρόσωπο του @el
label: est une personne consultante de @fr
definition: Met une personne en relation avec une œuvre qui comporte une responsabilité de la part d’une personne consistant à fournir des services de consultation et souvent à faire des recommandations à un créateur d’une œuvre. @fr
toolkit label: personne consultante de @fr
toolkit definition: Œuvre qui comporte une responsabilité de la part d’une personne consistant à fournir des services de consultation et souvent à faire des recommandations à un créateur d’une œuvre. @fr
label: ir konsultants (persona) @lv
definition: Sasaista personu ar darbu, kas ietver personas atbildību par konsultāciju pakalpojumu un ieteikumu sniegšanu citam aģentam, kas ir darba radītājs. @lv
toolkit label: ir konsultants (persona) @lv
toolkit definition: Darbs, kas ietver personas atbildību par konsultāciju pakalpojumu un ieteikumu sniegšanu citam aģentam, kas ir darba radītājs. @lv
label: 是……的顾问个人 @zh-hans
definition: 将一个个人与涉及向作品创作者提供咨询服务并经常提供建议的一个行为者的责任的一种作品关联起来。 @zh-hans
toolkit label: ……的顾问个人 @zh-hans
toolkit definition: 涉及向作品创作者提供咨询服务并经常提供建议的一个行为者的责任的一种作品 @zh-hans
label: danışman kişisidir @tr
definition: Bir kişiyi, bir eserin yaratıcısına danışma hizmetleri sağlama ve genellikle tavsiyelerde bulunma sorumluluğunu içeren bir eserle ilişkilendirir. @tr
toolkit label: danışman @tr
toolkit definition: Bir eserin yaratıcısına danışmanlık hizmetleri sağlama ve genellikle tavsiyelerde bulunma konusunda bir kişinin sorumluluğunu içeren bir eser. @tr
has subproperty: P50556

kartografiaan osallinen toimija manifestaatiossa
status: Published
label: is contributor agent of cartography of @en
lexical alias: contributorAgentOfCartographyOf.en
definition: Relates an agent to a manifestation that is an aggregate that embodies an expression of a cartographic work that is created by an agent. @en
toolkit label: contributor agent of cartography of @en
toolkit definition: A manifestation that is an aggregate that embodies an expression of a cartographic work that is created by an agent. @en
type: Property
domain: C10002
sub property of: aggregaattiin osallinen toimija manifestaatiossa
instruction number: 18.5
has element type: 2
alternative label: cartographer (expression) of @en
definition: Liittää toimijan manifestaatioon, joka on aggregaatti, joka sisältää kartografisen teoksen ekspression, jonka toimija on luonut.
toolkit label: kartografiaan osallinen toimija manifestaatiossa
toolkit definition: Manifestaatio, joka on aggregaatti, joka sisältää kartografisen teoksen ekspression, jonka toimija on luonut.
label: er bidragsyter til kartografi for (agent) @no
definition: Relaterer en agent til en manifestasjon som er et aggregat som realiserer et kartografisk verk skapt av en agent. @no
toolkit label: bidragsyter til kartografi for (agent) @no
toolkit definition: En manifestasjon som er et aggregat som realiserer et kartografisk verk skapt av en agent. @no
label: is bijdrager-actor van cartografie van @nl
definition: Relateert een actor aan een manifestatie die een aggregaat is die een expressie van een cartografisch werk verwezenlijkt dat gecreëerd is door een actor. @nl
toolkit label: bijdrager-actor van cartografie van @nl
toolkit definition: Een manifestatie die een aggregaat is die een expressie van een cartografisch werk verwezenlijkt dat gecreëerd is door een actor. @nl
label: هو وكيل مساهم في رسم خرائط لـ @ar
definition: يربط وكيلا بتجسيدة عبارة عن تجميعة تجسد عمل رسم خرائطي أنشأه وكيل. @ar
toolkit label: وكيل مساهم في رسم خرائط @ar
toolkit definition: تجسيدة عبارة عن تجميعة تجسد عملا رسم خرائطي أنشأه وكيل. @ar
label: és agent contribuïdor de cartografia de @ca
definition: Relaciona un agent amb una manifestació que és un agregat que materialitza una expressió d’una obra cartogràfica que és creada per un agent. @ca
toolkit label: agent contribuïdor de cartografia de @ca
toolkit definition: Manifestació que és un agregat que materialitza una expressió d’una obra cartogràfica que és creada per un agent. @ca
label: er agent, som er bidragsyder til kartografi af @da
definition: Relaterer en agent til en manifestation, som er en samling, som rummer et udtryk af et kartografisk værk, som er skabt af en agent. @da
toolkit label: agent, som er bidragsyder til kartografi af @da
toolkit definition: Manifestation, som er en samling, som rummer et udtryk af et kartografisk værk, som er skabt af en agent. @da
label: kaastööline kartograafia alal (tegija) kehastuses @et
definition: Seostab tegija kehastusega, mis on liitum, milles on teostatud tegija loodud kartograafilise teose väljendus. @et
toolkit label: kaastööline kartograafia alal (tegija) kehastuses @et
toolkit definition: Kehastus, mis on liitum, milles on teostatud tegija loodud kartograafilise teose väljendus. @et
label: ist Akteur als Beiträgerin/Beiträger von einer Kartografie von @de
definition: Setzt einen Akteur in Beziehung zu einem Aggregat (Manifestation), das eine Expression eines kartografischen Werks verkörpert, die ein Akteur erstellt hat. @de
toolkit label: Akteur als Beiträgerin/Beiträger von einer Kartografie von @de
toolkit definition: Ein Aggregat (Manifestation), das eine Expression eines kartografischen Werks verkörpert, die ein Akteur erstellt hat. @de
label: közreműködő ágense a következő kartográfiának: @hu
definition: Hozzákapcsol egy ágenst egy aggregátum megjelenési formához, amely egy ágens által létrehozott kartográfiai mű kifejezési formáját testesíti meg. @hu
toolkit label: közreműködő ágense a következő kartográfiának: @hu
toolkit definition: Egy aggregátum megjelenési forma, amely egy ágens által létrehozott kartográfiai mű kifejezési formáját testesíti meg. @hu
label: è contributore agente di cartografia di @it
definition: Correla un agente a una manifestazione che è un aggregato che materializza un'opera cartografica creata da un agente. @it
toolkit label: contributore agente di cartografia di @it
toolkit definition: Manifestazione che è un aggregato che materializza un'opera cartografica creata da un agente. @it
label: είναι συντελεστής φορέας της χαρτογράφησης του @el
toolkit label: συντελεστής φορέας της χαρτογράφησης του @el
label: est un agent contributeur de cartographie de @fr
definition: Met un agent en relation avec une manifestation qui consiste en un agrégat matérialisant une expression d’une œuvre cartographique créée par un agent. @fr
toolkit label: agent contributeur de cartographie de @fr
toolkit definition: Manifestation qui consiste en un agrégat matérialisant une expression d’une œuvre cartographique créée par un agent. @fr
label: ir kartogrāfijas līdzradītās (aģents) @lv
definition: Sasaista aģentu ar manifestāciju, kas ir apkopojums, kas ietver aģenta radītu kartogrāfijas darbu. @lv
toolkit label: ir kartogrāfijas līdzradītās (aģents) @lv
toolkit definition: Manifestācija, kas ir apkopojums, kas ietver aģenta radītu kartogrāfijas darbu. @lv
alternative label: kartantekijä (ekspressio) manifestaatiossa
alternative label: cartographe (expression) de @fr
alternative label: kartograf (udtryk) af @da
alternative label: Kartograf (Expression) von @de
alternative label: cartògraf (expressió) de @ca
alternative label: ……的地图绘制者（内容表达） @zh-hans
label: 是……的地图绘制的贡献者行为者 @zh-hans
definition: 将一个行为者与作为一种合集、把一个行为者所创作的一种地图作品的内容表达具体化的一种载体表现关联起来。 @zh-hans
toolkit label: ……的地图绘制的贡献者行为者 @zh-hans
toolkit definition: 作为一种合集、把一个行为者所创作的一种地图绘制作品的内容表达具体化的一种载体表现 @zh-hans
alternative label: cartógrafo (expresión) de @es
alternative label: térképésze a következőnek (kifejezési forma): @hu
alternative label: kartograf (anlatım) @tr
label: kartografisinin katkıda bulunan temsilcisidir @tr
definition: Bir temsilciyi, temsilci tarafından oluşturulan kartografik bir eserin anlatımını somutlaştıran topluluğun bir gösterimiyle ilişkilendirir. @tr
toolkit label: kartografyaya katkıda bulunan temsilci @tr
toolkit definition: Bir temsilci tarafından oluşturulan bir kartografik eserin anlatımını somutlaştıran topluluk olan bir gösterim. @tr
has subproperty: kartografiaan osallinen yhteistoimija manifestaatiossa
has subproperty: kartografiaan osallinen henkilö manifestaatiossa

koreografiaan osallinen toimija manifestaatiossa
status: Published
label: is contributor agent of choreography of @en
lexical alias: contributorAgentOfChoreographyOf.en
definition: Relates an agent to a manifestation that is an aggregate that embodies an expression of a choreographic work that is created by an agent. @en
toolkit label: contributor agent of choreography of @en
toolkit definition: A manifestation that is an aggregate that embodies an expression of a choreographic work that is created by an agent. @en
type: Property
domain: C10002
sub property of: aggregaattiin osallinen toimija manifestaatiossa
instruction number: 18.5
has element type: 2
definition: Liittää toimijan manifestaatioon, joka on aggregaatti, joka sisältää koreografisen teoksen ekspression, jonka toimija on luonut.
toolkit label: koreografiaan osallinen toimija manifestaatiossa
toolkit definition: Manifestaatio, joka on aggregaatti, joka sisältää koreografisen teoksen ekspression, jonka toimija on luonut.
label: er bidragsyter til koreografi for (agent) @no
definition: Relaterer en agent til en manifestasjon som er et aggregat som realiserer et koreografisk verk skapt av en agent. @no
toolkit label: bidragsyter til koreografi for (agent) @no
toolkit definition: En manifestasjon som er et aggregat som realiserer et koreografisk verk skapt av en agent. @no
label: is bijdrager-actor van choreografie van @nl
definition: Relateert een actor aan een manifestatie die een aggregaat is die een expressie van een choreografisch werk verwezenlijkt dat gecreëerd is door een actor. @nl
toolkit label: bijdrager-actor van choreografie van @nl
toolkit definition: Een manifestatie die een aggregaat is die een expressie van een choreografisch werk verwezenlijkt dat gecreëerd is door een actor. @nl
label: هو وكيل مساهم في رقص لـ @ar
definition: يربط وكيلا بتجسيدة عبارة عن تجميعة تجسد عملا راقص أنشأه وكيل @ar
toolkit label: وكيل مساهم في رقص @ar
toolkit definition: تجسيدة عبارة عن تجميعة تجسد عملا راقصا أنشأه وكيل. @ar
label: és agent contribuïdor de coreografia de @ca
definition: Relaciona un agent amb una manifestació que és un agregat que materialitza una expressió que és una obra coreogràfica que és creada per un agent. @ca
toolkit label: agent contribuïdor de coreografia de @ca
toolkit definition: Manifestació que és un agregat que materialitza una expressió que és una obra coreogràfica que és creada per un agent. @ca
label: er agent, som er bidragsyder til koreografi af @da
definition: Relaterer en agent til en manifestation, som er en samling, som rummer et udtryk af et koreografisk værk, som er skabt af en agent. @da
toolkit label: agent, som er bidragsyder til koreografi af @da
toolkit definition: Manifestation, som er en samling, som rummer et udtryk af et koreografisk værk, som er skabt af en agent. @da
label: kaastööline koreograafia alal (tegija) kehastuses @et
definition: Seostab tegija kehastusega, mis on liitum, milles on teostatud tegija loodud koreograafilise teose väljendus. @et
toolkit label: kaastööline koreograafia alal (tegija) kehastuses @et
toolkit definition: Kehastus, mis on liitum, milles on teostatud tegija loodud koreograafilise teose väljendus. @et
label: ist Akteur als Beiträgerin/Beiträger von einer Choreografie von @de
definition: Setzt einen Akteur in Beziehung zu einem Aggregat (Manifestation), das eine Expression eines choreografischen Werks verkörpert, die ein Akteur erstellt hat. @de
toolkit label: Akteur als Beiträgerin/Beiträger von einer Choreografie von @de
toolkit definition: Ein Aggregat (Manifestation), das eine Expression eines choreografischen Werks verkörpert, die ein Akteur erstellt hat. @de
label: közreműködő ágense a következő koreográfiának:: @hu
definition: Hozzákapcsol egy ágenst egy aggregátum megjelenési formához, amely egy ágens által létrehozott koreografikus mű kifejezési formáját testesíti meg. @hu
toolkit label: közreműködő ágense a következő koreográfiának: @hu
toolkit definition: Egy aggregátum megjelenési forma, amely egy ágens által létrehozott koreografikus mű kifejezési formáját testesíti meg. @hu
label: è contributore agente di coreografia di @it
definition: Correla un agente a una manifestazione che è un aggregato che materializza un'opera coreografica creata da un agente. @it
toolkit label: contributore agente di coreografia di @it
toolkit definition: Manifestazione che è un aggregato che materializza un'opera coreografica creata da un agente. @it
label: είναι συντελεστής φορέας της χορογραφίας του @el
toolkit label: συντελεστής φορέας της χορογραφίας του @el
label: est un agent contributeur de chorégraphie de @fr
definition: Met un agent en relation avec une manifestation qui consiste en un agrégat matérialisant une expression d’une œuvre chorégraphique créée par un agent. @fr
toolkit label: agent contributeur de chorégraphie de @fr
toolkit definition: Manifestation qui consiste en un agrégat matérialisant une expression d’une œuvre chorégraphique créée par un agent. @fr
label: ir heoreogrāfijas līdzradītājs (aģents) @lv
definition: Sasaista aģentu ar manifestāciju, kas ir apkopojums, kas ietver aģenta radītu horeogrāfijas darbu. @lv
toolkit label: ir heoreogrāfijas līdzradītājs (aģents) @lv
toolkit definition: Manifestācija, kas ir apkopojums, kas ietver aģenta radītu horeogrāfijas darbu. @lv
label: 是……的编舞的贡献者行为者 @zh-hans
definition: 将一个行为者与作为一种合集、把一个行为者所创作的一种编舞作品的内容表达具体化的一种载体表现关联起来。 @zh-hans
toolkit label: ……的编舞的贡献者行为者 @zh-hans
toolkit definition: 作为一种合集、把一个行为者所创作的一种编舞作品的内容表达具体化的一种载体表现 @zh-hans
label: koreografisinin katkıda bulunan temsilcisidir @tr
definition: Bir temsilciyi, temsilci tarafından oluşturulan koreografik bir eserin anlatımını somutlaştıran topluluğun bir gösterimiyle ilişkilendirir. @tr
toolkit label: koreografiye katkıda bulunan temsilci @tr
toolkit definition: Bir temsilci tarafından oluşturulan bir koreografik eserin anlatımını somutlaştıran topluluk olan bir gösterim. @tr
has subproperty: koreografiaan osallinen yhteistoimija manifestaatiossa
has subproperty: koreografiaan osallinen henkilö manifestaatiossa
has subproperty: P50464

digitaaliseen sisältöön osallinen toimija manifestaatiossa
status: Published
label: is contributor agent of computer content of @en
lexical alias: contributorAgentOfComputerContentOf.en
definition: Relates an agent to a manifestation that is an aggregate that embodies an expression of computer content created by an agent. @en
toolkit label: contributor agent of computer content of @en
toolkit definition: A manifestation that is an aggregate that embodies an expression of computer content created by an agent. @en
type: Property
domain: C10002
sub property of: aggregaattiin osallinen toimija manifestaatiossa
has element type: 2
definition: Liittää toimijan manifestaatioon, joka on aggregaatti, joka sisältää digitaalisen sisällön ekspression, jonka toimija on luonut.
toolkit label: digitaaliseen sisältöön osallinen toimija manifestaatiossa
toolkit definition: Manifestaatio, joka on aggregaatti, joka sisältää digitaalisen sisällön ekspression, jonka toimija on luonut.
label: er bidragsyter til maskinlesbart innhold for (agent) @no
definition: Relaterer en agent til en manifestasjon som er et aggregat som realiserer maskinlesbart innhold skapt av en agent. @no
toolkit label: bidragsyter til maskinlesbart innhold for (agent) @no
toolkit definition: En manifestasjon som er et aggregat som realiserer maskinlesbart innhold skapt av en agent. @no
label: is bijdrager-actor van computercontent van @nl
definition: Relateert een actor aan een manifestatie die een aggregaat is die een expressie van computercontent verwezenlijkt die is gecreëerd door een actor. @nl
toolkit label: bijdrager-actor van computercontent van @nl
toolkit definition: Een manifestatie die een aggregaat is die een expressie van computercontent verwezenlijkt die is gecreëerd door een actor. @nl
label: هو وكيل مساهم في محتوى حاسوبي لـ @ar
definition: يربط وكيلا بتجسيدة عبارة عن تجميعة تجسد محتوى حاسوبي أنشأه وكيل. @ar
toolkit label: وكيل مساهم في محتوى حاسوبي @ar
toolkit definition: تجسيدة تمثل تجميعة تجسد محتوى حاسوبي أنشأه وكيل. @ar
label: és agent contribuïdor de contingut informàtic de @ca
definition: Relaciona un agent amb una manifestació que és un agregat que materialitza una expressió d’una obra de contingut informàtic creada per un agent. @ca
toolkit label: agent contribuïdor de contingut informàtic de @ca
toolkit definition: Manifestació que és un agregat que materialitza una expressió d’una obra de contingut informàtic creada per un agent. @ca
label: er agent, som er bidragsyder til computerindhold af @da
definition: Relaterer en agent til en manifestation, som er en samling, som rummer et udtryk af computerindhold skabt af en agent. @da
toolkit label: agent, som er bidragsyder til computerindhold af @da
toolkit definition: Manifestation, som er en samling, som rummer et udtryk af computerindhold skabt af en agent. @da
label: digisisu kaastööline (tegija) kehastuses @et
definition: Seostab tegija kehastusega, mis on liitum, milles on teostatud tegija loodud digisisu väljendus. @et
toolkit label: digisisu kaastööline (tegija) kehastuses @et
toolkit definition: Kehastus, mis on liitum, milles on teostatud tegija loodud digisisu väljendus. @et
label: ist Akteur ist Beiträgerin/Beiträger von Computer Content von @de
definition: Setzt einen Akteur in Beziehung zu einem Aggregat (Manifestation), das eine Expression von Computer Content verkörpert, die ein Akteur erstellt hat. @de
toolkit label: Akteur ist Beiträgerin/Beiträger von Computer Content von @de
toolkit definition: Ein Aggregat (Manifestation), das eine Expression von Computer Content verkörpert, die ein Akteur erstellt hat. @de
label: közreműködő ágense a következő számítógépes tartalomnak: @hu
definition: Hozzákapcsol egy ágenst egy aggregátum megjelenési formához, amely egy ágens által létrehozott számítógépes tartalom kifejezési formáját testesíti meg. @hu
toolkit label: közreműködő ágense a következő számítógépes tartalomnak: @hu
toolkit definition: Egy aggregátum megjelenési forma, amely egy ágens által létrehozott számítógépes tartalom kifejezési formáját testesíti meg. @hu
label: è contributore agente di contenuto informatico di @it
definition: Correla un agente a una manifestazione che è un aggregato che materializza contenuto informatico creato da un agente. @it
toolkit label: contributore agente di contenuto informatico di @it
toolkit definition: Manifestazione che è un aggregato che materializza contenuto informatico creato da un agente. @it
label: είναι συντελεστής φορέας του περιεχομένου του υπολογιστή του @el
toolkit label: συντελεστής φορέας του περιεχομένου του υπολογιστή του @el
label: est un agent contributeur de contenu informatique de @fr
definition: Met un agent en relation avec une manifestation qui consiste en un agrégat matérialisant une expression d’un contenu informatique créé par un agent. @fr
toolkit label: agent contributeur de contenu informatique de @fr
toolkit definition: Manifestation qui consiste en un agrégat matérialisant une expression d’un contenu informatique créé par un agent. @fr
label: ir datororientēta satura līdzradītājs (aģents) @lv
definition: Sasaista aģentu ar manifestāciju, kas ir apkopojums, kas ietver aģenta radītu datororientētu saturu. @lv
toolkit label: ir datororientēta satura līdzradītājs (aģents) @lv
toolkit definition: Manifestācija, kas ir apkopojums, kas ietver aģenta radītu datororientētu saturu. @lv
label: 是……的计算机内容贡献者行为者 @zh-hans
definition: 将一个行为者与作为一种合集、把一个行为者所创作的一种计算机内容的内容表达具体化的一种载体表现关联起来。 @zh-hans
toolkit label: ……的计算机内容贡献者行为者 @zh-hans
toolkit definition: 作为一种合集、把一个行为者所创作的一种计算机内容的内容表达具体化的一种载体表现 @zh-hans
label: bilgisayar içeriğinin katkıda bulunan temsilcisidir @tr
definition: Bir temsilciyi, temsilci tarafından oluşturulan bilgisayar içeriğinin anlatımını somutlaştıran bir topluluğun gösterimiyle ilişkilendirir. @tr
toolkit label: bilgisayar içeriğine katkıda bulunan temsilci @tr
toolkit definition: Bir temsilci tarafından oluşturulan bir bilgisayar destekli içeriğin anlatımını somutlaştıran topluluk olan bir gösterim. @tr
has subproperty: digitaaliseen sisältöön osallinen yhteistoimija manifestaatiossa
has subproperty: digitaaliseen sisältöön osallinen henkilö manifestaatiossa
has subproperty: P50485

liikkuvaan kuvaan osallinen toimija manifestaatiossa
status: Published
label: is contributor agent of moving image of @en
lexical alias: contributorAgentOfMovingImageOf.en
definition: Relates an agent to a manifestation that is an aggregate that embodies an expression of a moving image work that is created by an agent. @en
toolkit label: contributor agent of moving image of @en
toolkit definition: A manifestation that is an aggregate that embodies an expression of a moving image work that is created by an agent. @en
type: Property
domain: C10002
sub property of: aggregaattiin osallinen toimija manifestaatiossa
instruction number: 18.5
has element type: 2
definition: Liittää toimijan manifestaatioon, joka on aggregaatti, joka sisältää liikkuvan kuvan teoksen ekspression, jonka toimija on luonut.
toolkit label: liikkuvaan kuvaan osallinen toimija manifestaatiossa
toolkit definition: Manifestaatio, joka on aggregaatti, joka sisältää liikkuvan kuvan teoksen ekspression, jonka toimija on luonut.
label: er bidragsyter til levende bilder for (agent) @no
definition: Relaterer en agent til en manifestasjon som er et aggregat som realiserer et verk med levende bilder skapt av en agent. @no
toolkit label: bidragsyter til levende bilder for (agent) @no
toolkit definition: En manifestasjon som er et aggregat som realiserer et verk med levende bilder skapt av en agent. @no
label: is bijdrager-actor van bewegend beeld van @nl
definition: Relateert een actor aan een manifestatie die een aggregaat is die een expressie van een bewegend beeldwerk verwezenlijkt dat gecreëerd is door een actor. @nl
toolkit label: bijdrager-actor van bewegend beeld van @nl
toolkit definition: Een manifestatie die een aggregaat is die een expressie van een bewegend beeldwerk verwezenlijkt dat gecreëerd is door een actor. @nl
label: هو وكيل مساهم في صور متحركة لـ @ar
definition: يربط وكيلا بتجسيدة عبارة عن تجميعة تجسد عمل صور متحركة أنشأه وكيل. @ar
toolkit label: وكيل مساهم في صور متحركة @ar
toolkit definition: تجسيدة عبارة عن تجميعة تجسد عمل صور متحركة أنشأه وكيل. @ar
label: és agent contribuïdor d’imatge en moviment de @ca
definition: Relaciona un agent amb una manifestació que és un agregat que materialitza una expressió d’una obra d’imatge en moviment que és creada per un agent. @ca
toolkit label: agent contribuïdor d’imatge en moviment de @ca
toolkit definition: Manifestació que és un agregat que materialitza una expressió d’una obra d’imatge en moviment que és creada per un agent. @ca
label: er agent, som er bidragsyder til levende billede af @da
definition: Relaterer en agent til en manifestation, som er en samling, som rummer et udtryk af et værk med levende billeder, som er skabt af en agent. @da
toolkit label: agent, som er bidragsyder til levende billede af @da
toolkit definition: Manifestation, som er en samling, som rummer et udtryk af et værk med levende billeder, som er skabt af en agent. @da
label: kaastööline liikuva pildi alal (tegija) kehastuses @et
definition: Seostab tegija kehastusega, mis on liitum, milles on teostatud tegija loodud liikuvast pildist koosneva teose väljendus. @et
toolkit label: kaastööline liikuva pildi alal (tegija) kehastuses @et
toolkit definition: Kehastus, mis on liitum, milles on teostatud tegija loodud liikuvast pildist koosneva teose väljendus. @et
label: ist Akteur als Beiträgerin/Beiträger von einem Bewegtbild von @de
definition: Setzt einen Akteur in Beziehung zu einem Aggregat (Manifestation), das eine Expression eines Bewegtbildwerks verkörpert, die ein Akteur erstellt hat. @de
toolkit label: Akteur als Beiträgerin/Beiträger von einem Bewegtbild von @de
toolkit definition: Ein Aggregat (Manifestation), das eine Expression eines Bewegtbildwerks verkörpert, die ein Akteur erstellt hat. @de
label: közreműködő ágense a következő mozgóképnek: @hu
definition: Hozzákapcsol egy ágenst egy aggregátum megjelenési formához, amely egy ágens által létrehozott mozgóképmű kifejezési formáját testesíti meg. @hu
toolkit label: közreműködő ágense a következő mozgóképnek: @hu
toolkit definition: Egy aggregátum megjelenési forma, amely egy ágens által létrehozott mozgóképmű kifejezési formáját testesíti meg. @hu
label: è contributore agente di immagine in movimento di @it
definition: Correla un agente a una manifestazione che è un aggregato che materializza un'immagine in movimento creata da un agente. @it
toolkit label: contributore agente di immagine in movimento di @it
toolkit definition: Manifestazione che è un aggregato che materializza un'immagine in movimento creata da un agente. @it
label: είναι συντελεστής φορέας της κινητής εικόνας του @el
toolkit label: συντελεστής φορέας της κινητής εικόνας του @el
label: est un agent contributeur d’images animées de @fr
definition: Met un agent en relation avec une manifestation qui consiste en un agrégat matérialisant une expression d’une œuvre d’images animées créée par un agent. @fr
toolkit label: agent contributeur d’images animées de @fr
toolkit definition: Manifestation qui consiste en un agrégat matérialisant une expression d’une œuvre d’images animées créée par un agent. @fr
label: ir kustīgu attēlu līdzradītājs (aģents) @lv
definition: Sasaista aģentu ar manifestāciju, kas ir apkopojums, kas ietver aģenta radītu kustīga attēla darbu. @lv
toolkit label: ir kustīgu attēlu līdzradītājs (aģents) @lv
toolkit definition: Manifestācija, kas ir apkopojums, kas ietver aģenta radītu kustīga attēla darbu. @lv
label: 是……的动态图像的贡献者行为者 @zh-hans
definition: 将一个行为者与作为一种合集、把一个行为者所创作的一种动态图像作品的内容表达具体化的一种载体表现关联起来。 @zh-hans
toolkit label: ……的动态图像的贡献者行为者 @zh-hans
toolkit definition: 作为一种合集、把一个行为者所创作的一种动态图像作品的内容表达具体化的一种载体表现 @zh-hans
label: hareketli görüntüsünün katkıda bulunan temsilcisidir @tr
definition: Bir temsilciyi, temsilci tarafından oluşturulan hareketli görüntü eserinin anlatımını somutlaştıran topluluğun bir gösterimiyle ilişkilendirir. @tr
toolkit label: hareketli görüntüye katkıda bulunan temsilci @tr
toolkit definition: Bir temsilci tarafından oluşturulan hareketli bir görüntü eserinin anlatımını somutlaştıran topluluk olan bir gösterim. @tr
has subproperty: liikkuvaan kuvaan osallinen yhteistoimija
has subproperty: liikkuvaan kuvaan osallinen henkilö manifestaatiossa
has subproperty: P50474

musiikkiin osallinen toimija manifestaatiossa
status: Published
label: is contributor agent of music of @en
lexical alias: contributorAgentOfMusicOf.en
definition: Relates an agent to a manifestation that is an aggregate that embodies an expression of a musical work that is created by an agent. @en
toolkit label: contributor agent of music of @en
toolkit definition: A manifestation that is an aggregate that embodies an expression of a musical work that is created by an agent. @en
type: Property
domain: C10002
sub property of: aggregaattiin osallinen toimija manifestaatiossa
instruction number: 18.5
has element type: 2
alternative label: composer (expression) of @en
definition: Liittää toimijan manifestaatioon, joka on aggregaatti, joka sisältää musiikkiteoksen ekspression, jonka toimija on luonut.
toolkit label: musiikkiin osallinen toimija manifestaatiossa
toolkit definition: Manifestaatio, joka on aggregaatti, joka sisältää musiikkiteoksen ekspression, jonka toimija on luonut.
label: er har bidragsyter til musikk for (agent) @no
definition: Relaterer en agent til en manifestasjon som er et aggregat som realiserer et musikalsk verk skapt av en agent. @no
toolkit label: har bidragsyter til musikk for (agent) @no
toolkit definition: En manifestasjon som er et aggregat som realiserer et musikalsk verk skapt av en agent. @no
label: is bijdrager-actor van muziek van @nl
definition: Relateert een actor aan een manifestatie die een aggregaat is die een expressie van een muziekwerk verwezenlijkt die is gecreëerd door een actor. @nl
toolkit label: bijdrager-actor van muziek van @nl
toolkit definition: Een manifestatie die een aggregaat is die een expressie van een muziekwerk verwezenlijkt die is gecreëerd door een actor. @nl
label: هو وكيل مساهم في موسيقى لـ @ar
definition: يربط وكيلا بتجسيدة عبارة عن تجميعة تجسد عملًا موسيقيًا ألفه وكيل. @ar
toolkit label: وكيل مساهم في موسيقى @ar
toolkit definition: تجسيدة عبارة عن تجميعة تجسد عملًا موسيقيًا ألفه الوكيل. @ar
label: és agent contribuïdor de música de @ca
definition: Relaciona un agent amb una manifestació que és un agregat que materialitza una expressió d’una obra musical que és creada per un agent. @ca
toolkit label: agent contribuïdor de música de @ca
toolkit definition: Manifestació que és un agregat que materialitza una expressió d’una obra musical que és creada per un agent. @ca
label: er agent, som er bidragsyder til musik af @da
definition: Relaterer en agent til en manifestation, som er en samling, som rummer et udtryk af et musikværk, som er skabt af en agent. @da
toolkit label: agent, som er bidragsyder til musik af @da
toolkit definition: Manifestation, som er en samling, som rummer et udtryk af et musikværk, som er skabt af en agent. @da
label: muusikaline kaastööline (tegija) kehastuses @et
definition: Seostab tegija kehastusega, mis on liitum, milles on teostatud tegija loodud muusikateose väljendus. @et
toolkit label: muusikaline kaastööline (tegija) kehastuses @et
toolkit definition: Kehastus, mis on liitum, milles on teostatud tegija loodud muusikateose väljendus. @et
label: ist Akteur als Beiträgerin/Beiträger einer Musik von @de
definition: Setzt einen Akteur in Beziehung zu einem Aggregat (Manifestation), das eine Expression eines Musikwerks verkörpert, die ein Akteur erstellt hat. @de
toolkit label: Akteur als Beiträgerin/Beiträger einer Musik von @de
toolkit definition: Ein Aggregat (Manifestation), das eine Expression eines Musikwerks verkörpert, die ein Akteur erstellt hat. @de
label: közreműködő ágense a következő zenének: @hu
definition: Hozzákapcsol egy ágenst egy aggregátum megjelenési formához, amely egy ágens által létrehozott zenemű kifejezési formáját testesíti meg. @hu
toolkit label: közreműködő ágense a következő zenének: @hu
toolkit definition: Egy aggregátum megjelenési forma, amely egy ágens által létrehozott zenemű kifejezési formáját testesíti meg. @hu
label: è contributore agente di musica di @it
definition: Correla un agente a una manifestazione che è un aggregato che materializza un'opera musicale creata da un agente. @it
toolkit label: contributore agente di musica di @it
toolkit definition: Manifestazione che è un aggregato che materializza un'opera musicale creata da un agente. @it
label: είναι συντελεστής φορέας της μουσικής του @el
toolkit label: συντελεστής φορέας της μουσικής του @el
label: est un agent contributeur de musique de @fr
definition: Met un agent en relation avec une manifestation qui consiste en un agrégat matérialisant une expression d’une œuvre musicale créée par un agent. @fr
toolkit label: agent contributeur de musique de @fr
toolkit definition: Manifestation qui consiste en un agrégat matérialisant une expression d’une œuvre musicale créée par un agent. @fr
label: ir mūzikas līdzradītājs (aģents) @lv
definition: Sasaista aģentu ar manifestāciju, kas ir apkopojums, kas ietver aģenta radītu mūzikas darbu. @lv
toolkit label: ir mūzikas līdzradītājs (aģents) @lv
toolkit definition: Manifestācija, kas ir apkopojums, kas ietver aģenta radītu mūzikas darbu. @lv
alternative label: säveltäjä (ekspressio) manifestaatiossa
alternative label: compositeur (expression) de @fr
alternative label: komponist (udtryk) af @da
alternative label: Komponistin/Komponist (Expression) von @de
alternative label: compositor (expressió) de @ca
alternative label: ……的作曲者（内容表达） @zh-hans
label: 是……的音乐的贡献者行为者 @zh-hans
definition: 将一个行为者与作为一种合集、把一个行为者所创作的一种音乐作品的内容表达具体化的一种载体表现关联起来。 @zh-hans
toolkit label: ……的音乐的贡献者行为者 @zh-hans
toolkit definition: 作为一种合集、把一个行为者所创作的一种音乐作品的内容表达具体化的一种载体表现 @zh-hans
alternative label: compositor (expresión) de @es
alternative label: zeneszerzője a következőnek (kifejezési forma): @hu
alternative label: besteci (anlatım) @tr
label: müziğinin katkıda bulunan temsilcisidir @tr
definition: Bir temsilciyi, bir temsilci tarafından oluşturulan bir müzik eserinin anlatımını somutlaştıran bir topluluğun gösterimiyle ilişkilendirir. @tr
toolkit label: müzi̇ğe katkıda bulunan temsi̇lci̇ @tr
toolkit definition: Bir temsilci tarafından oluşturulan bir müzik eserinin anlatımını somutlaştıran topluluk olan bir gösterim. @tr
has subproperty: musiikkiin osallinen yhteistoimija manifestaatiossa
has subproperty: musiikkiin osallinen henkilö manifestaatiossa

esineeseen osallinen toimija manifestaatiossa
status: Published
label: is contributor agent of object of @en
lexical alias: contributorAgentOfObjectOf.en
definition: Relates an agent to a manifestation that is an aggregate that embodies an expression of an object work that is created by an agent. @en
toolkit label: contributor agent of object of @en
toolkit definition: A manifestation that is an aggregate that embodies an expression of an object work that is created by an agent. @en
type: Property
domain: C10002
sub property of: aggregaattiin osallinen toimija manifestaatiossa
has element type: 2
definition: Liittää toimijan manifestaatioon, joka on aggregaatti, joka sisältää esineteoksen ekspression, jonka toimija on luonut.
toolkit label: esineeseen osallinen toimija manifestaatiossa
toolkit definition: Manifestaatio, joka on aggregaatti, joka sisältää esineteoksen ekspression, jonka toimija on luonut.
label: er bidragsyter til objekt for (agent) @no
definition: Relaterer en agent til en manifestasjon som er et aggregat som realiserer et verk bestående av et objekt skapt av en agent. @no
toolkit label: bidragsyter til objekt for (agent) @no
toolkit definition: En manifestasjon som er et aggregat som realiserer et verk bestående av et objekt skapt av en agent. @no
label: is bijdrager-actor van object van @nl
definition: Relateert een actor aan een manifestatie die een aggregaat is die een expressie van een objectwerk verwezenlijkt dat is gecreëerd door een actor. @nl
toolkit label: bijdrager-actor van object van @nl
toolkit definition: Een manifestatie die een aggregaat is die een expressie van een objectwerk verwezenlijkt dat is gecreëerd door een actor. @nl
label: هو وكيل مساهم في كيان لـ @ar
definition: يربط وكيلا بتجسيدة عبارة عن تجميعة تجسد عملا كائنا أنشأه وكيل. @ar
toolkit label: وكيل مساهم في كيان @ar
toolkit definition: تجسيدة تمثل تجميعة تجسد عملا كائنا أنشأه وكيل. @ar
label: és agent contribuïdor d’objecte de @ca
definition: Relaciona un agent amb una manifestació que és un agregat que materialitza una expressió d’una obra d’objecte que és creada per un agent. @ca
toolkit label: agent contribuïdor d’objecte de @ca
toolkit definition: Manifestació que és un agregat que materialitza una expressió d’una obra d’objecte que és creada per un agent. @ca
label: er agent, som er bidragsyder til objekt af @da
definition: Relaterer en agent til en manifestation, som er en samling, som rummer et udtryk af et værk med objekt, som er skabt af en agent. @da
toolkit label: agent, som er bidragsyder til objekt af @da
toolkit definition: Manifestation, som er en samling, som rummer et udtryk af et værk med objekt, som er skabt af en agent. @da
label: objektiloome kaastööline (tegija) kehastuses @et
definition: Seostab tegija kehastusega, mis on liitum, milles on teostatud tegija loodud objektteose väljendus. @et
toolkit label: objektiloome kaastööline (tegija) kehastuses @et
toolkit definition: Kehastus, mis on liitum, milles on teostatud tegija loodud objektteose väljendus. @et
label: ist Akteur als Beiträgerin/Beiträger von einem Gegenstand von @de
definition: Setzt einen Akteur in Beziehung zu einem Aggregat (Manifestation), das eine Expression eines gegenständlichen Werks verkörpert, die ein Akteur erstellt hat. @de
toolkit label: Akteur als Beiträgerin/Beiträger von einem Gegenstand von @de
toolkit definition: Ein Aggregat (Manifestation), das eine Expression eines gegenständlichen Werks verkörpert, die ein Akteur erstellt hat. @de
label: közreműködő ágense a következő objektumnak: @hu
definition: Hozzákapcsol egy ágenst egy aggregátum megjelenési formához, amely egy ágens által létrehozott objektummű kifejezési formáját testesíti meg. @hu
toolkit label: közreműködő ágense a következő objektumnak: @hu
toolkit definition: Egy aggregátum megjelenési forma, amely egy ágens által létrehozott objektummű kifejezési formáját testesíti meg. @hu
label: è contributore agente di oggetto di @it
definition: Correla un agente a una manifestazione che è un aggregato che materializza un oggetto creato da un agente. @it
toolkit label: contributore agente di oggetto di @it
toolkit definition: Manifestazione che è un aggregato che materializza un oggetto creato da un agente. @it
label: είναι συντελεστής φορέας του αντικειμένου του @el
toolkit label: συντελεστής φορέας του αντικειμένου του @el
label: est un agent contributeur d’objet de @fr
definition: Met un agent en relation avec une manifestation qui consiste en un agrégat matérialisant une expression d’une œuvre objet créée par un agent. @fr
toolkit label: agent contributeur d’objet de @fr
toolkit definition: Manifestation qui consiste en un agrégat matérialisant une expression d’une œuvre objet créée par un agent. @fr
label: ir objekta līdzradītājs (aģents) @lv
definition: Sasaista aģentu ar manifestāciju, kas ir apkopojums, kas ietver aģenta radītu objekta darbu. @lv
toolkit label: ir objekta līdzradītājs (aģents) @lv
toolkit definition: Manifestācija, kas ir apkopojums, kas ietver aģenta radītu objekta darbu. @lv
label: 是……的物体的贡献者行为者 @zh-hans
definition: 将一个行为者与作为一种合集、把一个行为者所创作的一种物体作品的内容表达具体化的一种载体表现关联起来。 @zh-hans
toolkit label: ……的物体的贡献者行为者 @zh-hans
toolkit definition: 作为一种合集、把一个行为者所创作的一种物体作品的内容表达具体化的一种载体表现 @zh-hans
label: nesnesinin katkıda bulunan temsilcisidir @tr
definition: Bir temsilciyi, temsilci tarafından oluşturulan bir nesne eserinin anlatımını somutlaştıran bir topluluğunun gösterimiyle ilişkilendirir. @tr
toolkit label: nesneye katkıda bulunan temsilci @tr
toolkit definition: Bir temsilci tarafından oluşturulan bir nesne eserinin anlatımını somutlaştıran topluluk olan bir gösterim. @tr
has subproperty: esineeseen osallinen yhteistoimija manifestaatiossa
has subproperty: esineeseen osallinen henkilö manifestaatiossa
has subproperty: P50484

puheeseen osallinen toimija manifestaatiossa
status: Published
label: is contributor agent of speech of @en
lexical alias: contributorAgentOfSpeechOf.en
definition: Relates an agent to a manifestation that is an aggregate that embodies an expression of a vocal work that is created by an agent. @en
toolkit label: contributor agent of speech of @en
toolkit definition: A manifestation that is an aggregate that embodies an expression of a vocal work that is created by an agent. @en
type: Property
domain: C10002
sub property of: aggregaattiin osallinen toimija manifestaatiossa
has element type: 2
definition: Liittää toimijan manifestaatioon, joka on aggregaatti, joka sisältää puheteoksen ekspression, jonka toimija on luonut.
toolkit label: puheeseen osallinen toimija manifestaatiossa
toolkit definition: Manifestaatio, joka on aggregaatti, joka sisältää puheteoksen ekspression, jonka toimija on luonut.
label: er bidragsyter til tale for (agent) @no
definition: Relaterer en agent til en manifestasjon som er et aggregat som realiserer et verk bestående av tale skapt av en agent. @no
toolkit label: bidragsyter til tale for (agent) @no
toolkit definition: En manifestasjon som er et aggregat som realiserer et verk bestående av tale skapt av en agent. @no
label: is bijdrager-actor van spraak van @nl
definition: Relateert een actor aan een manifestatie die een aggregaat is die een expressie van een vocaal werk verwezenlijkt dat is gecreëerd door een actor. @nl
toolkit label: bijdrager-actor van spraak van @nl
toolkit definition: Een manifestatie die een aggregaat is die een expressie van een vocaal werk verwezenlijkt dat is gecreëerd door een actor. @nl
label: هو وكيل مساهم في حديث لـ @ar
definition: يربط وكيلا بتجسيدة عبارة عن تجميعة تجسد عملا بكلمات منطوقة أنشأه وكيل. @ar
toolkit label: وكيل مساهم في حديث @ar
toolkit definition: تجسيدة تمثل تجميعة تجسد عملا بكلمات منطوقة أنشأه وكيل. @ar
label: és agent contribuïdor de discurs de @ca
definition: Relaciona un agent amb una manifestació que és un agregat que materialitza una expressió d’una obra vocal que és creada per un agent. @ca
toolkit label: agent contribuïdor de discurs de @ca
toolkit definition: Manifestació que és un agregat que materialitza una expressió d’una obra vocal que és creada per un agent. @ca
label: er agent, som er bidragsyder til tale af @da
definition: Relaterer en agent til en manifestation, som er en samling, som rummer et udtryk af et værk med talte ord, som er skabt af en agent. @da
toolkit label: agent, som er bidragsyder til tale af @da
toolkit definition: Manifestation, som er en samling, som rummer et udtryk af et værk med talte ord, som er skabt af en agent. @da
label: kõneloome kaastööline (tegija) kehastuses @et
definition: Seostab tegija kehastusega, mis on liitum, milles on teostatud tegija loodud suulise teose väljendus. @et
toolkit label: kõneloome kaastööline (tegija) kehastuses @et
toolkit definition: Kehastus, mis on liitum, milles on teostatud tegija loodud suulise teose väljendus. @et
label: ist Akteur als Beiträgerin/Beiträger einer Rede von @de
definition: Setzt einen Akteur in Beziehung zu einem Aggregat (Manifestation), das eine Expression eines gesprochenen Werks verkörpert, die ein Akteur erstellt hat. @de
toolkit label: Akteur als Beiträgerin/Beiträger einer Rede von @de
toolkit definition: Ein Aggregat (Manifestation), das eine Expression eines gesprochenen Werks verkörpert, die ein Akteur erstellt hat. @de
label: közreműködő ágense a következő beszédnek: @hu
definition: Hozzákapcsol egy ágenst egy aggregátum megjelenési formához, amely egy ágens által létrehozott beszédmű kifejezési formáját testesíti meg. @hu
toolkit label: közreműködő ágense a következő beszédnek: @hu
toolkit definition: Egy aggregátum megjelenési forma, amely egy ágens által létrehozott beszédmű kifejezési formáját testesíti meg. @hu
label: è contributore agente di discorso di @it
definition: Correla un agente a una manifestazione che è un aggregato che materializza un'opera orale creata da un agente. @it
toolkit label: contributore agente di discorso di @it
toolkit definition: Manifestazione che è un aggregato che materializza un'opera orale creata da un agente. @it
label: είναι συντελεστής φορέας της ομιλίας του @el
toolkit label: συντελεστής φορέας της ομιλίας του @el
label: est un agent contributeur de contenu vocal de @fr
definition: Met un agent en relation avec une manifestation qui consiste en un agrégat matérialisant une expression d’une œuvre vocale créée par un agent. @fr
toolkit label: agent contributeur de contenu vocal de @fr
toolkit definition: Manifestation qui consiste en un agrégat matérialisant une expression d’une œuvre vocale créée par un agent. @fr
label: ir runas līdzradītājs (aģents) @lv
definition: Sasaista aģentu ar manifestāciju, kas ir apkopojums, kas ietver aģenta radītu mutvārdu darbu. @lv
toolkit label: ir runas līdzradītājs (aģents) @lv
toolkit definition: Manifestācija, kas ir apkopojums, kas ietver aģenta radītu mutvārdu darbu. @lv
label: 是……的讲话的贡献者行为者 @zh-hans
definition: 将一个行为者与作为一种合集、把一个行为者所创作的一种人声作品的内容表达具体化的一种载体表现关联起来。 @zh-hans
toolkit label: ……的讲话的贡献者行为者 @zh-hans
toolkit definition: 作为一种合集、把一个行为者所创作的一种人声作品的内容表达具体化的一种载体表现 @zh-hans
label: konuşmasının katkıda nulunan temsilcisidir @tr
definition: Bir temsilciyi, temsilci tarafından oluşturulan sesli bir eserin anlatımını somutlaştıran bir topluluğun gösterimiyle ilişkilendirir. @tr
toolkit label: konuşmaya katkıda bulunan temsilci @tr
toolkit definition: Bir temsilci tarafından oluşturulan bir vokal eserin anlatımını somutlaştıran topluluk olan bir gösterim. @tr
has subproperty: puheeseen osallinen yhteistoimija manifestaatiossa
has subproperty: puheeseen osallinen henkilö manifestaatiossa
has subproperty: P50483

stillkuvaan osallinen toimija manifestaatiossa
status: Published
label: is contributor agent of still image of @en
lexical alias: contributorAgentOfStillImageOf.en
definition: Relates an agent to a manifestation that is an aggregate that embodies an expression of a still image work that is created by an agent. @en
toolkit label: contributor agent of still image of @en
toolkit definition: A manifestation that is an aggregate that embodies an expression of a still image work that is created by an agent. @en
type: Property
domain: C10002
sub property of: aggregaattiin osallinen toimija manifestaatiossa
instruction number: 18.5
has element type: 2
alternative label: illustrator of @en
alternative label: photographer (expression) of @en
definition: Liittää toimijan manifestaatioon, joka on aggregaatti, joka sisältää stillkuvateoksen ekspression, jonka toimija on luonut.
toolkit label: stillkuvaan osallinen toimija manifestaatiossa
toolkit definition: Manifestaatio, joka on aggregaatti, joka sisältää stillkuvateoksen ekspression, jonka toimija on luonut.
label: er bidragsyter til bilde for (agent) @no
definition: Relaterer en agent til en manifestasjon som er et aggregat som realiserer et blideverk skapt av en agent. @no
alternative label: illustratør av @no
toolkit label: bidragsyter til bilde for (agent) @no
toolkit definition: En manifestasjon som er et aggregat som realiserer et blideverk skapt av en agent. @no
label: is bijdrager-actor van stilstaand beeld van @nl
definition: Relateert een actor aan een manifestatie die een aggregaat is die een expressie van een stilstaand beeldwerk verwezenlijkt dat gecreëerd is door een actor. @nl
toolkit label: bijdrager-actor van stilstaand beeld van @nl
toolkit definition: Een manifestatie die een aggregaat is die een expressie van een stilstaand beeldwerk verwezenlijkt dat gecreëerd is door een actor. @nl
label: هو وكيل مساهم في صور ثابتة لـ @ar
definition: يربط وكيلا بتجسيدة عبارة عن تجميعة تجسد تجسد عملا بصور ثابتة أنشأه وكيل. @ar
alternative label: رسام صور إيضاحية لـ @ar
toolkit label: وكيل مساهم في صور ثابتة @ar
toolkit definition: تجسيدة عبارة عن تجميعة تجسد عملا اصور ثابتة أنشأه وكيل. @ar
label: és agent contribuïdor d’imatge fixa de @ca
definition: Relaciona un agent amb una manifestació que és un agregat que materialitza una obra d’imatge fixa creada per un agent. @ca
toolkit label: agent contribuïdor d’imatge fixa de @ca
toolkit definition: Manifestació que és un agregat que materialitza una obra d’imatge fixa creada per un agent. @ca
label: er agent, som er bidragsyder til stillbillede af @da
definition: Relaterer en agent til en manifestation, som er en samling, som rummer et udtryk af et værk med stillbilleder, som er skabt af en agent. @da
alternative label: fotograf (udtryk) af @da
toolkit label: agent, som er bidragsyder til stillbillede af @da
toolkit definition: Manifestation, som er en samling, som rummer et udtryk af et værk med stillbilleder, som er skabt af en agent. @da
label: kaastööline liikumatu pildi alal (tegija) kehastuses @et
definition: Seostab tegija kehastusega, mis on liitum, milles on teostatud tegija loodud liikumatust pildist koosneva teose väljendus. @et
alternative label: illustreerija kehastuses @et
toolkit label: kaastööline liikumatu pildi alal (tegija) kehastuses @et
toolkit definition: Kehastus, mis on liitum, milles on teostatud tegija loodud liikumatust pildist koosneva teose väljendus. @et
label: ist Akteur als Illustratorin/Illustrator von @de
definition: Setzt einen Akteur in Beziehung zu einem Aggregat (Manifestation), das eine Expression eines unbewegten Bildwerks verkörpert, die ein Akteur erstellt hat. @de
toolkit label: Akteur als Illustratorin/Illustrator von @de
toolkit definition: Ein Aggregat (Manifestation), das eine Expression eines unbewegten Bildwerks verkörpert, die ein Akteur erstellt hat. @de
label: közreműködő ágense a következő állóképnek: @hu
definition: Hozzákapcsol egy ágenst egy aggregátum megjelenési formához, amely egy ágens által létrehozott állóképmű kifejezési formáját testesíti meg. @hu
toolkit label: közreműködő ágense a következő állóképnek: @hu
toolkit definition: Egy aggregátum megjelenési forma, amely egy ágens által létrehozott állóképmű kifejezési formáját testesíti meg. @hu
label: è contributore agente di immagine fissa di @it
definition: Correla un agente a una manifestazione che è un aggregato che materializza un'immagine fissa creata da un agente. @it
alternative label: illustratore di @it
toolkit label: contributore agente di immagine fissa di @it
toolkit definition: Manifestazione che è un aggregato che materializza un'immagine fissa creata da un agente. @it
label: είναι συντελεστής φορέας της σταθερής εικόνας του @el
alternative label: εικονογράφος του @el
toolkit label: συντελεστής φορέας της σταθερής εικόνας του @el
label: est un agent contributeur d’image fixe de @fr
definition: Met un agent en relation avec une manifestation qui consiste en un agrégat matérialisant une expression d’une œuvre d’image fixe créée par un agent. @fr
toolkit label: agent contributeur d’image fixe de @fr
toolkit definition: Manifestation qui consiste en un agrégat matérialisant une expression d’une œuvre d’image fixe créée par un agent. @fr
label: ir attēla līdzradītājs (aģents) @lv
definition: Sasaista aģentu ar manifestāciju, kas ir apkopojums, kas ietver aģenta radītu attēla darbu. @lv
toolkit label: ir attēla līdzradītājs (aģents) @lv
toolkit definition: Manifestācija, kas ir apkopojums, kas ietver aģenta radītu attēla darbu. @lv
alternative label: Fotograf (Expression) von @de
label: 是……的静态图像的贡献者行为者 @zh-hans
definition: 将一个行为者与作为一种合集、把一个行为者所创作的一种静态图像作品的内容表达具体化的一种载体表现关联起来。 @zh-hans
toolkit label: ……的静态图像的贡献者行为者 @zh-hans
toolkit definition: 作为一种合集、把一个行为者所创作的一种静态图像作品的内容表达具体化的一种载体表现 @zh-hans
alternative label: ilustrador de @es
alternative label: fotógrafo (expresión) de @es
alternative label: ……的插图者 @zh-hans
toolkit label: hareketsiz görüntüye katkıda bulunan temsilci @tr
toolkit definition: Bir temsilci tarafından oluşturulan hareketsiz bir görüntü eserinin anlatımını somutlaştıran topluluk olan bir gösterim. @tr
has subproperty: stillkuvaan osallinen yhteistoimija manifestaatiossa
has subproperty: stillkuvaan osallinen henkilö manifestaatiossa

tekstiin osallinen toimija manifestaatiossa
status: Published
label: is contributor agent of text of @en
lexical alias: contributorAgentOfTextOf.en
definition: Relates an agent to a manifestation that is an aggregate that embodies an expression of a textual work that is created by an agent. @en
alternative label: writer of supplementary textual content of @en
alternative label: writer of postface of @en
toolkit label: contributor agent of text of @en
toolkit definition: A manifestation that is an aggregate that embodies an expression of a textual work that is created by an agent. @en
type: Property
domain: C10002
sub property of: aggregaattiin osallinen toimija manifestaatiossa
has element type: 2
alternative label: writer of added text of @en
alternative label: writer of preface of @en
alternative label: writer of added commentary of @en
alternative label: writer of introduction of @en
alternative label: writer of added lyrics of @en
alternative label: writer of afterword of @en
alternative label: writer of foreword of @en
definition: Liittää toimijan manifestaatioon, joka on aggregaatti, joka sisältää tekstiteoksen ekspression, jonka toimija on luonut.
toolkit label: tekstiin osallinen toimija manifestaatiossa
toolkit definition: Manifestaatio, joka on aggregaatti, joka sisältää tekstiteoksen ekspression, jonka toimija on luonut.
label: er bidragsyter til tekst for (agent) @no
definition: Relaterer en agent til en manifestasjon som er et aggregat som realiserer et tekstlig verk skapt av en agent. @no
alternative label: forfatter av supplerende tekstlig innhold for @no
alternative label: forfatter av epilog for @no
alternative label: forfatter av tilføyd tekst for @no
alternative label: forfatter av prolog for @no
alternative label: forfatter av tilføyde kommentarer for @no
alternative label: forfatter av innledning for @no
alternative label: forfatter av tilføyde sangtekster for @no
alternative label: forfatter av etterord for @no
alternative label: forfatter av forord @no
toolkit label: bidragsyter til tekst for (agent) @no
toolkit definition: En manifestasjon som er et aggregat som realiserer et tekstlig verk skapt av en agent. @no
label: is bijdrager-actor van tekst van @nl
definition: Relateert een actor aan een manifestatie die een aggregaat is die een expressie van een tekstwerk verwezenlijkt dat gecreëerd is door een actor. @nl
toolkit label: bijdrager-actor van tekst van @nl
toolkit definition: Een manifestatie die een aggregaat is die een expressie van een tekstwerk verwezenlijkt dat gecreëerd is door een actor. @nl
label: هو وكيل مساهم في نص لـ @ar
definition: يربط وكيلا بتجسيدة عبارة عن تجميعة تجسد عملا نصيا أنشأه وكيل. @ar
alternative label: كاتب توطئة لـ @ar
toolkit label: وكيل مساهم في نص @ar
toolkit definition: تجسيدة تمثل تجميعة تجسد عملا نصيا أنشأه وكيل. @ar
label: és agent contribuïdor de text de @ca
definition: Relaciona un agent amb una manifestació que és un agregat que materialitza una expressió d’una obra textual que és creada per un agent. @ca
toolkit label: agent contribuïdor de text de @ca
toolkit definition: Manifestació que és un agregat que materialitza una expressió d’una obra textual que és creada per un agent. @ca
label: er agent, som er bidragsyder til tekst af @da
definition: Relaterer en agent til en manifestation, som er en samling, som rummer et udtryk af et tekstværk, som er skabt af en agent. @da
alternative label: forfatter af forord til @da
toolkit label: agent, som er bidragsyder til tekst af @da
toolkit definition: Manifestation, som er en samling, som rummer et udtryk af et tekstværk, som er skabt af en agent. @da
label: tekstiloome kaastööline (tegija) kehastuses @et
definition: Seostab tegija kehastusega, mis on liitum, milles on teostatud tegija loodud tekstteose väljendus. @et
alternative label: täiendava tekstsisu autor kehastuses @et
alternative label: järelsõna autor kehastuses @et
alternative label: teksti autor kehastuses @et
alternative label: eessõna autor kehastuses @et
alternative label: kommenteerija kehastuses @et
toolkit label: tekstiloome kaastööline (tegija) kehastuses @et
toolkit definition: Kehastus, mis on liitum, milles on teostatud tegija loodud tekstteose väljendus. @et
toolkit label: Akteur als Beiträgerin/Beiträger von ergänzendem Text von @de
toolkit definition: Ein Aggregat (Manifestation), das eine Expression eines textlichen Werks verkörpert, die ein Akteur erstellt hat. @de
toolkit label: a következő szöveg közreműködő ágense: @hu
toolkit definition: Egy aggregátum megjelenési forma, amely az ágens által létrehozott szöveges művet testesíti meg. @hu
toolkit label: contributore agente di testo di @it
toolkit definition: Manifestazione che è un aggregato che materializza un'opera testuale creata da un agente. @it
toolkit label: συντελεστής φορέας του κειμένου του @el
toolkit label: agent contributeur de texte de @fr
toolkit definition: Manifestation qui consiste en un agrégat matérialisant une expression d’une œuvre textuelle créée par un agent. @fr
toolkit label: ir teksta līdzradītājs (aģents) @lv
toolkit definition: Manifestācija, kas ir apkopojums, kas ietver aģenta radītu teksta darbu. @lv
toolkit label: ……的文本的贡献者行为者 @zh-hans
toolkit definition: 作为一种合集、把一个行为者所创作的一种文字作品的内容表达具体化的一种载体表现 @zh-hans
toolkit label: metne katkıda bulunan temsilci @tr
toolkit definition: Bir temsilci tarafından oluşturulan metinsel bir eserin anlatımını somutlaştıran topluluk olan bir gösterim. @tr
has subproperty: tekstiin osallinen yhteistoimija manifestaatiossa
has subproperty: tekstiin osallinen henkilö manifestaatiossa
has subproperty: P50475

aggregaattiin osallinen toimija manifestaatiossa
status: Published
label: is contributor agent to aggregate of @en
lexical alias: contributorAgentToAggregateOf.en
definition: Relates an agent to a manifestation that is an aggregate that embodies an expression of a work that is created by an agent. @en
toolkit label: contributor agent to aggregate of @en
toolkit definition: A manifestation that is an aggregate that embodies an expression of a work that is created by an agent. @en
type: Property
domain: C10002
sub property of: toimijaan liittyvä manifestaatio
has element type: 2
definition: Liittää toimijan manifestaatioon, joka on aggregaatti, joka sisältää teoksen ekspression, jonka toimija on luonut.
toolkit label: aggregaattiin osallinen toimija manifestaatiossa
toolkit definition: Manifestaatio, joka on aggregaatti, joka sisältää teoksen ekspression, jonka toimija on luonut.
label: er bidragsyter til aggregat for (agent) @no
definition: Relaterer en agent til en manifestasjon som er et aggregat som inkluderer et bidrag fra en agent. @no
toolkit label: bidragsyter til aggregat for (agent) @no
toolkit definition: En manifestasjon som er et aggregat som inkluderer et bidrag fra en agent. @no
label: is bijdrager-actor aan aggregaat van @nl
definition: Relateert een actor aan een manifestatie die een aggregaat is die een expressie van een werk verwezenlijkt dat gecreëerd is door een actor. @nl
toolkit label: bijdrager-actor aan aggregaat van @nl
toolkit definition: Een manifestatie die een aggregaat is die een expressie van een werk verwezenlijkt dat gecreëerd is door een actor. @nl
label: هو وكيل مساهم في تجميعة لـ @ar
definition: يربط وكيلا بتجسيدة عبارة عن تجميعة تتضمن إسهام وكيل. @ar
toolkit label: وكيل مساهم في تجميع @ar
toolkit definition: تجسيدة عبارة عن تجميعة تجسد تعبيرة لعمل أنشأه وكيل. @ar
label: és agent contribuïdor a un agregat de @ca
definition: Relaciona un agent amb una manifestació que és un agregat que materialitza una expressió d’una obra que és creada per un agent. @ca
toolkit label: agent contribuïdor a un agregat de @ca
toolkit definition: Manifestació que és un agregat que materialitza una expressió d’una obra que és creada per un agent. @ca
label: er agent, som er bidragsyder til samling af @da
definition: Relaterer en agent til en manifestation, som er en samling, som omfatter et udtryk af et værk, der er skabt af en agent. @da
toolkit label: agent, som er bidragsyder til samling af @da
toolkit definition: Manifestation, som er en samling, som omfatter et udtryk af et værk, der er skabt af en agent. @da
label: liitumi kaastööline (tegija) kehastuses @et
definition: Seostab tegija kehastusega, mis on liitum, milles on teostatud tegija loodud teose väljendus. @et
toolkit label: liitumi kaastööline (tegija) kehastuses @et
toolkit definition: Kehastus, mis on liitum, milles on teostatud tegija loodud teose väljendus. @et
label: ist Akteur als Beiträgerin/Beiträger zu einem Aggregat von @de
definition: Setzt einen Akteur in Beziehung zu einem Aggregat (Manifestation), das eine Expression eines Werks verkörpert, die ein Akteur erstellt hat. @de
toolkit label: Akteur als Beiträgerin/Beiträger zu einem Aggregat von @de
toolkit definition: Ein Aggregat (Manifestation), das eine Expression eines Werks verkörpert, die ein Akteur erstellt hat. @de
label: közreműködő ágense a következő aggregátumnak: @hu
definition: Hozzákapcsol egy ágenst egy aggregátum megjelenési formához, amely egy ágens által létrehozott mű kifejezési formáját testesíti meg. @hu
toolkit label: közreműködő ágense a következő aggregátumnak: @hu
toolkit definition: Egy aggregátum megjelenési forma, amely egy ágens által létrehozott mű kifejezési formáját testesíti meg. @hu
label: è contributore agente di aggregato di @it
definition: Correla un agente a una manifestazione che è un aggregato che comprende un contributo di un agente. @it
toolkit label: contributore agente di aggregato di @it
toolkit definition: Manifestazione che è un aggregato che comprende un contributo di un agente. @it
label: είναι συντελεστής φορέας της συνάθροισης του @el
toolkit label: συντελεστής φορέας της συνάθροισης του @el
label: est un agent contributeur à un agrégat de @fr
definition: Met un agent en relation avec une manifestation qui consiste en un agrégat matérialisant une expression d’une œuvre créée par un agent. @fr
toolkit label: agent contributeur à un agrégat de @fr
toolkit definition: Manifestation qui consiste en un agrégat matérialisant une expression d’une œuvre créée par un agent. @fr
label: ir apkopojuma līdzradītājs (aģents) @lv
definition: Sasaista aģentu ar manifestāciju, kas ir apkopojums, kas ietver aģenta ieguldījumu/līdzdalību. @lv
toolkit label: ir apkopojuma līdzradītājs (aģents) @lv
toolkit definition: Manifestācija, kas ir apkopojums, kas ietver aģenta ieguldījumu/līdzdalību. @lv
label: 是……的合集的贡献者行为者 @zh-hans
definition: 将一个行为者与作为一种合集、把一个行为者所创作的一种作品的内容表达具体化的一种载体表现关联起来。 @zh-hans
toolkit label: ……的合集的贡献者行为者 @zh-hans
toolkit definition: 作为一种合集、把一个行为者所创作的一种作品的内容表达具体化的一种载体表现 @zh-hans
label: toplanmasına katkıda bulunan temsilcidir @tr
definition: Bir temsilciyi, temsilci tarafından oluşturuan bir eserin anlatımını somutlaştıran bir topluluğun gösterimiyle ilişkilendirir. @tr
toolkit label: topluluğa katkıda bulunan temsilci @tr
toolkit definition: Bir temsilci tarafından oluşturulan bir eserin anlatımını somutlaştıran topluluk olan bir gösterim. @tr
has subproperty: kartografiaan osallinen toimija manifestaatiossa
has subproperty: koreografiaan osallinen toimija manifestaatiossa
has subproperty: digitaaliseen sisältöön osallinen toimija manifestaatiossa
has subproperty: liikkuvaan kuvaan osallinen toimija manifestaatiossa
has subproperty: musiikkiin osallinen toimija manifestaatiossa
has subproperty: esineeseen osallinen toimija manifestaatiossa
has subproperty: puheeseen osallinen toimija manifestaatiossa
has subproperty: stillkuvaan osallinen toimija manifestaatiossa
has subproperty: tekstiin osallinen toimija manifestaatiossa
has subproperty: aggregaattiin osallinen yhteistoimija manifestaatiossa
has subproperty: aggregaattiin osallinen henkilö manifestaatiossa
has subproperty: P50476

yhdistymään osallinen toimija ekspressiossa
status: Published
label: is contributor agent to amalgamation of @en
lexical alias: contributorAgentToAmalgamationOf.en
definition: Relates an agent to an expression that includes a contribution by an agent to a seamless mix of kinds of content. @en
toolkit label: contributor agent to amalgamation of @en
toolkit definition: An expression that includes a contribution by an agent to a seamless mix of kinds of content. @en
type: Property
domain: C10002
sub property of: ekspression tekijä (toimija) ekspressiossa
has element type: 2
definition: Liittää toimijan ekspressioon, jossa toimija osallistuu sellaisen ekspression tekemiseen, joka on saumaton yhdistelmä erilaisia sisältöjä.
toolkit label: yhdistymään osallinen toimija ekspressiossa
toolkit definition: Ekspressio, jossa toimija osallistuu sellaisen ekspression tekemiseen, joka on saumaton yhdistelmä erilaisia sisältöjä.
label: er bidragsyter til sammenslutning for (agent) @no
definition: Relaterer en agent til et uttrykk som inkluderer et bidrag fra en agent til en sømløs blanding av forskjellig innhold. @no
toolkit label: bidragsyter til sammenslutning for (agent) @no
toolkit definition: Et uttrykk som inkluderer et bidrag fra en agent til en sømløs blanding av forskjellig innhold. @no
label: is bijdrager-actor aan amalgamering van @nl
definition: Relateert een actor aan een expressie die omvat een bijdrage door een actor aan een naadloze mix van soorten content. @nl
toolkit label: bijdrager-actor aan amalgamering van @nl
toolkit definition: Een expressie die omvat een bijdrage door een actor aan een naadloze mix van soorten content. @nl
label: هو وكيل مساهم في دمج لـ @ar
definition: يربط وكيلا بتعبيرة تتضمن إسهام وكيل في مزج سلس لأنواع من المحتوى. @ar
toolkit label: وكيل مساهم في مزج @ar
toolkit definition: تعبيرة تتضمن إسهام وكيل في مزج سلس لأنواع من المحتوى. @ar
label: és agent contribuïdor a una amalgama de @ca
definition: Relaciona un agent amb una expressió que inclou una contribució d’un agent a una mescla sense continuïtat de classes de contingut. @ca
toolkit label: agent contribuïdor a una amalgama de @ca
toolkit definition: Expressió que inclou una contribució d’un agent a una mescla sense continuïtat de classes de contingut. @ca
label: er agent, som er bidragsyder til sammensmeltning af @da
definition: Relaterer en agent til et udtryk, som omfatter en agents bidrag til en glat kombinering af forskellige slags af indhold. @da
toolkit label: agent, som er bidragsyder til sammensmeltning af @da
toolkit definition: Udtryk, som omfatter en agents bidrag til en glat kombinering af forskellige slags af indhold. @da
label: sulami kaastööline (tegija) väljenduses @et
definition: Seostab tegija väljendusega, millesse tegija on andnud panuse, osaledes eri liiki sisu lahutamatu segu loomisel. @et
toolkit label: sulami kaastööline (tegija) väljenduses @et
toolkit definition: Väljendus, millesse tegija on andnud panuse, osaledes eri liiki sisu lahutamatu segu loomisel. @et
label: Akteur als Beiträgerin/Beiträger zu einer Verschmelzung von @de
definition: Setzt einen Akteur in Beziehung zu einer Expression, bei der ein Akteur zu einer nahtlosen Mischung von Inhalten beiträgt. @de
toolkit label: Akteur als Beiträgerin/Beiträger zu einer Verschmelzung von @de
toolkit definition: Eine Expression, bei der ein Akteur zu einer nahtlosen Mischung von Inhalten beiträgt. @de
label: közreműködő ágense a következő vegyes tartalomnak: @hu
definition: Hozzákapcsol egy ágenst egy kifejezési formához, amely magában foglalja egy ágens közreműködését a tartalom fajtáinak szabad keverésében. @hu
toolkit label: közreműködő ágense a következő vegyes tartalomnak: @hu
toolkit definition: Egy kifejezési forma, amely magában foglalja egy ágens közreműködését a tartalom fajtáinak szabad keverésében. @hu
label: è contributore agente di fusione di @it
definition: Correla un agente a un'espressione che comprende un contributo di un agente a una varietà di tipi di contenuto senza soluzione di continuità. @it
toolkit label: contributore agente di fusione di @it
toolkit definition: Espressione che comprende un contributo di un agente a una varietà di tipi di contenuto senza soluzione di continuità. @it
label: είναι συντελεστής φορέας σε μείξη του (?) @el
toolkit label: συντελεστής φορέας σε μείξη του (?) @el
label: est un agent contributeur à un amalgame de @fr
definition: Met un agent en relation avec une expression qui intègre une contribution de la part d’un agent à un mélange intégré de différents genres de contenu. @fr
toolkit label: agent contributeur à un amalgame de @fr
toolkit definition: Expression qui intègre une contribution de la part d’un agent à un mélange intégré de différents genres de contenu. @fr
label: ir amalgamāta līdzradītājs (aģents) @lv
definition: Sasaista aģentu ar izteiksmi, kas ietver aģenta ieguldījumu dažādu satura veidu vienlaidu sajaukumā. @lv
toolkit label: ir amalgamāta līdzradītājs (aģents) @lv
toolkit definition: Izteiksme, kas ietver aģenta ieguldījumu dažādu satura veidu vienlaidu sajaukumā. @lv
label: 是……的融合体的贡献者行为者 @zh-hans
definition: 将一个行为者与包括将各种内容无缝融合的一个行为者的贡献的一种内容表达关联起来。 @zh-hans
toolkit label: ……的融合体的贡献者行为者 @zh-hans
toolkit definition: 包括将各种内容无缝融合的一个行为者的贡献的一种内容表达 @zh-hans
label: birleşimine katkıda bulunan temsilcidir @tr
definition: Bir temsilciyi, bir temsilcinin içerik türlerinin kesintisiz bir birleşimine yaptığı katkıyı içeren bir anlatımla ilişkilendirir. @tr
toolkit label: birleşmeye katkıda bulunan temsilci @tr
toolkit definition: Farklı türde içeriklerin kusursuz karışımını sağlayan bir temsilcinin katkısını içeren bir anlatım.​ @tr
has subproperty: värittäjä (toimija) ekspressiossa
has subproperty: esitykseen osallinen toimija ekspressiossa
has subproperty: yhdistymään osallinen yhteistoimija ekspressiossa
has subproperty: yhdistymään osallinen henkilö ekspressiossa
has subproperty: tuomioistuimen kirjuri (toimija) ekspressiossa
has subproperty: piirtäjä (toimija) ekspressiossa
has subproperty: toimittaja (toimija) ekspressiossa
has subproperty: tekstaaja (toimija) ekspressiossa
has subproperty: pöytäkirjan laatija (toimija) ekspressiossa
has subproperty: ohjelmistokehittäjä (toimija) ekspressiossa
has subproperty: P50448

esitykseen osallinen toimija ekspressiossa
status: Published
label: is contributor agent to performance of @en
lexical alias: contributorAgentToPerformanceOf.en
definition: Relates an agent to an expression that includes a contribution by an agent to a performance. @en
toolkit label: contributor agent to performance of @en
toolkit definition: An expression that includes a contribution by an agent to a performance. @en
type: Property
domain: C10002
sub property of: yhdistymään osallinen toimija ekspressiossa
has element type: 2
definition: Liittää toimijan ekspressioon, jossa toimija osallistuu sellaisen ekspression tekemiseen, joka on esitys.
toolkit label: esitykseen osallinen toimija ekspressiossa
toolkit definition: Ekspressio, jossa toimija osallistuu sellaisen ekspression tekemiseen, joka on esitys.
label: er bidragsyter til framføring av (agent) @no
definition: Relaterer en agent til et uttrykk som inkluderer et bidrag fra en agent til en framføring. @no
toolkit label: bidragsyter til framføring av (agent) @no
toolkit definition: Et uttrykk som inkluderer et bidrag fra en agent til en framføring. @no
label: is bijdrager-actor aan uitvoering van @nl
definition: Relateert een actor aan een expressie die omvat een bijdrage door een actor aan een uitvoering. @nl
toolkit label: bijdrager-actor aan uitvoering van @nl
toolkit definition: Een expressie die omvat een bijdrage door een actor aan een uitvoering. @nl
label: هو وكيل مساهم في أداء لـ @ar
definition: يربط وكيلا بتعبيرة تتضمن إسهام وكيل في أداء. @ar
toolkit label: وكيل مساهم في أداء @ar
toolkit definition: تعبيرة تتضمن إسهام وكيل في أداء. @ar
label: és agent contribuïdor a una interpretació de @ca
definition: Relaciona un agent amb una expressió que inclou una contribució d’un agent a una interpretació. @ca
toolkit label: agent contribuïdor a una interpretació de @ca
toolkit definition: Expressió que inclou una contribució d’un agent a una interpretació. @ca
label: er agent, som er bidragsyder til optræden af @da
definition: Relaterer en agent til et udtryk, som omfatter en agents bidrag til en optræden. @da
toolkit label: agent, som er bidragsyder til optræden af @da
toolkit definition: Udtryk, som omfatter en agents bidrag til en optræden @da
label: esituse kaastööline (tegija) väljenduses @et
definition: Seostab tegija väljendusega, millesse tegija on andnud panuse, osaledes esituse loomisel. @et
toolkit label: esituse kaastööline (tegija) väljenduses @et
toolkit definition: Väljendus, millesse tegija on andnud panuse, osaledes esituse loomisel. @et
label: ist Akteur als Beiträgerin/Beiträger zu einer Darbietung von @de
definition: Setzt einen Akteur in Beziehung zu einer Expression, bei der ein Akteur zu einer Darbietung beiträgt @de
toolkit label: Akteur als Beiträgerin/Beiträger zu einer Darbietung von @de
toolkit definition: Eine Expression, bei der ein Akteur zu eine Darbietung beiträgt. @de
label: közreműködő ágense a következő előadásnak: @hu
definition: Hozzákapcsol egy ágenst egy kifejezési formához, amely magában foglalja egy ágens közreműködését egy előadásban. @hu
toolkit label: közreműködő ágense a következő előadásnak: @hu
toolkit definition: Egy kifejezési forma, amely magában foglalja egy ágens közreműködését egy előadásban. @hu
label: è contributore agente di esibizione di @it
definition: Correla un agente a un'espressione che comprende un contributo di un agente a un'esibizione. @it
toolkit label: contributore agente di performance di @it
toolkit definition: Espressione che comprende un contributo di un agente a un'esibizione. @it
label: είναι συντελεστής φορέας σε εκτέλεση του @el
toolkit label: συντελεστής φορέας σε εκτέλεση του @el
label: est un agent contributeur à une prestation de @fr
definition: Met un agent en relation avec une expression qui intègre une contribution de la part d’un agent à une prestation. @fr
toolkit label: agent contributeur à une prestation de @fr
toolkit definition: Expression qui intègre une contribution de la part d’un agent à une prestation. @fr
label: ir uzveduma līdzradītājs (aģents) @lv
definition: Sasaista aģentu ar izteiksmi, kas ietver aģenta ieguldījumu uzvedumā. @lv
toolkit label: ir uzveduma līdzradītājs (aģents) @lv
toolkit definition: Izteiksme, kas ietver aģenta ieguldījumu uzvedumā. @lv
label: 是……的表演的贡献者行为者 @zh-hans
definition: 将一个行为者与包括一个行为者对一个表演之贡献的一种内容表达关联起来。 @zh-hans
toolkit label: ……的表演的贡献者行为者 @zh-hans
toolkit definition: 包括一个行为者对一个表演之贡献的一种内容表达 @zh-hans
label: peformansına katkıda bulunan temsilcidir @tr
definition: Bir temsilciyi, bir temcilcinin bir performansa katkısını içeren bir anlatımla ilişkilendirir. @tr
toolkit label: performansa katkıda bulunan temsilci @tr
toolkit definition: Bir temsilcinin bir performansa katkısını içeren bir anlatım. @tr
has subproperty: animaattori (toimija) ekspressiossa
has subproperty: lavastaja (toimija) ekspressiossa
has subproperty: ääniteknikko (toimija) ekspressiossa
has subproperty: esitykseen osallinen yhteistoimija ekspressiossa
has subproperty: esitykseen osallinen henkilö ekspressiossa
has subproperty: puvustaja (toimija) ekspressiossa
has subproperty: DJ (toimija) ekspressiossa
has subproperty: dubbausohjaaja (toimija) ekspressiossa
has subproperty: leikkaaja (toimija) ekspressiossa
has subproperty: ekspression haastateltava (toimija) ekspressiossa
has subproperty: ekspression haastattelija (toimija) ekspressiossa
has subproperty: valosuunnittelija (toimija) ekspressiossa

kartografiaan osallinen yhteistoimija manifestaatiossa
status: Published
label: is contributor collective agent of cartography of @en
lexical alias: contributorCollectiveAgentOfCartographyOf.en
definition: Relates a collective agent to a manifestation that is an aggregate that embodies an expression of a cartographic work that is created by a collective agent. @en
toolkit label: contributor collective agent of cartography of @en
toolkit definition: A manifestation that is an aggregate that embodies an expression of a cartographic work that is created by a collective agent. @en
type: Property
domain: C10011
has element type: 2
sub property of: aggregaattiin osallinen yhteistoimija manifestaatiossa
sub property of: kartografiaan osallinen toimija manifestaatiossa
definition: Liittää yhteistoimijan manifestaatioon, joka on aggregaatti, joka sisältää kartografisen teoksen ekspression, jonka yhteistoimija on luonut.
toolkit label: kartografiaan osallinen yhteistoimija manifestaatiossa
toolkit definition: Manifestaatio, joka on aggregaatti, joka sisältää kartografisen teoksen ekspression, jonka yhteistoimija on luonut.
label: er bidragsyter til kartografi for (kollektiv agent) @no
definition: Relaterer en kollektiv agent til en manifestasjon som er et aggregat som realiserer et kartografisk verk skapt av en kollektiv agent. @no
toolkit label: bidragsyter til kartografi for (kollektiv agent) @no
toolkit definition: En manifestasjon som er et aggregat som realiserer et kartografisk verk skapt av en kollektiv agent. @no
label: is bijdrager-collectieve actor van cartografie van @nl
definition: Relateert een collectieve actor aan een manifestatie die een aggregaat is die een expressie van een cartografisch werk verwezenlijkt dat is gecreëerd door een collectieve actor. @nl
toolkit label: bijdrager-collectieve actor van cartografie van @nl
toolkit definition: Een manifestatie die een aggregaat is die een expressie van een cartografisch werk verwezenlijkt dat is gecreëerd door een collectieve actor. @nl
label: هو وكيل جماعي مساهم في رسم خرائط لـ @ar
definition: يربط وكيلا جماعيا بتجسيدة عبارة عن تجميعة تجسد عملا رسم خرائطي أنشأه وكيل جماعي. @ar
toolkit label: وكيل جماعي مساهم في رسم خرائط @ar
toolkit definition: تجسيدة تمثل تجميعة تجسد عملا رسم خرائطي أنشأه وكيل جماعي. @ar
label: és agent col·lectiu contribuïdor de cartografia de @ca
definition: Relaciona un agent col·lectiu amb una manifestació que és un agregat que materialitza una expressió d’una obra cartogràfica que és creada per un agent col·lectiu. @ca
toolkit label: agent col·lectiu contribuïdor de cartografia de @ca
toolkit definition: Manifestació que és un agregat que materialitza una expressió d’una obra cartogràfica que és creada per un agent col·lectiu. @ca
label: er kollektiv agent, som er bidragsyder til kartografi af @da
definition: Relaterer en kollektiv agent til en manifestation, som er en samling, som rummer et udtryk af et kartografisk værk, som er skabt af en kollektiv agent. @da
toolkit label: kollektiv agent, som er bidragsyder til kartografi af @da
toolkit definition: Manifestation, som er en samling, som rummer et udtryk af et kartografisk værk, som er skabt af en kollektiv agent. @da
label: kaastööline kartograafia alal (kollektiiv) kehastuses @et
definition: Seostab kollektiivi kehastusega, mis on liitum, milles on teostatud kollektiivi loodud kartograafilise teose väljendus. @et
toolkit label: kaastööline kartograafia alal (kollektiiv) kehastuses @et
toolkit definition: Kehastus, mis on liitum, milles on teostatud kollektiivi loodud kartograafilise teose väljendus. @et
label: ist gemeinschaftlicher Akteur als Beiträgerin/Beiträger von einer Kartografie von @de
definition: Setzt einen gemeinschaftlichen Akteur in Beziehung zu einem Aggregat (Manifestation), das eine Expression eines kartografischen Werks verkörpert, die ein gemeinschaftlicher Akteur erstellt hat. @de
toolkit label: Gemeinschaftlicher Akteur als Beiträgerin/Beiträger von einer Kartografie von @de
toolkit definition: Ein Aggregat (Manifestation), das eine Expression eines kartografischen Werks verkörpert, die ein gemeinschaftlicher Akteur erstellt hat. @de
label: közreműködő kollektív ágense a következő kartográfiának: @hu
definition: Hozzákapcsol egy kollektív ágenst egy aggregátum megjelenési formához, amely egy kollektív ágens által létrehozott kartográfiai mű kifejezési formáját testesíti meg. @hu
toolkit label: közreműködő kollektív ágense a következő kartográfiának: @hu
toolkit definition: Egy aggregátum megjelenési forma, amely egy kollektív ágens által létrehozott kartográfiai mű kifejezési formáját testesíti meg. @hu
label: è contributore agente collettivo di cartografia di @it
definition: Correla un agente collettivo a una manifestazione che è un aggregato che materializza un'opera cartografica creata da un agente collettivo. @it
toolkit label: contributore agente collettivo di cartografia di @it
toolkit definition: Manifestazione che è un aggregato che materializza un'opera cartografica creata da un agente collettivo. @it
label: είναι συντελεστής συλλογικός φορέας της χαρτογράφησης του @el
toolkit label: συντελεστής συλλογικός φορέας της χαρτογράφησης του @el
label: est un agent collectif contributeur de cartographie de @fr
definition: Met un agent collectif en relation avec une manifestation qui consiste en un agrégat matérialisant une expression d’une œuvre cartographique créée par un agent collectif. @fr
toolkit label: agent collectif contributeur de cartographie de @fr
toolkit definition: Manifestation qui consiste en un agrégat matérialisant une expression d’une œuvre cartographique créée par un agent collectif. @fr
label: ir kartogrāfijas līdzradītājs (grupa) @lv
definition: Sasaista grupu ar manifestāciju, kas ir apkopojums, kas ietver grupas radītu kartogrāfijas darbu. @lv
toolkit label: ir kartogrāfijas līdzradītājs (grupa) @lv
toolkit definition: Manifestācija, kas ir apkopojums, kas ietver grupas radītu kartogrāfijas darbu. @lv
label: 是……的地图绘制的贡献者集体行为者 @zh-hans
definition: 将一个集体行为者与作为一种合集、把一个集体行为者所创作的一种地图作品的内容表达具体化的一种载体表现关联起来。 @zh-hans
toolkit label: ……的地图绘制的贡献者集体行为者 @zh-hans
toolkit definition: 作为一种合集、把一个集体行为者所创作的一种地图作品的内容表达具体化的一种载体表现 @zh-hans
label: kartografisinin katkıda bulunan kolektif temsilcisidir @tr
definition: Kolektif bir temsilciyi, kolektif bir temsilci tarafından oluşturulan bir kartografik çalışmanın anlatımını somutlaştıran bir gösterimle ilişkilendirir. @tr
toolkit label: kartografyaya katkıda bulunan kolektif temsilci @tr
toolkit definition: Kolektif bir temsilci tarafından oluşturulan bir kartografik eserin anlatımını somutlaştıran topluluk olan bir gösterim. @tr
has subproperty: kartografiaan osallinen yhteisö manifestaatiossa
has subproperty: kartografiaan osallinen suku manifestaatiossa
has subproperty: maanmittari (yhteistoimija) manifestaatiossa
has subproperty: P50662

koreografiaan osallinen yhteistoimija manifestaatiossa
status: Published
label: is contributor collective agent of choreography of @en
lexical alias: contributorCollectiveAgentOfChoreographyOf.en
definition: Relates a collective agent to a manifestation that is an aggregate that embodies an expression of a choreographic work that is created by a collective agent. @en
toolkit label: contributor collective agent of choreography of @en
toolkit definition: A manifestation that is an aggregate that embodies an expression of a choreographic work that is created by a collective agent. @en
type: Property
domain: C10011
has element type: 2
sub property of: aggregaattiin osallinen yhteistoimija manifestaatiossa
sub property of: koreografiaan osallinen toimija manifestaatiossa
definition: Liittää yhteistoimijan manifestaatioon, joka on aggregaatti, joka sisältää koreografisen teoksen ekspression, jonka yhteistoimija on luonut.
toolkit label: koreografiaan osallinen yhteistoimija manifestaatiossa
toolkit definition: Manifestaatio, joka on aggregaatti, joka sisältää koreografisen teoksen ekspression, jonka yhteistoimija on luonut.
label: er bidragsyter til koreografi for (kollektiv agent) @no
definition: Relaterer en kollektiv agent til en manifestasjon som er et aggregat som realiserer et koreografisk verk skapt av en kollektiv agent. @no
toolkit label: bidragsyter til koreografi for (kollektiv agent) @no
toolkit definition: En manifestasjon som er et aggregat som realiserer et koreografisk verk skapt av en kollektiv agent. @no
label: is bijdrager-collectieve actor van choreografie van @nl
definition: Relateert een collectieve actor aan een manifestatie die een aggregaat is die een expressie van een choreografisch werk verwezenlijkt dat is gecreëerd door een collectieve actor. @nl
toolkit label: bijdrager-collectieve actor van choreografie van @nl
toolkit definition: Een manifestatie die een aggregaat is die een expressie van een choreografisch werk verwezenlijkt dat is gecreëerd door een collectieve actor. @nl
label: هو وكيل جماعي مساهم في رقصات لـ @ar
definition: يربط وكيلا جماعيا بتجسيدة عبارة عن تجميعة تجسد عملا راقص أنشأه وكيل جماعي. @ar
toolkit label: وكيل جماعي مساهم في رقصات @ar
toolkit definition: تجسيدة التي هي عبارة عن تجميعة تجسد عملا راقص أبدعه وكيل جماعي. @ar
label: és agent col·lectiu contribuïdor de coreografia de @ca
definition: Relaciona un agent col·lectiu amb una manifestació que és un agregat que materialitza expressió d’una obra coreogràfica que és creada per un agent col·lectiu. @ca
toolkit label: agent col·lectiu contribuïdor de coreografia de @ca
toolkit definition: Manifestació que és un agregat que materialitza expressió d’una obra coreogràfica que és creada per un agent col·lectiu. @ca
label: er kollektiv agent, som er bidragsyder til koreografi af @da
definition: Relaterer en kollektiv agent til en manifestation, som er en samling, som rummer et udtryk af et koreografisk værk, som er skabt af en kollektiv agent. @da
toolkit label: kollektiv agent, som er bidragsyder til koreografi af @da
toolkit definition: Manifestation, som er en samling, som rummer et udtryk af et koreografisk værk, som er skabt af en kollektiv agent. @da
label: kaastööline koreograafia alal (kollektiiv) kehastuses @et
definition: Seostab kollektiivi kehastusega, mis on liitum, milles on teostatud kollektiivi loodud koreograafilise teose väljendus. @et
toolkit label: kaastööline koreograafia alal (kollektiiv) kehastuses @et
toolkit definition: Kehastus, mis on liitum, milles on teostatud kollektiivi loodud koreograafilise teose väljendus. @et
label: ist gemeinschaftlicher Akteur als Beiträgerin/Beiträger von einer Choreografie von @de
definition: Setzt einen gemeinschaftlichen Akteur in Beziehung zu einem Aggregat (Manifestation), das eine Expression eines choreografischen Werks verkörpert, die ein gemeinschaftlicher Akteur erstellt hat. @de
toolkit label: Gemeinschaftlicher Akteur als Beiträgerin/Beiträger von einer Choreografie von @de
toolkit definition: Ein Aggregat (Manifestation), das eine Expression eines choreografischen Werks verkörpert, die ein gemeinschaftlicher Akteur erstellt hat. @de
label: közreműködő kollektív ágense a következő koreográfiának: @hu
definition: Hozzákapcsol egy kollektív ágenst egy aggregátum megjelenési formához, amely egy kollektív ágens által létrehozott koreografikus mű kifejezési formáját testesíti meg. @hu
toolkit label: közreműködő kollektív ágense a következő koreográfiának: @hu
toolkit definition: Egy aggregátum megjelenési forma, amely egy kollektív ágens által létrehozott koreografikus mű kifejezési formáját testesíti meg. @hu
label: è contributore agente collettivo di coreografia di @it
definition: Correla un agente collettivo a una manifestazione che è un aggregato che materializza un'opera coreografica creata da un agente collettivo. @it
toolkit label: contributore agente collettivo di coreografia di @it
toolkit definition: Manifestazione che è un aggregato che materializza un'opera coreografica creata da un agente collettivo. @it
label: είναι συντελεστής συλλογικός φορέας της χορογραφίας του @el
toolkit label: συντελεστής συλλογικός φορέας της χορογραφίας του @el
label: est un agent collectif contributeur de chorégraphie de @fr
definition: Met un agent collectif en relation avec une manifestation qui consiste en un agrégat matérialisant une expression d’une œuvre chorégraphique créée par un agent collectif. @fr
toolkit label: agent collectif contributeur de chorégraphie de @fr
toolkit definition: Manifestation qui consiste en un agrégat matérialisant une expression d’une œuvre chorégraphique créée par un agent collectif. @fr
label: ir horeogrāfijas līdzradītājs (grupa) @lv
definition: Sasaista grupu ar manifestāciju, kas ir apkopojums, kas ietver grupas radītu horeogrāfijas darbu. @lv
toolkit label: ir horeogrāfijas līdzradītājs (grupa) @lv
toolkit definition: Manifestācija, kas ir apkopojums, kas ietver grupas radītu horeogrāfijas darbu. @lv
label: 是……的编舞的贡献者集体行为者 @zh-hans
definition: 将一个集体行为者与作为一种合集、把一个集体行为者所创作的一种编舞作品的内容表达具体化的一种载体表现关联起来。 @zh-hans
toolkit label: ……的编舞的贡献者集体行为者 @zh-hans
toolkit definition: 作为一种合集、把一个集体行为者所创作的一种编舞作品的内容表达具体化的一种载体表现 @zh-hans
label: koreografisinin katkıda bulunan kolektif temsilcisidir @tr
definition: Kolektif bir temsilciyi, kolektif bir temsilci tarafından oluşturulan bir koreografik çalışmanın anlatımını somutlaştıran bir gösterimle ilişkilendirir. @tr
toolkit label: koreografiye katkıda bulunan kolektif temsilci @tr
toolkit definition: Kolektif bir temsilci tarafından oluşturulan bir koreografik eserin anlatımını somutlaştıran topluluk olan bir gösterim. @tr
has subproperty: koreografiaan osallinen yhteisö manifestaatiossa
has subproperty: koreografiaan osallinen suku manifestaatiossa
has subproperty: P50663

digitaaliseen sisältöön osallinen yhteistoimija manifestaatiossa
status: Published
label: is contributor collective agent of computer content of @en
lexical alias: contributorCollectiveAgentOfComputerContentOf.en
definition: Relates a collective agent to a manifestation that is an aggregate that embodies an expression of computer content created by a collective agent. @en
toolkit label: contributor collective agent of computer content of @en
toolkit definition: A manifestation that is an aggregate that embodies an expression of computer content created by a collective agent. @en
type: Property
domain: C10011
has element type: 2
sub property of: aggregaattiin osallinen yhteistoimija manifestaatiossa
sub property of: digitaaliseen sisältöön osallinen toimija manifestaatiossa
definition: Liittää yhteistoimijan manifestaatioon, joka on aggregaatti, joka sisältää digitaalisen sisällön ekspression, jonka yhteistoimija on luonut.
toolkit label: digitaaliseen sisältöön osallinen yhteistoimija manifestaatiossa
toolkit definition: Manifestaatio, joka on aggregaatti, joka sisältää digitaalisen sisällön ekspression, jonka yhteistoimija on luonut.
label: er bidragsyter til datamaskininnhold for (kollektiv agent) @no
definition: Relaterer en kollektiv agent til en manifestasjon som er et aggregat som realiserer datamaskininnhold skapt av en kollektiv agent. @no
toolkit label: bidragsyter til datamaskininnhold for (kollektiv agent) @no
toolkit definition: En manifestasjon som er et aggregat som realiserer datamaskininnhold skapt av en kollektiv agent. @no
label: is bijdrager-collectieve actor van computercontent van @nl
definition: Relateert een collectieve actor aan een manifestatie die een aggregaat is die een expressie van computercontent verwezenlijkt die is gecreëerd door een collectieve actor. @nl
toolkit label: bijdrager-collectieve actor van computercontent van @nl
toolkit definition: Een manifestatie die een aggregaat is die een expressie van computercontent verwezenlijkt die is gecreëerd door een collectieve actor. @nl
label: هو وكيل جماعي مساهم في محتوى حاسوبي لـ @ar
definition: يربط وكيلا جماعيا بتجسيدة عبارة عن تجميعة تجسد محتوى حاسوبي أنشأه وكيل جماعي. @ar
toolkit label: وكيل جماعي مساهم في محتوى حاسوبي @ar
toolkit definition: تجسيدة تمثل تجميعة تجسد محتوى حاسوبي أنشأه وكيل جماعي. @ar
label: és agent col·lectiu contribuïdor de contingut informàtic de @ca
definition: Relaciona un agent col·lectiu amb una manifestació que és un agregat que materialitza una expressió de contingut informàtic creada per un agent col·lectiu. @ca
toolkit label: agent col·lectiu contribuïdor de contingut informàtic de @ca
toolkit definition: Manifestació que és un agregat que materialitza una expressió de contingut informàtic creada per un agent col·lectiu. @ca
label: er kollektiv agent, som er bidragsyder til computerindhold af @da
definition: Relaterer en kollektiv agent til en manifestation, som er en samling, som rummer et udtryk af computerindhold skabt af en kollektiv agent. @da
toolkit label: kollektiv agent, som er bidragsyder til computerindhold af @da
toolkit definition: Manifestation, som er en samling, som rummer et udtryk af computerindhold skabt af en kollektiv agent. @da
label: digisisu kaastööline (kollektiiv) kehastuses @et
definition: Seostab kollektiivi kehastusega, mis on liitum, milles on teostatud kollektiivi loodud digisisu väljendus. @et
toolkit label: digisisu kaastööline (kollektiiv) kehastuses @et
toolkit definition: Kehastus, mis on liitum, milles on teostatud kollektiivi loodud digisisu väljendus. @et
label: ist gemeinschaftlicher Akteur als Beiträgerin/Beiträger von Computer Content von @de
definition: Setzt einen gemeinschaftlichen Akteur in Beziehung zu einem Aggregat (Manifestation), das eine Expression von Computer Content verkörpert, die ein gemeinschaftlicher Akteur erstellt hat. @de
toolkit label: Gemeinschaftlicher Akteur als Beiträgerin/Beiträger von Computer Content von @de
toolkit definition: Ein Aggregat (Manifestation), das eine Expression von Computer Content verkörpert, die ein gemeinschaftlicher Akteur erstellt hat. @de
label: közreműködő kollektív ágense a következő számítógépes tartalomnak: @hu
definition: Hozzákapcsol egy kollektív ágenst egy aggregátum megjelenési formához, amely egy kollektív ágens által létrehozott számítógépes tartalom kifejezési formáját testesíti meg. @hu
toolkit label: közreműködő kollektív ágense a következő számítógépes tartalomnak: @hu
toolkit definition: Egy aggregátum megjelenési forma, amely egy kollektív ágens által létrehozott számítógépes tartalom kifejezési formáját testesíti meg. @hu
label: è contributore agente collettivo di contenuto informatico di @it
definition: Correla un agente collettivo a una manifestazione che è un aggregato che materializza contenuto informatico creato da un agente collettivo. @it
toolkit label: contributore agente collettivo di contenuto informatico di @it
toolkit definition: Manifestazione che è un aggregato che materializza contenuto informatico creato da un agente collettivo. @it
label: είναι συντελεστής συλλογικός φορέας του περιεχομένου του υπολογιστή του @el
toolkit label: συντελεστής συλλογικός φορέας του περιεχομένου του υπολογιστή του @el
label: est un agent collectif contributeur de contenu informatique de @fr
definition: Met un agent collectif en relation avec une manifestation qui consiste en un agrégat matérialisant une expression d’un contenu informatique créé par un agent collectif. @fr
toolkit label: agent collectif contributeur de contenu informatique de @fr
toolkit definition: Manifestation qui consiste en un agrégat matérialisant une expression d’un contenu informatique créé par un agent collectif. @fr
label: ir datororientēta satura līdzradītājs (grupa) @lv
definition: Sasaista grupu ar manifestāciju, kas ir apkopojums, kas ietver grupas radītu datororientētu saturu. @lv
toolkit label: ir datororientēta satura līdzradītājs (grupa) @lv
toolkit definition: Manifestācija, kas ir apkopojums, kas ietver grupas radītu datororientētu saturu. @lv
label: 是……的计算机内容贡献者集体行为者 @zh-hans
definition: 将一个集体行为者与作为一种合集、把一个集体行为者所创作的一种计算机内容的内容表达具体化的一种载体表现关联起来。 @zh-hans
toolkit label: ……的计算机内容贡献者集体行为者 @zh-hans
toolkit definition: 作为一种合集、把一个集体行为者所创作的一种计算机内容的内容表达具体化的一种载体表现 @zh-hans
label: bilgisayar içeriğinin katkıda bulunan kolektif temsilcisidir @tr
definition: Kolektif temsilciyi, kolektif bir temsilci tarafından oluşturulan bilgisayar içeriğinin bir anlatımını somutlaştıran bir gösterimle ilişkilendirir. @tr
toolkit label: bilgisayar içeriğine katkıda bulunan kolektif temsilci @tr
toolkit definition: Kolektif bir temsilci tarafından oluşturulan bir bilgisayar destekli içeriğin anlatımını somutlaştıran topluluk olan bir gösterim. @tr
has subproperty: digitaaliseen sisältöön osallinen yhteisö manifestaatiossa
has subproperty: digitaaliseen sisältöön osallinen suku manifestaatiossa
has subproperty: P50670

liikkuvaan kuvaan osallinen yhteistoimija
status: Published
label: is contributor collective agent of moving image of @en
lexical alias: contributorCollectiveAgentOfMovingImageOf.en
definition: Relates a collective agent to a manifestation that is an aggregate that embodies an expression of a moving image work that is created by a collective agent. @en
toolkit label: contributor collective agent of moving image of @en
toolkit definition: A manifestation that is an aggregate that embodies an expression of a moving image work that is created by a collective agent. @en
type: Property
domain: C10011
has element type: 2
sub property of: aggregaattiin osallinen yhteistoimija manifestaatiossa
sub property of: liikkuvaan kuvaan osallinen toimija manifestaatiossa
definition: Liittää yhteistoimijan manifestaatioon, joka on aggregaatti, joka sisältää liikkuvan kuvan teoksen ekspression, jonka yhteistoimija on luonut.
toolkit label: liikkuvaan kuvaan osallinen yhteistoimija
toolkit definition: Manifestaatio, joka on aggregaatti, joka sisältää liikkuvan kuvan teoksen ekspression, jonka yhteistoimija on luonut.
label: er bidragsyter til levende bilder for (kollektiv agent) @no
definition: Relaterer en kollektiv agent til en manifestasjon som er et aggregat som realiserer et verk med levende bilder skapt av en kollektiv agent. @no
toolkit label: bidragsyter til levende bilder for (kollektiv agent) @no
toolkit definition: En manifestasjon som er et aggregat som realiserer et verk med levende bilder skapt av en kollektiv agent. @no
label: is bijdrager-collectieve actor van bewegend beeld van @nl
definition: Relateert een collectieve actor aan een manifestatie die een aggregaat is die een expressie van een bewegend beeldwerk verwezenlijkt dat is gecreëerd door een collectieve actor. @nl
toolkit label: bijdrager-collectieve actor van bewegend beeld van @nl
toolkit definition: Een manifestatie die een aggregaat is die een expressie van een bewegend beeldwerk verwezenlijkt dat is gecreëerd door een collectieve actor. @nl
label: هو وكيل جماعي مساهم في صور متحركة لـ @ar
definition: يربط وكيلا جماعيا بتجسيدة عبارة عن تجميعة تجسد عملا صور متحركة أنشأه وكيل جماعي. @ar
toolkit label: وكيل جماعي مساهم في صور متحركة @ar
toolkit definition: تجسيدة تمثل تجميعة تجسد عملا صور متحركة أنشأه وكيل جماعي. @ar
label: és agent col·lectiu contribuïdor d’imatge en moviment de @ca
definition: Relaciona un agent col·lectiu amb una manifestació que és un agregat que materialitza una obra d’imatge en moviment que és creada per un agent col·lectiu. @ca
toolkit label: agent col·lectiu contribuïdor d’imatge en moviment de @ca
toolkit definition: Manifestació que és un agregat que materialitza una obra d’imatge en moviment que és creada per un agent col·lectiu. @ca
label: er kollektiv agent, som er bidragsyder til levende billede af @da
definition: Relaterer en kollektiv agent til en manifestation, som er en samling, som rummer et udtryk af et værk med levende billeder, som er skabt af en kollektiv agent. @da
toolkit label: kollektiv agent, som er bidragsyder til levende billede af @da
toolkit definition: Manifestation, som er en samling, som rummer et udtryk af et værk med levende billeder, som er skabt af en kollektiv agent. @da
label: kaastööline liikuva pildi alal (kollektiiv) kehastuses @et
definition: Seostab kollektiivi kehastusega, mis on liitum, milles on teostatud kollektiivi loodud liikuvast pildist koosneva teose väljendus. @et
toolkit label: kaastööline liikuva pildi alal (kollektiiv) kehastuses @et
toolkit definition: Kehastus, mis on liitum, milles on teostatud kollektiivi loodud liikuvast pildist koosneva teose väljendus. @et
label: ist gemeinschaftlicher Akteur als Beiträgerin/Beiträger von einem Bewegtbild von @de
definition: Setzt einen gemeinschaftlichen Akteur in Beziehung zu einem Aggregat (Manifestation), das eine Expression eines Bewegtbildwerks verkörpert, die ein gemeinschaftlicher Akteur erstellt hat. @de
toolkit label: Gemeinschaftlicher Akteur als Beiträgerin/Beiträger von einem Bewegtbild von @de
toolkit definition: Ein Aggregat (Manifestation), das eine Expression eines Bewegtbildwerks verkörpert, die ein gemeinschaftlicher Akteur erstellt hat. @de
label: közreműködő kollektív ágense a következő mozgóképnek: @hu
definition: Hozzákapcsol egy kollektív ágenst egy aggregátum megjelenési formához, amely egy kollektív ágens által létrehozott mozgóképmű kifejezési formáját testesíti meg. @hu
toolkit label: közreműködő kollektív ágense a következő mozgóképnek: @hu
toolkit definition: Egy aggregátum megjelenési forma, amely egy kollektív ágens által létrehozott mozgóképmű kifejezési formáját testesíti meg. @hu
label: è contributore agente collettivo di immagine in movimento di @it
definition: Correla un agente collettivo a una manifestazione che è un aggregato che materializza un'immagine in movimento creata da un agente collettivo. @it
toolkit label: contributore agente collettivo di immagine in movimento di @it
toolkit definition: Manifestazione che è un aggregato che materializza un'immagine in movimento creata da un agente collettivo. @it
label: είναι συντελεστής συλλογικός φορέας της κινητής εικόνας του @el
toolkit label: εσυντελεστής συλλογικός φορέας της κινητής εικόνας του @el
label: est un agent collectif contributeur d’images animées de @fr
definition: Met un agent collectif en relation avec une manifestation qui consiste en un agrégat matérialisant une expression d’une œuvre d’images animées créée par un agent collectif. @fr
toolkit label: agent collectif contributeur d’images animées de @fr
toolkit definition: Manifestation qui consiste en un agrégat matérialisant une expression d’une œuvre d’images animées créée par un agent collectif. @fr
label: ir kustīga attēla līdzradītājs (grupa) @lv
definition: Sasaista grupu ar manifestāciju, kas ir apkopojums, kas ietver grupas radītu kustīga attēla darbu. @lv
toolkit label: ir kustīga attēla līdzradītājs (grupa) @lv
toolkit definition: Manifestācija, kas ir apkopojums, kas ietver grupas radītu kustīga attēla darbu. @lv
label: 是……的动态图像的贡献者集体行为者 @zh-hans
definition: 将一个集体行为者与作为一种合集、把一个集体行为者所创作的一种动态图像作品的内容表达具体化的一种载体表现关联起来。 @zh-hans
toolkit label: ……的动态图像的贡献者集体行为者 @zh-hans
toolkit definition: 作为一种合集、把一个集体行为者所创作的一种动态图像作品的内容表达具体化的一种载体表现 @zh-hans
label: hareketli görüntüsünün katkıda bulunan kolektif temsilcisidir @tr
definition: Kolektif temsilciyi, kolektif bir temsilci tarafından oluşturulan hareketli bir görüntünün anlatımını somutlaştıran bir gösterimle ilişkilendirir. @tr
toolkit label: hareketli̇ görüntüye katkıda bulunan kolektif temsilci @tr
toolkit definition: Kolektif bir temsilci tarafından oluşturulan hareketli bir görüntü eserinin anlatımını somutlaştıran topluluk olan bir gösterim. @tr
has subproperty: liikkuvaan kuvaan osallinen yhteisö manifestaatiossa
has subproperty: liikkuvaan kuvaan osallinen suku manifestaatiossa
has subproperty: P50664

musiikkiin osallinen yhteistoimija manifestaatiossa
status: Published
label: is contributor collective agent of music of @en
lexical alias: contributorCollectiveAgentOfMusicOf.en
definition: Relates a collective agent to a manifestation that is an aggregate that embodies an expression of a musical work that is created by a collective agent. @en
toolkit label: contributor collective agent of music of @en
toolkit definition: A manifestation that is an aggregate that embodies an expression of a musical work that is created by a collective agent. @en
type: Property
domain: C10011
has element type: 2
sub property of: aggregaattiin osallinen yhteistoimija manifestaatiossa
sub property of: musiikkiin osallinen toimija manifestaatiossa
definition: Liittää yhteistoimijan manifestaatioon, joka on aggregaatti, joka sisältää musiikkiteoksen ekspression, jonka yhteistoimija on luonut.
toolkit label: musiikkiin osallinen yhteistoimija manifestaatiossa
toolkit definition: Manifestaatio, joka on aggregaatti, joka sisältää musiikkiteoksen ekspression, jonka yhteistoimija on luonut.
label: er bidragsyter til musikk for (kollektiv agent) @no
definition: Relaterer en kollektiv agent til en manifestasjon som er et aggregat som realiserer et musikalsk verk skapt av en kollektiv agent. @no
toolkit label: bidragsyter til musikk for (kollektiv agent) @no
toolkit definition: En manifestasjon som er et aggregat som realiserer et musikalsk verk skapt av en kollektiv agent. @no
label: is bijdrager-collectieve actor van muziek van @nl
definition: Relateert een collectieve actor aan een manifestatie die een aggregaat is die een expressie van een muziekwerk verwezenlijkt dat is gecreëerd door een collectieve actor. @nl
toolkit label: bijdrager-collectieve actor van muziek van @nl
toolkit definition: Een manifestatie die een aggregaat is die een expressie van een muziekwerk verwezenlijkt dat is gecreëerd door een collectieve actor. @nl
label: هو وكيل جماعي مساهم في موسيقى لـ @ar
definition: يربط وكيلا جماعيا بتجسيدة عبارة عن تجميعة تجسد عملًا موسيقيًا أنشأه وكيل جماعي. @ar
toolkit label: وكيل جماعي مساهم في موسيقى @ar
toolkit definition: تجسيدة تمثل تجميعة تجسد عملًا موسيقيًا أنشأه وكيل جماعي. @ar
label: és agent col·lectiu contribuïdor de música de @ca
definition: Relaciona un agent col·lectiu amb una manifestació que és un agregat que materialitza una expressió d’una obra musical creada per un agent col·lectiu. @ca
toolkit label: agent col·lectiu contribuïdor de música de @ca
toolkit definition: Manifestació que és un agregat que materialitza una expressió d’una obra musical creada per un agent col·lectiu. @ca
label: er kollektiv agent, som er bidragsyder til musik af @da
definition: Relaterer en kollektiv agent til en manifestation, som er en samling, som rummer et udtryk af et musikværk, som er skabt af en kollektiv agent. @da
toolkit label: kollektiv agent, som er bidragsyder til musik af @da
toolkit definition: Manifestation, som er en samling, som rummer et udtryk af et musikværk, som er skabt af en kollektiv agent. @da
label: muusikaline kaastööline (kollektiiv) kehastuses @et
definition: Seostab kollektiivi kehastusega, mis on liitum, milles on teostatud kollektiivi loodud muusikateose väljendus. @et
toolkit label: muusikaline kaastööline (kollektiiv) kehastuses @et
toolkit definition: Kehastus, mis on liitum, milles on teostatud kollektiivi loodud muusikateose väljendus. @et
label: ist gemeinschaftlicher Akteur als Beiträgerin/Beiträger einer Musik von @de
definition: Setzt einen gemeinschaftlichen Akteur in Beziehung zu einem Aggregat (Manifestation), das eine Expression eines Musikwerks verkörpert, die ein gemeinschaftlicher Akteur erstellt hat. @de
toolkit label: Gemeinschaftlicher Akteur als Beiträgerin/Beiträger einer Musik von @de
toolkit definition: Ein Aggregat (Manifestation), das eine Expression eines Musikwerks verkörpert, die ein gemeinschaftlicher Akteur erstellt hat. @de
label: közreműködő kollektív ágense a következő zenének: @hu
definition: Hozzákapcsol egy kollektív ágenst egy aggregátum megjelenési formához, amely egy kollektív ágens által létrehozott zenemű kifejezési formáját testesíti meg. @hu
toolkit label: közreműködő kollektív ágense a következő zenének: @hu
toolkit definition: Egy aggregátum megjelenési forma, amely egy kollektív ágens által létrehozott zenemű kifejezési formáját testesíti meg. @hu
label: è contributore agente collettivo di musica di @it
definition: Correla un agente collettivo a una manifestazione che è un aggregato che materializza un'opera musicale creata da un agente collettivo. @it
toolkit label: contributore agente collettivo di musica di @it
toolkit definition: Manifestazione che è un aggregato che materializza un'opera musicale creata da un agente collettivo. @it
label: είναι συντελεστής συλλογικός φορέας της μουσικής του @el
toolkit label: συντελεστής συλλογικός φορέας της μουσικής του @el
label: est un agent collectif contributeur de musique de @fr
definition: Met un agent collectif en relation avec une manifestation qui consiste en un agrégat matérialisant une expression d’une œuvre musicale créée par un agent collectif. @fr
toolkit label: agent collectif contributeur de musique de @fr
toolkit definition: Manifestation qui consiste en un agrégat matérialisant une expression d’une œuvre musicale créée par un agent collectif. @fr
label: ir mūzikas līdzradītājs (grupa) @lv
definition: Sasaista grupu ar manifestāciju, kas ir apkopojums, kas ietver grupas radītu mūzikas darbu. @lv
toolkit label: ir mūzikas līdzradītājs (grupa) @lv
toolkit definition: Manifestācija, kas ir apkopojums, kas ietver grupas radītu mūzikas darbu. @lv
label: 是……的音乐的贡献者集体行为者 @zh-hans
definition: 将一个集体行为者与作为一种合集、把一个集体行为者所创作的一种音乐作品的内容表达具体化的一种载体表现关联起来。 @zh-hans
toolkit label: ……的音乐的贡献者集体行为者 @zh-hans
toolkit definition: 作为一种合集、把一个集体行为者所创作的一种音乐作品的内容表达具体化的一种载体表现 @zh-hans
label: müziğinin katkıda bulunan kolektif temsilcisidir @tr
definition: Kolektif temsilciyi, kolektif temsilci tarafından oluşturulan bir müzik eserinin anlatımını somutlaştıran bir gösterimle ilişkilendirir. @tr
toolkit label: müzi̇ğe katkıda bulunan kolektif temsi̇lci̇ @tr
toolkit definition: Kolektif bir temsilci tarafından oluşturulan bir müzik eserinin anlatımını somutlaştıran topluluk olan bir gösterim. @tr
has subproperty: musiikkiin osallinen yhteisö manifestaatiossa
has subproperty: musiikkiin osallinen suku manifestaatiossa
has subproperty: P50665

esineeseen osallinen yhteistoimija manifestaatiossa
status: Published
label: is contributor collective agent of object of @en
lexical alias: contributorCollectiveAgentOfObjectOf.en
definition: Relates a collective agent to a manifestation that is an aggregate that embodies an expression of an object work that is created by a collective agent. @en
toolkit label: contributor collective agent of object of @en
toolkit definition: A manifestation that is an aggregate that embodies an expression of an object work that is created by a collective agent. @en
type: Property
domain: C10011
has element type: 2
sub property of: aggregaattiin osallinen yhteistoimija manifestaatiossa
sub property of: esineeseen osallinen toimija manifestaatiossa
definition: Liittää yhteistoimijan manifestaatioon, joka on aggregaatti, joka sisältää esineteoksen ekspression, jonka yhteistoimija on luonut.
toolkit label: esineeseen osallinen yhteistoimija manifestaatiossa
toolkit definition: Manifestaatio, joka on aggregaatti, joka sisältää esineteoksen ekspression, jonka yhteistoimija on luonut.
label: er bidragsyter til gjenstand for (kollektiv agent) @no
definition: Relaterer en kollektiv agent til en manifestasjon som er et aggregat som realiserer et verk som er en gjenstand skapt av en kollektiv agent. @no
toolkit label: bidragsyter til gjenstand for (kollektiv agent) @no
toolkit definition: En manifestasjon som er et aggregat som realiserer et verk som er en gjenstand skapt av en kollektiv agent. @no
label: is bijdrager-collectieve actor van object van @nl
definition: Relateert een collectieve actor aan een manifestatie die een aggregaat is die een expressie van een objectwerk verwezenlijkt dat is gecreëerd door een collectieve actor. @nl
toolkit label: bijdrager-collectieve actor van object van @nl
toolkit definition: Een manifestatie die een aggregaat is die een expressie van een objectwerk verwezenlijkt dat is gecreëerd door een collectieve actor. @nl
label: هو وكيل جماعي مساهم في كيان لـ @ar
definition: يربط وكيلا جماعيا بتجسيدة عبارة عن تجميعة تجسد عملا كائنا أنشأه وكيل جماعي. @ar
toolkit label: وكيل جماعي مساهم في كيان @ar
toolkit definition: تجسيدة تمثل تجميعة تجسد عملا كائنا أنشأه وكيل جماعي. @ar
label: és agent col·lectiu contribuïdor d’objecte de @ca
definition: Relaciona un agent col·lectiu amb una manifestació que és un agregat que materialitza una expressió d’una obra d’objecte que és creada per un agent col·lectiu. @ca
toolkit label: agent col·lectiu contribuïdor d’objecte de @ca
toolkit definition: Manifestació que és un agregat que materialitza una expressió d’una obra d’objecte que és creada per un agent col·lectiu. @ca
label: er kollektiv agent, som er bidragsyder til objekt af @da
definition: Relaterer en kollektiv agent til en manifestation, som er en samling, som rummer et udtryk af et værk med objekt, som er skabt af en kollektiv agent. @da
toolkit label: kollektiv agent, som er bidragsyder til objekt af @da
toolkit definition: Manifestation, som er en samling, som rummer et udtryk af et værk med objekt, som er skabt af en kollektiv agent. @da
label: objektiloome kaastööline (kollektiiv) kehastuses @et
definition: Seostab kollektiivi kehastusega, mis on liitum, milles on teostatud kollektiivi loodud objektteose väljendus. @et
toolkit label: objektiloome kaastööline (kollektiiv) kehastuses @et
toolkit definition: Kehastus, mis on liitum, milles on teostatud kollektiivi loodud objektteose väljendus. @et
label: ist gemeinschaftlicher Akteur als Beiträgerin/Beiträger von einem Gegenstand von @de
definition: Setzt einen gemeinschaftlichen Akteur in Beziehung zu einem Aggregat (Manifestation), das eine Expression eines gegenständlichen Werks verkörpert, die ein gemeinschaftlicher Akteur erstellt hat. @de
toolkit label: Gemeinschaftlicher Akteur als Beiträgerin/Beiträger von einem Gegenstand von @de
toolkit definition: Ein Aggregat (Manifestation), das eine Expression eines gegenständlichen Werks verkörpert, die ein gemeinschaftlicher Akteur erstellt hat. @de
label: közreműködő kollektív ágense a következő objektumnak: @hu
definition: Hozzákapcsol egy kollektív ágenst egy aggregátum megjelenési formához, amely egy kollektív ágens által létrehozott objektummű kifejezési formáját testesíti meg. @hu
toolkit label: közreműködő kollektív ágense a következő objektumnak: @hu
toolkit definition: Egy aggregátum megjelenési forma, amely egy kollektív ágens által létrehozott objektummű kifejezési formáját testesíti meg. @hu
label: è contributore agente collettivo di oggetto di @it
definition: Correla un agente collettivo a una manifestazione che è un aggregato che materializza un oggetto creato da un agente collettivo. @it
toolkit label: contributore agente collettivo di oggetto di @it
toolkit definition: Manifestazione che è un aggregato che materializza un oggetto creato da un agente collettivo. @it
label: είναι συντελεστής συλλογικός φορέας του αντικειμένου του @el
toolkit label: συντελεστής συλλογικός φορέας του αντικειμένου του @el
label: est un agent collectif contributeur d’objet de @fr
definition: Met un agent collectif en relation avec une manifestation qui consiste en un agrégat matérialisant une expression d’une œuvre textuelle créée par un agent collectif. @fr
toolkit label: agent collectif contributeur d’objet de @fr
toolkit definition: Manifestation qui consiste en un agrégat matérialisant une expression d’une œuvre objet créée par un agent collectif. @fr
label: ir objekta līdzradītājs (grupa) @lv
definition: Sasaista grupu ar manifestāciju, kas ir apkopojums, kas ietver grupas radītu objekta darbu. @lv
toolkit label: ir objekta līdzradītājs (grupa) @lv
toolkit definition: Manifestācija, kas ir apkopojums, kas ietver grupas radītu objekta darbu. @lv
label: 是……的物体的贡献者集体行为者 @zh-hans
definition: 将一个集体行为者与作为一种合集、把一个集体行为者所创作的一种物体作品的内容表达具体化的一种载体表现关联起来。 @zh-hans
toolkit label: ……的物体的贡献者集体行为者 @zh-hans
toolkit definition: 作为一种合集、把一个集体行为者所创作的一种物体作品的内容表达具体化的一种载体表现 @zh-hans
label: nesnesinin katkıda bulunan kolektif temsilcisidir @tr
definition: Kolektif temsilciyi, kolektif bir temsilci tarafından oluşturulan bir nesne eserinin ifadesini somutlaştıran bir gösterimle ilişkilendirir. @tr
toolkit label: nesneye katkıda bulunan kolektif temsilci @tr
toolkit definition: Kolektif bir temsilci tarafından oluşturulan bir nesne eserinin anlatımını somutlaştıran topluluk olan bir gösterim. @tr
has subproperty: esineeseen osallinen yhteisö manifestaatiossa
has subproperty: esineeseen osallinen suku manifestaatiossa
has subproperty: P50669

puheeseen osallinen yhteistoimija manifestaatiossa
status: Published
label: is contributor collective agent of speech of @en
lexical alias: contributorCollectiveAgentOfSpeechOf.en
definition: Relates a collective agent to a manifestation that is an aggregate that embodies an expression of a vocal work that is created by a collective agent. @en
toolkit label: contributor collective agent of speech of @en
toolkit definition: A manifestation that is an aggregate that embodies an expression of a vocal work that is created by a collective agent. @en
type: Property
domain: C10011
has element type: 2
sub property of: aggregaattiin osallinen yhteistoimija manifestaatiossa
sub property of: puheeseen osallinen toimija manifestaatiossa
definition: Liittää yhteistoimijan manifestaatioon, joka on aggregaatti, joka sisältää puheteoksen ekspression, jonka yhteistoimija on luonut.
toolkit label: puheeseen osallinen yhteistoimija manifestaatiossa
toolkit definition: Manifestaatio, joka on aggregaatti, joka sisältää puheteoksen ekspression, jonka yhteistoimija on luonut.
label: er bidragsyter til tale for (kollektiv agent) @no
definition: Relaterer en kollektiv agent til en manifestasjon som er et aggregat som realiserer et verk av tale skapt av en kollektiv agent. @no
toolkit label: bidragsyter til tale for (kollektiv agent) @no
toolkit definition: En manifestasjon som er et aggregat som realiserer et verk av tale skapt av en kollektiv agent. @no
label: is bijdrager-collectieve actor van spraak van @nl
definition: Relateert een collectieve actor aan een manifestatie die een aggregaat is die een vocaal werk verwezenlijkt dat is gecreëerd door een collectieve actor. @nl
toolkit label: bijdrager-collectieve actor van spraak van @nl
toolkit definition: Een manifestatie die een aggregaat is die een vocaal werk verwezenlijkt dat is gecreëerd door een collectieve actor. @nl
label: هو وكيل جماعي مساهم في حديث لـ @ar
definition: يربط وكيلا جماعيا بتجسيدة عبارة عن تجميعة تجسد عملا كلمة منطوقة أنشأه وكيل جماعي. @ar
toolkit label: وكيل جماعي مساهم في حديث @ar
toolkit definition: تجسيدة تمثل تجميعة تجسد عملا كلمة منطوقة أنشأه وكيل جماعي. @ar
label: és agent col·lectiu contribuïdor de discurs de @ca
definition: Relaciona un agent col·lectiu amb una manifestació que és un agregat que materialitza una expressió d’una obra vocal que és creada per un agent col·lectiu. @ca
toolkit label: agent col·lectiu contribuïdor de discurs de @ca
toolkit definition: Manifestació que és un agregat que materialitza una expressió d’una obra vocal que és creada per un agent col·lectiu. @ca
label: er kollektiv agent, som er bidragsyder til tale af @da
definition: Relaterer en kollektiv agent til en manifestation, som er en samling, som rummer et udtryk af et værk med talte ord, som er skabt af en kollektiv agent. @da
toolkit label: kollektiv agent, som er bidragsyder til tale af @da
toolkit definition: Manifestation, som er en samling, som rummer et udtryk af et værk med talte ord, som er skabt af en kollektiv agent. @da
label: kõneloome kaastööline (kollektiiv) kehastuses @et
definition: Seostab kollektiivi kehastusega, mis on liitum, milles on teostatud kollektiivi loodud suulise teose väljendus. @et
toolkit label: kõneloome kaastööline (kollektiiv) kehastuses @et
toolkit definition: Kehastus, mis on liitum, milles on teostatud kollektiivi loodud suulise teose väljendus. @et
label: ist gemeinschaftlicher Akteur als Beiträgerin/Beiträger von einer Rede von @de
definition: Setzt einen gemeinschaftlichen Akteur in Beziehung zu einem Aggregat (Manifestation), das eine Expression eines gesprochenen Werks verkörpert, die ein gemeinschaftlicher Akteur erstellt hat. @de
toolkit label: Gemeinschaftlicher Akteur als Beiträgerin/Beiträger von einer Rede von @de
toolkit definition: Ein Aggregat (Manifestation), das eine Expression eines gesprochenen Werks verkörpert, die ein gemeinschaftlicher Akteur erstellt hat. @de
label: közreműködő kollektív ágense a következő beszédnek: @hu
definition: Hozzákapcsol egy kollektív ágenst egy aggregátum megjelenési formához, amely egy kollektív ágens által létrehozott beszédmű kifejezési formáját testesíti meg. @hu
toolkit label: közreműködő kollektív ágense a következő beszédnek: @hu
toolkit definition: Egy aggregátum megjelenési forma, amely egy kollektív ágens által létrehozott beszédmű kifejezési formáját testesíti meg. @hu
label: è contributore agente collettivo di discorso di @it
definition: Correla un agente collettivo a una manifestazione che è un aggregato che materializza un'opera orale creata da un agente collettivo. @it
toolkit label: contributore agente collettivo di discorso di @it
toolkit definition: Manifestazione che è un aggregato che materializza un'opera orale creata da un agente collettivo. @it
label: είναι συντελεστής συλλογικός φορέας της ομιλίας του @el
toolkit label: συντελεστής συλλογικός φορέας της ομιλίας του @el
label: est un agent collectif contributeur de contenu vocal de @fr
definition: Met un agent collectif en relation avec une manifestation qui consiste en un agrégat matérialisant une expression d’une œuvre vocale créée par un agent collectif. @fr
toolkit label: agent collectif contributeur de contenu vocal de @fr
toolkit definition: Manifestation qui consiste en un agrégat matérialisant une expression d’une œuvre vocale créée par un agent collectif. @fr
label: ir runas līdzradītājs (grupa) @lv
definition: Sasaista grupu ar manifestāciju, kas ir apkopojums, kas ietver grupas radītu mutvārdu darbu. @lv
toolkit label: ir runas līdzradītājs (grupa) @lv
toolkit definition: Manifestācija, kas ir apkopojums, kas ietver grupas radītu mutvārdu darbu. @lv
label: 是……的讲话的贡献者集体行为者 @zh-hans
definition: 将一个集体行为者与作为一种合集、把一个集体行为者所创作的一种人声作品的内容表达具体化的一种载体表现关联起来。 @zh-hans
toolkit label: ……的讲话的贡献者集体行为者 @zh-hans
toolkit definition: 作为一种合集、把一个集体行为者所创作的一种人声作品的内容表达具体化的一种载体表现 @zh-hans
label: konuşmasının katkıda bulunan kolektif temsilcisidir @tr
definition: Kolektif temsilciyi, kolektif bir temsilci tarafından oluşturulan bir vokal eserin anlatımını somutlaştıran bir gösterimle ilişkilendirir. @tr
toolkit label: konuşmaya katkıda bulunan kolektif temsilci @tr
toolkit definition: Kolektif temsilci tarafından oluşturulan bir vokal eserin anlatımını somutlaştıran topluluk olan bir gösterim. @tr
has subproperty: puheeseen osallinen yhteisö manifestaatiossa
has subproperty: puheeseen osallinen suku manifestaatiossa
has subproperty: P50666

stillkuvaan osallinen yhteistoimija manifestaatiossa
status: Published
label: is contributor collective agent of still image of @en
lexical alias: contributorCollectiveAgentOfStillImageOf.en
definition: Relates a collective agent to a manifestation that is an aggregate that embodies an expression of a still image work that is created by a collective agent. @en
toolkit label: contributor collective agent of still image of @en
toolkit definition: A manifestation that is an aggregate that embodies an expression of a still image work that is created by a collective agent. @en
type: Property
domain: C10011
has element type: 2
sub property of: aggregaattiin osallinen yhteistoimija manifestaatiossa
sub property of: stillkuvaan osallinen toimija manifestaatiossa
definition: Liittää yhteistoimijan manifestaatioon, joka on aggregaatti, joka sisältää stillkuvateoksen ekspression, jonka yhteistoimija on luonut.
toolkit label: stillkuvaan osallinen yhteistoimija manifestaatiossa
toolkit definition: Manifestaatio, joka on aggregaatti, joka sisältää stillkuvateoksen ekspression, jonka yhteistoimija on luonut.
label: er bidragsyter til bilde for (kollektiv agent) @no
definition: Relaterer en kollektiv agent til en manifestasjon som er et aggregat som realiserer et bildeverk skapt av en kollektiv agent. @no
toolkit label: bidragsyter til bilde for (kollektiv agent) @no
toolkit definition: En manifestasjon som er et aggregat som realiserer et bildeverk skapt av en kollektiv agent. @no
label: is bijdrager-collectieve actor van stilstaand beeld van @nl
definition: Relateert een collectieve actor aan een manifestatie die een aggregaat is die een expressie van een stilstaand beeldwerk verwezenlijkt dat is gecreëerd door een collectieve actor. @nl
toolkit label: bijdrager-collectieve actor van stilstaand beeld van @nl
toolkit definition: Een manifestatie die een aggregaat is die een expressie van een stilstaand beeldwerk verwezenlijkt dat is gecreëerd door een collectieve actor. @nl
label: هو وكيل جماعي مساهم في صور ثابتة لـ @ar
definition: يربط وكيلا جماعيا بتجسيدة عبارة عن تجميعة تجسد عملا بصور ثابتة أنشأه وكيل جماعي. @ar
toolkit label: وكيل جماعي مساهم في صور ثابتة @ar
toolkit definition: تجسيدة تمثل تجميعة تجسد عملا بصور ثابتة أنشأه وكيل جماعي. @ar
label: és agent col·lectiu contribuïdor d’imatge fixa de @ca
definition: Relaciona un agent col·lectiu amb una manifestació que és un agregat que materialitza una expressió d’una obra d’imatge fixa que és creada per un agent col·lectiu. @ca
toolkit label: agent col·lectiu contribuïdor d’imatge fixa de @ca
toolkit definition: Manifestació que és un agregat que materialitza una expressió d’una obra d’imatge fixa que és creada per un agent col·lectiu. @ca
label: er kollektiv agent, som er bidragsyder til stillbillede af @da
definition: Relaterer en kollektiv agent til en manifestation, som er en samling, som rummer et udtryk af et værk med stillbilleder, som er skabt af en kollektiv agent. @da
toolkit label: kollektiv agent, som er bidragsyder til stillbillede af @da
toolkit definition: Manifestation, som er en samling, som rummer et udtryk af et værk med stillbilleder, som er skabt af en kollektiv agent. @da
label: kaastööline liikumatu pildi alal (kollektiiv) kehastuses @et
definition: Seostab kollektiivi kehastusega, mis on liitum, milles on teostatud kollektiivi loodud liikumatust pildist koosneva teose väljendus. @et
toolkit label: kaastööline liikumatu pildi alal (kollektiiv) kehastuses @et
toolkit definition: Kehastus, mis on liitum, milles on teostatud kollektiivi loodud liikumatust pildist koosneva teose väljendus. @et
label: ist gemeinschaftlicher Akteur als Illustratorin/Illustrator von @de
definition: Setzt einen gemeinschaftlichen Akteur in Beziehung zu einem Aggregat (Manifestation), das eine Expression eines unbewegten Bildwerks verkörpert, die ein gemeinschaftlicher Akteur erstellt hat. @de
toolkit label: Gemeinschaftlicher Akteur als Illustratorin/Illustrator von @de
toolkit definition: Ein Aggregat (Manifestation), das eine Expression eines unbewegten Bildwerks verkörpert, die ein gemeinschaftlicher Akteur erstellt hat. @de
label: közreműködő kollektív ágense a következő állóképnek: @hu
definition: Hozzákapcsol egy kollektív ágenst egy aggregátum megjelenési formához, amely egy kollektív ágens által létrehozott állóképmű kifejezési formáját testesíti meg. @hu
toolkit label: közreműködő kollektív ágense a következő állóképnek: @hu
toolkit definition: Egy aggregátum megjelenési forma, amely egy kollektív ágens által létrehozott állóképmű kifejezési formáját testesíti meg. @hu
label: è contributore agente collettivo di immagine fissa di @it
definition: Correla un agente collettivo a una manifestazione che è un aggregato che materializza un'immagine fissa creata da un agente collettivo. @it
toolkit label: contributore agente collettivo di immagine fissa di @it
toolkit definition: Manifestazione che è un aggregato che materializza un'immagine fissa creata da un agente collettivo. @it
label: είναι συντελεστής συλλογικός φορέας της σταθερής εικόνας του @el
toolkit label: συντελεστής συλλογικός φορέας της σταθερής εικόνας του @el
label: est un agent collectif contributeur d’image fixe de @fr
definition: Met un agent collectif en relation avec une manifestation qui consiste en un agrégat matérialisant une expression d’une œuvre d’image fixe créée par un agent collectif. @fr
toolkit label: agent collectif contributeur d’image fixe de @fr
toolkit definition: Manifestation qui consiste en un agrégat matérialisant une expression d’une œuvre d’image fixe créée par un agent collectif. @fr
label: ir attēla līdzradītājs (grupa) @lv
definition: Sasaista grupu ar manifestāciju, kas ir apkopojums, kas ietver grupas radītu attēla darbu. @lv
toolkit label: ir attēla līdzradītājs (grupa) @lv
toolkit definition: Manifestācija, kas ir apkopojums, kas ietver grupas radītu attēla darbu. @lv
label: 是……的静态图像的贡献者集体行为者 @zh-hans
definition: 将一个集体行为者与作为一种合集、把一个集体行为者所创作的一种静态图像作品的内容表达具体化的一种载体表现关联起来。 @zh-hans
toolkit label: ……的静态图像的贡献者集体行为者 @zh-hans
toolkit definition: 作为一种合集、把一个集体行为者所创作的一种静态图像作品的内容表达具体化的一种载体表现 @zh-hans
label: durağan görüntüsüne katkıda bulunan kolektif temsilcisidir @tr
definition: Kolektif temsilciyi, kolektif bir temsilci tarafından oluşturulan bir hareketsiz görüntünün anlatımını somutlaştıran bir gösterimle ilişkilendirir. @tr
toolkit label: hareketsiz görüntüye katkıda bulunan kolektif temsilci @tr
toolkit definition: Kolektif bir temsilci tarafından oluşturulan hareketsiz bir görüntü eserinin anlatımını somutlaştıran topluluk olan bir gösterim. @tr
has subproperty: stillkuvaan osallinen yhteisö manifestaatiossa
has subproperty: stillkuvaan osallinen suku manifestaatiossa
has subproperty: P50667

tekstiin osallinen yhteistoimija manifestaatiossa
status: Published
label: is contributor collective agent of text of @en
lexical alias: contributorCollectiveAgentOfTextOf.en
definition: Relates a collective agent to a manifestation that is an aggregate that embodies an expression of a textual work that is created by a collective agent. @en
toolkit label: contributor collective agent of text of @en
toolkit definition: A manifestation that is an aggregate that embodies an expression of a textual work that is created by a collective agent. @en
type: Property
domain: C10011
has element type: 2
sub property of: aggregaattiin osallinen yhteistoimija manifestaatiossa
sub property of: tekstiin osallinen toimija manifestaatiossa
definition: Liittää yhteistoimijan manifestaatioon, joka on aggregaatti, joka sisältää tekstiteoksen ekspression, jonka yhteistoimija on luonut.
toolkit label: tekstiin osallinen yhteistoimija manifestaatiossa
toolkit definition: Manifestaatio, joka on aggregaatti, joka sisältää tekstiteoksen ekspression, jonka yhteistoimija on luonut.
label: er bidragsyter til tekst for (kollektiv agent) @no
definition: Relaterer en kollektiv agent til en manifestasjon som er et aggregat som realiserer et tekstlig verk skapt av en kollektiv agent. @no
toolkit label: bidragsyter til tekst for (kollektiv agent) @no
toolkit definition: En manifestasjon som er et aggregat som realiserer et tekstlig verk skapt av en kollektiv agent. @no
label: is bijdrager-collectieve actor van tekst van @nl
definition: Relateert een collectieve actor aan een manifestatie die een aggregaat is die een expressie van een tekstwerk verwezenlijkt dat is gecreëerd door een collectieve actor. @nl
toolkit label: bijdrager-collectieve actor van tekst van @nl
toolkit definition: Een manifestatie die een aggregaat is die een expressie van een tekstwerk verwezenlijkt dat is gecreëerd door een collectieve actor. @nl
label: هو وكيل جماعي مساهم في نص لـ @ar
definition: يربط وكيلا جماعيا بتجسيدة عبارة عن تجميعة تجسد عملا نصي أنشأه وكيل جماعي. @ar
toolkit label: وكيل جماعي مساهم في نص @ar
toolkit definition: تجسيدة تمثل تجميعة تجسد عملا نصي أنشأه وكيل جماعي. @ar
label: és agent col·lectiu contribuïdor de text de @ca
definition: Relaciona un agent col·lectiu amb una manifestació que és un agregat que materialitza una expressió d’una obra textual creada per un agent col·lectiu. @ca
toolkit label: agent col·lectiu contribuïdor de text de @ca
toolkit definition: Manifestació que és un agregat que materialitza una obra textual creada per un agent col·lectiu. @ca
label: er kollektiv agent, som er bidragsyder til tekst af @da
definition: Relaterer en kollektiv agent til en manifestation, som er en samling, som rummer et udtryk af et tekstværk, som er skabt af en kollektiv agent. @da
toolkit label: kollektiv agent, som er bidragsyder til tekst af @da
toolkit definition: Manifestation, som er en samling, som rummer et udtryk af et tekstværk, som er skabt af en kollektiv agent. @da
label: tekstiloome kaastööline (kollektiiv) kehastuses @et
definition: Seostab kollektiivi kehastusega, mis on liitum, milles on teostatud kollektiivi loodud tekstteose väljendus. @et
toolkit label: tekstiloome kaastööline (kollektiiv) kehastuses @et
toolkit definition: Kehastus, mis on liitum, milles on teostatud kollektiivi loodud tekstteose väljendus. @et
label: ist gemeinschaftlicher Akteur als Beiträgerin/Beiträger von ergänzendem Text von @de
definition: Setzt einen gemeinschaftlichen Akteur in Beziehung zu einem Aggregat (Manifestation), das eine Expression eines textlichen Werks verkörpert, die ein gemeinschaftlicher Akteur erstellt hat. @de
toolkit label: Gemeinschaftlicher Akteur als Beiträgerin/Beiträger von ergänzendem Text von @de
toolkit definition: Ein Aggregat (Manifestation), das eine Expression eines textlichen Werks verkörpert, die ein gemeinschaftlicher Akteur erstellt hat. @de
label: közreműködő kollektív ágense a következő szövegnek: @hu
definition: Hozzákapcsol egy kollektív ágenst egy aggregátum megjelenési formához, amely egy kollektív ágens által létrehozott szöveges mű kifejezési formáját testesíti meg. @hu
toolkit label: közreműködő kollektív ágense a következő szövegnek: @hu
toolkit definition: Egy aggregátum megjelenési forma, amely egy kollektív ágens által létrehozott szöveges mű kifejezési formáját testesíti meg. @hu
label: è contributore agente collettivo di testo di @it
definition: Correla un agente collettivo a una manifestazione che è un aggregato che materializza un'opera testuale creata da un agente collettivo. @it
toolkit label: contributore agente collettivo di testo di @it
toolkit definition: Manifestazione che è un aggregato che materializza un'opera testuale creata da un agente collettivo. @it
label: είναι συντελεστής συλλογικός φορέας του κειμένου του @el
toolkit label: συντελεστής συλλογικός φορέας του κειμένου του @el
label: est un agent collectif contributeur de texte de @fr
definition: Met un agent collectif en relation avec une manifestation qui consiste en un agrégat matérialisant une expression d’une œuvre textuelle créée par un agent collectif. @fr
toolkit label: agent collectif contributeur de texte de @fr
toolkit definition: Manifestation qui consiste en un agrégat matérialisant une expression d’une œuvre textuelle créée par un agent collectif. @fr
label: ir teksta līdzradītājs (grupa) @lv
definition: Sasaista grupu ar manifestāciju, kas ir apkopojums, kas ietver grupas radītu teksta darbu. @lv
toolkit label: ir teksta līdzradītājs (grupa) @lv
toolkit definition: Manifestācija, kas ir apkopojums, kas ietver grupas radītu teksta darbu. @lv
label: 是……的文本的贡献者集体行为者 @zh-hans
definition: 将一个集体行为者与作为一种合集、把一个集体行为者所创作的一种文字作品的内容表达具体化的一种载体表现关联起来。 @zh-hans
toolkit label: ……的文本的贡献者集体行为者 @zh-hans
toolkit definition: 作为一种合集、把一个集体行为者所创作的一种文字作品的内容表达具体化的一种载体表现 @zh-hans
label: metninin katkıda bulunan kolektif temsilcisidir @tr
definition: Kolektif temsilciyi, kolektif bir temsilci tarafından oluşturulan metinsel eserin anlatımını somutlaştıran bir gösterimle ilişkilendirir. @tr
toolkit label: metne katkıda bulunan kolektif temsilci @tr
toolkit definition: Kolektif bir temsilci tarafından oluşturulan metinsel bir eserin anlatımını somutlaştıran topluluk olan bir gösterim. @tr
has subproperty: tekstiin osallinen yhteisö manifestaatiossa
has subproperty: tekstiin osallinen suku manifestaatiossa
has subproperty: P50668

aggregaattiin osallinen yhteistoimija manifestaatiossa
status: Published
label: is contributor collective agent to aggregate of @en
lexical alias: contributorCollectiveAgentToAggregateOf.en
definition: Relates a collective agent to a manifestation that is an aggregate that embodies an expression of a work that is created by a collective agent. @en
toolkit label: contributor collective agent to aggregate of @en
toolkit definition: A manifestation that is an aggregate that embodies an expression of a work that is created by a collective agent. @en
type: Property
domain: C10011
has element type: 2
sub property of: yhteistoimijaan liittyvä manifestaatio
sub property of: aggregaattiin osallinen toimija manifestaatiossa
definition: Liittää yhteistoimijan manifestaatioon, joka on aggregaatti, joka sisältää teoksen ekspression, jonka yhteistoimija on luonut.
toolkit label: aggregaattiin osallinen yhteistoimija manifestaatiossa
toolkit definition: Manifestaatio, joka on aggregaatti, joka sisältää teoksen ekspression, jonka yhteistoimija on luonut.
label: er bidragsyter til aggregat for (kollektiv agent) @no
definition: Relaterer en kollektiv agent til en manifestasjon som er et aggregat som inkluderer et bidrag fra en kollektiv agent. @no
toolkit label: bidragsyter til aggregat for (kollektiv agent) @no
toolkit definition: En manifestasjon som er et aggregat som inkluderer et bidrag fra en kollektiv agent. @no
label: is bijdrager-collectieve actor aan aggregaat van @nl
definition: Relateert een collectieve actor aan een manifestatie die een aggregaat is die een expressie van een werk verwezenlijkt dat is gecreëerd door een collectieve actor. @nl
toolkit label: bijdrager-collectieve actor aan aggregaat van @nl
toolkit definition: Een manifestatie die een aggregaat is die een expressie van een werk verwezenlijkt dat is gecreëerd door een collectieve actor. @nl
label: وكيل جماعي مساهم في تجميعة @ar
definition: يربط وكيلا جماعيا بتجسيدة عبارة عن تجميعة تتضمن إسهام وكيل جماعي. @ar
toolkit label: وكيل جماعي مساهم في تجميعة @ar
toolkit definition: تجسيدة عبارة عن تجميعة تتضمن إسهام وكيل جماعي. @ar
label: és agent col·lectiu contribuïdor a un agregat de @ca
definition: Relaciona un agent col·lectiu amb una manifestació que és un agregat que materialitza una expressió d’una obra que és creada per un agent col·lectiu. @ca
toolkit label: agent col·lectiu contribuïdor a un agregat de @ca
toolkit definition: Manifestació que és un agregat que materialitza una expressió d’una obra que és creada per un agent col·lectiu. @ca
label: er kollektiv agent, som er bidragsyder til samling af @da
definition: Relaterer en kollektiv agent til en manifestation, som er en samling,som omfatter et udtryk af et værk, som er skabt af en kollektiv agent. @da
toolkit label: kollektiv agent, som er bidragsyder til samling af @da
toolkit definition: Manifestation, som er en samling, som omfatter et udtryk af et værk, som er skabt af en kollektiv agent. @da
label: liitumi kaastööline (kollektiiv) kehastuses @et
definition: Seostab kollektiivi kehastusega, mis on liitum, milles on teostatud tegija loodud teose väljendus. @et
toolkit label: liitumi kaastööline (kollektiiv) kehastuses @et
toolkit definition: Kehastus, mis on liitum, milles on teostatud tegija loodud teose väljendus. @et
label: ist gemeinschaftlicher Akteur als Beiträgerin/Beiträger zu einem Aggregat von @de
definition: Setzt einen gemeinschaftlichen Akteur in Beziehung zu einem Aggregat (Manifestation), das eine Expression eines Werks verkörpert, die ein gemeinschaftlicher Akteur erstellt hat. @de
toolkit label: Gemeinschaftlicher Akteur als Beiträgerin/Beiträger zu einem Aggregat von @de
toolkit definition: Ein Aggregat (Manifestation), das eine Expression eines Werks verkörpert, die ein gemeinschaftlicher Akteur erstellt hat. @de
label: közreműködő kollektív ágense a következő aggregátumnak: @hu
definition: Hozzákapcsol egy kollektív ágenst egy aggregátum megjelenési formához, amely egy kollektív ágens által létrehozott mű kifejezési formáját testesíti meg. @hu
toolkit label: közreműködő kollektív ágense a következő aggregátumnak: @hu
toolkit definition: Egy aggregátum megjelenési forma, amely egy kollektív ágens által létrehozott mű kifejezési formáját testesíti meg. @hu
label: è contributore agente collettivo di aggregato di @it
definition: Correla un agente collettivo a una manifestazione che è un aggregato che comprende un contributo di un agente collettivo. @it
toolkit label: contributore agente collettivo di aggregato di @it
toolkit definition: Manifestazione che è un aggregato che comprende un contributo di un agente collettivo. @it
label: είναι συντελεστής συλλογικός φορέας της συνάθροισης του @el
toolkit label: συντελεστής συλλογικός φορέας της συνάθροισης του @el
label: est un agent collectif contributeur à un agrégat de @fr
definition: Met un agent collectif en relation avec une manifestation qui consiste en un agrégat matérialisant une expression d’une œuvre créée par un agent collectif. @fr
toolkit label: agent collectif contributeur à un agrégat de @fr
toolkit definition: Manifestation qui consiste en un agrégat matérialisant une expression d’une œuvre créée par un agent collectif. @fr
label: ir apkopojuma līdzradītājs (grupa) @lv
definition: Sasaista grupu ar manifestāciju, kas ir apkopojums, kas ietver grupas ieguldījumu/līdzdalību. @lv
toolkit label: ir apkopojuma līdzradītājs (grupa) @lv
toolkit definition: Manifestācija, kas ir apkopojums, kas ietver grupas ieguldījumu/līdzdalību. @lv
label: 是……的合集的贡献者集体行为者 @zh-hans
definition: 将一个集体行为者与作为一种合集、把一个集体行为者所创作的一种作品的内容表达具体化的一种载体表现关联起来。 @zh-hans
toolkit label: ……的合集的贡献者集体行为者 @zh-hans
toolkit definition: 作为一种合集、把一个集体行为者所创作的一种作品的内容表达具体化的一种载体表现 @zh-hans
label: toplanmasına katkıda bulunan kolektif temsilcidir @tr
definition: Kolektif temsilciyi, kolektif bir temsilci tarafından oluşturulan bir eserin ifadesini somutlaştıran bir bütünü olan ifadeyle ilişkilendirir. @tr
toolkit label: topluluğa katkıda bulunan kolektif temsilci @tr
toolkit definition: Kolektif bir temsilci tarafından oluşturulan bir eserin anlatımını somutlaştıran topluluk olan bir gösterim. @tr
has subproperty: kartografiaan osallinen yhteistoimija manifestaatiossa
has subproperty: koreografiaan osallinen yhteistoimija manifestaatiossa
has subproperty: digitaaliseen sisältöön osallinen yhteistoimija manifestaatiossa
has subproperty: liikkuvaan kuvaan osallinen yhteistoimija
has subproperty: musiikkiin osallinen yhteistoimija manifestaatiossa
has subproperty: esineeseen osallinen yhteistoimija manifestaatiossa
has subproperty: puheeseen osallinen yhteistoimija manifestaatiossa
has subproperty: stillkuvaan osallinen yhteistoimija manifestaatiossa
has subproperty: tekstiin osallinen yhteistoimija manifestaatiossa
has subproperty: aggregaattiin osallinen yhteisö manifestaatiossa
has subproperty: aggregaattiin osallinen suku manifestaatiossa

yhdistymään osallinen yhteistoimija ekspressiossa
status: Published
label: is contributor collective agent to amalgamation of @en
lexical alias: contributorCollectiveAgentToAmalgamationOf.en
definition: Relates a collective agent to an expression that includes a contribution by a collective agent to a seamless mix of kinds of content. @en
toolkit label: contributor collective agent to amalgamation of @en
toolkit definition: An expression that includes a contribution by a collective agent to a seamless mix of kinds of content. @en
type: Property
domain: C10011
has element type: 2
sub property of: ekspression tekijä (yhteistoimija) ekspressiossa
sub property of: yhdistymään osallinen toimija ekspressiossa
definition: Liittää yhteistoimijan ekspressioon, jossa yhteistoimija on osallisena sellaisen ekspression tekemisessä, joka on saumaton yhdistelmä erilaisia sisältöjä.
toolkit label: yhdistymään osallinen yhteistoimija ekspressiossa
toolkit definition: Ekspressio, jossa yhteistoimija on osallisena sellaisen ekspression tekemisessä, joka on saumaton yhdistelmä erilaisia sisältöjä.
label: er bidragsyter til sammenslutning for (kollektiv agent) @no
definition: Relaterer en kollektiv agent til et uttrykk som inkluderer et bidrag fra en kollektiv agent til en sømløs blanding av forskjellig innhold. @no
toolkit label: bidragsyter til sammenslutning for (kollektiv agent) @no
toolkit definition: Et uttrykk som inkluderer et bidrag fra en kollektiv agent til en sømløs blanding av forskjellig innhold. @no
label: is bijdrager-collectieve actor aan amalgamering van @nl
definition: Relateert een collectieve actor aan een expressie die omvat een bijdrage door een collectieve actor aan een naadloze mix van soorten content. @nl
toolkit label: bijdrager-collectieve actor aan amalgamering van @nl
toolkit definition: Een expressie die omvat een bijdrage door een collectieve actor aan een naadloze mix van soorten content. @nl
label: هو وكيل جماعي مساهم في دمج لـ @ar
definition: يربط وكيلا جماعيا بتعبيرة تتضمن إسهام وكيل جماعي في مزج سلس لأنواع من المحتوى. @ar
toolkit label: وكيل جماعي مساهم في دمج @ar
toolkit definition: تعبيرة تتضمن إسهام وكيل جماعي في مزج سلس لأنواع من المحتوى. @ar
label: és agent col·lectiu contribuïdor a una amalgama de @ca
definition: Relaciona un agent col·lectiu amb una expressió que inclou una contribució d’un agent col·lectiu a una mescla sense continuïtat de classes de contingut. @ca
toolkit label: agent col·lectiu contribuïdor a una amalgama de @ca
toolkit definition: Expressió que inclou una contribució d’un agent col·lectiu a una mescla sense continuïtat de classes de contingut. @ca
label: er kollektiv agent, som er bidragsyder til sammensmeltning af @da
definition: Relaterer en kollektiv agent til et udtryk, som omfatter en kollektiv agents bidrag til en glat kombinering af forskellige slags af indhold. @da
toolkit label: kollektiv agent, som er bidragsyder til sammensmeltning af @da
toolkit definition: Udtryk, som omfatter en kollektiv agents bidrag til en glat kombinering af forskellige slags af indhold. @da
label: sulami kaastööline (kollektiiv) väljenduses @et
definition: Seostab kollektiivi väljendusega, millesse kollektiiv on andnud panuse, osaledes eri liiki sisu lahutamatu segu loomisel. @et
toolkit label: sulami kaastööline (kollektiiv) väljenduses @et
toolkit definition: Väljendus, millesse kollektiiv on andnud panuse, osaledes eri liiki sisu lahutamatu segu loomisel. @et
label: ist gemeinschaftlicher Akteur als Beiträgerin/Beiträger zu einer Verschmelzung von @de
definition: Setzt einen gemeinschaftlichen Akteur in Beziehung zu einer Expression, bei der ein gemeinschaftlicher Akteur zu einer nahtlosen Mischung von Inhalten beiträgt. @de
toolkit label: Gemeinschaftlicher Akteur als Beiträgerin/Beiträger zu einer Verschmelzung von @de
toolkit definition: Eine Expression, bei der ein gemeinschaftlicher Akteur zu einer nahtlosen Mischung von Inhalten beiträgt. @de
label: közreműködő kollektív ágense a következő vegyes tartalomnak: @hu
definition: Hozzákapcsol egy kollektív ágenst egy kifejezési formához, amely magában foglalja egy kollektív ágens közreműködését a tartalom fajtáinak szabad keverésében. @hu
toolkit label: közreműködő kollektív ágense a következő vegyes tartalomnak: @hu
toolkit definition: Egy kifejezési forma, amely magában foglalja egy kollektív ágens közreműködését a tartalom fajtáinak szabad keverésében. @hu
label: è contributore agente collettivo di fusione di @it
definition: Correla un agente collettivo a un'espressione che comprende un contributo di un agente collettivo a una varietà di tipi di contenuto senza soluzione di continuità. @it
toolkit label: contributore agente collettivo di fusione di @it
toolkit definition: Espressione che comprende un contributo di un agente collettivo a una varietà di tipi di contenuto senza soluzione di continuità. @it
label: είναι συντελεστής συλλογικός φορέας σε μείξη του (?) @el
toolkit label: συντελεστής συλλογικός φορέας σε μείξη του (?) @el
label: est un agent collectif contributeur à un amalgame de @fr
definition: Met un agent collectif en relation avec une expression qui intègre une contribution de la part d’un agent collectif à un mélange intégré de différents genres de contenu. @fr
toolkit label: agent collectif contributeur à un amalgame de @fr
toolkit definition: Expression qui intègre une contribution de la part d’un agent collectif à un mélange intégré de différents genres de contenu. @fr
label: ir amalgamāta līdzradītājs (grupa) @lv
definition: Sasaista grupu ar izteiksmi, kas ietver grupas ieguldījumu dažādu satura veidu vienlaidu sajaukumā. @lv
toolkit label: ir amalgamāta līdzradītājs (grupa) @lv
toolkit definition: Izteiksme, kas ietver grupas ieguldījumu dažādu satura veidu vienlaidu sajaukumā. @lv
label: 是……的融合体的贡献者集体行为者 @zh-hans
definition: 将一个集体行为者与包括将各种内容无缝融合的一个集体行为者的贡献的一种内容表达关联起来。 @zh-hans
toolkit label: ……的融合体的贡献者集体行为者 @zh-hans
toolkit definition: 包括将各种内容无缝融合的一个集体行为者的贡献的一种内容表达 @zh-hans
label: birleşimine katkıda bulunan kolektif temsilcidir @tr
definition: Kolektif bir temsilciyi, kesintisiz bir içerik türü karışımına katkı sağlayan bir kolektif temsilcinin katkısını içeren bir anlatım ile ilişkilendirir. @tr
toolkit label: birleşmeye katkıda bulunan kolektif temsilci @tr
toolkit definition: Farklı türde içeriklerin kusursuz karışımını sağlayan kolektif bir temsilcinin katkısını içeren bir anlatım. @tr
has subproperty: värittäjä (yhteistoimija) ekspressiossa
has subproperty: esitykseen osallinen yhteistoimija ekspressiossa
has subproperty: yhdistymään osallinen yhteisö ekspressiossa
has subproperty: yhdistymään osallinen suku ekspressiossa
has subproperty: tuomioistuimen kirjuri (yhteistoimija) ekspressiossa
has subproperty: piirtäjä (yhteistoimija) ekspressiossa
has subproperty: toimittaja (yhteistoimija) ekspressiossa
has subproperty: tekstaaja (yhteistoimija) ekspressiossa
has subproperty: pöytäkirjan laatija (yhteistoimija) ekspressiossa
has subproperty: ohjelmistokehittäjä (yhteistoimija) ekspressiossa
has subproperty: P50775

esitykseen osallinen yhteistoimija ekspressiossa
status: Published
label: is contributor collective agent to performance of @en
lexical alias: contributorCollectiveAgentToPerformanceOf.en
definition: Relates a collective agent to an expression that includes a contribution by a collective agent to a performance. @en
toolkit label: contributor collective agent to performance of @en
toolkit definition: An expression that includes a contribution by a collective agent to a performance. @en
type: Property
domain: C10011
has element type: 2
sub property of: yhdistymään osallinen yhteistoimija ekspressiossa
sub property of: esitykseen osallinen toimija ekspressiossa
definition: Liittää yhteistoimijan ekspressioon, jossa yhteistoimija on osallisena sellaisen ekspression tekemisessä, joka on esitys.
toolkit label: esitykseen osallinen yhteistoimija ekspressiossa
toolkit definition: Ekspressio, jossa yhteistoimija on osallisena sellaisen ekspression tekemisessä, joka on esitys.
label: er bidragsyter til framføring for (kollektiv agent) @no
definition: Relaterer en kollektiv agent til et uttrykk som inkluderer et bidrag fra en kollektiv agent til en framføring. @no
toolkit label: bidragsyter til framføring for (kollektiv agent) @no
toolkit definition: Et uttrykk som inkluderer et bidrag fra en kollektiv agent til en framføring. @no
label: is bijdrager-collectieve actor aan uitvoering van @nl
definition: Relateert een collectieve actor aan een expressie die omvat een bijdrage door een collectieve actor aan een uitvoering. @nl
toolkit label: bijdrager-collectieve actor aan uitvoering van @nl
toolkit definition: Een expressie die omvat een bijdrage door een collectieve actor aan een uitvoering. @nl
label: هو وكيل جماعي مساهم في أداء لـ @ar
definition: يربط وكيلا جماعيا بتعبيرة تتضمن إسهام وكيل جماعي في أداء. @ar
toolkit label: وكيل جماعي مساهم في أداء @ar
toolkit definition: تعبيرة تتضمن إسهام وكيل جماعي في أداء. @ar
label: és agent col·lectiu contribuïdor a una interpretació de @ca
definition: Relaciona un agent col·lectiu amb una expressió que inclou una contribució d’un agent col·lectiu a una interpretació. @ca
toolkit label: agent col·lectiu contribuïdor a una interpretació de @ca
toolkit definition: Expressió que inclou una contribució d’un agent col·lectiu a una interpretació. @ca
label: er kollektiv agent, som er bidragsyder til optræden af @da
definition: Relaterer en kollektiv agent til et udtryk, som omfatter en kollektiv agents bidrag til en optræden. @da
toolkit label: kollektiv agent, som er bidragsyder til optræden af @da
toolkit definition: Udtryk, som omfatter en kollektiv agents bidrag til en optræden. @da
label: esituse kaastööline (kollektiiv) väljenduses @et
definition: Seostab kollektiivi väljendusega, millesse kollektiiv on andnud panuse, osaledes esituse loomisel. @et
toolkit label: esituse kaastööline (kollektiiv) väljenduses @et
toolkit definition: Väljendus, millesse kollektiiv on andnud panuse, osaledes esituse loomisel. @et
label: ist gemeinschaftlicher Akteur als Beiträgerin/Beiträger zu einer Darbietung von @de
definition: Setzt einen gemeinschaftlichen Akteur in Beziehung zu einer Expression, bei der ein gemeinschaftlicher Akteur zu einer Darbietung beiträgt. @de
toolkit label: Gemeinschaftlicher Akteur als Beiträgerin/Beiträger zu einer Darbietung von @de
toolkit definition: Eine Expression, bei der ein gemeinschaftlicher Akteur zu eine Darbietung beiträgt. @de
label: közreműködő kollektív ágense a következő előadásnak: @hu
definition: Hozzákapcsol egy kollektív ágenst egy kifejezési formához, amely magában foglalja egy kollektív ágens közreműködését egy előadásban. @hu
toolkit label: közreműködő kollektív ágense a következő előadásnak:közreműködő ágense a következő előadásnak: @hu
toolkit definition: Egy kifejezési forma, amely magában foglalja egy kollektív ágens közreműködését egy előadásban. @hu
label: è contributore agente collettivo di esibizione di @it
definition: Correla un agente collettivo a un'espressione che comprende un contributo di un agente collettivo a un'esibizione. @it
toolkit label: contributore agente collettivo di esibizione di @it
toolkit definition: Espressione che comprende un contributo di un agente collettivo a un'esibizione. @it
label: είναι συντελεστής συλλογικός φορέας σε εκτέλεση του @el
toolkit label: συντελεστής συλλογικός φορέας σε εκτέλεση του @el
label: est un agent collectif contributeur à une prestation de @fr
definition: Met un agent collectif en relation avec une expression qui intègre une contribution de la part d’un agent collectif à une prestation. @fr
toolkit label: agent collectif contributeur à une prestation de @fr
toolkit definition: Expression qui intègre une contribution de la part d’un agent collectif à une prestation. @fr
label: ir uzveduma līdzradītājs (grupa) @lv
definition: Sasaista grupu ar izteiksmi, kas ietver grupas ieguldījumu uzvedumā. @lv
toolkit label: ir uzveduma līdzradītājs (grupa) @lv
toolkit definition: Izteiksme, kas ietver grupas ieguldījumu uzvedumā. @lv
label: 是……的表演的贡献者集体行为者 @zh-hans
definition: 将一个集体行为者与包括一个集体行为者对一个表演之贡献的一种内容表达关联起来。 @zh-hans
toolkit label: ……的表演的贡献者集体行为者 @zh-hans
toolkit definition: 包括一个集体行为者对一个表演之贡献的一种内容表达 @zh-hans
label: performansına katkıda bulunan kolektif temsilcidir @tr
definition: Kolektif bir temsilciyi, bir kolektif temsilcinin bir performansa katkısını içeren bir anlatım ile ilişkilendirir. @tr
toolkit label: performansa katkıda bulunan kolektif temsilci @tr
toolkit definition: Kolektif bir temsilcinin bir performansa katkısını içeren bir anlatım. @tr
has subproperty: animaattori (yhteistoimija) ekspressiossa
has subproperty: lavastaja (yhteistoimija) ekspressiossa
has subproperty: ääniteknikko (yhteistoimija) ekspressiossa
has subproperty: esitykseen osallinen yhteisö ekspressiossa
has subproperty: esitykseen osallinen suku ekspressiossa
has subproperty: puvustaja (yhteistoimija) ekspressiossa
has subproperty: DJ (yhteistoimija) ekspressiossa
has subproperty: dubbausohjaaja (yhteistoimija) ekspressiossa
has subproperty: leikkaaja (yhteistoimija) ekspressiossa
has subproperty: ekspression haastateltava (yhteistoimija) ekspressiossa
has subproperty: ekspression haastattelija (yhteistoimija) ekspressiossa

kartografiaan osallinen yhteisö manifestaatiossa
status: Published
label: is contributor corporate body of cartography of @en
lexical alias: contributorCorporateBodyOfCartographyOf.en
definition: Relates a corporate body to a manifestation that is an aggregate that embodies an expression of a cartographic work that is created by a corporate body. @en
toolkit label: contributor corporate body of cartography of @en
toolkit definition: A manifestation that is an aggregate that embodies an expression of a cartographic work that is created by a corporate body. @en
type: Property
domain: C10005
has element type: 2
sub property of: aggregaattiin osallinen yhteisö manifestaatiossa
sub property of: kartografiaan osallinen yhteistoimija manifestaatiossa
definition: Liittää yhteisön manifestaatioon, joka on aggregaatti, joka sisältää kartografisen teoksen ekspression, jonka yhteisö on luonut.
toolkit label: kartografiaan osallinen yhteisö manifestaatiossa
toolkit definition: Manifestaatio, joka on aggregaatti, joka sisältää kartografisen teoksen ekspression, jonka yhteisö on luonut.
label: er bidragsyter til kartografi for (korporasjon) @no
definition: Relaterer en korporasjon til en manifestasjon som er et aggregat som realiserer et kartografisk verk skapt av en korporasjon. @no
toolkit label: bidragsyter til kartografi for (korporasjon) @no
toolkit definition: En manifestasjon som er et aggregat som realiserer et kartografisk verk skapt av en korporasjon. @no
label: is bijdrager-corporatie van cartografie van @nl
definition: Relateert een corporatie aan een manifestatie die een aggregaat is die een expressie van een cartografisch werk verwezenlijkt dat is gecreëerd door een corporatie. @nl
toolkit label: bijdrager-corporatie van cartografie van @nl
toolkit definition: Een manifestatie die een aggregaat is die een expressie van een cartografisch werk verwezenlijkt dat is gecreëerd door een corporatie. @nl
label: هي هيئة مساهمة في رسم خرائط لـ @ar
definition: يربط هيئة بتجسيدة عبارة عن تجميعة تجسد عملا رسم خرائطي أنشأته هيئة. @ar
toolkit label: هيئة مساهمة في رسم خرائط @ar
toolkit definition: تجسيدة تمثل تجميعة تجسد عملا رسم خرائطي أنشأه هيئة. @ar
label: és entitat corporativa contribuïdora de cartografia de @ca
definition: Relaciona una entitat corporativa amb una manifestació que és un agregat que materialitza una obra cartogràfica que és creada per una entitat corporativa. @ca
toolkit label: entitat corporativa contribuïdora de cartografia de @ca
toolkit definition: Manifestació que és un agregat que materialitza una obra cartogràfica que és creada per una entitat corporativa. @ca
label: er korporation, som er bidragsyder til kartografi af @da
definition: Relaterer en korporation til en manifestation, som er en samling, som rummer et udtryk af et kartografisk værk, som er skabt af en korporation. @da
toolkit label: korporation, som er bidragsyder til kartografi af @da
toolkit definition: Manifestation, som er en samling, som rummer et udtryk af et kartografisk værk, som er skabt af en korporation. @da
label: kaastööline kartograafia alal (asutus) kehastuses @et
definition: Seostab asutuse kehastusega, mis on liitum, milles on teostatud asutuse loodud kartograafilise teose väljendus. @et
toolkit label: kaastööline kartograafia alal (asutus) kehastuses @et
toolkit definition: Kehastus, mis on liitum, milles on teostatud asutuse loodud kartograafilise teose väljendus. @et
label: ist Körperschaft als Beiträgerin/Beiträger von einer Kartografie von @de
definition: Setzt eine Körperschaft in Beziehung zu einem Aggregat (Manifestation), das eine Expression eines kartografischen Werks verkörpert, die eine Körperschaft erstellt hat. @de
toolkit label: Körperschaft als Beiträgerin/Beiträger von einer Kartografie von @de
toolkit definition: Ein Aggregat (Manifestation), das eine Expression eines kartografischen Werks verkörpert, die eine Körperschaft erstellt hat. @de
label: közreműködő testülete a következő kartográfiának: @hu
definition: Hozzákapcsol egy testületet egy aggregátum megjelenési formához, amely egy testület által létrehozott kartográfiai mű kifejezési formáját testesíti meg. @hu
toolkit label: közreműködő testülete a következő kartográfiának: @hu
toolkit definition: Egy aggregátum megjelenési forma, amely egy testület által létrehozott kartográfiai mű kifejezési formáját testesíti meg. @hu
label: è contributore ente di cartografia di @it
definition: Correla un ente a una manifestazione che è un aggregato che materializza un'opera cartografica creata da un ente. @it
toolkit label: contributore ente di cartografia di @it
toolkit definition: Manifestazione che è un aggregato che materializza un'opera cartografica creata da un ente. @it
label: είναι συντελεστής συλλογικό όργανο της χαρτογράφησης του @el
toolkit label: συντελεστής συλλογικό όργανο της χαρτογράφησης του @el
label: est une collectivité contributrice de cartographie de @fr
definition: Met une collectivité en relation avec une manifestation qui consiste en un agrégat matérialisant une expression d’une œuvre cartographique créée par une collectivité. @fr
toolkit label: collectivité contributrice de cartographie de @fr
toolkit definition: Manifestation qui consiste en un agrégat matérialisant une expression d’une œuvre cartographique créée par une collectivité. @fr
label: ir kartogrāfijas līdzradītājs (institūcija) @lv
definition: Sasaista institūciju ar manifestāciju, kas ir apkopojums, kas ietver institūcijas radītu kartogrāfijas darbu. @lv
toolkit label: ir kartogrāfijas līdzradītājs (institūcija) @lv
toolkit definition: Manifestācija, kas ir apkopojums, kas ietver institūcijas radītu kartogrāfijas darbu. @lv
label: 是……的地图绘制的贡献者团体 @zh-hans
definition: 将一个团体与作为一种合集、把一个团体所创作的一种地图作品的内容表达具体化的一种载体表现关联起来。 @zh-hans
toolkit label: ……的地图绘制的贡献者团体 @zh-hans
toolkit definition: 作为一种合集、把一个团体所创作的一种地图作品的内容表达具体化的一种载体表现 @zh-hans
label: kartografisinin katkıda bulunan tüzel kişisidir @tr
definition: Bir tüzel kişiyi, bir tüzel kişilik tarafından yaratılan bir kartografik çalışmanın bir ifadesini somutlaştıran bir bütün olan bir gösterimle ilişkilendirir. @tr
toolkit label: kartografyaya katkıda bulunan tüzel kişi @tr
toolkit definition: Tüzel bir kişi tarafından oluşturulan bir kartografik eserin anlatımını somutlaştıran topluluk olan bir gösterim. @tr
has subproperty: maanmittari (yhteisö) manifestaatiossa
has subproperty: P50813

koreografiaan osallinen yhteisö manifestaatiossa
status: Published
label: is contributor corporate body of choreography of @en
lexical alias: contributorCorporateBodyOfChoreographyOf.en
definition: Relates a corporate body to a manifestation that is an aggregate that embodies an expression of a choreographic work that is created by a corporate body. @en
toolkit label: contributor corporate body of choreography of @en
toolkit definition: A manifestation that is an aggregate that embodies an expression of a choreographic work that is created by a corporate body. @en
type: Property
domain: C10005
has element type: 2
sub property of: aggregaattiin osallinen yhteisö manifestaatiossa
sub property of: koreografiaan osallinen yhteistoimija manifestaatiossa
definition: Liittää yhteisön manifestaatioon, joka on aggregaatti, joka sisältää koreografisen teoksen ekspression, jonka yhteisö on luonut.
toolkit label: koreografiaan osallinen yhteisö manifestaatiossa
toolkit definition: Manifestaatio, joka on aggregaatti, joka sisältää koreografisen teoksen ekspression, jonka yhteisö on luonut.
label: er bidragsyter til koreografi for (korporasjon) @no
definition: Relaterer en korporasjon til en manifestasjon som er et aggregat som realiserer et koreografisk verk skapt av en korporasjon. @no
toolkit label: bidragsyter til koreografi for (korporasjon) @no
toolkit definition: En manifestasjon som er et aggregat som realiserer et koreografisk verk skapt av en korporasjon. @no
label: is bijdrager-corporatie van choreografie van @nl
definition: Relateert een corporatie aan een manifestatie die een aggregaat is die een expressie van een choreografisch werk verwezenlijkt dat is gecreëerd door een corporatie. @nl
toolkit label: bijdrager-corporatie van choreografie van @nl
toolkit definition: Een manifestatie die een aggregaat is die een expressie van een choreografisch werk verwezenlijkt dat is gecreëerd door een corporatie. @nl
label: هي هيئة مساهمة في تصميم رقصات لـ @ar
definition: يربط هيئة بتجسيدة عبارة عن تجميعة تجسد عملا راقص أنشأته هيئة. @ar
toolkit label: هيئة مساهمة في تصميم رقصات @ar
toolkit definition: تجسيدة عبارة عن تجميعة تجسد عملا راقص أنشأته هيئة. @ar
label: és entitat corporativa contribuïdora de coreografia de @ca
definition: Relaciona una entitat corporativa amb una manifestació que és un agregat que materialitza una expressió d’una obra coreogràfica que és creada per una entitat corporativa. @ca
toolkit label: entitat corporativa contribuïdora de coreografia de @ca
toolkit definition: Manifestació que és un agregat que materialitza una expressió d’una obra coreogràfica que és creada per una entitat corporativa. @ca
label: er korporation, som er bidragsyder til koreografi af @da
definition: Relaterer en korporation til en manifestation, som er en samling, som rummer et udtryk af et koreografisk værk, som er skabt af en korporation. @da
toolkit label: korporation, som er bidragsyder til koreografi af @da
toolkit definition: Manifestation, som er en samling, som rummer et uddtryk af et koreografisk værk, som er skabt af en korporation. @da
label: kaastööline koreograafia alal (asutus) kehastuses @et
definition: Seostab asutuse kehastusega, mis on liitum, milles on teostatud asutuse loodud koreograafilise teose väljendus. @et
toolkit label: kaastööline koreograafia alal (asutus) kehastuses @et
toolkit definition: Kehastus, mis on liitum, milles on teostatud asutuse loodud koreograafilise teose väljendus. @et
label: ist Körperschaft als Beiträgerin/Beiträger von einer Choreografie von @de
definition: Setzt eine Körperschaft in Beziehung zu einem Aggregat (Manifestation), das eine Expression eines choreografischen Werks verkörpert, die eine Körperschaft erstellt hat. @de
toolkit label: Körperschaft als Beiträgerin/Beiträger von einer Choreografie von @de
toolkit definition: Ein Aggregat (Manifestation), das eine Expression eines choreografischen Werks verkörpert, die eine Körperschaft erstellt hat. @de
label: közreműködő testülete a következő koreográfiának: @hu
definition: Hozzákapcsol egy testületet egy aggregátum megjelenési formához, amely egy testület által létrehozott koreografikus mű kifejezési formáját testesíti meg. @hu
toolkit label: közreműködő testülete a következő koreográfiának: @hu
toolkit definition: Egy aggregátum megjelenési forma, amely egy testület által létrehozott koreografikus mű kifejezési formáját testesíti meg. @hu
label: è contributore ente di coreografia di @it
definition: Correla un ente a una manifestazione che è un aggregato che materializza un'opera coreografica creata da un ente. @it
toolkit label: contributore ente di coreografia di @it
toolkit definition: Manifestazione che è un aggregato che materializza un'opera coreografica creata da un ente. @it
label: είναι συντελεστής συλλογικό όργανο της χορογραφίας του @el
toolkit label: συντελεστής συλλογικό όργανο της χορογραφίας του @el
label: est une collectivité contributrice de chorégraphie de @fr
definition: Met une collectivité en relation avec une manifestation qui consiste en un agrégat matérialisant une expression d’une œuvre chorégraphique créée par une collectivité. @fr
toolkit label: collectivité contributrice de chorégraphie de @fr
toolkit definition: Manifestation qui consiste en un agrégat matérialisant une expression d’une œuvre chorégraphique créée par une collectivité. @fr
label: ir horeogrāfijas līdzradītājs (institūcija) @lv
definition: Sasaista institūciju ar manifestāciju, kas ir apkopojums, kas ietver institūcijas radītu horeogrāfijas darbu. @lv
toolkit label: ir horeogrāfijas līdzradītājs (institūcija) @lv
toolkit definition: Manifestācija, kas ir apkopojums, kas ietver institūcijas radītu horeogrāfijas darbu. @lv
label: 是……的编舞的贡献者团体 @zh-hans
definition: 将一个团体与作为一种合集、把一个团体所创作的一种编舞作品的内容表达具体化的一种载体表现关联起来。 @zh-hans
toolkit label: ……的编舞的贡献者团体 @zh-hans
toolkit definition: 作为一种合集、把一个团体所创作的一种编舞作品的内容表达具体化的一种载体表现 @zh-hans
label: koreografisinin katkıda bulunan tüzel kişisidir @tr
definition: Bir tüzel kişiyi, bir tüzel kişi tarafından yaratılan bir koreografik çalışmanın ifadesini somutlaştıran bir bütün olan gösterimle ilişkilendirir. @tr
toolkit label: koreografiye katkıda bulunan tüzel kişi @tr
toolkit definition: Tüzel bir kişi tarafından oluşturulan bir koreografik eserin anlatımını somutlaştıran topluluk olan bir gösterim. @tr
has subproperty: P50814

digitaaliseen sisältöön osallinen yhteisö manifestaatiossa
status: Published
label: is contributor corporate body of computer content of @en
lexical alias: contributorCorporateBodyOfComputerContentOf.en
definition: Relates a corporate body to a manifestation that is an aggregate that embodies an expression of computer content created by a corporate body. @en
toolkit label: contributor corporate body of computer content of @en
toolkit definition: A manifestation that is an aggregate that embodies an expression of computer content created by a corporate body. @en
type: Property
domain: C10005
has element type: 2
sub property of: aggregaattiin osallinen yhteisö manifestaatiossa
sub property of: digitaaliseen sisältöön osallinen yhteistoimija manifestaatiossa
definition: Liittää yhteisön manifestaatioon, joka on aggregaatti, joka sisältää digitaalisen sisällön ekspression, jonka yhteisö on luonut.
toolkit label: digitaaliseen sisältöön osallinen yhteisö manifestaatiossa
toolkit definition: Manifestaatio, joka on aggregaatti, joka sisältää digitaalisen sisällön ekspression, jonka yhteisö on luonut.
label: er bidragsyter til datamaskininnhold for (korporasjon) @no
definition: Relaterer en korporasjon til en manifestasjon som er et aggregat som realiserer datamaskininnhold skapt av en korporasjon. @no
toolkit label: bidragsyter til datamaskininnhold for (korporasjon) @no
toolkit definition: En manifestasjon som er et aggregat som realiserer datamaskininnhold skapt av en korporasjon. @no
label: is bijdrager-corporatie van computercontent van @nl
definition: Relateert een corporatie aan een manifestatie die een aggregaat is die een expressie van computercontent verwezenlijkt die is gecreëerd door een corporatie. @nl
toolkit label: bijdrager-corporatie van computercontent van @nl
toolkit definition: Een manifestatie die een aggregaat is die een expressie van computercontent verwezenlijkt die is gecreëerd door een corporatie. @nl
label: هي هيئة مساهمة في محتوى حاسوبي لـ @ar
definition: يربط هيئة بتجسيدة عبارة عن تجميعة تجسد محتوى حاسوبي أنشأته هيئة. @ar
toolkit label: هيئة مساهمة في محتوى حاسوبي @ar
toolkit definition: تجسيدة تمثل تجميعة تجسد محتوى حاسوبي أنشأته هيئة. @ar
label: és entitat corporativa contribuïdora de contingut informàtic de @ca
definition: Relaciona una entitat corporativa amb una manifestació que és un agregat que materialitza una expressió de contingut informàtic creada per una entitat corporativa. @ca
toolkit label: entitat corporativa contribuïdora de contingut informàtic de @ca
toolkit definition: Manifestació que és un agregat que materialitza una expressió de contingut informàtic creada per una entitat corporativa. @ca
label: er korporation, som er bidragsyder til computerindhold af @da
definition: Relaterer en korporation til en manifestation, som er en samling, som rummer et udtryk af computerindhold skabt af en korporation. @da
toolkit label: korporation, som er bidragsyder til computerindhold af @da
toolkit definition: Manifestation, som er en samling, som rummer et udtryk af computerindhold skabt af en korporation. @da
label: digisisu kaastööline (asutus) kehastuses @et
definition: Seostab asutuse kehastusega, mis on liitum, milles on teostatud asutuse loodud digisisu väljendus. @et
toolkit label: digisisu kaastööline (asutus) kehastuses @et
toolkit definition: Kehastus, mis on liitum, milles on teostatud asutuse loodud digisisu väljendus. @et
label: ist Körperschaft als Beiträgerin/Beiträger von Computer Content von @de
definition: Setzt eine Körperschaft in Beziehung zu einem Aggregat (Manifestation), das eine Expression von Computer Content verkörpert, die eine Körperschaft erstellt hat. @de
toolkit label: Körperschaft als Beiträgerin/Beiträger von Computer Content von @de
toolkit definition: Ein Aggregat (Manifestation), das eine Expression von Computer Content verkörpert, die eine Körperschaft erstellt hat. @de
label: közreműködő testülete a következő számítógépes tartalomnak: @hu
definition: Hozzákapcsol egy testületet egy aggregátum megjelenési formához, amely egy testület által létrehozott számítógépes tartalom kifejezési formáját testesíti meg. @hu
toolkit label: közreműködő testülete a következő számítógépes tartalomnak: @hu
toolkit definition: Egy aggregátum megjelenési forma, amely egy testület által létrehozott számítógépes tartalom kifejezési formáját testesíti meg. @hu
label: è contributore ente di contenuto informatico di @it
definition: Correla un ente a una manifestazione che è un aggregato che materializza contenuto informatico creato da un ente. @it
toolkit label: contributore ente di contenuto informatico di @it
toolkit definition: Manifestazione che è un aggregato che materializza contenuto informatico creato da un ente. @it
label: είναι συντελεστής συλλογικό όργανο του περιεχομένου του υπολογιστή του @el
toolkit label: συντελεστής συλλογικό όργανο του περιεχομένου του υπολογιστή του @el
label: est une collectivité contributrice de contenu informatique de @fr
definition: Met une collectivité en relation avec une manifestation qui consiste en un agrégat matérialisant une expression d’un contenu informatique créé par une collectivité. @fr
toolkit label: collectivité contributrice de contenu informatique de @fr
toolkit definition: Manifestation qui consiste en un agrégat matérialisant une expression d’un contenu informatique créé par une collectivité. @fr
label: ir datororientēta satura līdzradītājs (institūcija) @lv
definition: Sasaista institūciju ar manifestāciju, kas ir apkopojums, kas ietver institūcijas radītu datororientētu saturu. @lv
toolkit label: ir datororientēta satura līdzradītājs (institūcija) @lv
toolkit definition: Manifestācija, kas ir apkopojums, kas ietver institūcijas radītu datororientētu saturu. @lv
label: 是……的计算机内容贡献者团体 @zh-hans
definition: 将一个团体与作为一种合集、把一个团体所创作的一种计算机内容的内容表达具体化的一种载体表现关联起来。 @zh-hans
toolkit label: ……的计算机内容贡献者团体 @zh-hans
toolkit definition: 作为一种合集、把一个团体所创作的一种计算机内容的内容表达具体化的一种载体表现 @zh-hans
label: bilgisayar içeriğine katkıda bulunan tüzel kişisidir @tr
definition: Bir tüzel kişiyi, bir tüzel kişilik tarafından yaratılan bilgisayar içeriğinin bir ifadesini somutlaştıran bir bütün olan gösterimle ilişkilendirir. @tr
toolkit label: bilgisayar içeriğine katkıda bulunan tüzel kişi @tr
toolkit definition: Tüzel bir kişilik tarafından oluşturulan bir bilgisayar destekli içeriğin anlatımını somutlaştıran topluluk olan bir gösterim. @tr
has subproperty: P50821

liikkuvaan kuvaan osallinen yhteisö manifestaatiossa
status: Published
label: is contributor corporate body of moving image of @en
lexical alias: contributorCorporateBodyOfMovingImageOf.en
definition: Relates a corporate body to a manifestation that is an aggregate that embodies an expression of a moving image work that is created by a corporate body. @en
toolkit label: contributor corporate body of moving image of @en
toolkit definition: A manifestation that is an aggregate that embodies an expression of a moving image work that is created by a corporate body. @en
type: Property
domain: C10005
has element type: 2
sub property of: aggregaattiin osallinen yhteisö manifestaatiossa
sub property of: liikkuvaan kuvaan osallinen yhteistoimija
definition: Liittää yhteisön manifestaatioon, joka on aggregaatti, joka sisältää liikkuvan kuvan teoksen ekspression, jonka yhteisö on luonut.
toolkit label: liikkuvaan kuvaan osallinen yhteisö manifestaatiossa
toolkit definition: Manifestaatio, joka on aggregaatti, joka sisältää liikkuvan kuvan teoksen ekspression, jonka yhteisö on luonut.
label: er bidragsyter til levende bilder for (korporasjon) @no
definition: Relaterer en korporasjon til en manifestasjon som er et aggregat som realiserer et verk med levende bilder skapt av en korporasjon. @no
toolkit label: bidragsyter til levende bilder for (korporasjon) @no
toolkit definition: En manifestasjon som er et aggregat som realiserer et verk med levende bilder skapt av en korporasjon. @no
label: is bijdrager-corporatie van bewegend beeld van @nl
definition: Relateert een corporatie aan een manifestatie die een aggregaat is die een expressie van een bewegend beeldwerk verwezenlijkt dat is gecreëerd door een corporatie. @nl
toolkit label: bijdrager-corporatie van bewegend beeld van @nl
toolkit definition: Een manifestatie die een aggregaat is die een expressie van een bewegend beeldwerk verwezenlijkt dat is gecreëerd door een corporatie. @nl
label: هي هيئة مساهمة في صور متحركة لـ @ar
definition: يربط هيئة بتجسيدة عبارة عن تجميعة تجسد عملا صور متحركة أنشأته هيئة. @ar
toolkit label: هيئة مساهمة في صور متحركة @ar
toolkit definition: تجسيدة تمثل تجميعة تجسد عملا صور متحركة أنشأته هيئة. @ar
label: és entitat corporativa contribuïdora d’imatge en moviment de @ca
definition: Relaciona una entitat corporativa amb una manifestació que és un agregat que materialitza una expressió d’una obra d’imatge en moviment que és creada per una entitat corporativa. @ca
toolkit label: entitat corporativa contribuïdora d’imatge en moviment de @ca
toolkit definition: Manifestació que és un agregat que materialitza una expressió d’una obra d’imatge en moviment que és creada per una entitat corporativa. @ca
label: er korporation, som er bidragsyder til levende billede af @da
definition: Relaterer en korporation til en manifestation, som er en samling, som rummer et udtryk af et værk med levende billeder, som er skabt af en korporation. @da
toolkit label: korporation, som er bidragsyder til levende billede af @da
toolkit definition: Manifestation, som er en samling, som rummer et udtryk af et værk med levende billeder, som er skabt af en korporation. @da
label: kaastööline liikuva pildi alal (asutus) kehastuses @et
definition: Seostab asutuse kehastusega, mis on liitum, milles on teostatud asutuse loodud liikuvast pildist koosneva teose väljendus. @et
toolkit label: kaastööline liikuva pildi alal (asutus) kehastuses @et
toolkit definition: Kehastus, mis on liitum, milles on teostatud asutuse loodud liikuvast pildist koosneva teose väljendus. @et
label: ist Körperschaft als Beiträgerin/Beiträger von einem Bewegtbild von @de
definition: Setzt eine Körperschaft in Beziehung zu einem Aggregat (Manifestation), das eine Expression eines Bewegtbildwerks verkörpert, die eine Körperschaft erstellt hat. @de
toolkit label: Körperschaft als Beiträgerin/Beiträger von einem Bewegtbild von @de
toolkit definition: Ein Aggregat (Manifestation), das eine Expression eines Bewegtbildwerks verkörpert, die eine Körperschaft erstellt hat. @de
label: közreműködő testülete a következő mozgóképnek: @hu
definition: Hozzákapcsol egy testületet egy aggregátum megjelenési formához, amely egy testület által létrehozott mozgóképmű kifejezési formáját testesíti meg. @hu
toolkit label: közreműködő testülete a következő mozgóképnek: @hu
toolkit definition: Egy aggregátum megjelenési forma, amely egy testület által létrehozott mozgóképmű kifejezési formáját testesíti meg. @hu
label: è contributore ente di immagine in movimento di @it
definition: Correla un ente a una manifestazione che è un aggregato che materializza un'opera immagine in movimento creata da un ente. @it
toolkit label: contributore ente di immagine in movimento di @it
toolkit definition: Manifestazione che è un aggregato che materializza un'opera immagine in movimento creata da un ente. @it
label: είναι συντελεστής συλλογικό όργανο της κινητής εικόνας του @el
toolkit label: συντελεστής συλλογικό όργανο της κινητής εικόνας του @el
label: est une collectivité contributrice d’images animées de @fr
definition: Met une collectivité en relation avec une manifestation qui consiste en un agrégat matérialisant une expression d’une œuvre d’images animées créée par une collectivité. @fr
toolkit label: collectivité contributrice d’images animées de @fr
toolkit definition: Manifestation qui consiste en un agrégat matérialisant une expression d’une œuvre d’images animées créée par une collectivité. @fr
label: ir kustīga attēla līdzradītājs (institūcija) @lv
definition: Sasaista institūciju ar manifestāciju, kas ir apkopojums, kas ietver institūcijas radītu kustīga attēla darbu. @lv
toolkit label: ir kustīga attēla līdzradītājs (institūcija) @lv
toolkit definition: Manifestācija, kas ir apkopojums, kas ietver institūcijas radītu kustīga attēla darbu. @lv
label: 是……的动态图像的贡献者团体 @zh-hans
definition: 将一个团体与作为一种合集、把一个团体所创作的一种动态图像作品的内容表达具体化的一种载体表现关联起来。 @zh-hans
toolkit label: ……的动态图像的贡献者团体 @zh-hans
toolkit definition: 作为一种合集、把一个团体所创作的一种动态图像作品的内容表达具体化的一种载体表现 @zh-hans
label: hareketli görüntüsünün katkıda bulunan tüzel kişisidir @tr
definition: Bir tüzel kişiyi, tüzel kişi tarafından yaratılan hareketli görüntü çalışmasının bir ifadesini somutlaştıran bütün olan bir gösterimle ilişkilendirir. @tr
toolkit label: hareketli̇ görüntüye katkıda bulunan tüzel kişi @tr
toolkit definition: Tüzel bir kişi tarafından oluşturulan hareketli bir görüntü eserinin anlatımını somutlaştıran topluluk olan bir gösterim. @tr
has subproperty: P50815

musiikkiin osallinen yhteisö manifestaatiossa
status: Published
label: is contributor corporate body of music of @en
lexical alias: contributorCorporateBodyOfMusicOf.en
definition: Relates a corporate body to a manifestation that is an aggregate that embodies an expression of a musical work that is created by a corporate body. @en
toolkit label: contributor corporate body of music of @en
toolkit definition: A manifestation that is an aggregate that embodies an expression of a musical work that is created by a corporate body. @en
type: Property
domain: C10005
has element type: 2
sub property of: aggregaattiin osallinen yhteisö manifestaatiossa
sub property of: musiikkiin osallinen yhteistoimija manifestaatiossa
definition: Liittää yhteisön manifestaatioon, joka on aggregaatti, joka sisältää musiikkiteoksen ekspression, jonka yhteisö on luonut.
toolkit label: musiikkiin osallinen yhteisö manifestaatiossa
toolkit definition: Manifestaatio, joka on aggregaatti, joka sisältää musiikkiteoksen ekspression, jonka yhteisö on luonut.
label: er bidragsyter til musikk for (korporasjon) @no
definition: Relaterer en korporasjon til en manifestasjon som er et aggregat som realiserer et musikalsk verk skapt av en korporasjon. @no
toolkit label: bidragsyter til musikk for (korporasjon) @no
toolkit definition: En manifestasjon som er et aggregat som realiserer et musikalsk verk skapt av en korporasjon. @no
label: is bijdrager-corporatie van muziek van @nl
definition: Relateert een corporatie aan een manifestatie die een aggregaat is die een expressie van een muziekwerk verwezenlijkt dat is gecreëerd door een corporatie. @nl
toolkit label: bijdrager-corporatie van muziek van @nl
toolkit definition: Een manifestatie die een aggregaat is die een expressie van een muziekwerk verwezenlijkt dat is gecreëerd door een corporatie. @nl
label: هي هيئة مساهمة في موسيقى لـ @ar
definition: يربط هيئة بتجسيدة عبارة عن تجميعة تجسد عملًا موسيقيًا أنشأته هيئة. @ar
toolkit label: هيئة مساهمة في موسيقى @ar
toolkit definition: تجسيدة تمثل تجميعة تجسد عملًا موسيقيًا تم إنشاؤه بمعرفة هيئة. @ar
label: és entitat corporativa contribuïdora de música de @ca
definition: Relaciona una entitat corporativa amb una manifestació que és un agregat que materialitza una expressió d’una obra musical que és creada per una entitat corporativa. @ca
toolkit label: entitat corporativa contribuïdora de música de @ca
toolkit definition: Manifestació que és un agregat que materialitza una expressió d’una obra musical que és creada per una entitat corporativa. @ca
label: er korporation, som er bidragsyder til musik af @da
definition: Relaterer en korporation til en manifestation, som er en samling, som rummer et udtryk af et musikværk, som er skabt af en korporation. @da
toolkit label: korporation, som er bidragsyder til musik af @da
toolkit definition: Manifestation, som er en samling, som rummer et udtryk af et musikværk, som er skabt af en korporation. @da
label: muusikaline kaastööline (asutus) kehastuses @et
definition: Seostab asutuse kehastusega, mis on liitum, milles on teostatud asutuse loodud muusikateose väljendus. @et
toolkit label: muusikaline kaastööline (asutus) kehastuses @et
toolkit definition: Kehastus, mis on liitum, milles on teostatud asutuse loodud muusikateose väljendus. @et
label: ist Körperschaft als Beiträgerin/Beiträger einer Musik von @de
definition: Setzt eine Körperschaft in Beziehung zu einem Aggregat (Manifestation), das eine Expression eines Musikwerks verkörpert, die eine Körperschaft erstellt hat. @de
toolkit label: Körperschaft als Beiträgerin/Beiträger einer Musik von @de
toolkit definition: Ein Aggregat (Manifestation), das eine Expression eines Musikwerks verkörpert, die eine Körperschaft erstellt hat. @de
label: közreműködő testülete a következő a zenének: @hu
definition: Hozzákapcsol egy testületet egy aggregátum megjelenési formához, amely egy testület által létrehozott zenemű kifejezési formáját testesíti meg. @hu
toolkit label: közreműködő testülete a következő zenének: @hu
toolkit definition: Egy aggregátum megjelenési forma, amely egy testület által létrehozott zenemű kifejezési formáját testesíti meg. @hu
label: è contributore ente di musica di @it
definition: Correla un ente a una manifestazione che è un aggregato che materializza un'opera musicale creata da un ente. @it
toolkit label: contributore ente di musica di @it
toolkit definition: Manifestazione che è un aggregato che materializza un'opera musicale creata da un ente. @it
label: είναι συντελεστής συλλογικό όργανο της μουσικής του @el
toolkit label: συντελεστής συλλογικό όργανο της μουσικής του @el
label: est une collectivité contributrice de musique de @fr
definition: Met une collectivité en relation avec une manifestation qui consiste en un agrégat matérialisant une expression d’une œuvre musicale créée par une collectivité. @fr
toolkit label: collectivité contributrice de musique de @fr
toolkit definition: Manifestation qui consiste en un agrégat matérialisant une expression d’une œuvre musicale créée par une collectivité. @fr
label: ir mūzikas līdzradītājs (institūcija) @lv
definition: Sasaista institūciju ar manifestāciju, kas ir apkopojums, kas ietver institūcijas radītu mūzikas darbu. @lv
toolkit label: ir mūzikas līdzradītājs (institūcija) @lv
toolkit definition: Manifestācija, kas ir apkopojums, kas ietver institūcijas radītu mūzikas darbu. @lv
label: 是……的音乐的贡献者团体 @zh-hans
definition: 将一个团体与作为一种合集、把一个团体所创作的一种音乐作品的内容表达具体化的一种载体表现关联起来。 @zh-hans
toolkit label: ……的音乐的贡献者团体 @zh-hans
toolkit definition: 作为一种合集、把一个团体所创作的一种音乐作品的内容表达具体化的一种载体表现 @zh-hans
label: müziğinin katkıda bulunan tüzel kişisidir @tr
definition: Bir tüzel kişiyi, bir tüzel kişi tarafından yaratılan bir müzik eserinin ifadesini somutlaştıran bir bütün olan bir gösterimle ilişkilendirir. @tr
toolkit label: müzi̇ğe katkıda bulunan tüzel kişi @tr
toolkit definition: Tüzel bir kişi tarafından oluşturulan bir müzik eserinin anlatımını somutlaştıran topluluk olan bir gösterim. @tr
has subproperty: P50816

esineeseen osallinen yhteisö manifestaatiossa
status: Published
label: is contributor corporate body of object of @en
lexical alias: contributorCorporateBodyOfObjectOf.en
definition: Relates a corporate body to a manifestation that is an aggregate that embodies an expression of an object work that is created by a corporate body. @en
toolkit label: contributor corporate body of object of @en
toolkit definition: A manifestation that is an aggregate that embodies an expression of an object work that is created by a corporate body. @en
type: Property
domain: C10005
has element type: 2
sub property of: aggregaattiin osallinen yhteisö manifestaatiossa
sub property of: esineeseen osallinen yhteistoimija manifestaatiossa
definition: Liittää yhteisön manifestaatioon, joka on aggregaatti, joka sisältää esineteoksen ekspression, jonka yhteisö on luonut.
toolkit label: esineeseen osallinen yhteisö manifestaatiossa
toolkit definition: Manifestaatio, joka on aggregaatti, joka sisältää esineteoksen ekspression, jonka yhteisö on luonut.
label: er bidragsyter til gjenstand for (korporasjon) @no
definition: Relaterer en korporasjon til en manifestasjon som er et aggregat som realiserer et verk som er en gjenstand skapt av en korporasjon. @no
toolkit label: bidragsyter til gjenstand for (korporasjon) @no
toolkit definition: En manifestasjon som er et aggregat som realiserer et verk som er en gjenstand skapt av en korporasjon. @no
label: is bijdrager-corporatie van object van @nl
definition: Relateert een corporatie aan een manifestatie die een aggregaat is die een expressie van een objectwerk verwezenlijkt dat is gecreëerd door een corporatie. @nl
toolkit label: bijdrager-corporatie van object van @nl
toolkit definition: Een manifestatie die een aggregaat is die een expressie van een objectwerk verwezenlijkt dat is gecreëerd door een corporatie. @nl
label: هي هيئة مساهمة في كيان لـ @ar
definition: يربط هيئة بتجسيدة عبارة عن تجميعة تجسد عملا كائنا أنشأته هيئة. @ar
toolkit label: هيئة مساهمة في كيان @ar
toolkit definition: تجسيدة تمثل تجميعة تجسد عملا كائنا أنشأته هيئة. @ar
label: és entitat corporativa contribuïdora d’objecte de @ca
definition: Relaciona una entitat corporativa amb una manifestació que és un agregat que materialitza una expressió d’una obra d’objecte que és creada per una entitat corporativa. @ca
toolkit label: entitat corporativa contribuïdora d’objecte de @ca
toolkit definition: Manifestació que és un agregat que materialitza una expressió d’una obra d’objecte que és creada per una entitat corporativa. @ca
label: er korporation, som er bidragsyder til objekt af @da
definition: Relaterer en korporation til en manifestation, som er en samling, som rummer et udtryk af et værk med objekt, som er skabt af en korporation. @da
toolkit label: korporation, som er bidragsyder til objekt af @da
toolkit definition: Manifestation, som er en samling, som rummer et udtryk af et værk med objekt, som er skabt af en korporation. @da
label: objektiloome kaastööline (asutus) kehastuses @et
definition: Seostab asutuse kehastusega, mis on liitum, milles on teostatud asutuse loodud objektteose väljendus. @et
toolkit label: objektiloome kaastööline (asutus) kehastuses @et
toolkit definition: Kehastus, mis on liitum, milles on teostatud asutuse loodud objektteose väljendus. @et
label: ist Körperschaft als Beiträgerin/Beiträger von einem Gegenstand von @de
definition: Setzt eine Körperschaft in Beziehung zu einem Aggregat (Manifestation), das eine Expression eines gegenständlichen Werks verkörpert, die eine Körperschaft erstellt hat. @de
toolkit label: Körperschaft als Beiträgerin/Beiträger von einem Gegenstand von @de
toolkit definition: Ein Aggregat (Manifestation), das eine Expression eines gegenständlichen Werks verkörpert, die eine Körperschaft erstellt hat. @de
label: közreműködő testülete a következő objektumnak: @hu
definition: Hozzákapcsol egy testületet egy aggregátum megjelenési formához, amely egy testület által létrehozott objektummű kifejezési formáját testesíti meg. @hu
toolkit label: közreműködő testülete a következő objektumnak: @hu
toolkit definition: Egy aggregátum megjelenési forma, amely egy testület által létrehozott objektummű kifejezési formáját testesíti meg. @hu
label: è contributore ente di oggetto di @it
definition: Correla un ente a una manifestazione che è un aggregato che materializza un'opera oggetto creata da un ente. @it
toolkit label: contributore ente di oggetto di @it
toolkit definition: Manifestazione aggregata che comprende un'opera oggettuale creata da un ente. @it
label: είναι συντελεστής συλλογικό όργανο του αντικειμένου του @el
toolkit label: συντελεστής συλλογικό όργανο του αντικειμένου του @el
label: est une collectivité contributrice d’objet de @fr
definition: Met une collectivité en relation avec une manifestation qui consiste en un agrégat matérialisant une expression d’une œuvre objet créée par une collectivité. @fr
toolkit label: collectivité contributrice d’objet de @fr
toolkit definition: Manifestation qui consiste en un agrégat matérialisant une expression d’une œuvre objet créée par une collectivité. @fr
label: ir objekta līdzradītājs (institūcija) @lv
definition: Sasaista institūciju ar manifestāciju, kas ir apkopojums, kas ietver institūcijas radītu objekta darbu. @lv
toolkit label: ir objekta līdzradītājs (institūcija) @lv
toolkit definition: Manifestācija, kas ir apkopojums, kas ietver institūcijas radītu objekta darbu. @lv
label: 是……的物体的贡献者团体 @zh-hans
definition: 将一个团体与作为一种合集、把一个团体所创作的一种物体作品的内容表达具体化的一种载体表现关联起来。 @zh-hans
toolkit label: ……的物体的贡献者团体 @zh-hans
toolkit definition: 作为一种合集、把一个团体所创作的一种物体作品的内容表达具体化的一种载体表现 @zh-hans
label: nesnesinin katkıda bulunan tüzel kişisidir @tr
definition: Bir tüzel kişiyi, bir tüzel kişilik tarafından yaratılan bir nesne çalışmasının ifadesini somutlaştıran bir bütün olan gösterimle ilişkilendirir. @tr
toolkit label: nesneye katkıda bulunan tüzel kişi @tr
toolkit definition: Tüzel bir kişi tarafından oluşturulan bir nesne eserinin anlatımını somutlaştıran topluluk olan bir gösterim. @tr
has subproperty: P50820

puheeseen osallinen yhteisö manifestaatiossa
status: Published
label: is contributor corporate body of speech of @en
lexical alias: contributorCorporateBodyOfSpeechOf.en
definition: Relates a corporate body to a manifestation that is an aggregate that embodies an expression of a vocal work that is created by a corporate body. @en
toolkit label: contributor corporate body of speech of @en
toolkit definition: A manifestation that is an aggregate that embodies an expression of a vocal work that is created by a corporate body. @en
type: Property
domain: C10005
has element type: 2
sub property of: aggregaattiin osallinen yhteisö manifestaatiossa
sub property of: puheeseen osallinen yhteistoimija manifestaatiossa
definition: Liittää yhteisön manifestaatioon, joka on aggregaatti, joka sisältää puheteoksen ekspression, jonka yhteisö on luonut.
toolkit label: puheeseen osallinen yhteisö manifestaatiossa
toolkit definition: Manifestaatio, joka on aggregaatti, joka sisältää puheteoksen ekspression, jonka yhteisö on luonut.
label: er bidragsyter til tale for (korporasjon) @no
definition: Relaterer en korporasjon til en manifestasjon som er et aggregat som realiserer et verk av tale skapt av en korporasjon. @no
toolkit label: bidragsyter til tale for (korporasjon) @no
toolkit definition: En manifestasjon som er et aggregat som realiserer et verk av tale skapt av en korporasjon. @no
label: is bijdrager-corporatie van spraak van @nl
definition: Relateert een corporatie aan een manifestatie die een aggregaat is die een expressie van een vocaal werk verwezenlijkt dat is gecreëerd door een corporatie. @nl
toolkit label: bijdrager-corporatie van spraak van @nl
toolkit definition: Een manifestatie die een aggregaat is die een expressie van een vocaal werk verwezenlijkt dat is gecreëerd door een corporatie. @nl
label: هي هيئة مساهمة في حديث لـ @ar
definition: يربط هيئة بتجسيدة عبارة عن تجميعة تجسد عملا كلمة منطوقة أنشأته هيئة. @ar
toolkit label: هيئة مساهمة في حديث @ar
toolkit definition: تجسيدة تمثل تجميعة تجسد عملا كلمة منطوقة أنشأه هيئة. @ar
label: és entitat corporativa contribuïdora de discurs de @ca
definition: Relaciona una entitat corporativa amb una manifestació que és un agregat que materialitza una expressió d’una obra vocal que és creada per una entitat corporativa. @ca
toolkit label: entitat corporativa contribuïdora de discurs de @ca
toolkit definition: Manifestació que és un agregat que materialitza una expressió d’una obra vocal que és creada per una entitat corporativa. @ca
label: er korporation, som er bidragsyder til tale af @da
definition: Relaterer en korporation til en manifestation, som er en samling, som rummer et udtryk af et værk med talte ord, som er skabt af en korporation. @da
toolkit label: korporation, som er bidragsyder til tale af @da
toolkit definition: Manifestation, som er en samling, som rummer et udtryk af et værk med talte ord, som er skabt af en korporation. @da
label: kõneloome kaastööline (asutus) kehastuses @et
definition: Seostab asutuse kehastusega, mis on liitum, milles on teostatud asutuse loodud suulise teose väljendus. @et
toolkit label: kõneloome kaastööline (asutus) kehastuses @et
toolkit definition: Kehastus, mis on liitum, milles on teostatud asutuse loodud suulise teose väljendus. @et
label: ist Körperschaft als Beiträgerin/Beiträger von einer Rede von @de
definition: Setzt eine Körperschaft in Beziehung zu einem Aggregat (Manifestation), das eine Expression eines gesprochenen Werks verkörpert, die eine Körperschaft erstellt hat. @de
toolkit label: Körperschaft als Beiträgerin/Beiträger von einer Rede von @de
toolkit definition: Ein Aggregat (Manifestation), das eine Expression eines gesprochenen Werks verkörpert, die eine Körperschaft erstellt hat. @de
label: közreműködő testülete a következő beszédnek: @hu
definition: Hozzákapcsol egy testületet egy aggregátum megjelenési formához, amely egy testület által létrehozott beszédmű kifejezési formáját testesíti meg. @hu
toolkit label: közreműködő testülete a következő beszédnek: @hu
toolkit definition: Egy aggregátum megjelenési forma, amely egy testület által létrehozott beszédmű kifejezési formáját testesíti meg. @hu
label: è contributore ente di discorso di @it
definition: Correla un ente a una manifestazione che è un aggregato che materializza un'opera orale creata da un ente. @it
toolkit label: contributore ente di discorso di @it
toolkit definition: Manifestazione che è un aggregato che materializza un'opera orale creata da un ente. @it
label: είναι συντελεστής συλλογικό όργανο της ομιλίας του @el
toolkit label: συντελεστής συλλογικό όργανο της ομιλίας του @el
label: est une collectivité contributrice de contenu vocal de @fr
definition: Met une collectivité en relation avec une manifestation qui consiste en un agrégat matérialisant une expression d’une œuvre vocale créée par une collectivité. @fr
toolkit label: collectivité contributrice de contenu vocal de @fr
toolkit definition: Manifestation qui consiste en un agrégat matérialisant une expression d’une œuvre vocale créée par une collectivité. @fr
label: ir runas līdzradītājs (institūcija) @lv
definition: Sasaista institūciju ar manifestāciju, kas ir apkopojums, kas ietver institūcijas radītu mutvārdu darbu. @lv
toolkit label: ir runas līdzradītājs (institūcija) @lv
toolkit definition: Manifestācija, kas ir apkopojums, kas ietver institūcijas radītu mutvārdu darbu. @lv
label: 是……的讲话的贡献者团体 @zh-hans
definition: 将一个团体与作为一种合集、把一个团体所创作的一种人声作品的内容表达具体化的一种载体表现关联起来。 @zh-hans
toolkit label: ……的讲话的贡献者团体 @zh-hans
toolkit definition: 作为一种合集、把一个团体所创作的一种人声作品的内容表达具体化的一种载体表现 @zh-hans
label: konuşmasının katkıda bulunan tüzel kişisidir @tr
definition: Bir tüzel kişiyi, bir tüzel kişilik tarafından yaratılan bir ses eserinin ifadesini somutlaştıran bir bütün olan bir gösterimle ilişkilendirir. @tr
toolkit label: konuşmaya katkıda bulunan tüzel kişi @tr
toolkit definition: Bir tüzel kişi tarafından oluşturulan bir vokal eserin anlatımını somutlaştıran topluluk olan bir gösterim. @tr
has subproperty: P50817

stillkuvaan osallinen yhteisö manifestaatiossa
status: Published
label: is contributor corporate body of still image of @en
lexical alias: contributorCorporateBodyOfStillImageOf.en
definition: Relates a corporate body to a manifestation that is an aggregate that embodies an expression of a still image work that is created by a corporate body. @en
toolkit label: contributor corporate body of still image of @en
toolkit definition: A manifestation that is an aggregate that embodies an expression of a still image work that is created by a corporate body. @en
type: Property
domain: C10005
has element type: 2
sub property of: aggregaattiin osallinen yhteisö manifestaatiossa
sub property of: stillkuvaan osallinen yhteistoimija manifestaatiossa
definition: Liittää yhteisön manifestaatioon, joka on aggregaatti, joka sisältää stillkuvateoksen ekspression, jonka yhteisö on luonut.
toolkit label: stillkuvaan osallinen yhteisö manifestaatiossa
toolkit definition: Manifestaatio, joka on aggregaatti, joka sisältää stillkuvateoksen ekspression, jonka yhteisö on luonut.
label: er bidragsyter til bilde for (korporasjon) @no
definition: Relaterer en korporasjon til en manifestasjon som er et aggregat som realiserer et bildeverk skapt av en korporasjon. @no
toolkit label: bidragsyter til bilde for (korporasjon) @no
toolkit definition: En manifestasjon som er et aggregat som realiserer et bildeverk skapt av en korporasjon. @no
label: is bijdrager-corporatie van stilstaand beeld van @nl
definition: Relateert een corporatie aan een manifestatie die een aggregaat is die een expressie van een stilstaand beeldwerk verwezenlijkt dat is gecreëerd door een corporatie. @nl
toolkit label: bijdrager-corporatie van stilstaand beeld van @nl
toolkit definition: Een manifestatie die een aggregaat is die een expressie van een stilstaand beeldwerk verwezenlijkt dat is gecreëerd door een corporatie. @nl
label: هي هيئة مساهمة في صور ثابتة لـ @ar
definition: يربط هيئة بتجسيدة عبارة عن تجميعة تجسد عملا بصور ثابتة أنشأته هيئة. @ar
toolkit label: هيئة مساهمة في صور ثابتة @ar
toolkit definition: تجسيدة تمثل تجميعة تجسد عملا بصور ثابتة أنشأته هيئة. @ar
label: és entitat corporativa contribuïdora d’imatge fixa de @ca
definition: Relaciona una entitat corporativa amb una manifestació que és un agregat que materialitza una expressió d’una obra d’imatge fixa que és creada per una entitat corporativa. @ca
toolkit label: entitat corporativa contribuïdora d’imatge fixa de @ca
toolkit definition: Manifestació que és un agregat que materialitza una expressió d’una obra d’imatge fixa que és creada per una entitat corporativa. @ca
label: er korporation, som er bidragsyder til stillbillede af @da
definition: Relaterer en korporation til en manifestation, som er en samling, som rummer et udtryk af et værk med stillbilleder, som er skabt af en korporation. @da
toolkit label: korporation, som er bidragsyder til stillbillede af @da
toolkit definition: Manifestation, som er en samling, som rummer et udtryk af et værk med stillbilleder, som er skabt af en korporation. @da
label: kaastööline liikumatu pildi alal (asutus) kehastuses @et
definition: Seostab asutuse kehastusega, mis on liitum, milles on teostatud asutuse loodud liikumatust pildist koosneva teose väljendus. @et
toolkit label: kaastööline liikumatu pildi alal (asutus) kehastuses @et
toolkit definition: Kehastus, mis on liitum, milles on teostatud asutuse loodud liikumatust pildist koosneva teose väljendus. @et
label: ist Körperschaft als Illustratorin/Illustrator von @de
definition: Setzt eine Körperschaft in Beziehung zu einem Aggregat (Manifestation), das eine Expression eines unbewegten Bildwerks verkörpert, die eine Körperschaft erstellt hat. @de
toolkit label: ist Körperschaft als Illustratorin/Illustrator von @de
toolkit definition: Ein Aggregat (Manifestation), das eine Expression eines unbewegten Bildwerks verkörpert, die eine Körperschaft erstellt hat. @de
label: közreműködő testülete a következő állóképnek: @hu
definition: Hozzákapcsol egy testületet egy aggregátum megjelenési formához, amely egy testület által létrehozott állóképmű kifejezési formáját testesíti meg. @hu
toolkit label: közreműködő testülete a következő állóképnek: @hu
toolkit definition: Egy aggregátum megjelenési forma, amely egy testület által létrehozott állóképmű kifejezési formáját testesíti meg. @hu
label: è contributore ente di immagine fissa di @it
definition: Correla un ente a una manifestazione che è un aggregato che materializza un'opera immagine fissa creata da un ente. @it
toolkit label: contributore ente di immagine fissa di @it
toolkit definition: Manifestazione che è un aggregato che materializza un'opera immagine fissa creata da un ente. @it
label: είναι συντελεστής συλλογικό όργανο της σταθερής εικόνας του @el
toolkit label: συντελεστής συλλογικό όργανο της σταθερής εικόνας του @el
label: est une collectivité contributrice d’image fixe de @fr
definition: Met une collectivité en relation avec une manifestation qui consiste en un agrégat matérialisant une expression d’une œuvre d’image fixe créée par une collectivité. @fr
toolkit label: collectivité contributrice d’image fixe de @fr
toolkit definition: Manifestation qui consiste en un agrégat matérialisant une expression d’une œuvre d’image fixe créée par une collectivité. @fr
label: ir attēla līdzradītājs (institūcija) @lv
definition: Sasaista institūciju ar manifestāciju, kas ir apkopojums, kas ietver institūcijas radītu attēla darbu. @lv
toolkit label: ir attēla līdzradītājs (institūcija) @lv
toolkit definition: Manifestācija, kas ir apkopojums, kas ietver institūcijas radītu attēla darbu. @lv
label: 是……的静态图像的贡献者团体 @zh-hans
definition: 将一个团体与作为一种合集、把一个团体所创作的一种静态图像作品的内容表达具体化的一种载体表现关联起来。 @zh-hans
toolkit label: ……的静态图像的贡献者团体 @zh-hans
toolkit definition: 作为一种合集、把一个团体所创作的一种静态图像作品的内容表达具体化的一种载体表现 @zh-hans
label: durağan görüntüsünün katkıda bulunan tüzel kişisidir @tr
definition: Bir tüzel kişiyi, bir tüzel kişi tarafından yaratılan hareketsiz görüntü çalışmasının ifadesini somutlaştıran bir bütün olan gösterimle ilişkilendirir. @tr
toolkit label: hareketsiz görüntüye katkıda bulunan tüzel kişi @tr
toolkit definition: Tüzel bir kişi tarafından oluşturulan hareketsiz bir görüntü eserinin anlatımını somutlaştıran topluluk olan bir gösterim. @tr
has subproperty: P50818

tekstiin osallinen yhteisö manifestaatiossa
status: Published
label: is contributor corporate body of text of @en
lexical alias: contributorCorporateBodyOfTextOf.en
definition: Relates a corporate body to a manifestation that is an aggregate that embodies an expression of a textual work that is created by a corporate body. @en
toolkit label: contributor corporate body of text of @en
toolkit definition: A manifestation that is an aggregate that embodies an expression of a textual work that is created by a corporate body. @en
type: Property
domain: C10005
has element type: 2
sub property of: aggregaattiin osallinen yhteisö manifestaatiossa
sub property of: tekstiin osallinen yhteistoimija manifestaatiossa
definition: Liittää yhteisön manifestaatioon, joka on aggregaatti, joka sisältää tekstiteoksen ekspression, jonka yhteisö on luonut.
toolkit label: tekstiin osallinen yhteisö manifestaatiossa
toolkit definition: Manifestaatio, joka on aggregaatti, joka sisältää tekstiteoksen ekspression, jonka yhteisö on luonut.
label: er bidragsyter til tekst for (korporasjon) @no
definition: Relaterer en korporasjon til en manifestasjon som er et aggregat som realiserer et tekstlig verk skapt av en korporasjon. @no
toolkit label: bidragsyter til tekst for (korporasjon) @no
toolkit definition: En manifestasjon som er et aggregat som realiserer et tekstlig verk skapt av en korporasjon. @no
label: is bijdrager-corporatie van tekst van @nl
definition: Relateert een corporatie aan een manifestatie die een aggregaat is die een expressie van een tekstwerk verwezenlijkt dat is gecreëerd door een corporatie. @nl
toolkit label: bijdrager-corporatie van tekst van @nl
toolkit definition: Een manifestatie die een aggregaat is die een expressie van een tekstwerk verwezenlijkt dat is gecreëerd door een corporatie. @nl
label: هي هيئة مساهمة في نص لـ @ar
definition: يربط هيئة بتجسيدة عبارة عن تجميعة تجسد عملا نصي أنشأته هيئة. @ar
toolkit label: هيئة مساهمة في نص @ar
toolkit definition: تجسيدة تمثل تجميعة تجسد عملا نصي أنشأته هيئة. @ar
label: és entitat corporativa contribuïdora de text de @ca
definition: Relaciona una entitat corporativa amb una manifestació que és un agregat que materialitza una expressió d’una obra textual que és creada per una entitat corporativa. @ca
toolkit label: entitat corporativa contribuïdora de text de @ca
toolkit definition: Manifestació que és un agregat que materialitza una expressió d’una obra textual que és creada per una entitat corporativa. @ca
label: er korporation, som er bidragsyder til tekst af @da
definition: Relaterer en korporation til en manifestation, som er en samling, som rummer et udtryk af et tekstværk, som er skabt af en korporation. @da
toolkit label: korporation, som er bidragsyder til tekst af @da
toolkit definition: Manifestation, som er en samling, som rummer et udtryk af et tekstværk, som er skabt af en korporation. @da
label: tekstiloome kaastööline (asutus) kehastuses @et
definition: Seostab asutuse kehastusega, mis on liitum, milles on teostatud asutuse loodud tekstteose väljendus. @et
toolkit label: tekstiloome kaastööline (asutus) kehastuses @et
toolkit definition: Kehastus, mis on liitum, milles on teostatud asutuse loodud tekstteose väljendus. @et
label: ist Körperschaft als Beiträgerin/Beiträger von ergänzendem Text von @de
definition: Setzt eine Körperschaft in Beziehung zu einem Aggregat (Manifestation), das eine Expression eines textlichen Werks verkörpert, die eine Körperschaft erstellt hat. @de
toolkit label: ist Körperschaft als Beiträgerin/Beiträger von ergänzendem Text von @de
toolkit definition: Ein Aggregat (Manifestation), das eine Expression eines textlichen Werks verkörpert, die eine Körperschaft erstellt hat. @de
label: közreműködő testülete a következő szövegnek: @hu
definition: Hozzákapcsol egy testületet egy aggregátum megjelenési formához, amely egy testület által létrehozott szöveges mű kifejezési formáját testesíti meg. @hu
toolkit label: közreműködő testülete a következő szövegnek: @hu
toolkit definition: Egy aggregátum megjelenési forma, amely egy testület által létrehozott szöveges mű kifejezési formáját testesíti meg. @hu
label: è contributore ente di testo di @it
definition: Correla un ente a una manifestazione che è un aggregato che materializza un'opera testuale creata da un ente. @it
toolkit label: contributore ente di testo di @it
toolkit definition: Manifestazione che è un aggregato che materializza un'opera testuale creata da un ente. @it
label: είναι συντελεστής συλλογικό όργανο του κειμένου του @el
toolkit label: συντελεστής συλλογικό όργανο του κειμένου του @el
label: est une collectivité contributrice de texte de @fr
definition: Met une collectivité en relation avec une manifestation qui consiste en un agrégat matérialisant une expression d’une œuvre textuelle créée par une collectivité. @fr
toolkit label: collectivité contributrice de texte de @fr
toolkit definition: Manifestation qui consiste en un agrégat matérialisant une expression d’une œuvre textuelle créée par une collectivité. @fr
label: ir teksta līdzradītājs (institūcija) @lv
definition: Sasaista institūciju ar manifestāciju, kas ir apkopojums, kas ietver institūcijas radītu teksta darbu. @lv
toolkit label: ir teksta līdzradītājs (institūcija) @lv
toolkit definition: Manifestācija, kas ir apkopojums, kas ietver institūcijas radītu teksta darbu. @lv
label: 是……的文本的贡献者团体 @zh-hans
definition: 将一个团体与作为一种合集、把一个团体所创作的一种文字作品的内容表达具体化的一种载体表现关联起来。 @zh-hans
toolkit label: ……的文本的贡献者团体 @zh-hans
toolkit definition: 作为一种合集、把一个团体所创作的一种文字作品的内容表达具体化的一种载体表现 @zh-hans
label: metninin katkıda bulunan tüzel kişisidir @tr
definition: Bir tüzel kişiyi, bir tüzel kişilik tarafından yaratılan metinsel bir çalışmanın ifadesini somutlaştıran bir bütün olan gösterimle ilişkilendirir. @tr
toolkit label: metne katkıda bulunan tüzel kişi @tr
toolkit definition: Tüzel bir kişi tarafından oluşturulan metinsel bir eserin anlatımını somutlaştıran topluluk olan bir gösterim. @tr
has subproperty: P50819

aggregaattiin osallinen yhteisö manifestaatiossa
status: Published
label: is contributor corporate body to aggregate of @en
lexical alias: contributorCorporateBodyToAggregateOf.en
definition: Relates a corporate body to a manifestation that is an aggregate that embodies an expression of a work that is created by a corporate body. @en
toolkit label: contributor corporate body to aggregate of @en
toolkit definition: A manifestation that is an aggregate that embodies an expression of a work that is created by a corporate body. @en
type: Property
domain: C10005
has element type: 2
sub property of: yhteisöön liittyvä manifestaatio
sub property of: aggregaattiin osallinen yhteistoimija manifestaatiossa
definition: Liittää yhteisön manifestaatioon, joka on aggregaatti, joka sisältää teoksen ekspression, jonka yhteisö on luonut.
toolkit label: aggregaattiin osallinen yhteisö manifestaatiossa
toolkit definition: Manifestaatio, joka on aggregaatti, joka sisältää teoksen ekspression, jonka yhteisö on luonut.
label: er bidragsyter til aggregat for (korporasjon) @no
definition: Relaterer en korporasjon til en manifestasjon som er et aggregat som inkluderer et bidrag fra en korporasjon. @no
toolkit label: bidragsyter til aggregat for (korporasjon) @no
toolkit definition: En manifestasjon som er et aggregat som inkluderer et bidrag fra en korporasjon. @no
label: is bijdrager-corporatie aan aggregaat van @nl
definition: Relateert een corporatie aan een manifestatie die een aggregaat is die een expressie van een werk verwezenlijkt dat gecreëerd is door een corporatie. @nl
toolkit label: bijdrager-corporatie aan aggregaat van @nl
toolkit definition: Een manifestatie die een aggregaat is die een expressie van een werk verwezenlijkt dat gecreëerd is door een corporatie. @nl
label: هي هيئة مساهمة في تجميعة لـ @ar
definition: يربط هيئة بتجسيدة عبارة عن تجميعة تتضمن إسهام هيئة. @ar
toolkit label: هيئة مساهمة في تجميعة @ar
toolkit definition: تجسيدة عبارة عن تجميعة تتضمن إسهام هيئة. @ar
label: és entitat corporativa contribuïdora a un agregat de @ca
definition: Relaciona una entitat corporativa amb una manifestació que és un agregat que materialitza una expressió que és creada per una entitat corporativa. @ca
toolkit label: entitat corporativa contribuïdora a un agregat de @ca
toolkit definition: Manifestació que és un agregat que materialitza una expressió que és creada per una entitat corporativa. @ca
label: er korporation, som er bidragsyder til samling af @da
definition: Relaterer en korporation til en manifestation, som er en samling, som omfatter et udtryk af et værk, som er skabt af en korporation. @da
toolkit label: korporation, som er bidragsyder til samling af @da
toolkit definition: Manifestation, som er en samling, som omfatter et udtryk af et værk, som er skabt af en korporation. @da
label: liitumi kaastööline (asutus) kehastuses @et
definition: Seostab asutuse kehastusega, mis on liitum, milles on teostatud asutuse loodud teose väljendus. @et
toolkit label: liitumi kaastööline (asutus) kehastuses @et
toolkit definition: Kehastus, mis on liitum, milles on teostatud asutuse loodud teose väljendus. @et
label: ist Körperschaft als Beiträgerin/Beiträger zu einem Aggregat von @de
definition: Setzt eine Körperschaft in Beziehung zu einem Aggregat (Manifestation), das eine Expression eines Werks verkörpert, die eine Körperschaft erstellt hat. @de
toolkit label: Körperschaft als Beiträgerin/Beiträger zu einem Aggregat von @de
toolkit definition: Ein Aggregat (Manifestation), das eine Expression eines Werks verkörpert, die eine Körperschaft erstellt hat. @de
label: közreműködő testülete a következő aggregátumnak: @hu
definition: Hozzákapcsol egy testületet egy aggregátum megjelenési formához, amely egy testület által létrehozott mű kifejezési formáját testesíti meg. @hu
toolkit label: közreműködő testülete a következő aggregátumnak: @hu
toolkit definition: Egy aggregátum megjelenési forma, amely egy testület által létrehozott mű kifejezési formáját testesíti meg. @hu
label: è contributore ente di aggregato di @it
definition: Correla un ente a una manifestazione che è un aggregato che comprende un contributo di un ente. @it
toolkit label: contributore ente di aggregato di @it
toolkit definition: Manifestazione che è un aggregato che comprende un contributo di un ente. @it
label: είναι συντελεστής συλλογικό όργανο σε συνάθροιση του @el
toolkit label: συντελεστής συλλογικό όργανο σε συνάθροιση του @el
label: est une collectivité contributrice à un agrégat de @fr
definition: Met une collectivité en relation avec une manifestation qui consiste en un agrégat matérialisant une expression d’une œuvre créée par une collectivité. @fr
toolkit label: collectivité contributrice à un agrégat de @fr
toolkit definition: Manifestation qui consiste en un agrégat matérialisant une expression d’une œuvre créée par une collectivité. @fr
label: ir apkopojuma līdzradītājs (institūcija) @lv
definition: Sasaista institūciju ar manifestāciju, kas ir apkopojums, kas ietver institūcijas ieguldījumu/līdzdalību. @lv
toolkit label: ir apkopojuma līdzradītājs (institūcija) @lv
toolkit definition: Manifestācija, kas ir apkopojums, kas ietver institūcijas ieguldījumu/līdzdalību. @lv
label: 是……的合集的贡献者团体 @zh-hans
definition: 将一个团体与作为一种合集、把一个团体所创作的一种作品的内容表达具体化的一种载体表现关联起来。 @zh-hans
toolkit label: ……的合集的贡献者团体 @zh-hans
toolkit definition: 作为一种合集、把一个团体所创作的一种作品的内容表达具体化的一种载体表现 @zh-hans
label: toplanmasına katkıda bulunan tüzel kişidir @tr
definition: Bir tüzel kişiyi,, bir tüzel kişilik tarafından yaratılan bir çalışmanın ifadesini somutlaştıran bir bütün olan gösterimle ilişkilendirir. @tr
toolkit label: topluluğa katkıda bulunan tüzel kişi @tr
toolkit definition: Tüzel bir kişi tarafından oluşturulan bir eserin anlatımını somutlaştıran topluluk olan bir gösterim. @tr
has subproperty: kartografiaan osallinen yhteisö manifestaatiossa
has subproperty: koreografiaan osallinen yhteisö manifestaatiossa
has subproperty: digitaaliseen sisältöön osallinen yhteisö manifestaatiossa
has subproperty: liikkuvaan kuvaan osallinen yhteisö manifestaatiossa
has subproperty: musiikkiin osallinen yhteisö manifestaatiossa
has subproperty: esineeseen osallinen yhteisö manifestaatiossa
has subproperty: puheeseen osallinen yhteisö manifestaatiossa
has subproperty: stillkuvaan osallinen yhteisö manifestaatiossa
has subproperty: tekstiin osallinen yhteisö manifestaatiossa
has subproperty: P50823

yhdistymään osallinen yhteisö ekspressiossa
status: Published
label: is contributor corporate body to amalgamation of @en
lexical alias: contributorCorporateBodyToAmalgamationOf.en
definition: Relates a corporate body to an expression that includes a contribution by a corporate body to a seamless mix of kinds of content. @en
toolkit label: contributor corporate body to amalgamation of @en
toolkit definition: An expression that includes a contribution by a corporate body to a seamless mix of kinds of content. @en
type: Property
domain: C10005
has element type: 2
sub property of: ekspression tekijä (yhteisö) ekspressiossa
sub property of: yhdistymään osallinen yhteistoimija ekspressiossa
definition: Liittää yhteisön ekspressioon, jossa yhteisö on osallisena sellaisen ekspression tekemisessä, joka on saumaton yhdistelmä erilaisia sisältöjä.
toolkit label: yhdistymään osallinen yhteisö ekspressiossa
toolkit definition: Ekspressio, jossa yhteisö on osallisena sellaisen ekspression tekemisessä, joka on saumaton yhdistelmä erilaisia sisältöjä.
label: er bidragsyter til sammenslutning for (korporasjon) @no
definition: Relaterer en korporasjon til et uttrykk som inkluderer et bidrag fra en korporasjon til en sømløs blanding av forskjellig innhold. @no
toolkit label: bidragsyter til sammenslutning for (korporasjon) @no
toolkit definition: Et uttrykk som inkluderer et bidrag fra en korporasjon til en sømløs blanding av forskjellig innhold. @no
label: is bijdrager-corporatie aan amalgamering van @nl
definition: Relateert een corporatie aan een expressie die omvat een bijdrage door een corporatie aan een naadloze mix van soorten content. @nl
toolkit label: bijdrager-corporatie aan amalgamering van @nl
toolkit definition: Een expressie die omvat een bijdrage door een corporatie aan een naadloze mix van soorten content. @nl
label: هي هيئة مساهمة في دمج لـ @ar
definition: يربط هيئة بتعبيرة تتضمن إسهام هيئة في مزج سلس لأنواع من المحتوى. @ar
toolkit label: هيئة مساهمة في دمج @ar
toolkit definition: تعبيرة تتضمن إسهام هيئة في مزج سلس لأنواع من المحتوى. @ar
label: és entitat corporativa contribuïdora a una amalgama de @ca
definition: Relaciona una entitat corporativa amb una expressió que inclou una contribució d’una entitat corporativa a una mescla sense continuïtat de classes de contingut. @ca
toolkit label: entitat corporativa contribuïdora a una amalgama de @ca
toolkit definition: Expressió que inclou una contribució d’una entitat corporativa a una mescla sense continuïtat de classes de contingut. @ca
label: er korporation, som er bidragsyder til sammensmeltning af @da
definition: Relaterer en korporation til et udtryk, som omfatter en korporations bidrag til en glat kombinering af forskellige slags af indhold. @da
toolkit label: korporation, som er bidragsyder til sammensmeltning af @da
toolkit definition: Udtryk, som omfatter en korporations bidrag til en glat kombinering af forskellige slags af indhold. @da
label: sulami kaastööline (asutus) väljenduses @et
definition: Seostab asutuse väljendusega, millesse asutus on andnud panuse, osaledes eri liiki sisu lahutamatu segu loomisel. @et
toolkit label: sulami kaastööline (asutus) väljenduses @et
toolkit definition: Väljendus, millesse asutus on andnud panuse, osaledes eri liiki sisu lahutamatu segu loomisel. @et
label: ist Körperschaft als Beiträgerin/Beiträger zu einer Verschmelzung von @de
definition: Setzt eine Körperschaft in Beziehung zu einer Expression, bei der eine Körperschaft zu einer nahtlosen Mischung von Inhalten beiträgt. @de
toolkit label: Körperschaft als Beiträgerin/Beiträger zu einer Verschmelzung von @de
toolkit definition: Eine Expression, bei der eine Körperschaft zu einer nahtlosen Mischung von Inhalten beiträgt. @de
label: közreműködő testülete a következő vegyes tartalomnak: @hu
definition: Hozzákapcsol egy testületet egy kifejezési formához, amely magában foglalja egy testület közreműködését a tartalom fajtáinak szabad keverésében. @hu
toolkit label: közreműködő testülete a következő vegyes tartalomnak: @hu
toolkit definition: Egy kifejezési forma, amely magában foglalja egy testület közreműködését a tartalom fajtáinak szabad keverésében. @hu
label: è contributore ente di fusione di @it
definition: Correla un ente a un'espressione che comprende un contributo di un ente a una varietà di tipi di contenuto senza soluzione di continuità. @it
toolkit label: contributore ente di fusione di @it
toolkit definition: Espressione che comprende un contributo di un ente a una varietà di tipi di contenuto senza soluzione di continuità. @it
label: είναι συντελεστής συλλογικό όργανο σε μείξη του (?) @el
toolkit label: συντελεστής συλλογικό όργανο σε μείξη του (?) @el
label: est une collectivité contributrice à un amalgame de @fr
definition: Met une collectivité en relation avec une expression qui intègre une contribution de la part d’une collectivité à un mélange intégré de différents genres de contenu. @fr
toolkit label: collectivité contributrice à un amalgame de @fr
toolkit definition: Expression qui intègre une contribution de la part d’une collectivité à un mélange intégré de différents genres de contenu. @fr
label: ir amalgamāta līdzradītājs (institūcija) @lv
definition: Sasaista institūciju ar izteiksmi, kas ietver institūcijas ieguldījumu dažādu satura veidu vienlaidu sajaukumā. @lv
toolkit label: ir amalgamāta līdzradītājs (institūcija) @lv
toolkit definition: Izteiksme, kas ietver institūcijas ieguldījumu dažādu satura veidu vienlaidu sajaukumā. @lv
label: 是……的融合体的贡献者团体 @zh-hans
definition: 将一个团体与包括将各种内容无缝融合的一个团体的贡献的一种内容表达关联起来。 @zh-hans
toolkit label: ……的融合体的贡献者团体 @zh-hans
toolkit definition: 包括将各种内容无缝融合的一个团体的贡献的一种内容表达 @zh-hans
label: birleşimine katkıda bulunan tüzel kişidir @tr
definition: Bir tüzel kişiyi, bir tüzel kişinin içerik türlerinin kusursuz bir karışımına yaptığı katkıyı içeren bir anlatımla ilişkilendirir. @tr
toolkit label: birleşmeye katkıda bulunan tüzel kişi @tr
toolkit definition: İçerik türlerinin kusursuz bir karışımına tüzel bir kişinin katkısını içeren bir anlatım. @tr
has subproperty: värittäjä (yhteisö) ekspressiossa
has subproperty: esitykseen osallinen yhteisö ekspressiossa
has subproperty: tuomioistuimen kirjuri (yhteisö) ekspressiossa
has subproperty: piirtäjä (yhteisö) ekspressiossa
has subproperty: toimittaja (yhteisö) ekspressiossa
has subproperty: tekstaaja (yhteisö) ekspressiossa
has subproperty: pöytäkirjan laatija (yhteisö) ekspressiossa
has subproperty: ohjelmistokehittäjä (yhteisö) ekspressiossa
has subproperty: P50926

esitykseen osallinen yhteisö ekspressiossa
status: Published
label: is contributor corporate body to performance of @en
lexical alias: contributorCorporateBodyToPerformanceOf.en
definition: Relates a corporate body to an expression that includes a contribution by a corporate body to a performance. @en
toolkit label: contributor corporate body to performance of @en
toolkit definition: An expression that includes a contribution by a corporate body to a performance. @en
type: Property
domain: C10005
has element type: 2
sub property of: yhdistymään osallinen yhteisö ekspressiossa
sub property of: esitykseen osallinen yhteistoimija ekspressiossa
definition: Liittää yhteisön ekspressioon, jossa yhteisö on osallisena sellaisen ekspression tekemisessä, joka on esitys.
toolkit label: esitykseen osallinen yhteisö ekspressiossa
toolkit definition: Ekspressio, jossa yhteisö on osallisena sellaisen ekspression tekemisessä, joka on esitys.
label: er bidragsyter til framføring for (korporasjon) @no
definition: Relaterer en korporasjon til et uttrykk som inkluderer et bidrag fra en korporasjon til en framføring. @no
toolkit label: bidragsyter til framføring for (korporasjon) @no
toolkit definition: Et uttrykk som inkluderer et bidrag fra en korporasjon til en framføring. @no
label: is bijdrager-corporatie aan uitvoering van @nl
definition: Relateert een corporatie aan een expressie die omvat een bijdrage door een corporatie aan een uitvoering. @nl
toolkit label: bijdrager-corporatie aan uitvoering van @nl
toolkit definition: Een expressie die omvat een bijdrage door een corporatie aan een uitvoering. @nl
label: هي هيئة مساهمة في أداء لـ @ar
definition: يربط هيئة بتعبيرة تتضمن إسهام هيئة في أداء. @ar
toolkit label: هيئة مساهمة في أداء @ar
toolkit definition: تعبيرة تتضمن إسهام هيئة في أداء. @ar
label: és entitat corporativa contribuïdora a una interpretació de @ca
definition: Relaciona una entitat corporativa amb una expressió que inclou una contribució d’una entitat corporativa a una interpretació. @ca
toolkit label: entitat corporativa contribuïdora a una interpretació de @ca
toolkit definition: Expressió que inclou una contribució d’una entitat corporativa a una interpretació. @ca
label: er korporation, som er bidragsyder til optræden af @da
definition: Relaterer en korporation til et udtryk, som omfatter en korporations bidrag til en optræden. @da
toolkit label: korporation, som er bidragsyder til optræden af @da
toolkit definition: Udtryk, som omfatter en korporations bidrag til en optræden. @da
label: esituse kaastööline (asutus) @et
definition: Seostab asutuse väljendusega, millesse asutus on andnud panuse, osaledes esituse loomisel. @et
toolkit label: esituse kaastööline (asutus) @et
toolkit definition: Väljendus, millesse asutus on andnud panuse, osaledes esituse loomisel. @et
label: ist Körperschaft als Beiträgerin/Beiträger zu einer Darbietung von @de
definition: Setzt eine Körperschaft in Beziehung zu einer Expression, bei der eine Körperschaft zu einer Darbietung beiträgt. @de
toolkit label: Körperschaft als Beiträgerin/Beiträger zu einer Darbietung von @de
toolkit definition: Eine Expression, bei der eine Körperschaft zu einer Darbietung beiträgt. @de
label: közreműködő testülete a következő előadásnak: @hu
definition: Hozzákapcsol egy testületet egy kifejezési formához, amely magában foglalja egy testület közreműködését egy előadásban. @hu
toolkit label: közreműködő testülete a következő előadásnak: @hu
toolkit definition: Egy kifejezési forma, amely magában foglalja egy testület közreműködését egy előadásban. @hu
label: è contributore ente di esibizione di @it
definition: Correla un ente a un'espressione che comprende un contributo di un ente a un'esibizione. @it
toolkit label: contributore ente di esibizione di @it
toolkit definition: Espressione che comprende un contributo di un ente a un'esibizione. @it
label: είναι συντελεστής συλλογικό όργανο σε εκτέλεση του @el
toolkit label: συντελεστής συλλογικό όργανο σε εκτέλεση του @el
label: est une collectivité contributrice à une prestation de @fr
definition: Met une collectivité en relation avec une expression qui intègre une contribution de la part d’une collectivité à une prestation. @fr
toolkit label: collectivité contributrice à une prestation de @fr
toolkit definition: Expression qui intègre une contribution de la part d’une collectivité à une prestation. @fr
label: ir uzveduma līdzradītājs (institūcija) @lv
definition: Sasaista institūciju ar izteiksmi, kas ietver institūcijas ieguldījumu uzvedumā. @lv
toolkit label: ir uzveduma līdzradītājs (institūcija) @lv
toolkit definition: Izteiksme, kas ietver institūcijas ieguldījumu uzvedumā. @lv
label: 是……的表演的贡献者团体 @zh-hans
definition: 将一个团体与包括一个团体对一个表演之贡献的一种内容表达关联起来。 @zh-hans
toolkit label: ……的表演的贡献者团体 @zh-hans
toolkit definition: 包括一个团体对一个表演之贡献的一种内容表达 @zh-hans
label: performansına katkıda bulunan tüzel kişidir @tr
definition: Bir tüzel kişiyi, bir tüzel kişinin bir performansa katkısını içeren bir ianlatımla ilişkilendirir. @tr
toolkit label: performansa katkıda bulunan tüzel kişi @tr
toolkit definition: Bir performansa tüzel bir kişinin katkısını içeren bir anlatım. @tr
has subproperty: animaattori (yhteisö) ekspressiossa
has subproperty: lavastaja (yhteisö) ekspressiossa
has subproperty: ääniteknikko (yhteisö) ekspressiossa
has subproperty: puvustaja (yhteisö) ekspressiossa
has subproperty: DJ (yhteisö) ekspressiossa
has subproperty: dubbausohjaaja (yhteisö) ekspressiossa
has subproperty: leikkaaja (yhteisö) ekspressiossa
has subproperty: ekspression haastateltava (yhteisö) ekspressiossa
has subproperty: ekspression haastattelija (yhteisö) ekspressiossa
has subproperty: valosuunnittelija (yhteisö) ekspressiossa
has subproperty: maskeeraaja (yhteisö) ekspressiossa

kartografiaan osallinen suku manifestaatiossa
status: Published
label: is contributor family of cartography of @en
lexical alias: contributorFamilyOfCartographyOf.en
definition: Relates a family to a manifestation that is an aggregate that embodies an expression of a cartographic work that is created by a family. @en
toolkit label: contributor family of cartography of @en
toolkit definition: A manifestation that is an aggregate that embodies an expression of a cartographic work that is created by a family. @en
type: Property
domain: C10008
has element type: 2
sub property of: aggregaattiin osallinen suku manifestaatiossa
sub property of: kartografiaan osallinen yhteistoimija manifestaatiossa
definition: Liittää suvun manifestaatioon, joka on aggregaatti, joka sisältää kartografisen teoksen ekspression, jonka suuku on luonut.
toolkit label: kartografiaan osallinen suku manifestaatiossa
toolkit definition: Manifestaatio, joka on aggregaatti, joka sisältää kartografisen teoksen ekspression, jonka suku on luonut.
label: er bidragsyter til kartografi for (familie) @no
definition: Relaterer en familie til en manifestasjon som er et aggregat som realiserer et kartografisk verk skapt av en familie. @no
toolkit label: bidragsyter til kartografi for (familie) @no
toolkit definition: En manifestasjon som er et aggregat som realiserer et kartografisk verk skapt av en familie. @no
label: is bijdrager-familie van cartografie van @nl
definition: Relateert een familie aan een manifestatie die een aggregaat is die een expressie van een cartografisch werk verwezenlijkt dat is gecreëerd door een familie. @nl
toolkit label: bijdrager-familie van cartografie van @nl
toolkit definition: Een manifestatie die een aggregaat is die een expressie van een cartografisch werk verwezenlijkt dat is gecreëerd door een familie. @nl
label: هي عائلة مساهمة في رسم خرائط لـ @ar
definition: يربط عائلة بتجسيدة عبارة عن تجميعة تجسد عملا رسم خرائطي أنشأته عائلة. @ar
toolkit label: عائلة مساهمة في رسم خرائط @ar
toolkit definition: تجسيدة تمثل تجميعة تجسد عملا رسم خرائطي أنشأته عائلة. @ar
label: és família contribuïdora de cartografia de @ca
definition: Relaciona una família amb una manifestació que és un agregat que materialitza una expressió d’una obra cartogràfica que és creada per una família. @ca
toolkit label: família contribuïdora de cartografia de @ca
toolkit definition: Manifestació que és un agregat que materialitza una expressió d’una obra cartogràfica que és creada per una família. @ca
label: er familie, som er bidragsyder til kartografi af @da
definition: Relaterer en familie til en manifestation, som er en samling, som rummer et udtryk af et kartografisk værk, som er skabt af en familie. @da
toolkit label: familie, som er bidragsyder til kartografi af @da
toolkit definition: Manifestation, som er en samling, som rummer et udtryk af et kartografisk værk, som er skabt af en familie. @da
label: kaastööline kartograafia alal (perekond) kehastuses @et
definition: Seostab perekonna kehastusega, mis on liitum, milles on teostatud perekonna loodud kartograafilise teose väljendus. @et
toolkit label: kaastööline kartograafia alal (perekond) kehastuses @et
toolkit definition: Kehastus, mis on liitum, milles on teostatud perekonna loodud kartograafilise teose väljendus. @et
label: ist Familie als Beiträgerin/Beiträger von einer Kartografie von @de
definition: Setzt eine Familie in Beziehung zu einem Aggregat (Manifestation), das eine Expression eines kartografischen Werks verkörpert, die eine Familie erstellt hat. @de
toolkit label: Familie als Beiträgerin/Beiträger von einer Kartografie von @de
toolkit definition: Ein Aggregat (Manifestation), das eine Expression eines kartografischen Werks verkörpert, die eine Familie erstellt hat. @de
label: közreműködő családja a következő kartográfiának: @hu
definition: Hozzákapcsol egy családot egy aggregátum megjelenési formához, amely egy család által létrehozott kartográfiai mű kifejezési formáját testesíti meg. @hu
toolkit label: közreműködő családja a következő kartográfiának: @hu
toolkit definition: Egy aggregátum megjelenési forma, amely egy család által létrehozott kartográfiai mű kifejezési formáját testesíti meg. @hu
label: è contributore famiglia di cartografia di @it
definition: Correla una famiglia a una manifestazione che è un aggregato che materializza un'opera cartografica creata da una famiglia. @it
toolkit label: contributore famiglia di cartografia di @it
toolkit definition: Manifestazione che è un aggregato che materializza un'opera cartografica creata da una famiglia. @it
label: είναι συντελεστής οικογένεια της χαρτογράφησης του @el
toolkit label: συντελεστής οικογένεια της χαρτογράφησης του @el
label: est une famille contributrice de cartographie de @fr
definition: Met une famille en relation avec une manifestation qui consiste en un agrégat matérialisant une expression d’une œuvre cartographique créée par une famille. @fr
toolkit label: famille contributrice de cartographie de @fr
toolkit definition: Manifestation qui consiste en un agrégat matérialisant une expression d’une œuvre cartographique créée par une famille. @fr
label: ir kartogrāfijas līdzradītājs (dzimta/ģimene) @lv
definition: Sasaista dzimtu/ģimeni ar manifestāciju, kas ir apkopojums, kas ietver dzimtas/ģimenes radītu kartogrāfijas darbu. @lv
toolkit label: ir kartogrāfijas līdzradītājs (dzimta/ģimene) @lv
toolkit definition: Manifestācija, kas ir apkopojums, kas ietver dzimtas/ģimenes radītu kartogrāfijas darbu. @lv
label: 是……的地图绘制的贡献者家族 @zh-hans
definition: 将一个家族与作为一种合集、把一个家族所创作的一种地图作品的内容表达具体化的一种载体表现关联起来。 @zh-hans
toolkit label: ……的地图绘制的贡献者家族 @zh-hans
toolkit definition: 作为一种合集、把一个家族所创作的一种地图作品的内容表达具体化的一种载体表现 @zh-hans
label: kartografisinin katkıda bulunan ailesidir @tr
definition: Bir aileyi, aile tarafından yaratılan bir kartografik çalışmanın anlamını somutlaştıran bir bütün olan gösterimle ilişkilendirir. @tr
toolkit label: kartografyaya katkıda bulunan aile @tr
toolkit definition: Bir aile tarafından oluşturulan bir kartografik eserin anlatımını somutlaştıran topluluk olan bir gösterim. @tr
has subproperty: maanmittari (suku) manifestaatiossa
has subproperty: P50964

koreografiaan osallinen suku manifestaatiossa
status: Published
label: is contributor family of choreography of @en
lexical alias: contributorFamilyOfChoreographyOf.en
definition: Relates a family to a manifestation that is an aggregate that embodies an expression of a choreographic work that is created by a family. @en
toolkit label: contributor family of choreography of @en
toolkit definition: A manifestation that is an aggregate that embodies an expression of a choreographic work that is created by a family. @en
type: Property
domain: C10008
has element type: 2
sub property of: aggregaattiin osallinen suku manifestaatiossa
sub property of: koreografiaan osallinen yhteistoimija manifestaatiossa
definition: Liittää suvun manifestaatioon, joka on aggregaatti, joka sisältää koreografisen teoksen ekspression, jonka suku on luonut.
toolkit label: koreografiaan osallinen suku manifestaatiossa
toolkit definition: Manifestaatio, joka on aggregaatti, joka sisältää koreografisen teoksen ekspression, jonka suku on luonut.
label: er bidragsyter til koreografi for (familie) @no
definition: Relaterer en familie til en manifestasjon som er et aggregat som realiserer et koreografisk verk skapt av en familie. @no
toolkit label: bidragsyter til koreografi for (familie) @no
toolkit definition: En manifestasjon som er et aggregat som realiserer et koreografisk verk skapt av en familie. @no
label: is bijdrager-familie van choreografie van @nl
definition: Relateert een familie aan een manifestatie die een aggregaat is die een expressie van een choreografisch werk verwezenlijkt dat is gecreëerd door een familie. @nl
toolkit label: bijdrager-familie van choreografie van @nl
toolkit definition: Een manifestatie die een aggregaat is die een expressie van een choreografisch werk verwezenlijkt dat is gecreëerd door een familie. @nl
label: هي عائلة مساهمة في رقصات لـ @ar
definition: يربط عائلة بتجسيدة عبارة عن تجميعة تجسد عملا راقص أنشأته عائلة. @ar
toolkit label: عائلة مساهمة في رقصات @ar
toolkit definition: تجسيدة عبارة عن تجميعة تجسد عملا راقص أنشأته عائلة. @ar
label: és família contribuïdora de coreografia de @ca
definition: Relaciona una família amb una manifestació que és un agregat que materialitza una expressió d’una obra coreogràfica que és creada per una família. @ca
toolkit label: família contribuïdora de coreografia de @ca
toolkit definition: Manifestació que és un agregat que materialitza una expressió d’una obra coreogràfica que és creada per una família. @ca
label: er familie, som er bidragsyder til koreografi af @da
definition: Relaterer en familie til en manifestation, som er en samling, som rummer et udtryk af et koreografisk værk, som er skabt af en familie. @da
toolkit label: familie, som er bidragsyder til koreografi af @da
toolkit definition: Manifestation, som er en samling, som rummer et udtryk af et koreografisk værk, som er skabt af en familie. @da
label: kaastööline koreograafia alal (perekond) kehastuses @et
definition: Seostab perekonna kehastusega, mis on liitum, milles on teostatud perekonna loodud koreograafilise teose väljendus. @et
toolkit label: kaastööline koreograafia alal (perekond) kehastuses @et
toolkit definition: Kehastus, mis on liitum, milles on teostatud perekonna loodud koreograafilise teose väljendus. @et
label: ist Familie als Beiträgerin/Beiträger von einer Choreografie von @de
definition: Setzt eine Familie in Beziehung zu einem Aggregat (Manifestation), das eine Expression eines choreografischen Werks verkörpert, die eine Familie erstellt hat. @de
toolkit label: Familie als Beiträgerin/Beiträger von einer Choreografie von @de
toolkit definition: Ein Aggregat (Manifestation), das eine Expression eines choreografischen Werks verkörpert, die eine Familie erstellt hat. @de
label: közreműködő családja a következő koreográfiának: @hu
definition: Hozzákapcsol egy családot egy aggregátum megjelenési formához, amely egy család által létrehozott koreografikus mű kifejezési formáját testesíti meg. @hu
toolkit label: közreműködő családja a következő koreográfiának: @hu
toolkit definition: Egy aggregátum megjelenési forma, amely egy család által létrehozott koreografikus mű kifejezési formáját testesíti meg. @hu
label: è contributore famiglia di coreografia di @it
definition: Correla una famiglia a una manifestazione che è un aggregato che materializza un'opera coreografica creata da una famiglia. @it
toolkit label: contributore famiglia di coreografia di @it
toolkit definition: Manifestazione che è un aggregato che materializza un'opera coreografica creata da una famiglia. @it
label: είναι συντελεστής οικογένεια της χορογραφίας του @el
toolkit label: συντελεστής οικογένεια της χορογραφίας του @el
label: est une famille contributrice de chorégraphie de @fr
definition: Met une famille en relation avec une manifestation qui consiste en un agrégat matérialisant une expression d’une œuvre chorégraphique créée par une famille. @fr
toolkit label: famille contributrice de chorégraphie de @fr
toolkit definition: Manifestation qui consiste en un agrégat matérialisant une expression d’une œuvre chorégraphique créée par une famille. @fr
label: ir horeogrāfijas līdzradītājs (dzimta/ģimene) @lv
definition: Sasaista dzimtu/ģimeni ar manifestāciju, kas ir apkopojums, kas ietver dzimtas/ģimenes radītu horeogrāfijas darbu. @lv
toolkit label: ir horeogrāfijas līdzradītājs (dzimta/ģimene) @lv
toolkit definition: Manifestācija, kas ir apkopojums, kas ietver dzimtas/ģimenes radītu horeogrāfijas darbu. @lv
label: 是……的编舞的贡献者家族 @zh-hans
definition: 将一个家族与作为一种合集、把一个家族所创作的一种编舞作品的内容表达具体化的一种载体表现关联起来。 @zh-hans
toolkit label: ……的编舞的贡献者家族 @zh-hans
toolkit definition: 作为一种合集、把一个家族所创作的一种编舞作品的内容表达具体化的一种载体表现 @zh-hans
label: koreografisinin katkıda bulunan ailesidir @tr
definition: Bir aileyi, aile tarafından yaratılan bir koreografi çalışmasının anlatımını somutlaştıran bir bütün olan gösterimle ilişkilendirir. @tr
toolkit label: koreografiye katkıda bulunan aile @tr
toolkit definition: Bir aile tarafından oluşturulan bir koreografik eserin anlatımını somutlaştıran topluluk olan bir gösterim. @tr
has subproperty: P50965

digitaaliseen sisältöön osallinen suku manifestaatiossa
status: Published
label: is contributor family of computer content of @en
lexical alias: contributorFamilyOfComputerContentOf.en
definition: Relates a family to a manifestation that is an aggregate that embodies an expression of computer content created by a family. @en
toolkit label: contributor family of computer content of @en
toolkit definition: A manifestation that is an aggregate that embodies an expression of computer content created by a family. @en
type: Property
domain: C10008
has element type: 2
sub property of: aggregaattiin osallinen suku manifestaatiossa
sub property of: digitaaliseen sisältöön osallinen yhteistoimija manifestaatiossa
definition: Liittää suvun manifestaatioon, joka on aggregaatti, joka sisältää digitaalisen sisällön ekspression, jonka suku on luonut.
toolkit label: digitaaliseen sisältöön osallinen suku manifestaatiossa
toolkit definition: Manifestaatio, joka on aggregaatti, joka sisältää digitaalisen sisällön ekspression, jonka suku on luonut.
label: er bidragsyter til datamaskininnhold for (familie) @no
definition: Relaterer en familie til en manifestasjon som er et aggregat som realiserer datamaskininnhold skapt av en familie. @no
toolkit label: bidragsyter til datamaskininnhold for (familie) @no
toolkit definition: En manifestasjon som er et aggregat som realiserer datamaskininnhold skapt av en familie. @no
label: is bijdrager-familie van computercontent van @nl
definition: Relateert een familie aan een manifestatie die een aggregaat is die een expressie van computercontent verwezenlijkt die is gecreëerd door een familie. @nl
toolkit label: bijdrager-familie van computercontent van @nl
toolkit definition: Een manifestatie die een aggregaat is die een expressie van computercontent verwezenlijkt die is gecreëerd door een familie. @nl
label: هي عائلة مساهمة في محتوى حاسوبي لـ @ar
definition: يربط عائلة بتجسيدة عبارة عن تجميعة تجسد محتوى حاسوبي أنشأته عائلة. @ar
toolkit label: عائلة مساهمة في محتوى حاسوبي @ar
toolkit definition: تجسيدة تمثل تجميعة تجسد محتوى حاسوبي أنشأته عائلة. @ar
label: és família contribuïdora de contingut informàtic de @ca
definition: Relaciona una família amb una manifestació que és un agregat que materialitza una expressió d’una obra de contingut informàtic que és creada per una família. @ca
toolkit label: família contribuïdora de contingut informàtic de @ca
toolkit definition: Manifestació que és un agregat que materialitza una expressió d’una obra de contingut informàtic que és creada per una família. @ca
label: er familie, som er bidragsyder til computerindhold af @da
definition: Relaterer en familie til en manifestation, som er en samling, som rummer et udtryk af computerindhold skabt af en familie. @da
toolkit label: familie, som er bidragsyder til computerindhold af @da
toolkit definition: Manifestation, som er en samling, som rummer et udtryk af computerindhold skabt af en familie. @da
label: digisisu kaastööline (perekond) kehastuses @et
definition: Seostab perekonna kehastusega, mis on liitum, milles on teostatud perekonna loodud digisisu väljendus. @et
toolkit label: digisisu kaastööline (perekond) kehastuses @et
toolkit definition: Kehastus, mis on liitum, milles on teostatud perekonna loodud digisisu väljendus. @et
label: ist Familie als Beiträgerin/Beiträger von Computer Content von @de
definition: Setzt eine Familie in Beziehung zu einem Aggregat (Manifestation), das eine Expression von Computer Content verkörpert, die eine Familie erstellt hat. @de
toolkit label: Familie als Beiträgerin/Beiträger eine Computer Content von @de
toolkit definition: Ein Aggregat (Manifestation), das eine Expression von Computer Content verkörpert, die eine Familie erstellt hat. @de
label: közreműködő családja a következő számítógépes tartalomnak: @hu
definition: Hozzákapcsol egy családot egy aggregátum megjelenési formához, amely egy család által létrehozott számítógépes tartalom kifejezési formáját testesíti meg. @hu
toolkit label: közreműködő családja a következő számítógépes tartalomnak: @hu
toolkit definition: Egy aggregátum megjelenési forma, amely egy család által létrehozott számítógépes tartalom kifejezési formáját testesíti meg. @hu
label: è contributore famiglia di contenuto informatico di @it
definition: Correla una famiglia a una manifestazione che è un aggregato che materializza contenuto informatico creato da una famiglia. @it
toolkit label: contributore famiglia di contenuto informatico di @it
toolkit definition: Manifestazione che è un aggregato che materializza contenuto informatico creato da una famiglia. @it
label: είναι συντελεστής οικογένεια του περιεχομένου του υπολογιστή του @el
toolkit label: συντελεστής οικογένεια του περιεχομένου του υπολογιστή του @el
label: est une famille contributrice de contenu informatique de @fr
definition: Met une famille en relation avec une manifestation qui consiste en un agrégat matérialisant une expression d’un contenu informatique créé par une famille. @fr
toolkit label: famille contributrice de contenu informatique de @fr
toolkit definition: Manifestation qui consiste en un agrégat matérialisant une expression d’un contenu informatique créé par une famille. @fr
label: ir datororientēta satura līdzradītājs (dzimta/ģimene) @lv
definition: Sasaista dzimtu/ģimeni ar manifestāciju, kas ir apkopojums, kas ietver dzimtas/ģimenes radītu datororientētu saturu. @lv
toolkit label: ir datororientēta satura līdzradītājs (dzimta/ģimene) @lv
toolkit definition: Manifestācija, kas ir apkopojums, kas ietver dzimtas/ģimenes radītu datororientētu saturu. @lv
label: 是……的计算机内容贡献者家族 @zh-hans
definition: 将一个家族与作为一种合集、把一个家族所创作的一种计算机内容的内容表达具体化的一种载体表现关联起来。 @zh-hans
toolkit label: ……的计算机内容贡献者家族 @zh-hans
toolkit definition: 作为一种合集、把一个家族所创作的一种计算机内容的内容表达具体化的一种载体表现 @zh-hans
label: bilgisayar içeriğinin katkıda bulunan ailesidir @tr
definition: Bir aileyi, aile tarafından yaratılan bir bilgisayar içeriğinin anlatımını somutlaştıran bir bütün olan gösterimle ilişkilendirir. @tr
toolkit label: bilgisayar içeriğine katkıda bulunan aile @tr
toolkit definition: Bir aile tarafından oluşturulan bir bilgisayar destekli içeriğin anlatımını somutlaştıran topluluk olan bir gösterim. @tr
has subproperty: P50972

liikkuvaan kuvaan osallinen suku manifestaatiossa
status: Published
label: is contributor family of moving image of @en
lexical alias: contributorFamilyOfMovingImageOf.en
definition: Relates a family to a manifestation that is an aggregate that embodies an expression of a moving image work that is created by a family. @en
toolkit label: contributor family of moving image of @en
toolkit definition: A manifestation that is an aggregate that embodies an expression of a moving image work that is created by a family. @en
type: Property
domain: C10008
has element type: 2
sub property of: aggregaattiin osallinen suku manifestaatiossa
sub property of: liikkuvaan kuvaan osallinen yhteistoimija
definition: Liittää suvun manifestaatioon, joka on aggregaatti, joka sisältää liikkuvan kuvan teoksen ekspression, jonka suku on luonut.
toolkit label: liikkuvaan kuvaan osallinen suku manifestaatiossa
toolkit definition: Manifestaatio, joka on aggregaatti, joka sisältää liikkuvan kuvan teoksen ekspression, jonka suku on luonut.
label: er bidragsyter til levende bilder for (familie) @no
definition: Relaterer en familie til en manifestasjon som er et aggregat som realiserer et verk med levende bilder skapt av en familie. @no
toolkit label: bidragsyter til levende bilder for (familie) @no
toolkit definition: En manifestasjon som er et aggregat som realiserer et verk med levende bilder skapt av en familie. @no
label: is bijdrager-familie van bewegend beeld van @nl
definition: Relateert een familie aan een manifestatie die een aggregaat is die een expressie van een bewegend beeldwerk verwezenlijkt dat is gecreëerd door een familie. @nl
toolkit label: bijdrager-familie van bewegend beeld van @nl
toolkit definition: Een manifestatie die een aggregaat is die een expressie van een bewegend beeldwerk verwezenlijkt dat is gecreëerd door een familie. @nl
label: هي عائلة مساهمة في صور متحركة لـ @ar
definition: يربط عائلة بتجسيدة عبارة عن تجميعة تجسد عملا صور متحركة أنشأته عائلة. @ar
toolkit label: عائلة مساهمة في صور متحركة @ar
toolkit definition: تجسيدة تمثل تجميعة تجسد عملا صور متحركة أنشأته عائلة. @ar
label: és família contribuïdora d’imatge en moviment de @ca
definition: Relaciona una família amb una manifestació que és un agregat que materialitza una expressió d’una obra d’imatge en moviment que és creada per una família. @ca
toolkit label: família contribuïdora d’imatge en moviment de @ca
toolkit definition: Manifestació que és un agregat que materialitza una expressió d’una obra d’imatge en moviment que és creada per una família. @ca
label: er familie, som er bidragsyder til levende billede af @da
definition: Relaterer en familie til en manifestation, som er en samling, som rummer et udtryk af et værk med levende billeder, som er skabt af en familie. @da
toolkit label: familie, som er bidragsyder til levende billede af @da
toolkit definition: Manifestation, som er en samling, som rummer et udtryk af et værk med levende billeder, som er skabt af en familie. @da
label: kaastööline liikuva pildi alal (perekond) kehastuses @et
definition: Seostab perekonna kehastusega, mis on liitum, milles on teostatud perekonna loodud liikuvast pildist koosneva teose väljendus. @et
toolkit label: kaastööline liikuva pildi alal (perekond) kehastuses @et
toolkit definition: Kehastus, mis on liitum, milles on teostatud perekonna loodud liikuvast pildist koosneva teose väljendus. @et
label: ist Familie als Beiträgerin/Beiträger von einem Bewegtbild von @de
definition: Setzt eine Familie in Beziehung zu einem Aggregat (Manifestation), das eine Expression eines Bewegtbildwerks verkörpert, die eine Familie erstellt hat. @de
toolkit label: Familie als Beiträgerin/Beiträger von einem Bewegtbild von @de
toolkit definition: Ein Aggregat (Manifestation), das eine Expression eines Bewegtbildwerks verkörpert, die eine Familie erstellt hat. @de
label: közreműködő családja a következő mozgóképnek: @hu
definition: Hozzákapcsol egy családot egy aggregátum megjelenési formához, amely egy család által létrehozott mozgóképmű kifejezési formáját testesíti meg. @hu
toolkit label: közreműködő családja a következő mozgóképnek: @hu
toolkit definition: Egy aggregátum megjelenési forma, amely egy család által létrehozott mozgóképmű kifejezési formáját testesíti meg. @hu
label: è contributore famiglia di immagine in movimento di @it
definition: Correla una famiglia a una manifestazione che è un aggregato che materializza un'opera immagine in movimento creata da una famiglia. @it
toolkit label: contributore famiglia di immagine in movimento di @it
toolkit definition: Manifestazione che è un aggregato che materializza un'opera immagine in movimento creata da una famiglia. @it
label: είναι συντελεστής οικογένεια της κινητής εικόνας του @el
toolkit label: συντελεστής οικογένεια της κινητής εικόνας του @el
label: est une famille contributrice d’images animées de @fr
definition: Met une famille en relation avec une manifestation qui consiste en un agrégat matérialisant une expression d’une œuvre d’images animées créée par une famille. @fr
toolkit label: famille contributrice d’images animées de @fr
toolkit definition: Manifestation qui consiste en un agrégat matérialisant une expression d’une œuvre d’images animées créée par une famille. @fr
label: ir kustīga attēla līdzradītājs (dzimta/ģimene) @lv
definition: Sasaista dzimtu/ģimeni ar manifestāciju, kas ir apkopojums, kas ietver dzimtas/ģimenes radītu kustīga attēla darbu. @lv
toolkit label: ir kustīga attēla līdzradītājs (dzimta/ģimene) @lv
toolkit definition: Manifestācija, kas ir apkopojums, kas ietver dzimtas/ģimenes radītu kustīga attēla darbu. @lv
label: 是……的动态图像的贡献者家族 @zh-hans
definition: 将一个家族与作为一种合集、把一个家族所创作的一种动态图像作品的内容表达具体化的一种载体表现关联起来。 @zh-hans
toolkit label: ……的动态图像的贡献者家族 @zh-hans
toolkit definition: 作为一种合集、把一个家族所创作的一种动态图像作品的内容表达具体化的一种载体表现 @zh-hans
label: hareketli görüntüsünün katkıda bulunan ailesidir @tr
definition: Bir aileyi, aile tarafından yaratılan bir hareketli görüntü çalışmasının anlatımını somutlaştıran bir bütün olan gösterimle ilişkilendirir. @tr
toolkit label: hareketli̇ görüntüye katkıda bulunan aile @tr
toolkit definition: Bir aile tarafından oluşturulan hareketli bir görüntü eserinin anlatımını somutlaştıran topluluk olan bir gösterim. @tr
has subproperty: P50966

musiikkiin osallinen suku manifestaatiossa
status: Published
label: is contributor family of music of @en
lexical alias: contributorFamilyOfMusicOf.en
definition: Relates a family to a manifestation that is an aggregate that embodies an expression of a musical work that is created by a family. @en
toolkit label: contributor family of music of @en
toolkit definition: A manifestation that is an aggregate that embodies an expression of a musical work that is created by a family. @en
type: Property
domain: C10008
has element type: 2
sub property of: aggregaattiin osallinen suku manifestaatiossa
sub property of: musiikkiin osallinen yhteistoimija manifestaatiossa
definition: Liittää suvun manifestaatioon, joka on aggregaatti, joka sisältää musiikkiteoksen ekspression, jonka suku on luonut.
toolkit label: musiikkiin osallinen suku manifestaatiossa
toolkit definition: Manifestaatio, joka on aggregaatti, jossa suku on luonut aggregaattiin sisältyvän musiikkiteoksen.
label: er bidragsyter til musikk for (familie) @no
definition: Relaterer en familie til en manifestasjon som er et aggregat som realiserer et musikalsk verk skapt av en familie. @no
toolkit label: bidragsyter til musikk for (familie) @no
toolkit definition: En manifestasjon som er et aggregat som realiserer et musikalsk verk skapt av en familie. @no
label: is bijdrager-familie van muziek van @nl
definition: Relateert een familie aan een manifestatie die een aggregaat is die een expressie van een muziekwerk verwezenlijkt dat is gecreëerd door een familie. @nl
toolkit label: bijdrager-familie van muziek van @nl
toolkit definition: Een manifestatie die een aggregaat is die een expressie van een muziekwerk verwezenlijkt dat is gecreëerd door een familie. @nl
label: هي عائلة مساهمة في موسيقى لـ @ar
definition: يربط عائلة بتجسيدة عبارة عن تجميعة تجسد عملًا موسيقيًا أنشأته عائلة. @ar
toolkit label: عائلة مساهمة في موسيقى @ar
toolkit definition: تجسيدة تمثل تجميعة تجسد عملًا موسيقيًا أنشاته عائلة. @ar
label: és família contribuïdora de música de @ca
definition: Relaciona una família amb una manifestació que és un agregat que materialitza una expressió d’una obra musical que és creada per una família. @ca
toolkit label: família contribuïdora de música de @ca
toolkit definition: Manifestació que és un agregat que materialitza una expressió d’una obra musical que és creada per una família. @ca
label: er familie, som er bidragsyder til musik af @da
definition: Relaterer en familie til en manifestation, som er en samling, som rummer et udtryk af et musikværk, som er skabt af en familie. @da
toolkit label: familie, som er bidragsyder til musik af @da
toolkit definition: Manifestation, som er en samling, som rummer et udtryk af et musikværk, som er skabt af en familie. @da
label: muusikaline kaastööline (perekond) kehastuses @et
definition: Seostab perekonna kehastusega, mis on liitum, milles on teostatud perekonna loodud muusikateose väljendus. @et
toolkit label: muusikaline kaastööline (perekond) kehastuses @et
toolkit definition: Kehastus, mis on liitum, milles on teostatud perekonna loodud muusikateose väljendus. @et
label: ist Familie als Beiträgerin/Beiträger einer Musik von @de
definition: Setzt eine Familie in Beziehung zu einem Aggregat (Manifestation), das eine Expression eines Musikwerks verkörpert, die eine Familie erstellt hat. @de
toolkit label: Familie als Beiträgerin/Beiträger einer Musik von @de
toolkit definition: Ein Aggregat (Manifestation), das eine Expression eines Musikwerks verkörpert, die eine Familie erstellt hat. @de
label: közreműködő családja a következő zenének: @hu
definition: Hozzákapcsol egy családot egy aggregátum megjelenési formához, amely egy család által létrehozott zenemű kifejezési formáját testesíti meg. @hu
toolkit label: közreműködő családja a következő zenének: @hu
toolkit definition: Egy aggregátum megjelenési forma, amely egy család által létrehozott zenemű kifejezési formáját testesíti meg. @hu
label: è contributore famiglia di musica di @it
definition: Correla una famiglia a una manifestazione che è un aggregato che materializza un'opera musicale creata da un ente. @it
toolkit label: contributore famiglia di musica di @it
toolkit definition: Manifestazione che è un aggregato che materializza un'opera musicale creata da una famiglia. @it
label: είναι συντελεστής οικογένεια της μουσικής του @el
toolkit label: συντελεστής οικογένεια της μουσικής του @el
label: est une famille contributrice de musique de @fr
definition: Met une famille en relation avec une manifestation qui consiste en un agrégat matérialisant une expression d’une œuvre musicale créée par une famille. @fr
toolkit label: famille contributrice de musique de @fr
toolkit definition: Manifestation qui consiste en un agrégat matérialisant une expression d’une œuvre musicale créée par une famille. @fr
label: ir mūzikas līdzradītājs (dzimta/ģimene) @lv
definition: Sasaista dzimtu/ģimeni ar manifestāciju, kas ir apkopojums, kas ietver dzimtas/ģimenes radītu mūzikas darbu. @lv
toolkit label: ir mūzikas līdzradītājs (dzimta/ģimene) @lv
toolkit definition: Manifestācija, kas ir apkopojums, kas ietver dzimtas/ģimenes radītu mūzikas darbu. @lv
label: 是……的音乐的贡献者家族 @zh-hans
definition: 将一个家族与作为一种合集、把一个家族所创作的一种音乐作品的内容表达具体化的一种载体表现关联起来。 @zh-hans
toolkit label: ……的音乐的贡献者家族 @zh-hans
toolkit definition: 作为一种合集、把一个家族所创作的一种音乐作品的内容表达具体化的一种载体表现 @zh-hans
label: müziğinin katkıda bulunan ailesidir @tr
definition: Bir aileyi, aile tarafından yaratılan bir müzik çalışmasının anlatımını somutlaştıran bir bütün olan gösterimle ilişkilendirir. @tr
toolkit label: müzi̇ğe katkıda bulunan aile @tr
toolkit definition: Bir aile tarafından oluşturulan bir müzik eserinin anlatımını somutlaştıran topluluk olan bir gösterim. @tr
has subproperty: P50967

esineeseen osallinen suku manifestaatiossa
status: Published
label: is contributor family of object of @en
lexical alias: contributorFamilyOfObjectOf.en
definition: Relates a family to a manifestation that is an aggregate that embodies an expression of an object work that is created by a family. @en
toolkit label: contributor family of object of @en
toolkit definition: A manifestation that is an aggregate that embodies an expression of an object work that is created by a family. @en
type: Property
domain: C10008
has element type: 2
sub property of: aggregaattiin osallinen suku manifestaatiossa
sub property of: esineeseen osallinen yhteistoimija manifestaatiossa
definition: Liittää suvun manifestaatioon, joka on aggregaatti, joka sisältää esineteoksen ekspression, jonka suku on luonut.
toolkit label: esineeseen osallinen suku manifestaatiossa
toolkit definition: Manifestaatio, joka on aggregaatti, joka sisältää esineteoksen ekspression, jonka suku on luonut.
label: er bidragsyter til gjenstand for (familie) @no
definition: Relaterer en familie til en manifestasjon som er et aggregat som realiserer et verk som er en gjenstand skapt av en familie. @no
toolkit label: bidragsyter til gjenstand for (familie) @no
toolkit definition: En manifestasjon som er et aggregat som realiserer et verk som er en gjenstand skapt av en familie. @no
label: is bijdrager-familie van object van @nl
definition: Relateert een familie aan een manifestatie die een aggregaat is die een expressie van een objectwerk verwezenlijkt dat is gecreëerd door een familie. @nl
toolkit label: bijdrager-familie van object van @nl
toolkit definition: Een manifestatie die een aggregaat is die een expressie van een objectwerk verwezenlijkt dat is gecreëerd door een familie. @nl
label: هي عائلة مساهمة في كيان لـ @ar
definition: يربط عائلة بتجسيدة عبارة عن تجميعة تجسد عملا كائنا أنشأته عائلة. @ar
toolkit label: عائلة مساهمة في كيان @ar
toolkit definition: تجسيدة تمثل تجميعة تجسد عملا كائنا أنشأته عائلة. @ar
label: és família contribuïdora d’objecte de @ca
definition: Relaciona una família amb una manifestació que és un agregat que materialitza una expressió d’una obra d’objecte que és creada per una família. @ca
toolkit label: família contribuïdora d’objecte de @ca
toolkit definition: Manifestació que és un agregat que materialitza una expressió d’una obra d’objecte que és creada per una família. @ca
label: er familie, som er bidragsyder til objekt af @da
definition: Relaterer en familie til en manifestation, som er en samling, som rummer et udtryk af et værk med objekt, som er skabt af en familie. @da
toolkit label: familie, som er bidragsyder til objekt af @da
toolkit definition: Manifestation, som er en samling, som rummer et udtryk af et værk med objekt, som er skabt af en familie. @da
label: objektiloome kaastööline (perekond) kehastuses @et
definition: Seostab perekonna kehastusega, mis on liitum, milles on teostatud perekonna loodud objektteose väljendus. @et
toolkit label: objektiloome kaastööline (perekond) kehastuses @et
toolkit definition: Kehastus, mis on liitum, milles on teostatud perekonna loodud objektteose väljendus. @et
label: ist Familie als Beiträgerin/Beiträger von einem Gegenstand von @de
definition: Setzt eine Familie in Beziehung zu einem Aggregat (Manifestation), das eine Expression eines gegenständlichen Werks verkörpert, die eine Familie erstellt hat. @de
toolkit label: Familie als Beiträgerin/Beiträger von einem Gegenstand von @de
toolkit definition: Ein Aggregat (Manifestation), das eine Expression eines gegenständlichen Werks verkörpert, die eine Familie erstellt hat. @de
label: közreműködő családja a következő objektumnak: @hu
definition: Hozzákapcsol egy családot egy aggregátum megjelenési formához, amely egy család által létrehozott objektummű kifejezési formáját testesíti meg. @hu
toolkit label: közreműködő családja a következő objektumnak: @hu
toolkit definition: Egy aggregátum megjelenési forma, amely egy család által létrehozott objektummű kifejezési formáját testesíti meg. @hu
label: è contributore famiglia di oggetto di @it
definition: Correla una famiglia a una manifestazione che è un aggregato che materializza un'opera oggetto creata da una famiglia. @it
toolkit label: contributore famiglia di oggetto di @it
toolkit definition: Manifestazione che è un aggregato che materializza un'opera oggetto creata da una famiglia. @it
label: είναι συντελεστής οικογένεια του αντικειμένου του @el
toolkit label: συντελεστής οικογένεια του αντικειμένου του @el
label: est une famille contributrice d’objet de @fr
definition: Met une famille en relation avec une manifestation qui consiste en un agrégat matérialisant une expression d’une œuvre objet créée par une famille. @fr
toolkit label: famille contributrice d’objet de @fr
toolkit definition: Manifestation qui consiste en un agrégat matérialisant une expression d’une œuvre objet créée par une famille. @fr
label: ir objekta līdzradītājs (dzimta/ģimene) @lv
definition: Sasaista dzimtu/ģimeni ar manifestāciju, kas ir apkopojums, kas ietver dzimtas/ģimenes radītu objekta darbu. @lv
toolkit label: ir objekta līdzradītājs (dzimta/ģimene) @lv
toolkit definition: Manifestācija, kas ir apkopojums, kas ietver dzimtas/ģimenes radītu objekta darbu. @lv
label: 是……的物体的贡献者家族 @zh-hans
definition: 将一个家族与作为一种合集、把一个家族所创作的一种物体作品的内容表达具体化的一种载体表现关联起来。 @zh-hans
toolkit label: ……的物体的贡献者家族 @zh-hans
toolkit definition: 作为一种合集、把一个家族所创作的一种物体作品的内容表达具体化的一种载体表现 @zh-hans
label: nesnesinin katkıda bulunan ailesidir @tr
definition: Bir aileyi, aile tarafından yaratılan bir nesne çalışmasının anlatımını somutlaştıran bir bütün olan gösterimle ilişkilendirir. @tr
toolkit label: nesneye katkıda bulunan aile @tr
toolkit definition: Bir aile tarafından oluşturulan bir nesne eserinin anlatımını somutlaştıran topluluk olan bir gösterim. @tr
has subproperty: P50971

puheeseen osallinen suku manifestaatiossa
status: Published
label: is contributor family of speech of @en
lexical alias: contributorFamilyOfSpeechOf.en
definition: Relates a family to a manifestation that is an aggregate that embodies an expression of a vocal work that is created by a family. @en
toolkit label: contributor family of speech of @en
toolkit definition: A manifestation that is an aggregate that embodies an expression of a vocal work that is created by a family. @en
type: Property
domain: C10008
has element type: 2
sub property of: aggregaattiin osallinen suku manifestaatiossa
sub property of: puheeseen osallinen yhteistoimija manifestaatiossa
definition: Liittää suvun manifestaatioon, joka on aggregaatti, joka sisältää puheteoksen ekspression, jonka suku on luonut.
toolkit label: puheeseen osallinen suku manifestaatiossa
toolkit definition: Manifestaatio, joka on aggregaatti, joka sisältää puheteoksen ekspression, jonka suku on luonut.
label: er bidragsyter til tale for (familie) @no
definition: Relaterer en familie til en manifestasjon som er et aggregat som realiserer et verk av tale skapt av en familie. @no
toolkit label: bidragsyter til tale for (familie) @no
toolkit definition: En manifestasjon som er et aggregat som realiserer et verk av tale skapt av en familie. @no
label: is bijdrager-familie van spraak van @nl
definition: Relateert een familie aan een manifestatie die een aggregaat is die een expressie van een vocaal werk verwezenlijkt dat is gecreëerd door een familie. @nl
toolkit label: bijdrager-familie van spraak van @nl
toolkit definition: Een manifestatie die een aggregaat is die een expressie van een vocaal werk verwezenlijkt dat is gecreëerd door een familie. @nl
label: هي عائلة مساهمة في حديث لـ @ar
definition: يربط عائلة بتجسيدة عبارة عن تجميعة تجسد عملا كلمة منطوقة أنشأته عائلة. @ar
toolkit label: عائلة مساهمة في حديث @ar
toolkit definition: تجسيدة تمثل تجميعة تجسد عملا كلمة منطوقة أنشأته عائلة. @ar
label: és família contribuïdora de discurs de @ca
definition: Relaciona una família amb una manifestació que és un agregat que materialitza una expressió d’una obra vocal que és creada per una família. @ca
toolkit label: família contribuïdora de discurs de @ca
toolkit definition: Manifestació que és un agregat que materialitza una expressió d’una obra vocal que és creada per una família. @ca
label: er familie, som er bidragsyder til tale af @da
definition: Relaterer en familie til en manifestation, som er en samling, som rummer et udtryk af et værk med talte ord, som er skabt af en familie. @da
toolkit label: familie, som er bidragsyder til tale af @da
toolkit definition: Manifestation, som er en samling, som rummer et udtryk af et værk med talte ord, som er skabt af en familie. @da
label: kõneloome kaastööline (perekond) kehastuses @et
definition: Seostab perekonna kehastusega, mis on liitum, milles on teostatud perekonna loodud suulise teose väljendus. @et
toolkit label: kõneloome kaastööline (perekond) kehastuses @et
toolkit definition: Kehastus, mis on liitum, milles on teostatud perekonna loodud suulise teose väljendus. @et
label: ist Familie als Beiträgerin/Beiträger von einer Rede von @de
definition: Setzt eine Familie in Beziehung zu einem Aggregat (Manifestation), das eine Expression eines gesprochenen Werks verkörpert, die eine Familie erstellt hat. @de
toolkit label: Familie als Beiträgerin/Beiträger von einer Rede von @de
toolkit definition: Ein Aggregat (Manifestation), das eine Expression eines gesprochenen Werks verkörpert, die eine Familie erstellt hat. @de
label: közreműködő családja a következő beszédnek: @hu
definition: Hozzákapcsol egy családot egy aggregátum megjelenési formához, amely egy család által létrehozott beszédmű kifejezési formáját testesíti meg. @hu
toolkit label: közreműködő családja a következő beszédnek: @hu
toolkit definition: Egy aggregátum megjelenési forma, amely egy család által létrehozott beszédmű kifejezési formáját testesíti meg. @hu
label: è contributore famiglia di discorso di @it
definition: Correla una famiglia a una manifestazione che è un aggregato che materializza un'opera orale creata da una famiglia. @it
toolkit label: contributore famiglia di discorso di @it
toolkit definition: Manifestazione che è un aggregato che materializza un'opera orale creata da una famiglia. @it
label: είναι συντελεστής οικογένεια της ομιλίας του @el
toolkit label: συντελεστής οικογένεια της ομιλίας του @el
label: est une famille contributrice de contenu vocal de @fr
definition: Met une famille en relation avec une manifestation qui consiste en un agrégat matérialisant une expression d’une œuvre vocale créée par une famille. @fr
toolkit label: famille contributrice de contenu vocal de @fr
toolkit definition: Manifestation qui consiste en un agrégat matérialisant une expression d’une œuvre vocale créée par une famille. @fr
label: ir runas līdzradītājs (dzimta/ģimene) @lv
definition: Sasaista dzimtu/ģimeni ar manifestāciju, kas ir apkopojums, kas ietver dzimtas/ģimenes radītu mutvārdu darbu. @lv
toolkit label: ir runas līdzradītājs (dzimta/ģimene) @lv
toolkit definition: Manifestācija, kas ir apkopojums, kas ietver dzimtas/ģimenes radītu mutvārdu darbu. @lv
label: 是……的讲话的贡献者家族 @zh-hans
definition: 将一个家族与作为一种合集、把一个家族所创作的一种人声作品的内容表达具体化的一种载体表现关联起来。 @zh-hans
toolkit label: ……的讲话的贡献者家族 @zh-hans
toolkit definition: 作为一种合集、把一个家族所创作的一种人声作品的内容表达具体化的一种载体表现 @zh-hans
label: konuşmasının katkıda bulunan ailesidir @tr
definition: Bir aileyi, aile tarafından yaratılan bir ses çalışmasının anlatımını somutlaştıran bir bütün olan gösterimle ilişkilendirir. @tr
toolkit label: konuşmaya katkıda bulunan aile @tr
toolkit definition: Bir aile tarafından oluşturulan bir vokal eserin anlatımını somutlaştıran topluluk olan bir gösterim. @tr
has subproperty: P50968

stillkuvaan osallinen suku manifestaatiossa
status: Published
label: is contributor family of still image of @en
lexical alias: contributorFamilyOfStillImageOf.en
definition: Relates a family to a manifestation that is an aggregate that embodies an expression of a still image work that is created by a family. @en
toolkit label: contributor family of still image of @en
toolkit definition: A manifestation that is an aggregate that embodies an expression of a still image work that is created by a family. @en
type: Property
domain: C10008
has element type: 2
sub property of: aggregaattiin osallinen suku manifestaatiossa
sub property of: stillkuvaan osallinen yhteistoimija manifestaatiossa
definition: Liittää suvun manifestaatioon, joka on aggregaatti, joka sisältää stillkuvateoksen ekspression, jonka suku on luonut.
toolkit label: stillkuvaan osallinen suku manifestaatiossa
toolkit definition: Manifestaatio, joka on aggregaatti, joka sisältää stillkuvateoksen ekspression, jonka suku on luonut.
label: er bidragsyter til bilde for (familie) @no
definition: Relaterer en familie til en manifestasjon som er et aggregat som realiserer et bildeverk skapt av en familie. @no
toolkit label: bidragsyter til bilde for (familie) @no
toolkit definition: En manifestasjon som er et aggregat som realiserer et bildeverk skapt av en familie. @no
label: is bijdrager-familie van stilstaand beeld van @nl
definition: Relateert een familie aan een manifestatie die een aggregaat is die een expressie van een stilstaand beeldwerk verwezenlijkt dat is gecreëerd door een familie. @nl
toolkit label: bijdrager-familie van stilstaand beeld van @nl
toolkit definition: Een manifestatie die een aggregaat is die een expressie van een stilstaand beeldwerk verwezenlijkt dat is gecreëerd door een familie. @nl
label: هي عائلة مساهمة في صور ثابتة لـ @ar
definition: يربط عائلة بتجسيدة عبارة عن تجميعة تجسد عملا بصور ثابتة أنشأته عائلة. @ar
toolkit label: عائلة مساهمة في صور ثابتة @ar
toolkit definition: تجسيدة تمثل تجميعة تجسد عملا بصور ثابتة أنشأته عائلة. @ar
label: és família contribuïdora d’imatge fixa de @ca
definition: Relaciona una família amb una manifestació que és un agregat que materialitza una expressió d’una obra d’imatge fixa que és creada per una família. @ca
toolkit label: família contribuïdora d’imatge fixa de @ca
toolkit definition: Manifestació que és un agregat que materialitza una expressió d’una obra d’imatge fixa que és creada per una família. @ca
label: er familie, som er bidragsyder til stillbillede af @da
definition: Relaterer en familie til en manifestation, som er en samling, som rummer et udtryk af et værk med stillbilleder, som er skabt af en familie. @da
toolkit label: familie, som er bidragsyder til stillbillede af @da
toolkit definition: Manifestation, som er en samling, som rummer et udtryk af et værk med stillbilleder, som er skabt af en familie. @da
label: kaastööline liikumatu pildi alal (perekond) kehastuses @et
definition: Seostab perekonna kehastusega, mis on liitum, milles on teostatud perekonna loodud liikumatust pildist koosneva teose väljendus. @et
toolkit label: kaastööline liikumatu pildi alal (perekond) kehastuses @et
toolkit definition: Kehastus, mis on liitum, milles on teostatud perekonna loodud liikumatust pildist koosneva teose väljendus. @et
label: ist Familie als Illustratorin/Illustrator von @de
definition: Setzt eine Familie in Beziehung zu einem Aggregat (Manifestation), das eine Expression eines unbewegten Bildwerks verkörpert, die eine Familie erstellt hat. @de
toolkit label: Familie als Illustratorin/Illustrator von @de
toolkit definition: Ein Aggregat (Manifestation), das eine Expression eines unbewegten Bildwerks verkörpert, die eine Familie erstellt hat. @de
label: közreműködő családja a következő állóképnek: @hu
definition: Hozzákapcsol egy családot egy aggregátum megjelenési formához, amely egy család által létrehozott állóképmű kifejezési formáját testesíti meg. @hu
toolkit label: közreműködő családja a következő állóképnek: @hu
toolkit definition: Egy aggregátum megjelenési forma, amely egy család által létrehozott állóképmű kifejezési formáját testesíti meg. @hu
label: è contributore famiglia di immagine fissa di @it
definition: Correla una famiglia a una manifestazione che è un aggregato che materializza un'opera immagine fissa creata da una famiglia. @it
toolkit label: contributore famiglia di immagine fissa di @it
toolkit definition: Manifestazione che è un aggregato che materializza un'opera immagine fissa creata da una famiglia. @it
label: είναι συντελεστής οικογένεια της σταθερής εικόνας του @el
toolkit label: συντελεστής οικογένεια της σταθερής εικόνας του @el
label: est une famille contributrice d’image fixe de @fr
definition: Met une famille en relation avec une manifestation qui consiste en un agrégat matérialisant une expression d’une œuvre d’image fixe créée par une famille. @fr
toolkit label: famille contributrice d’image fixe de @fr
toolkit definition: Manifestation qui consiste en un agrégat matérialisant une expression d’une œuvre d’image fixe créée par une famille. @fr
label: ir attēla līdzradītājs (dzimta/ģimene) @lv
definition: Sasaista dzimtu/ģimeni ar manifestāciju, kas ir apkopojums, kas ietver dzimtas/ģimenes radītu attēla darbu. @lv
toolkit label: ir attēla līdzradītājs (dzimta/ģimene) @lv
toolkit definition: Manifestācija, kas ir apkopojums, kas ietver dzimtas/ģimenes radītu attēla darbu. @lv
label: 是……的静态图像的贡献者家族 @zh-hans
definition: 将一个家族与作为一种合集、把一个家族所创作的一种静态图像作品的内容表达具体化的一种载体表现关联起来。 @zh-hans
toolkit label: ……的静态图像的贡献者家族 @zh-hans
toolkit definition: 作为一种合集、把一个家族所创作的一种静态图像作品的内容表达具体化的一种载体表现 @zh-hans
label: durağan görüntüsünün katkıda bulunan ailesidir @tr
definition: Bir aileyi, aile tarafından yaratılan bir hareketsiz görüntü çalışmasının anlatımını somutlaştıran bir bütün olan gösterimle ilişkilendirir. @tr
toolkit label: hareketsiz görüntüye katkıda bulunan aile @tr
toolkit definition: Bir aile tarafından oluşturulan hareketsiz bir görüntü eserinin anlatımını somutlaştıran topluluk olan bir gösterim. @tr
has subproperty: P50969

tekstiin osallinen suku manifestaatiossa
status: Published
label: is contributor family of text of @en
lexical alias: contributorFamilyOfTextOf.en
definition: Relates a family to a manifestation that is an aggregate that embodies an expression of a textual work that is created by a family. @en
toolkit label: contributor family of text of @en
toolkit definition: A manifestation that is an aggregate that embodies an expression of a textual work that is created by a family. @en
type: Property
domain: C10008
has element type: 2
sub property of: aggregaattiin osallinen suku manifestaatiossa
sub property of: tekstiin osallinen yhteistoimija manifestaatiossa
definition: Liittää suvun manifestaatioon, joka on aggregaatti, joka sisältää tekstiteoksen ekspression, jonka suku on luonut.
toolkit label: tekstiin osallinen suku manifestaatiossa
toolkit definition: Manifestaatio, joka on aggregaatti, joka sisältää tekstiteoksen ekspression, jonka suku on luonut.
label: er bidragsyter til tekst for (familie) @no
definition: Relaterer en familie til en manifestasjon som er et aggregat som realiserer et tekstlig verk skapt av en familie. @no
toolkit label: bidragsyter til tekst for (familie) @no
toolkit definition: En manifestasjon som er et aggregat som realiserer et tekstlig verk skapt av en familie. @no
label: is bijdrager-familie van tekst van @nl
definition: Relateert een familie aan een manifestatie die een aggregaat is die een expressie van een tekstwerk verwezenlijkt dat is gecreëerd door een familie. @nl
toolkit label: bijdrager-familie van tekst van @nl
toolkit definition: Een manifestatie die een aggregaat is die een expressie van een tekstwerk verwezenlijkt dat is gecreëerd door een familie. @nl
label: هي عائلة مساهمة في نص لـ @ar
definition: يربط عائلة بتجسيدة عبارة عن تجميعة تجسد عملا نصي أنشأته عائلة. @ar
toolkit label: عائلة مساهمة في نص @ar
toolkit definition: تجسيدة تمثل تجميعة تجسد عملا نصي أنشأته عائلة. @ar
label: és família contribuïdora de text de @ca
definition: Relaciona una família amb una manifestació que és un agregat que materialitza una expressió d’una obra textual que és creada per una família. @ca
toolkit label: família contribuïdora de text de @ca
toolkit definition: Manifestació que és un agregat que materialitza una expressió d’una obra textual que és creada per una família. @ca
label: er familie, som er bidragsyder til tekst af @da
definition: Relaterer en familie til en manifestation, som er en samling, som rummer et udtryk af et tekstværk, som er skabt af en familie. @da
toolkit label: familie, som er bidragsyder til tekst af @da
toolkit definition: Manifestation, som er en samling, som rummer et udtryk af et tekstværk, som er skabt af en familie. @da
label: tekstiloome kaastööline (perekond) kehastuses @et
definition: Seostab perekonna kehastusega, mis on liitum, milles on teostatud perekonna loodud tekstteose väljendus. @et
toolkit label: tekstiloome kaastööline (perekond) kehastuses @et
toolkit definition: Kehastus, mis on liitum, milles on teostatud perekonna loodud tekstteose väljendus. @et
label: ist Familie als Beiträgerin/Beiträger von ergänzendem Text von @de
definition: Setzt eine Familie in Beziehung zu einem Aggregat (Manifestation), das eine Expression eines textlichen Werks verkörpert, die eine Familie erstellt hat. @de
toolkit label: Familie als Beiträgerin/Beiträger von ergänzendem Text von @de
toolkit definition: Ein Aggregat (Manifestation), das eine Expression eines textlichen Werks verkörpert, die eine Familie erstellt hat. @de
label: közreműködő családja a következő szövegnek: @hu
definition: Hozzákapcsol egy családot egy aggregátum megjelenési formához, amely egy család által létrehozott szöveges mű kifejezési formáját testesíti meg. @hu
toolkit label: közreműködő családja a következő szövegnek: @hu
toolkit definition: Egy aggregátum megjelenési forma, amely egy család által létrehozott szöveges mű kifejezési formáját testesíti meg. @hu
label: è contributore famiglia di testo di @it
definition: Correla una famiglia a una manifestazione che è un aggregato che materializza un'opera testuale creata da una famiglia. @it
toolkit label: contributore famiglia di testo di @it
toolkit definition: Manifestazione che è un aggregato che materializza un'opera testuale creata da una famiglia. @it
label: είναι συντελεστής οικογένεια του κειμένου του @el
toolkit label: συντελεστής οικογένεια του κειμένου του @el
label: est une famille contributrice de texte de @fr
definition: Met une famille en relation avec une manifestation qui consiste en un agrégat matérialisant une expression d’une œuvre textuelle créée par une famille. @fr
toolkit label: famille contributrice de texte de @fr
toolkit definition: Manifestation qui consiste en un agrégat matérialisant une expression d’une œuvre textuelle créée par une famille. @fr
label: ir teksta līdzradītājs (dzimta/ģimene) @lv
definition: Sasaista dzimtu/ģimeni ar manifestāciju, kas ir apkopojums, kas ietver dzimtas/ģimenes radītu teksta darbu. @lv
toolkit label: ir teksta līdzradītājs (dzimta/ģimene) @lv
toolkit definition: Manifestācija, kas ir apkopojums, kas ietver dzimtas/ģimenes radītu teksta darbu. @lv
label: 是……的文本的贡献者家族 @zh-hans
definition: 将一个家族与作为一种合集、把一个家族所创作的一种文字作品的内容表达具体化的一种载体表现关联起来。 @zh-hans
toolkit label: ……的文本的贡献者家族 @zh-hans
toolkit definition: 作为一种合集、把一个家族所创作的一种文字作品的内容表达具体化的一种载体表现 @zh-hans
label: metninin katkıda bulunan ailesidir @tr
definition: Bir aileyi, aile tarafından yaratılan bir metinsel çalışmanın anlatımını somutlaştıran bir bütün olan gösterimle ilişkilendirir. @tr
toolkit label: metne katkıda bulunan aile @tr
toolkit definition: Bir aile tarafından oluşturulan metinsel bir eserin anlatımını somutlaştıran topluluk olan bir gösterim. @tr
has subproperty: P50970

aggregaattiin osallinen suku manifestaatiossa
status: Published
label: is contributor family to aggregate of @en
lexical alias: contributorFamilyToAggregateOf.en
definition: Relates a family to a manifestation that is an aggregate that embodies an expression of a work that is created by a family. @en
toolkit label: contributor family to aggregate of @en
toolkit definition: A manifestation that is an aggregate that embodies an expression of a work that is created by a family. @en
type: Property
domain: C10008
has element type: 2
sub property of: sukuun liittyvä manifestaatio
sub property of: aggregaattiin osallinen yhteistoimija manifestaatiossa
definition: Liittää suvun manifestaatioon, joka on aggregaatti, joka sisältää teoksen ekspression, jonka suku on luonut.
toolkit label: aggregaattiin osallinen suku manifestaatiossa
toolkit definition: Manifestaatio, joka on aggregaatti, joka sisältää teoksen ekspression, jonka suku on luonut.
label: er bidragsyter til aggregat for (familie) @no
definition: Relaterer en familie til en manifestasjon som er et aggregat som inkluderer et bidrag fra en familie. @no
toolkit label: bidragsyter til aggregat for (familie) @no
toolkit definition: En manifestasjon som er et aggregat som inkluderer et bidrag fra en familie. @no
label: is bijdrager-familie aan aggregaat van @nl
definition: Relateert een familie aan een manifestatie die een aggregaat is die een expressie van een werk verwezenlijkt die gecreëerd is door een familie. @nl
toolkit label: bijdrager-familie aan aggregaat van @nl
toolkit definition: Een manifestatie die een aggregaat is die een expressie van een werk verwezenlijkt die gecreëerd is door een familie. @nl
label: هي عائلة مساهمة في تجميعة لـ @ar
definition: يربط عائلة بتجسيدة عبارة عن تجميعة تتضمن إسهام عائلة. @ar
toolkit label: عائلة مساهمة في تجميعة @ar
toolkit definition: تجسيدة عبارة عن تجميعة تتضمن إسهام عائلة. @ar
label: és família contribuïdora a un agregat de @ca
definition: Relaciona una família amb una manifestació que és un agregat que materialitza una expressió d’una obra que és creada per una família. @ca
toolkit label: família contribuïdora a un agregat de @ca
toolkit definition: Manifestació que és un agregat que materialitza una expressió d’una obra que és creada per una família. @ca
label: er familie, som er bidragsyder til samling af @da
definition: Relaterer en familie til en manifestation, som er en samling, som omfatter et værk skabt af en familie. @da
toolkit label: familie, som er bidragsyder til samling af @da
toolkit definition: Manifestation, som er en samling, som omfatter et værk skabt af en familie. @da
label: liitumi kaastööline (perekond) kehastuses @et
definition: Seostab perekonna kehastusega, mis on liitum, milles on teostatud perekonna loodud teose väljendus. @et
toolkit label: liitumi kaastööline (perekond) kehastuses @et
toolkit definition: Kehastus, mis on liitum, milles on teostatud perekonna loodud teose väljendus. @et
label: ist Familie als Beiträgerin/Beiträger zu einem Aggregat von @de
definition: Setzt eine Familie in Beziehung zu einem Aggregat (Manifestation), das eine Expression eines Werks verkörpert, die eine Familie erstellt hat. @de
toolkit label: Familie als Beiträgerin/Beiträger zu einem Aggregat von @de
toolkit definition: Ein Aggregat (Manifestation), das eine Expression eines Werks verkörpert, die eine Familie erstellt hat. @de
label: közreműködő családja a következő aggregátumnak: @hu
definition: Hozzákapcsol egy családot egy aggregátum megjelenési formához, amely egy család által létrehozott mű kifejezési formáját testesíti meg. @hu
toolkit label: közreműködő családja a következő aggregátumnak: @hu
toolkit definition: Egy megjelenési forma, amely egy család által létrehozott mű kifejezési formáját testesíti meg. @hu
label: è contributore famiglia di aggregato di @it
definition: Correla una famiglia a una manifestazione che è un aggregato che comprende un contributo di una famiglia. @it
toolkit label: contributore famiglia di aggregato di @it
toolkit definition: Manifestazione che è un aggregato che comprende un contributo di una famiglia. @it
label: είναι συντελεστής οικογένεια σε συνάθροιση του @el
toolkit label: συντελεστής οικογένεια σε συνάθροιση του @el
label: est une famille contributrice à un agrégat de @fr
definition: Met une famille en relation avec une manifestation qui consiste en un agrégat matérialisant une expression d’une œuvre créée par une famille. @fr
toolkit label: famille contributrice à un agrégat de @fr
toolkit definition: Manifestation qui consiste en un agrégat matérialisant une expression d’une œuvre créée par une famille. @fr
label: ir apkopojuma līdzradītājs (dzimta/ģimene) @lv
definition: Sasaista dzimtu/ģimeni ar manifestāciju, kas ir apkopojums, kas ietver dzimtas/ģimenes ieguldījumu/līdzdalību. @lv
toolkit label: ir apkopojuma līdzradītājs (dzimta/ģimene) @lv
toolkit definition: Manifestācija, kas ir apkopojums, kas ietver dzimtas/ģimenes ieguldījumu/līdzdalību. @lv
label: 是……的合集的贡献者家族 @zh-hans
definition: 将一个家族与作为一种合集、把一个家族所创作的一种作品的内容表达具体化的一种载体表现关联起来。 @zh-hans
toolkit label: ……的合集的贡献者家族 @zh-hans
toolkit definition: 作为一种合集、把一个家族所创作的一种作品的内容表达具体化的一种载体表现 @zh-hans
label: toplanmasına katkıda bulunan ailedir @tr
definition: Bir aileyi, bir aile tarafından yaratılan bir çalışmanın ifadesini somutlaştıran bir bütün olan bir gösterimle ilişkilendirir. @tr
toolkit label: topluluğa katkıda bulunan aile @tr
toolkit definition: Bir aile tarafından oluşturulan bir eserin anlatımını somutlaştıran topluluk olan bir gösterim. @tr
has subproperty: kartografiaan osallinen suku manifestaatiossa
has subproperty: koreografiaan osallinen suku manifestaatiossa
has subproperty: digitaaliseen sisältöön osallinen suku manifestaatiossa
has subproperty: liikkuvaan kuvaan osallinen suku manifestaatiossa
has subproperty: musiikkiin osallinen suku manifestaatiossa
has subproperty: esineeseen osallinen suku manifestaatiossa
has subproperty: puheeseen osallinen suku manifestaatiossa
has subproperty: stillkuvaan osallinen suku manifestaatiossa
has subproperty: tekstiin osallinen suku manifestaatiossa
has subproperty: P50974

yhdistymään osallinen suku ekspressiossa
status: Published
label: is contributor family to amalgamation of @en
lexical alias: contributorFamilyToAmalgamationOf.en
definition: Relates a family to an expression that includes a contribution by a family to a seamless mix of kinds of content. @en
toolkit label: contributor family to amalgamation of @en
toolkit definition: An expression that includes a contribution by a family to a seamless mix of kinds of content. @en
type: Property
domain: C10008
has element type: 2
sub property of: ekspression tekijä (suku) ekspressiossa
sub property of: yhdistymään osallinen yhteistoimija ekspressiossa
definition: Liittää suvun ekspressioon, jossa suku on osallisena sellaisen ekspression tekemisessä, joka on saumaton yhdistelmä erilaisia sisältöjä.
toolkit label: yhdistymään osallinen suku ekspressiossa
toolkit definition: Ekspressio, jossa suku on osallisena sellaisen ekspression tekemisessä, joka on saumaton yhdistelmä erilaisia sisältöjä.
label: er bidragsyter til sammenslutning for (familie) @no
definition: Relaterer en familie til et uttrykk som inkluderer et bidrag fra en familie til en sømløs blanding av forskjellig innhold. @no
toolkit label: bidragsyter til sammenslutning for (familie) @no
toolkit definition: Et uttrykk som inkluderer et bidrag fra en familie til en sømløs blanding av forskjellig innhold. @no
label: is bijdrager-familie aan amalgamering van @nl
definition: Relateert een familie aan een expressie die omvat een bijdrage door een familie aan een naadloze mix van soorten content. @nl
toolkit label: bijdrager-familie aan amalgamering van @nl
toolkit definition: Een expressie die omvat een bijdrage door een familie aan een naadloze mix van soorten content. @nl
label: هي عائلة مساهمة في دمج لـ @ar
definition: يربط عائلة بتعبيرة تتضمن إسهام عائلة في مزج سلس لأنواع من المحتوى. @ar
toolkit label: عائلة مساهمة في دمج @ar
toolkit definition: تعبيرة تتضمن إسهام عائلة في مزج سلس لأنواع من المحتوى. @ar
label: és família contribuïdora a una amalgama de @ca
definition: Relaciona una família amb una expressió que inclou una contribució d’una família a una mescla sense continuïtat de classes de contingut. @ca
toolkit label: família contribuïdora a una amalgama de @ca
toolkit definition: Expressió que inclou una contribució d’una família a una mescla sense continuïtat de classes de contingut. @ca
label: er familie, som er bidragsyder til sammensmeltning af @da
definition: Relaterer en familie til et udtryk, som omfatter en families bidrag til en glat kombinering af forskellige slags af indhold. @da
toolkit label: familie, som er bidragsyder til sammensmeltning af @da
toolkit definition: Udtryk, som omfatter en families bidrag til en glat kombinering af forskellige slags af indhold. @da
label: sulami kaastööline (perekond) väljenduses @et
definition: Seostab perekonna väljendusega, millesse perekond on andnud panuse, osaledes eri liiki sisu lahutamatu segu loomisel. @et
toolkit label: sulami kaastööline (perekond) väljenduses @et
toolkit definition: Väljendus, millesse perekond on andnud panuse, osaledes eri liiki sisu lahutamatu segu loomisel. @et
label: ist Familie als Beiträgerin/Beiträger zu einer Verschmelzung von @de
definition: Setzt eine Familie in Beziehung zu einer Expression, bei der eine Familie zu einer nahtlosen Mischung von Inhalten beiträgt. @de
toolkit label: Familie als Beiträgerin/Beiträger zu einer Verschmelzung von @de
toolkit definition: Eine Expression, bei der eine Familie zu einer nahtlosen Mischung von Inhalten beiträgt. @de
label: közreműködő családja a következő vegyes tartalomnak: @hu
definition: Hozzákapcsol egy családot egy kifejezési formához, amely magában foglalja egy család közreműködését a tartalom fajtáinak szabad keverésében. @hu
toolkit label: közreműködő családja a következő vegyes tartalomnak: @hu
toolkit definition: Egy kifejezési forma, amely magában foglalja egy család közreműködését a tartalom fajtáinak szabad keverésében. @hu
label: è contributore famiglia di fusione di @it
definition: Correla una famiglia a un'espressione che comprende un contributo di una famiglia a una varietà di tipi di contenuto senza soluzione di continuità. @it
toolkit label: contributore famiglia di fusione di @it
toolkit definition: Espressione che comprende un contributo di una famiglia a una varietà di tipi di contenuto senza soluzione di continuità. @it
label: είναι συντελεστής οικογένεια σε μείξη του (?) @el
definition: Συνδέει μια οικογένεια με μια έκφραση που περιλαμβάνει μια συνεισφορά από μια οικογένεια σε μια αρραγή μείξη ειδών περιεχομένου. @el
toolkit label: συντελεστής οικογένεια σε μείξη του (?) @el
label: est une famille contributrice à un amalgame de @fr
definition: Met une famille en relation avec une expression qui intègre une contribution de la part d’une famille à un mélange intégré de différents genres de contenu. @fr
toolkit label: famille contributrice à un amalgame de @fr
toolkit definition: Expression qui intègre une contribution de la part d’une famille à un mélange intégré de différents genres de contenu. @fr
label: ir amalgamāta līdzradītājs (dzimta/ģimene) @lv
definition: Sasaista dzimtu/ģimeni ar izteiksmi, kas ietver dzimtas/ģimenes ieguldījumu dažādu satura veidu vienlaidu sajaukumā. @lv
toolkit label: ir amalgamāta līdzradītājs (dzimta/ģimene) @lv
toolkit definition: Izteiksme, kas ietver dzimtas/ģimenes ieguldījumu dažādu satura veidu vienlaidu sajaukumā. @lv
label: 是……的融合体的贡献者家族 @zh-hans
definition: 将一个家族与包括将各种内容无缝融合的一个家族的贡献的一种内容表达关联起来。 @zh-hans
toolkit label: ……的融合体的贡献者家族 @zh-hans
toolkit definition: 包括将各种内容无缝融合的一个家族的贡献的一种内容表达 @zh-hans
label: birleşimine katkıda bulunan ailedir @tr
definition: Bir aileyi, bir ailenin kusursuz bir içerik türleri karışımına yaptığı katkıyı içeren bir anlatımla ilişkilendirir. @tr
toolkit label: birleşmeye katkıda bulunan aile @tr
toolkit definition: Farklı türde içeriklerin kusursuz karışımını sağlayan bir ailenin katkısını içeren bir anlatım.​ @tr
has subproperty: värittäjä (suku) ekspressiossa
has subproperty: esitykseen osallinen suku ekspressiossa
has subproperty: tuomioistuimen kirjuri (suku) ekspressiossa
has subproperty: piirtäjä (suku) ekspressiossa
has subproperty: toimittaja (suku) ekspressiossa
has subproperty: tekstaaja (suku) ekspressiossa
has subproperty: pöytäkirjan laatija (suku) ekspressiossa
has subproperty: ohjelmistokehittäjä (suku) ekspressiossa
has subproperty: P51077

esitykseen osallinen suku ekspressiossa
status: Published
label: is contributor family to performance of @en
lexical alias: contributorFamilyToPerformanceOf.en
definition: Relates a family to an expression that includes a contribution by a family to a performance. @en
toolkit label: contributor family to performance of @en
toolkit definition: An expression that includes a contribution by a family to a performance. @en
type: Property
domain: C10008
has element type: 2
sub property of: yhdistymään osallinen suku ekspressiossa
sub property of: esitykseen osallinen yhteistoimija ekspressiossa
definition: Liittää suvun ekspressioon, jossa suku on osallisena sellaisen ekspression tekemisessä, joka on esitys.
toolkit label: esitykseen osallinen suku ekspressiossa
toolkit definition: Ekspressio, jossa suku on osallisena sellaisen ekspression tekemisessä, joka on esitys.
label: er bidragsyter til framføring for (familie) @no
definition: Relaterer en familie til et uttrykk som inkluderer et bidrag fra en familie til en framføring. @no
toolkit label: bidragsyter til framføring for (familie) @no
toolkit definition: Et uttrykk som inkluderer et bidrag fra en familie til en framføring. @no
label: is bijdrager-familie aan uitvoering van @nl
definition: Relateert een familie aan een expressie die omvat een bijdrage door een familie aan een uitvoering. @nl
toolkit label: bijdrager-familie aan uitvoering van @nl
toolkit definition: Een expressie die omvat een bijdrage door een familie aan een uitvoering. @nl
label: هي عائلة مساهمة في أداء لـ @ar
definition: يربط عائلة بتعبيرة تتضمن إسهام عائلة في أداء. @ar
toolkit label: عائلة مساهمة في أداء @ar
toolkit definition: تعبيرة تتضمن إسهام عائلة في أداء. @ar
label: és família contribuïdora a una interpretació de @ca
definition: Relaciona una família amb una expressió que inclou una contribució d’una família a una interpretació. @ca
toolkit label: família contribuïdora a una interpretació de @ca
toolkit definition: Expressió que inclou una contribució d’una família a una interpretació. @ca
label: er familie, som er bidragsyder til optræden af @da
definition: Relaterer en familie til et udtryk, som omfatter en families bidrag til en optræden. @da
toolkit label: familie, som er bidragsyder til optræden af @da
toolkit definition: Udtryk, som omfatter en families bidrag til en optræden. @da
label: esituse kaastööline (perekond) väljenduses @et
definition: Seostab perekonna väljendusega, millesse perekond on andnud panuse, osaledes esituse loomisel. @et
toolkit label: esituse kaastööline (perekond) väljenduses @et
toolkit definition: Väljendus, millesse perekond on andnud panuse, osaledes esituse loomisel. @et
label: ist Familie als Beiträgerin/Beiträger zu einer Darbietung von @de
definition: Setzt eine Familie in Beziehung zu einer Expression, bei der eine Familie zu einer Darbietung beiträgt @de
toolkit label: Familie als Beiträgerin/Beiträger zu einer Darbietung von @de
toolkit definition: Eine Expression, bei der eine Familie zu eine Darbietung beiträgt. @de
label: közreműködő családja a következő előadásnak: @hu
definition: Hozzákapcsol egy családot egy kifejezési formához, amely magában foglalja egy család közreműködését egy előadásban. @hu
toolkit label: közreműködő családja a következő előadásnak: @hu
toolkit definition: Egy kifejezési forma, amely magában foglalja egy család közreműködését egy előadásban. @hu
label: è contributore famiglia di esibizione di @it
definition: Correla una famiglia a un'espressione che comprende un contributo di una famiglia a un'esibizione. @it
toolkit label: contributore famiglia di esibizione di @it
toolkit definition: Espressione che comprende un contributo di una famiglia a un'esibizione. @it
label: είναι συντελεστής οικογένεια σε εκτέλεση του @el
definition: Συνδέει μια οικογένεια με μια έκφραση που περιλαμβάνει μια συνεισφορά από μια οικογένεια σε μια εκτέλεση. @el
toolkit label: συντελεστής οικογένεια σε εκτέλεση του @el
label: est une famille contributrice à une prestation de @fr
definition: Met une famille en relation avec une expression qui intègre une contribution de la part d’une famille à une prestation. @fr
toolkit label: famille contributrice à une prestation de @fr
toolkit definition: Expression qui intègre une contribution de la part d’une famille à une prestation. @fr
label: ir uzveduma līdzradītājs (dzimta/ģimene) @lv
definition: Sasaista dzimtu/ģimeni ar izteiksmi, kas ietver dzimtas/ģimenes ieguldījumu uzvedumā. @lv
toolkit label: ir uzveduma līdzradītājs (dzimta/ģimene) @lv
toolkit definition: Izteiksme, kas ietver dzimtas/ģimenes ieguldījumu uzvedumā. @lv
label: 是……的表演的贡献者家族 @zh-hans
definition: 将一个家族与包括一个家族对一个表演之贡献的一种内容表达关联起来。 @zh-hans
toolkit label: ……的表演的贡献者家族 @zh-hans
toolkit definition: 包括一个家族对一个表演之贡献的一种内容表达 @zh-hans
label: performansına katkıda bulunan ailedir @tr
definition: Bir aileyi, bir ailenin bir performansa katkısını içeren bir anlatımla ilişkilendirir. @tr
toolkit label: performansa katkıda bulunan aile @tr
toolkit definition: Bir ailenin bir performansa katkısını içeren bir anlatım. @tr
has subproperty: animaattori (suku) ekspressiossa
has subproperty: lavastaja (suku) ekspressiossa
has subproperty: ääniteknikko (suku) ekspressiossa
has subproperty: puvustaja (suku) ekspressiossa
has subproperty: DJ (suku) ekspressiossa
has subproperty: dubbausohjaaja (suku) ekspressiossa
has subproperty: leikkaaja (suku) ekspressiossa
has subproperty: ekspression haastateltava (suku) ekspressiossa
has subproperty: ekspression haastattelija (suku) ekspressiossa
has subproperty: valosuunnittelija (suku) ekspressiossa

kartografiaan osallinen henkilö manifestaatiossa
status: Published
label: is contributor person of cartography of @en
lexical alias: contributorPersonOfCartographyOf.en
definition: Relates a person to a manifestation that is an aggregate that embodies an expression of a cartographic work that is created by a person. @en
toolkit label: contributor person of cartography of @en
toolkit definition: A manifestation that is an aggregate that embodies an expression of a cartographic work that is created by a person. @en
type: Property
domain: C10004
has element type: 2
sub property of: aggregaattiin osallinen henkilö manifestaatiossa
sub property of: kartografiaan osallinen toimija manifestaatiossa
definition: Liittää henkilön manifestaatioon, joka on aggregaatti, joka sisältää kartografisen teoksen ekspression, jonka henkilö on luonut.
toolkit label: kartografiaan osallinen henkilö manifestaatiossa
toolkit definition: Manifestaatio, joka on aggregaatti, joka sisältää kartografisen teoksen ekspression, jonka henkilö on luonut.
label: er bidragsyter til kartografi for (person) @no
definition: Relaterer en person til en manifestasjon som er et aggregat som realiserer et kartografisk verk skapt av en person. @no
toolkit label: bidragsyter til kartografi for (person) @no
toolkit definition: En manifestasjon som er et aggregat som realiserer et kartografisk verk skapt av en person. @no
label: is bijdrager-persoon van cartografie van @nl
definition: Relateert een persoon aan een manifestatie die een aggregaat is die een expressie van een cartografisch werk verwezenlijkt dat is gecreëerd door een persoon. @nl
toolkit label: bijdrager-persoon van cartografie van @nl
toolkit definition: Een manifestatie die een aggregaat is die een expressie van een cartografisch werk verwezenlijkt dat is gecreëerd door een persoon. @nl
label: هو شخص مساهم في رسم خرائط لـ @ar
definition: يربط شخصا بتجسيدة عبارة عن تجميعة تجسد عملا رسم خرائطي أنشأه شخص. @ar
toolkit label: شخص مساهم في رسم خرائط @ar
toolkit definition: تجسيدة تمثل تجميعة تجسد عملا رسم الخرائط أنشأه شخص. @ar
label: és persona contribuïdora de cartografia de @ca
definition: Relaciona una persona amb una manifestació que és un agregat que materialitza una expressió d’una obra cartogràfica que és creada per una persona. @ca
toolkit label: persona contribuïdora de cartografia de @ca
toolkit definition: Manifestació que és un agregat que materialitza una expressió d’una obra cartogràfica que és creada per una persona. @ca
label: er person, som er bidragsyder til kartografi af @da
definition: Relaterer en person til en manifestation, som er en samling, som rummer et udtryk af et kartografisk værk, som er skabt af en person. @da
toolkit label: person, som er bidragsyder til kartografi af @da
toolkit definition: Manifestation, som er en samling, som rummer et udtryk af et kartografisk værk, som er skabt af en person. @da
label: kaastööline kartograafia alal (isik) kehastuses @et
definition: Seostab isiku kehastusega, mis on liitum, milles on teostatud isiku loodud kartograafilise teose väljendus. @et
toolkit label: kaastööline kartograafia alal (isik) kehastuses @et
toolkit definition: Kehastus, mis on liitum, milles on teostatud isiku loodud kartograafilise teose väljendus. @et
label: ist Person als Beiträgerin/Beiträger von einer Kartografie von @de
definition: Setzt eine Person in Beziehung zu einem Aggregat (Manifestation), das eine Expression eines kartografischen Werks verkörpert, die eine Person erstellt hat. @de
toolkit label: Person als Beiträgerin/Beiträger von einer Kartografie von @de
toolkit definition: Ein Aggregat (Manifestation), das eine Expression eines kartografischen Werks verkörpert, die eine Person erstellt hat. @de
label: közreműködő személye a következő kartográfiának: @hu
definition: Hozzákapcsol egy személyt egy aggregátum megjelenési formához, amely egy személy által létrehozott kartográfiai mű kifejezési formáját testesíti meg. @hu
toolkit label: közreműködő személye a következő kartográfiának: @hu
toolkit definition: Egy aggregátum megjelenési forma, amely egy személy által létrehozott kartográfiai mű kifejezési formáját testesíti meg. @hu
label: è contributore persona di cartografia di @it
definition: Correla una persona a una manifestazione che è un aggregato che materializza un'opera cartografica creata da una persona. @it
toolkit label: contributore persona di cartografia di @it
toolkit definition: Manifestazione che è un aggregato che materializza un'opera cartografica creata da una persona. @it
label: είναι συντελεστής φυσικό πρόσωπο της χαρτογράφησης του @el
toolkit label: συντελεστής φυσικό πρόσωπο της χαρτογράφησης του @el
label: est une personne contributrice de cartographie de @fr
definition: Met une personne en relation avec une manifestation qui consiste en un agrégat matérialisant une expression d’une œuvre cartographique créée par une personne. @fr
toolkit label: personne contributrice de cartographie de @fr
toolkit definition: Manifestation qui consiste en un agrégat matérialisant une expression d’une œuvre cartographique créée par une personne. @fr
label: ir kartogrāfijas līdzradītājs (persona) @lv
definition: Sasaista personu ar manifestāciju, kas ir apkopojums, kas ietver personas radītu kartogrāfijas darbu. @lv
toolkit label: ir kartogrāfijas līdzradītājs (persona) @lv
toolkit definition: Manifestācija, kas ir apkopojums, kas ietver personas radītu kartogrāfijas darbu. @lv
label: 是……的地图绘制的贡献者个人 @zh-hans
definition: 将一个个人与作为一种合集、把一个个人所创作的一种地图作品的内容表达具体化的一种载体表现关联起来。 @zh-hans
toolkit label: ……的地图绘制的贡献者个人 @zh-hans
toolkit definition: 作为一种合集、把一个个人所创作的一种地图作品的内容表达具体化的一种载体表现 @zh-hans
label: kartografisinin katkıda bulunan kişisidir @tr
definition: Bir kişiyi, bir kişi tarafından yaratılan bir kartografik çalışmanın anlamını somutlaştıran bir bütün olan gösterimle ilişkilendirir. @tr
toolkit label: kartografiye katkıda bulunan kişi @tr
toolkit definition: Bir kişi tarafından oluşturulan bir kartografik eserin anlatımını somutlaştıran topluluk olan bir gösterim. @tr
has subproperty: maanmittari (henkilö) manifestaatiossa
has subproperty: P50511

koreografiaan osallinen henkilö manifestaatiossa
status: Published
label: is contributor person of choreography of @en
lexical alias: contributorPersonOfChoreographyOf.en
definition: Relates a person to a manifestation that is an aggregate that embodies an expression of a choreographic work that is created by a person. @en
toolkit label: contributor person of choreography of @en
toolkit definition: A manifestation that is an aggregate that embodies an expression of a choreographic work that is created by a person. @en
type: Property
domain: C10004
has element type: 2
sub property of: aggregaattiin osallinen henkilö manifestaatiossa
sub property of: koreografiaan osallinen toimija manifestaatiossa
definition: Liittää henkilön manifestaatioon, joka on aggregaatti, joka sisältää koreografisen teoksen ekspression, jonka henkilö on luonut.
toolkit label: koreografiaan osallinen henkilö manifestaatiossa
toolkit definition: Manifestaatio, joka on aggregaatti, joka sisältää koreografisen teoksen ekspression, jonka henkilö on luonut.
label: er bidragsyter til koreografi for (person) @no
definition: Relaterer en person til en manifestasjon som er et aggregat som realiserer et koreografisk verk skapt av en person. @no
toolkit label: bidragsyter til koreografi for (person) @no
toolkit definition: En manifestasjon som er et aggregat som realiserer et koreografisk verk skapt av en person. @no
label: is bijdrager-persoon van choreografie van @nl
definition: Relateert een persoon aan een manifestatie die een aggregaat is die een expressie van een choreografisch werk verwezenlijkt dat is gecreëerd door een persoon. @nl
toolkit label: bijdrager-persoon van choreografie van @nl
toolkit definition: Een manifestatie die een aggregaat is die een expressie van een choreografisch werk verwezenlijkt dat is gecreëerd door een persoon. @nl
label: هو شخص مساهم في رقص لـ @ar
definition: يربط شخصا بتجسيدة عبارة عن تجميعة تجسد عملا راقص أنشأه شخص. @ar
toolkit label: شخص مساهم في رقص @ar
toolkit definition: تجسيدة تمثل تجميعة تجسد عملا راقص أبدعه شخص. @ar
label: és persona contribuïdora de coreografia de @ca
definition: Relaciona una persona amb una manifestació que és un agregat que materialitza una expressió d’una obra coreogràfica que és creada per una persona. @ca
toolkit label: persona contribuïdora de coreografia de @ca
toolkit definition: Manifestació que és un agregat que materialitza una expressió d’una obra coreogràfica que és creada per una persona. @ca
label: er person, som er bidragsyder til koreografi af @da
definition: Relaterer en person til en manifestation, som er en samling, som rummer et udtryk af et koreografisk værk, som er skabt af en person. @da
toolkit label: person, som er bidragsyder til koreografi af @da
toolkit definition: Manifestation, som er en samling, som rummer et udtryk af et koreografisk værk, som er skabt af en person. @da
label: kaastööline koreograafia alal (isik) kehastuses @et
definition: Seostab isiku kehastusega, mis on liitum, milles on teostatud isiku loodud koreograafilise teose väljendus. @et
toolkit label: kaastööline koreograafia alal (isik) kehastuses @et
toolkit definition: Kehastus, mis on liitum, milles on teostatud isiku loodud koreograafilise teose väljendus. @et
label: ist Person als Beiträgerin/Beiträger von einer Choreografie von @de
definition: Setzt eine Person in Beziehung zu einem Aggregat (Manifestation), das eine Expression eines choreografischen Werks verkörpert, die eine Person erstellt hat. @de
toolkit label: Person als Beiträgerin/Beiträger von einer Choreografie von @de
toolkit definition: Ein Aggregat (Manifestation), das eine Expression eines choreografischen Werks verkörpert, die eine Person erstellt hat. @de
label: közreműködő személye a következő koreográfiának: @hu
definition: Hozzákapcsol egy személyt egy aggregátum megjelenési formához, amely egy személy által létrehozott koreografikus mű kifejezési formáját testesíti meg. @hu
toolkit label: közreműködő személye a következő koreográfiának: @hu
toolkit definition: Egy aggregátum megjelenési forma, amely egy személy által létrehozott koreografikus mű kifejezési formáját testesíti meg. @hu
label: è contributore persona di coreografia di @it
definition: Correla una persona a una manifestazione che è un aggregato che materializza un'opera coreografica creata da una persona. @it
toolkit label: contributore persona di coreografia di @it
toolkit definition: Manifestazione che è un aggregato che materializza un'opera coreografica creata da una persona. @it
label: είναι συντελεστής φυσικό πρόσωπο της χορογραφίας του @el
toolkit label: συντελεστής φυσικό πρόσωπο της χορογραφίας του @el
label: est une personne contributrice de chorégraphie de @fr
definition: Met une personne en relation avec une manifestation qui consiste en un agrégat matérialisant une expression d’une œuvre chorégraphique créée par une personne. @fr
toolkit label: personne contributrice de chorégraphie de @fr
toolkit definition: Manifestation qui consiste en un agrégat matérialisant une expression d’une œuvre chorégraphique créée par une personne. @fr
label: ir horeogrāfijas līdzradītājs (persona) @lv
definition: Sasaista personu ar manifestāciju, kas ir apkopojums, kas ietver personas radītu horeogrāfijas darbu. @lv
toolkit label: ir horeogrāfijas līdzradītājs (persona) @lv
toolkit definition: Manifestācija, kas ir apkopojums, kas ietver personas radītu horeogrāfijas darbu. @lv
label: 是……的编舞的贡献者个人 @zh-hans
definition: 将一个个人与作为一种合集、把一个个人所创作的一种编舞作品的内容表达具体化的一种载体表现关联起来。 @zh-hans
toolkit label: ……的编舞的贡献者个人 @zh-hans
toolkit definition: 作为一种合集、把一个个人所创作的一种编舞作品的内容表达具体化的一种载体表现 @zh-hans
label: kerografisinin katkıda bulunan kişisidir @tr
definition: Bir kişiyi, bir kişi tarafından yaratılan bir koreografi çalışmasının anlatımını somutlaştıran bir bütün olan gösterimle ilişkilendirir. @tr
toolkit label: koreografiye katkıda bulunan kişi @tr
toolkit definition: Bir kişi tarafından oluşturulan bir koreografik eserin anlatımını somutlaştıran topluluk olan bir gösterim. @tr
has subproperty: P50512

digitaaliseen sisältöön osallinen henkilö manifestaatiossa
status: Published
label: is contributor person of computer content of @en
lexical alias: contributorPersonOfComputerContentOf.en
definition: Relates a person to a manifestation that is an aggregate that embodies an expression of computer content created by a person. @en
toolkit label: contributor person of computer content of @en
toolkit definition: A manifestation that is an aggregate that embodies an expression of computer content created by a person. @en
type: Property
domain: C10004
has element type: 2
sub property of: aggregaattiin osallinen henkilö manifestaatiossa
sub property of: digitaaliseen sisältöön osallinen toimija manifestaatiossa
definition: Liittää henkilön manifestaatioon, joka on aggregaatti, joka sisältää digitaalisen sisällön ekspression, jonka henkilö on luonut.
toolkit label: digitaaliseen sisältöön osallinen henkilö manifestaatiossa
toolkit definition: Manifestaatio, joka on aggregaatti, joka sisältää digitaalisen sisällön ekspression, jonka henkilö on luonut.
label: er bidragsyter til datamaskininnhold for (person) @no
definition: Relaterer en person til en manifestasjon som er et aggregat som realiserer datamaskininnhold skapt av en person. @no
toolkit label: bidragsyter til datamaskininnhold for (person) @no
toolkit definition: En manifestasjon som er et aggregat som realiserer datamaskininnhold skapt av en person. @no
label: is bijdrager-persoon van computercontent van @nl
definition: Relateert een persoon aan een manifestatie die een aggregaat is die een expressie van computercontent verwezenlijkt die is gecreëerd door een persoon. @nl
toolkit label: bijdrager-persoon van computercontent van @nl
toolkit definition: Een manifestatie die een aggregaat is die een expressie van computercontent verwezenlijkt die is gecreëerd door een persoon. @nl
label: هو شخص مساهم في محتوى حاسوبي لـ @ar
definition: يربط شخصا بتجسيدة عبارة عن تجميعة تجسد عمل محتوى حاسوبي أنشأه شخص. @ar
toolkit label: شخص مساهم في محتوى حاسوبي @ar
toolkit definition: تجسيدة تمثل تجميعة تجسد عملا محتوى حاسوبي أنشأه شخص. @ar
label: és persona contribuïdora de contingut informàtic de @ca
definition: Relaciona una persona amb una manifestació que és un agregat que materialitza una expressió d’una obra de contingut informàtic que és creada per una persona. @ca
toolkit label: persona contribuïdora de contingut informàtic de @ca
toolkit definition: Manifestació que és un agregat que materialitza una expressió d’una obra de contingut informàtic que és creada per una persona. @ca
label: er person, som er bidragsyder til computerindhold af @da
definition: Relaterer en person til en manifestation, som er en samling, som rummer et udtryk af computerindhold skabt af en person. @da
toolkit label: person, som er bidragsyder til computerindhold af @da
toolkit definition: Manifestation, som er en samling, som rummer et udtryk af computerindhold skabt af en person. @da
label: digisisu kaastööline (isik) kehastuses @et
definition: Seostab isiku kehastusega, mis on liitum, milles on teostatud isiku loodud digisisu väljendus. @et
toolkit label: digisisu kaastööline (isik) kehastuses @et
toolkit definition: Kehastus, mis on liitum, milles on teostatud isiku loodud digisisu väljendus. @et
label: ist Person als Beiträgerin/Beiträger von Computer Content von @de
definition: Setzt eine Person in Beziehung zu einem Aggregat (Manifestation), das eine Expression von Computer Content verkörpert, die eine Person erstellt hat. @de
toolkit label: Person als Beiträgerin/Beiträger von Computer Content von @de
toolkit definition: Ein Aggregat (Manifestation), das eine Expression von Computer Content verkörpert, die eine Person erstellt hat. @de
label: közreműködő személye a következő számítógépes tartalomnak: @hu
definition: Hozzákapcsol egy személyt egy aggregátum megjelenési formához, amely egy személy által létrehozott számítógépes tartalom kifejezési formáját testesíti meg. @hu
toolkit label: közreműködő személye a következő számítógépes tartalomnak: @hu
toolkit definition: Egy aggregátum megjelenési forma, amely egy személy által létrehozott számítógépes tartalom kifejezési formáját testesíti meg. @hu
label: è contributore persona di contenuto informatico di @it
definition: Correla una persona a una manifestazione che è un aggregato che materializza contenuto informatico creato da una persona. @it
toolkit label: contributore persona di contenuto informatico di @it
toolkit definition: Manifestazione che è un aggregato che materializza contenuto informatico creato da una persona. @it
label: είναι συντελεστής φυσικό πρόσωπο του περιεχομένου του υπολογιστή του @el
toolkit label: συντελεστής φυσικό πρόσωπο του περιεχομένου του υπολογιστή του @el
label: est une personne contributrice de contenu informatique de @fr
definition: Met une personne en relation avec une manifestation qui consiste en un agrégat matérialisant une expression d’un contenu informatique créé par une personne. @fr
toolkit label: personne contributrice de contenu informatique de @fr
toolkit definition: Manifestation qui consiste en un agrégat matérialisant une expression d’un contenu informatique créé par une personne. @fr
label: ir datororientēta satura līdzradītājs (persona) @lv
definition: Sasaista personu ar manifestāciju, kas ir apkopojums, kas ietver personas radītu datororientētu saturu. @lv
toolkit label: ir datororientēta satura līdzradītājs (persona) @lv
toolkit definition: Manifestācija, kas ir apkopojums, kas ietver personas radītu datororientētu saturu. @lv
label: 是……的计算机内容的贡献者个人 @zh-hans
definition: 将一个个人与作为一种合集、把一个个人所创作的计算机内容的内容表达具体化的一种载体表现关联起来。 @zh-hans
toolkit label: ……的计算机内容的贡献者个人 @zh-hans
toolkit definition: 作为一种合集、把一个个人所创作的计算机内容的内容表达具体化的一种载体表现 @zh-hans
label: bilgisayar içeriğinin katkıda bulunan kişisidir @tr
definition: Bir kişiyi, kişi tarafından yaratılan bir bilgisayar içeriğinin anlatımını somutlaştıran bir bütün olan gösterimle ilişkilendirir. @tr
toolkit label: bilgisayar içeriğine katkıda bulunan kişi @tr
toolkit definition: Bir kişi tarafından oluşturulan bir bilgisayar destekli içeriğin anlatımını somutlaştıran topluluk olan bir gösterim. @tr
has subproperty: P50519

liikkuvaan kuvaan osallinen henkilö manifestaatiossa
status: Published
label: is contributor person of moving image of @en
lexical alias: contributorPersonOfMovingImageOf.en
definition: Relates a person to a manifestation that is an aggregate that embodies an expression of a moving image work that is created by a person. @en
toolkit label: contributor person of moving image of @en
toolkit definition: A manifestation that is an aggregate that embodies an expression of a moving image work that is created by a person. @en
type: Property
domain: C10004
has element type: 2
sub property of: aggregaattiin osallinen henkilö manifestaatiossa
sub property of: liikkuvaan kuvaan osallinen toimija manifestaatiossa
definition: Liittää henkilö manifestaatioon, joka on aggregaatti, joka sisältää liikkuvan kuvan teoksen ekspression, jonka henkilö on luonut.
toolkit label: liikkuvaan kuvaan osallinen henkilö manifestaatiossa
toolkit definition: Manifestaatio, joka on aggregaatti, joka sisältää liikkuvan kuvan teoksen ekspression, jonka henkilö on luonut.
label: er bidragsyter til levende bilder for (person) @no
definition: Relaterer en person til en manifestasjon som er et aggregat som realiserer et verk med levende bilder skapt av en person. @no
toolkit label: bidragsyter til levende bilder for (person) @no
toolkit definition: En manifestasjon som er et aggregat som realiserer et verk med levende bilder skapt av en person. @no
label: is bijdrager-persoon van bewegend beeld van @nl
definition: Relateert een persoon aan een manifestatie die een aggregaat is die een expressie van een bewegend beeldwerk verwezenlijkt dat is gecreëerd door een persoon. @nl
toolkit label: bijdrager-persoon van bewegend beeld van @nl
toolkit definition: Een manifestatie die een aggregaat is die een expressie van een bewegend beeldwerk verwezenlijkt dat is gecreëerd door een persoon. @nl
label: هو شخص مساهم في صور متحركة لـ @ar
definition: يربط شخصا بتجسيدة عبارة عن تجميعة تجسد عمل صور متحركة أنشأه شخص. @ar
toolkit label: شخص مساهم في صور متحركة @ar
toolkit definition: تجسيدة تمثل تجميعة تجسد عمل صور متحركة أنشأه شخص. @ar
label: és persona contribuïdora d’imatge en moviment de @ca
definition: Relaciona una persona amb una manifestació que és un agregat que materialitza una expressió d’una obra d’imatge en moviment que és creada per una persona. @ca
toolkit label: persona contribuïdora d’imatge en moviment de @ca
toolkit definition: Manifestació que és un agregat que materialitza una expressió d’una obra d’imatge en moviment que és creada per una persona. @ca
label: er person, som er bidragsyder til levende billede af @da
definition: Relaterer en person til en manifestation, som er en samling, som rummer et udtryk af et værk med levende billeder, som er skabt af en person. @da
toolkit label: person, som er bidragsyder til levende billede af @da
toolkit definition: Manifestation, som er en samling, som rummer et udtryk af et værk med levende billeder, som er skabt af en person. @da
label: kaastööline liikuva pildi alal (isik) kehastuses @et
definition: Seostab isiku kehastusega, mis on liitum, milles on teostatud isiku loodud liikuvast pildist koosneva teose väljendus. @et
toolkit label: kaastööline liikuva pildi alal (isik) kehastuses @et
toolkit definition: Kehastus, mis on liitum, milles on teostatud isiku loodud liikuvast pildist koosneva teose väljendus. @et
label: ist Person als Beiträgerin/Beiträger von einem Bewegtbild von @de
definition: Setzt eine Person in Beziehung zu einem Aggregat (Manifestation), das eine Expression eines Bewegtbildwerks verkörpert, die eine Person erstellt hat. @de
toolkit label: Person als Beiträgerin/Beiträger von einem Bewegtbild von @de
toolkit definition: Ein Aggregat (Manifestation), das eine Expression eines Bewegtbildwerks verkörpert, die eine Person erstellt hat. @de
label: közreműködő személye a következő mozgóképnek: @hu
definition: Hozzákapcsol egy személyt egy aggregátum megjelenési formához, amely egy személy által létrehozott mozgóképmű kifejezési formáját testesíti meg. @hu
toolkit label: közreműködő személye a következő mozgóképnek: @hu
toolkit definition: Egy aggregátum megjelenési forma, amely egy személy által létrehozott mozgóképmű kifejezési formáját testesíti meg. @hu
label: è contributore persona di immagine in movimento di @it
definition: Correla una persona a una manifestazione che è un aggregato che materializza un'immagine in movimento creata da una persona. @it
toolkit label: contributore persona di immagine in movimento di @it
toolkit definition: Manifestazione che è un aggregato che materializza un'opera consistente in un'immagine in movimento creata da una persona. @it
label: είναι συντελεστής φυσικό πρόσωπο της κινητής εικόνας του @el
toolkit label: συντελεστής φυσικό πρόσωπο της κινητής εικόνας του @el
label: est une personne contributrice d’images animées de @fr
definition: Met une personne en relation avec une manifestation qui consiste en un agrégat matérialisant une expression d’une œuvre d’images animées créée par une personne. @fr
toolkit label: personne contributrice d’images animées de @fr
toolkit definition: Manifestation qui consiste en un agrégat matérialisant une expression d’une œuvre d’images animées créée par une personne. @fr
label: ir kustīga attēla līdzradītājs (persona) @lv
definition: Sasaista personu ar manifestāciju, kas ir apkopojums, kas ietver personas radītu kustīga attēla darbu. @lv
toolkit label: ir kustīga attēla līdzradītājs (persona) @lv
toolkit definition: Manifestācija, kas ir apkopojums, kas ietver personas radītu kustīga attēla darbu. @lv
label: 是……的动态图像的贡献者个人 @zh-hans
definition: 将一个个人与作为一种合集、把一个个人所创作的一种动态图像作品的内容表达具体化的一种载体表现关联起来。 @zh-hans
toolkit label: ……的动态图像的贡献者个人 @zh-hans
toolkit definition: 作为一种合集、把一个个人所创作的一种动态图像作品的内容表达具体化的一种载体表现 @zh-hans
label: hareketli görüntüsünün katkıda bulunan kişisidir @tr
definition: Bir kişiyi, bir kişi tarafından yaratılan bir hareketli görüntü çalışmasının anlatımını somutlaştıran bir bütün olan gösterimle ilişkilendirir. @tr
toolkit label: hareketli görüntüye katkıda bulunan kişi @tr
toolkit definition: Bir kişi tarafından oluşturulan hareketli bir görüntü eserinin anlatımını somutlaştıran topluluk olan bir gösterim. @tr
has subproperty: P50513

musiikkiin osallinen henkilö manifestaatiossa
status: Published
label: is contributor person of music of @en
lexical alias: contributorPersonOfMusicOf.en
definition: Relates a person to a manifestation that is an aggregate that embodies an expression of a musical work that is created by a person. @en
toolkit label: contributor person of music of @en
toolkit definition: A manifestation that is an aggregate that embodies an expression of a musical work that is created by a person. @en
type: Property
domain: C10004
has element type: 2
sub property of: aggregaattiin osallinen henkilö manifestaatiossa
sub property of: musiikkiin osallinen toimija manifestaatiossa
definition: Liittää henkilön manifestaatioon, joka on aggregaatti, joka sisältää musiikkiteoksen ekspression, jonka henkilö on luonut.
toolkit label: musiikkiin osallinen henkilö manifestaatiossa
toolkit definition: Manifestaatio, joka on aggregaatti, joka sisältää musiikkiteoksen ekspression, jonka henkilö on luonut.
label: er bidragsyter til musikk for (person) @no
definition: Relaterer en person til en manifestasjon som er et aggregat som realiserer et musikalsk verk skapt av en person. @no
toolkit label: bidragsyter til musikk for (person) @no
toolkit definition: En manifestasjon som er et aggregat som realiserer et musikalsk verk skapt av en person. @no
label: is bijdrager-persoon van muziek van @nl
definition: Relateert een persoon aan een manifestatie die een aggregaat is die een expressie van een muziekwerk verwezenlijkt dat is gecreëerd door een persoon. @nl
toolkit label: bijdrager-persoon van muziek van @nl
toolkit definition: Een manifestatie die een aggregaat is die een expressie van een muziekwerk verwezenlijkt dat is gecreëerd door een persoon. @nl
label: هو شخص مساهم في موسيقى لـ @ar
definition: يربط شخصا بتجسيدة عبارة عن تجميعة تجسد عمل موسيقي أنشأه شخص. @ar
toolkit label: شخص مساهم في موسيقى @ar
toolkit definition: تجسيدة تمثل تجميعة تجسد عمل موسيقي أنشأه شخص. @ar
label: és persona contribuïdora de música de @ca
definition: Relaciona una persona amb una manifestació que és un agregat que materialitza una expressió d’una obra musical que és creada per una persona. @ca
toolkit label: persona contribuïdora de música de @ca
toolkit definition: Manifestació que és un agregat que materialitza una expressió d’una obra musical que és creada per una persona. @ca
label: er person, som er bidragsyder til musik af @da
definition: Relaterer en person til en manifestation, som er en samling, som rummer et udtryk af et musikværk, som er skabt af en person. @da
toolkit label: person, som er bidragsyder til musik af @da
toolkit definition: Manifestation, som er en samling, som rummer et udtryk af et musikværk, som er skabt af en person. @da
label: muusikaline kaastööline (isik) kehastuses @et
definition: Seostab isiku kehastusega, mis on liitum, milles on teostatud isiku loodud muusikateose väljendus. @et
toolkit label: muusikaline kaastööline (isik) kehastuses @et
toolkit definition: Kehastus, mis on liitum, milles on teostatud isiku loodud muusikateose väljendus. @et
label: ist Person als Beiträgerin/Beiträger einer Musik von @de
definition: Setzt eine Person in Beziehung zu einem Aggregat (Manifestation), das eine Expression eines Musikwerks verkörpert, die eine Person erstellt hat. @de
toolkit label: Person als Beiträgerin/Beiträger einer Musik von @de
toolkit definition: Ein Aggregat (Manifestation), das eine Expression eines Musikwerks verkörpert, die eine Person erstellt hat. @de
label: közreműködő személye a következő zenének: @hu
definition: Hozzákapcsol egy személyt egy aggregátum megjelenési formához, amely egy személy által létrehozott zenemű kifejezési formáját testesíti meg. @hu
toolkit label: közreműködő személye a következő zenének: @hu
toolkit definition: Egy aggregátum megjelenési forma, amely egy személy által létrehozott zenemű kifejezési formáját testesíti meg. @hu
label: è contributore persona di musica di @it
definition: Correla una persona a una manifestazione che è un aggregato che materializza un'opera musicale creata da una persona. @it
toolkit label: contributore persona di musica di @it
toolkit definition: Manifestazione che è un aggregato che materializza un'opera musicale creata da una persona. @it
label: είναι συντελεστής φυσικό πρόσωπο της μουσικής του @el
toolkit label: συντελεστής φυσικό πρόσωπο της μουσικής του @el
label: est une personne contributrice de musique de @fr
definition: Met une personne en relation avec une manifestation qui consiste en un agrégat matérialisant une expression d’une œuvre musicale créée par une personne. @fr
toolkit label: personne contributrice de musique de @fr
toolkit definition: Manifestation qui consiste en un agrégat matérialisant une expression d’une œuvre musicale créée par une personne. @fr
label: ir mūzikas līdzradītājs (persona) @lv
definition: Sasaista personu ar manifestāciju, kas ir apkopojums, kas ietver personas radītu mūzikas darbu. @lv
toolkit label: ir mūzikas līdzradītājs (persona) @lv
toolkit definition: Manifestācija, kas ir apkopojums, kas ietver personas radītu mūzikas darbu. @lv
label: 是……的音乐的贡献者个人 @zh-hans
definition: 将一个个人与作为一种合集、把一个个人所创作的一种音乐作品的内容表达具体化的一种载体表现关联起来。 @zh-hans
toolkit label: ……的音乐的贡献者个人 @zh-hans
toolkit definition: 作为一种合集、把一个个人所创作的一种音乐作品的内容表达具体化的一种载体表现 @zh-hans
label: müziğinin katkıda bulunan kişisidir @tr
definition: Bir kişiyi, bir kişi tarafından yaratılan bir müzik çalışmasının anlatımını somutlaştıran bir bütün olan gösterimle ilişkilendirir. @tr
toolkit label: müziğine katkıda bulunan kişi @tr
toolkit definition: Bir kişi tarafından oluşturulan bir müzik eserinin anlatımını somutlaştıran topluluk olan bir gösterim. @tr
has subproperty: P50514

esineeseen osallinen henkilö manifestaatiossa
status: Published
label: is contributor person of object of @en
lexical alias: contributorPersonOfObjectOf.en
definition: Relates a person to a manifestation that is an aggregate that embodies an expression of an object work that is created by a person. @en
toolkit label: contributor person of object of @en
toolkit definition: A manifestation that is an aggregate that embodies an expression of an object work that is created by a person. @en
type: Property
domain: C10004
has element type: 2
sub property of: aggregaattiin osallinen henkilö manifestaatiossa
sub property of: esineeseen osallinen toimija manifestaatiossa
definition: Liittää henkilön manifestaatioon, joka on aggregaatti, joka sisältää esineteoksen ekspression, jonka henkilö on luonut.
toolkit label: esineeseen osallinen henkilö manifestaatiossa
toolkit definition: Manifestaatio, joka on aggregaatti, joka sisältää esineteoksen ekspression, jonka henkilö on luonut.
label: er bidragsyter til gjenstand for (person) @no
definition: Relaterer en person til en manifestasjon som er et aggregat som realiserer et verk som er en gjenstand skapt av en person. @no
toolkit label: bidragsyter til gjenstand for (person) @no
toolkit definition: En manifestasjon som er et aggregat som realiserer et verk som er en gjenstand skapt av en person. @no
label: is bijdrager-persoon van object van @nl
definition: Relateert een persoon aan een manifestatie die een aggregaat is die een expressie van een objectwerk verwezenlijkt dat is gecreëerd door een persoon. @nl
toolkit label: bijdrager-persoon van object van @nl
toolkit definition: Een manifestatie die een aggregaat is die een expressie van een objectwerk verwezenlijkt dat is gecreëerd door een persoon. @nl
label: هو شخص مساهم في كيان لـ @ar
definition: يربط شخصا بتجسيدة عبارة عن تجميعة تجسد تعبيرة لعمل كيان أنشأه شخص. @ar
toolkit label: شخص مساهم في كيان @ar
toolkit definition: تجسيدة تمثل تجميعة تجسد عمل كيان أنشأه شخص. @ar
label: és persona contribuïdora d’objecte de @ca
definition: Relaciona una persona amb una manifestació que és un agregat que materialitza una expressió d’una obra d’objecte que és creada per una persona. @ca
toolkit label: persona contribuïdora d’objecte de @ca
toolkit definition: Manifestació que és un agregat que materialitza una expressió d’una obra d’objecte que és creada per una persona. @ca
label: er person, som er bidragsyder til objekt af @da
definition: Relaterer en person til en manifestation, som er en samling, som rummer et udtryk af et værk med objekt, som er skabt af en person. @da
toolkit label: person, som er bidragsyder til objekt af @da
toolkit definition: Manifestation, som er en samling, som rummer et udtryk af et værk med objekt, som er skabt af en person. @da
label: objektiloome kaastööline (isik) kehastuses @et
definition: Seostab isiku kehastusega, mis on liitum, milles on teostatud isiku loodud objektteose väljendus. @et
toolkit label: objektiloome kaastööline (isik) kehastuses @et
toolkit definition: Kehastus, mis on liitum, milles on teostatud isiku loodud objektteose väljendus. @et
label: ist Person als Beiträgerin/Beiträger von einem Gegenstand von @de
definition: Setzt eine Person in Beziehung zu einem Aggregat (Manifestation), das eine Expression eines gegenständlichen Werks verkörpert, die eine Person erstellt hat. @de
toolkit label: Person als Beiträgerin/Beiträger von einem Gegenstand von @de
toolkit definition: Ein Aggregat (Manifestation), das eine Expression eines gegenständlichen Werks verkörpert, die eine Person erstellt hat. @de
label: közreműködő személye a következő objektumnak: @hu
definition: Hozzákapcsol egy személyt egy aggregátum megjelenési formához, amely egy személy által létrehozott objektummű kifejezési formáját testesíti meg. @hu
toolkit label: közreműködő személye a következő objektumnak: @hu
toolkit definition: Egy aggregátum megjelenési forma, amely egy személy által létrehozott objektummű kifejezési formáját testesíti meg. @hu
label: è contributore persona di oggetto di @it
definition: Correla una persona a una manifestazione che è un aggregato che materializza un oggetto creato da una persona. @it
toolkit label: contributore persona di oggetto di @it
toolkit definition: Manifestazione che è un aggregato che materializza un oggetto creato da una persona. @it
label: είναι συντελεστής φυσικό πρόσωπο του αντικειμένου του @el
toolkit label: συντελεστής φυσικό πρόσωπο του αντικειμένου του @el
label: est une personne contributrice d’objet de @fr
definition: Met une personne en relation avec une manifestation qui consiste en un agrégat matérialisant une expression d’une œuvre objet créée par une personne. @fr
toolkit label: personne contributrice d’objet de @fr
toolkit definition: Manifestation qui consiste en un agrégat matérialisant une expression d’une œuvre objet créée par une personne. @fr
label: ir objekta līdzradītājs (persona) @lv
definition: Sasaista personu ar manifestāciju, kas ir apkopojums, kas ietver personas radītu objekta darbu. @lv
toolkit label: ir objekta līdzradītājs (persona) @lv
toolkit definition: Manifestācija, kas ir apkopojums, kas ietver personas radītu objekta darbu. @lv
label: 是……的物体的贡献者个人 @zh-hans
definition: 将一个个人与作为一种合集、把一个个人所创作的一种物体作品的内容表达具体化的一种载体表现关联起来。 @zh-hans
toolkit label: ……的物体的贡献者个人 @zh-hans
toolkit definition: 作为一种合集、把一个个人所创作的一种物体作品的内容表达具体化的一种载体表现 @zh-hans
label: nesnesinin katkıda bulunan kişisidir @tr
definition: Bir kişiyi, kişi tarafından yaratılan bir nesne çalışmasının anlatımını somutlaştıran bir bütün olan gösterimle ilişkilendirir. @tr
toolkit label: nesneye katkıda bulunan kişi @tr
toolkit definition: Bir kişi tarafından oluşturulan bir nesne eserinin anlatımını somutlaştıran topluluk olan bir gösterim. @tr
has subproperty: P50518

puheeseen osallinen henkilö manifestaatiossa
status: Published
label: is contributor person of speech of @en
lexical alias: contributorPersonOfSpeechOf.en
definition: Relates a person to a manifestation that is an aggregate that embodies an expression of a vocal work that is created by a person. @en
toolkit label: contributor person of speech of @en
toolkit definition: A manifestation that is an aggregate that embodies an expression of a vocal work that is created by a person. @en
type: Property
domain: C10004
has element type: 2
sub property of: aggregaattiin osallinen henkilö manifestaatiossa
sub property of: puheeseen osallinen toimija manifestaatiossa
definition: Liittää henkilön manifestaatioon, joka on aggregaatti, joka sisältää puheteoksen ekspression, jonka henkilö on luonut.
toolkit label: puheeseen osallinen henkilö manifestaatiossa
toolkit definition: Manifestaatio, joka on aggregaatti, joka sisältää puheteoksen ekspression, jonka henkilö on luonut.
label: er bidragsyter til tale for (person) @no
definition: Relaterer en person til en manifestasjon som er et aggregat som realiserer et verk av tale skapt av en person. @no
toolkit label: bidragsyter til tale for (person) @no
toolkit definition: En manifestasjon som er et aggregat som realiserer et verk av tale skapt av en person. @no
label: is bijdrager-persoon van spraak van @nl
definition: Relateert een persoon aan een manifestatie die een aggregaat is die een expressie van een vocaal werk verwezenlijkt dat is gecreëerd door een persoon. @nl
toolkit label: bijdrager-persoon van spraak van @nl
toolkit definition: Een manifestatie die een aggregaat is die een expressie van een vocaal werk verwezenlijkt dat is gecreëerd door een persoon. @nl
label: هو شخص مساهم في حديث لـ @ar
definition: يربط شخصا بتجسيدة عبارة عن تجميعة تجسد عمل كلمة منطوقة أنشأه شخص. @ar
toolkit label: شخص مساهم في حديث @ar
toolkit definition: تجسيدة تمثل تجميعة تجسد عمل كلمة منطوقة أنشأه شخص. @ar
label: és persona contribuïdora de discurs de @ca
definition: Relaciona una persona amb una manifestació que és un agregat que materialitza una expressió d’una obra vocal que és creada per una persona. @ca
toolkit label: persona contribuïdora de discurs de @ca
toolkit definition: Manifestació que és un agregat que materialitza una expressió d’una obra vocal que és creada per una persona. @ca
label: er person, som er bidragsyder til tale af @da
definition: Relaterer en person til en manifestation, som er en samling, som rummer et udtryk af et værk med talte ord, som er skabt af en person. @da
toolkit label: person, som er bidragsyder til tale af @da
toolkit definition: Manifestation, som er en samling, som rummer et udtryk af et værk med talte ord, som er skabt af en person. @da
label: kõneloome kaastööline (isik) kehastuses @et
definition: Seostab isiku kehastusega, mis on liitum, milles on teostatud isiku loodud suulise teose väljendus. @et
toolkit label: kõneloome kaastööline (isik) kehastuses @et
toolkit definition: Kehastus, mis on liitum, milles on teostatud isiku loodud suulise teose väljendus. @et
label: ist Person als Beiträgerin/Beiträger von einer Rede von @de
definition: Setzt eine Person in Beziehung zu einem Aggregat (Manifestation), das eine Expression eines gesprochenen Werks verkörpert, die eine Person erstellt hat. @de
toolkit label: Person als Beiträgerin/Beiträger von einer Rede von @de
toolkit definition: Ein Aggregat (Manifestation), das eine Expression eines gesprochenen Werks verkörpert, die eine Person erstellt hat. @de
label: közreműködő személye a következő beszédnek: @hu
definition: Hozzákapcsol egy személyt egy aggregátum megjelenési formához, amely egy személy által létrehozott beszédmű kifejezési formáját testesíti meg. @hu
toolkit label: közreműködő személye a következő beszédnek: @hu
toolkit definition: Egy aggregátum megjelenési forma, amely egy személy által létrehozott beszédmű kifejezési formáját testesíti meg. @hu
label: è contributore persona di discorso di @it
definition: Correla una persona a una manifestazione che è un aggregato che materializza un'opera orale creata da una persona. @it
toolkit label: contributore persona di discorso di @it
toolkit definition: Manifestazione che è un aggregato che materializza un'opera orale creata da una persona. @it
label: είναι συντελεστής φυσικό πρόσωπο της ομιλίας του @el
toolkit label: συντελεστής φυσικό πρόσωπο της ομιλίας του @el
label: est une personne contributrice de contenu vocal de @fr
definition: Met une personne en relation avec une manifestation qui consiste en un agrégat matérialisant une expression d’une œuvre vocale créée par une personne. @fr
toolkit label: personne contributrice de contenu vocal de @fr
toolkit definition: Manifestation qui consiste en un agrégat matérialisant une expression d’une œuvre vocale créée par une personne. @fr
label: ir runas līdzradītājs (persona) @lv
definition: Sasaista personu ar manifestāciju, kas ir apkopojums, kas ietver personas radītu mutvārdu darbu. @lv
toolkit label: ir runas līdzradītājs (persona) @lv
toolkit definition: Manifestācija, kas ir apkopojums, kas ietver personas radītu mutvārdu darbu. @lv
label: 是……的讲话的贡献者个人 @zh-hans
definition: 将一个个人与作为一种合集、把一个个人所创作的一种人声作品的内容表达具体化的一种载体表现关联起来。 @zh-hans
toolkit label: ……的讲话的贡献者个人 @zh-hans
toolkit definition: 作为一种合集、把一个个人所创作的一种人声作品的内容表达具体化的一种载体表现 @zh-hans
label: konuşmasının katkıda bulunan kişisidir @tr
definition: Bir kişiyi, bir kişi tarafından yaratılan bir ses çalışmasının anlatımını somutlaştıran bir bütün olan gösterimle ilişkilendirir. @tr
toolkit label: konuşmaya katkıda bulunan kişi @tr
toolkit definition: Bir kişi tarafından oluşturulan bir vokal eserin anlatımını somutlaştıran topluluk olan bir gösterim. @tr
has subproperty: P50515

stillkuvaan osallinen henkilö manifestaatiossa
status: Published
label: is contributor person of still image of @en
lexical alias: contributorPersonOfStillImageOf.en
definition: Relates a person to a manifestation that is an aggregate that embodies an expression of a still image work that is created by a person. @en
toolkit label: contributor person of still image of @en
toolkit definition: A manifestation that is an aggregate that embodies an expression of a still image work that is created by a person. @en
type: Property
domain: C10004
has element type: 2
sub property of: aggregaattiin osallinen henkilö manifestaatiossa
sub property of: stillkuvaan osallinen toimija manifestaatiossa
definition: Liittää henkilön manifestaatioon, joka on aggregaatti, joka sisältää stillkuvateoksen ekspression, jonka henkilö on luonut.
toolkit label: stillkuvaan osallinen henkilö manifestaatiossa
toolkit definition: Manifestaatio, joka on aggregaatti, joka sisältää stillkuvateoksen ekspression, jonka henkilö on luonut.
label: er bidragsyter til bilde for (person) @no
definition: Relaterer en person til en manifestasjon som er et aggregat som realiserer et bildeverk skapt av en person. @no
toolkit label: bidragsyter til bilde for (person) @no
toolkit definition: En manifestasjon som er et aggregat som realiserer et bildeverk skapt av en person. @no
label: is bijdrager-persoon van stilstaand beeld van @nl
definition: Relateert een persoon aan een manifestatie die een aggregaat is die een expressie van een stilstaand beeldwerk verwezenlijkt dat is gecreëerd door een persoon. @nl
toolkit label: bijdrager-persoon van stilstaand beeld van @nl
toolkit definition: Een manifestatie die een aggregaat is die een expressie van een stilstaand beeldwerk verwezenlijkt dat is gecreëerd door een persoon. @nl
label: هو شخص مساهم في صور ثابتة لـ @ar
definition: يربط شخصا بتجسيدة عبارة عن تجميعة تجسد عملا بصور ثابتة أنشأه شخص. @ar
toolkit label: شخص مساهم في صور ثابتة @ar
toolkit definition: تجسيدة تمثل تجميعة تجسد عملا اصور ثابتة أنشأه شخص. @ar
label: és persona contribuïdora d’imatge fixa de @ca
definition: Relaciona una persona amb una manifestació que és un agregat que materialitza una expressió d’una obra d’imatge fixa que és creada per una persona. @ca
toolkit label: persona contribuïdora d’imatge fixa de @ca
toolkit definition: Manifestació que és un agregat que materialitza una expressió d’una obra d’imatge fixa que és creada per una persona. @ca
label: er person, som er bidragsyder til stillbillede af @da
definition: Relaterer en person til en manifestation, som er en samling, som rummer et udtryk af et værk med stillbilleder, som er skabt af en person. @da
toolkit label: person, som er bidragsyder til stillbillede af @da
toolkit definition: Manifestation, som er en samling, som rummer et udtryk af et værk med stillbilleder, som er skabt af en person. @da
label: kaastööline liikumatu pildi alal (isik) kehastuses @et
definition: Seostab isiku kehastusega, mis on liitum, milles on teostatud isiku loodud liikumatust pildist koosneva teose väljendus. @et
toolkit label: kaastööline liikumatu pildi alal (isik) kehastuses @et
toolkit definition: Kehastus, mis on liitum, milles on teostatud isiku loodud liikumatust pildist koosneva teose väljendus. @et
label: ist Person als Illustratorin/Illustrator von @de
definition: Setzt eine Person in Beziehung zu einem Aggregat (Manifestation), das eine Expression eines unbewegten Bildwerks verkörpert, die eine Person erstellt hat. @de
toolkit label: Person als Illustratorin/Illustrator von @de
toolkit definition: Ein Aggregat (Manifestation), das eine Expression eines unbewegten Bildwerks verkörpert, die eine Person erstellt hat. @de
label: közreműködő személye a következő állóképnek: @hu
definition: Hozzákapcsol egy személyt egy aggregátum megjelenési formához, amely egy személy által létrehozott állóképmű kifejezési formáját testesíti meg. @hu
toolkit label: közreműködő személye a következő állóképnek: @hu
toolkit definition: Egy aggregátum megjelenési forma, amely egy személy által létrehozott állóképmű kifejezési formáját testesíti meg. @hu
label: è contributore persona di immagine fissa di @it
definition: Correla una persona a una manifestazione che è un aggregato che materializza un'immagine fissa creata da una persona. @it
toolkit label: contributore persona di immagine fissa di @it
toolkit definition: Manifestazione che è un aggregato che materializza un'immagine fissa creata da una persona. @it
label: είναι συντελεστής φυσικό πρόσωπο της σταθερής εικόνας του @el
toolkit label: συντελεστής φυσικό πρόσωπο της σταθερής εικόνας του @el
label: est une personne contributrice d’image fixe de @fr
definition: Met une personne en relation avec une manifestation qui consiste en un agrégat matérialisant une expression d’une œuvre d’image fixe créée par une personne. @fr
toolkit label: personne contributrice d’image fixe de @fr
toolkit definition: Manifestation qui consiste en un agrégat matérialisant une expression d’une œuvre d’image fixe créée par une personne. @fr
label: ir attēla līdzradītājs (persona) @lv
definition: Sasaista personu ar manifestāciju, kas ir apkopojums, kas ietver personas radītu attēla darbu. @lv
toolkit label: ir attēla līdzradītājs (persona) @lv
toolkit definition: Manifestācija, kas ir apkopojums, kas ietver personas radītu attēla darbu. @lv
label: 是……的静态图像的贡献者个人 @zh-hans
definition: 将一个个人与作为一种合集、把一个个人所创作的一种静态图像作品的内容表达具体化的一种载体表现关联起来。 @zh-hans
toolkit label: ……的静态图像的贡献者个人 @zh-hans
toolkit definition: 作为一种合集、把一个个人所创作的一种静态图像作品的内容表达具体化的一种载体表现 @zh-hans
label: durağan görüntüsünün katkıda bulunan kişisidir @tr
definition: Bir kişiyi, bir kişi tarafından yaratılan bir hareketsiz görüntü çalışmasının anlatımını somutlaştıran bir bütün olan gösterimle ilişkilendirir. @tr
toolkit label: hareketsiz görüntüye katkıda bulunan kişi @tr
toolkit definition: Bir kişi tarafından oluşturulan hareketsiz bir görüntü eserinin anlatımını somutlaştıran topluluk olan bir gösterim. @tr
has subproperty: P50516

tekstiin osallinen henkilö manifestaatiossa
status: Published
label: is contributor person of text of @en
lexical alias: contributorPersonOfTextOf.en
definition: Relates a person to a manifestation that is an aggregate that embodies an expression of a textual work that is created by a person. @en
toolkit label: contributor person of text of @en
toolkit definition: A manifestation that is an aggregate that embodies an expression of a textual work that is created by a person. @en
type: Property
domain: C10004
has element type: 2
sub property of: aggregaattiin osallinen henkilö manifestaatiossa
sub property of: tekstiin osallinen toimija manifestaatiossa
definition: Liittää henkilön manifestaatioon, joka on aggregaatti, joka sisältää tekstiteoksen ekspression, jonka henkilö on luonut.
toolkit label: tekstiin osallinen henkilö manifestaatiossa
toolkit definition: Manifestaatio, joka on aggregaatti, joka sisältää tekstiteoksen ekspression, jonka henkilö on luonut.
label: er bidragsyter til tekst for (person) @no
definition: Relaterer en person til en manifestasjon som er et aggregat som realiserer et tekstlig verk skapt av en person. @no
toolkit label: bidragsyter til tekst for (person) @no
toolkit definition: En manifestasjon som er et aggregat som realiserer et tekstlig verk skapt av en person. @no
label: is bijdrager-persoon van tekst van @nl
definition: Relateert een persoon aan een manifestatie die een aggregaat is die een expressie van een tekstwerk verwezenlijkt dat is gecreëerd door een persoon. @nl
toolkit label: bijdrager-persoon van tekst van @nl
toolkit definition: Een manifestatie die een aggregaat is die een expressie van een tekstwerk verwezenlijkt dat is gecreëerd door een persoon. @nl
label: هو شخص مساهم في نص لـ @ar
definition: يربط شخصا بتجسيدة عبارة عن تجميعة تجسد عمل نصيا أنشأه شخص. @ar
toolkit label: شخص مساهم في نص @ar
toolkit definition: تجسيدة تمثل تجميعة تجسد عمل نصيا أنشأه شخص. @ar
label: és persona contribuïdora de text de @ca
definition: Relaciona una persona amb una manifestació que és un agregat que materialitza una expressió d’una obra textual que és creada per una persona. @ca
toolkit label: persona contribuïdora de text de @ca
toolkit definition: Manifestació que és un agregat que materialitza una expressió d’una obra textual que és creada per una persona. @ca
label: er person, som er bidragsyder til tekst af @da
definition: Relaterer en person til en manifestation, som er en samling, som rummer et udtryk af et tekstværk, som er skabt af en person. @da
toolkit label: person, som er bidragsyder til tekst af @da
toolkit definition: Manifestation, som er en samling, som rummer et udtryk af et tekstværk, som er skabt af en person. @da
label: tekstiloome kaastööline (isik) kehastuses @et
definition: Seostab isiku kehastusega, mis on liitum, milles on teostatud isiku loodud tekstteose väljendus. @et
toolkit label: tekstiloome kaastööline (isik) kehastuses @et
toolkit definition: Kehastus, mis on liitum, milles on teostatud isiku loodud tekstteose väljendus. @et
label: ist Person als Beiträgerin/Beiträger von ergänzendem Text von @de
definition: Setzt eine Person in Beziehung zu einem Aggregat (Manifestation), das eine Expression eines textlichen Werks verkörpert, die eine Person erstellt hat. @de
toolkit label: Person als Beiträgerin/Beiträger von ergänzendem Text von @de
toolkit definition: Ein Aggregat (Manifestation), das eine Expression eines textlichen Werks verkörpert, die eine Person erstellt hat. @de
label: közreműködő személye a következő szövegnek: @hu
definition: Hozzákapcsol egy személyt egy aggregátum megjelenési formához, amely egy személy által létrehozott szöveges mű kifejezési formáját testesíti meg. @hu
toolkit label: közreműködő személye a következő szövegnek: @hu
toolkit definition: Egy aggregátum megjelenési forma, amely egy személy által létrehozott szöveges mű kifejezési formáját testesíti meg. @hu
label: è contributore persona di testo di @it
definition: Correla una persona a una manifestazione che è un aggregato che materializza un'opera testuale creata da una persona. @it
toolkit label: contributore persona di testo di @it
toolkit definition: Manifestazione che è un aggregato che materializza un'opera testuale creata da una persona. @it
label: είναι συντελεστής φυσικό πρόσωπο του κειμένου του @el
toolkit label: συντελεστής φυσικό πρόσωπο του κειμένου του @el
label: est une personne contributrice de texte de @fr
definition: Met une personne en relation avec une manifestation qui consiste en un agrégat matérialisant une expression d’une œuvre textuelle créée par une personne. @fr
toolkit label: personne contributrice de texte de @fr
toolkit definition: Manifestation qui consiste en un agrégat matérialisant une expression d’une œuvre textuelle créée par une personne. @fr
label: ir teksta līdzradītājs (persona) @lv
definition: Sasaista personu ar manifestāciju, kas ir apkopojums, kas ietver personas radītu teksta darbu. @lv
toolkit label: ir teksta līdzradītājs (persona) @lv
toolkit definition: Manifestācija, kas ir apkopojums, kas ietver personas radītu teksta darbu. @lv
label: 是……的文本的贡献者个人 @zh-hans
definition: 将一个个人与作为一种合集、把一个个人所创作的一种文字作品的内容表达具体化的一种载体表现关联起来。 @zh-hans
toolkit label: ……的文本的贡献者个人 @zh-hans
toolkit definition: 作为一种合集、把一个个人所创作的一种文字作品的内容表达具体化的一种载体表现 @zh-hans
label: metninin katkıda bulunan kişisidir @tr
definition: Bir kişiyi, bir kişi tarafından yaratılan bir metinsel çalışmanın anlatımını somutlaştıran bir bütün olan gösterimle ilişkilendirir. @tr
toolkit label: metne katkıda bulunan kişi @tr
toolkit definition: Bir kişi tarafından oluşturulan metinsel bir eserin anlatımını somutlaştıran topluluk olan bir gösterim. @tr
has subproperty: P50517

aggregaattiin osallinen henkilö manifestaatiossa
status: Published
label: is contributor person to aggregate of @en
lexical alias: contributorPersonToAggregateOf.en
definition: Relates a person to a manifestation that is an aggregate that embodies an expression of a work that is created by a person. @en
toolkit label: contributor person to aggregate of @en
toolkit definition: A manifestation that is an aggregate that embodies an expression of a work that is created by a person. @en
type: Property
domain: C10004
has element type: 2
sub property of: henkilöön liittyvä manifestaatio
sub property of: aggregaattiin osallinen toimija manifestaatiossa
definition: Liittää henkilön manifestaatioon, joka on aggregaatti, joka sisältää teoksen ekspression, jonka henkilö on luonut.
toolkit label: aggregaattiin osallinen henkilö manifestaatiossa
toolkit definition: Manifestaatio, joka on aggregaatti, joka sisältää teoksen ekspression, jonka henkilö on luonut.
label: er bidragsyter til aggregat for (person) @no
definition: Relaterer en person til en manifestasjon som er et aggregat som inkluderer et bidrag fra en person. @no
toolkit label: bidragsyter til aggregat for (person) @no
toolkit definition: En manifestasjon som er et aggregat som inkluderer et bidrag fra en person. @no
label: is bijdrager-persoon aan aggregaat van @nl
definition: Relateert een persoon aan een manifestatie die een aggregaat is die een expressie van een werk verwezenlijkt die is gecreëerd door een persoon. @nl
toolkit label: bijdrager-persoon aan aggregaat van @nl
toolkit definition: Een manifestatie die een aggregaat is die een expressie van een werk verwezenlijkt die is gecreëerd door een persoon. @nl
label: هو شخص مساهم في تجميعة لـ @ar
definition: يربط شخصا بتجسيدة عبارة عن تجميعة تجسد تعبيرة لعمل أنشاه شخص. @ar
toolkit label: شخص مساهم في تجميعة @ar
toolkit definition: تجسيدة تمثل تجميعة يتضمن إسهام شخص. @ar
label: és persona contribuïdora a un agregat de @ca
definition: Relaciona una persona amb una manifestació que és un agregat que materialitza una expressió d’una obra que és creada per una persona. @ca
toolkit label: persona contribuïdora a un agregat de @ca
toolkit definition: Manifestació que és un agregat que materialitza una expressió d’una obra que és creada per una persona. @ca
label: er person, som er bidragsyder til samling af @da
definition: Relaterer en person til en manifestation, som er en samling, der rummer et udtryk af et værk, som er skabt af en person. @da
toolkit label: person, som er bidragsyder til samling af @da
toolkit definition: Manifestation, som er en samling, som omfatter en persons bidrag, der rummer et udtryk af et værk, som er skabt af en person. @da
label: liitumi kaastööline (isik) kehastuses @et
definition: Seostab isiku kehastusega, mis on liitum, milles on teostatud isiku loodud teose väljendus. @et
toolkit label: liitumi kaastööline (isik) kehastuses @et
toolkit definition: Kehastus, mis on liitum, milles on teostatud isiku loodud teose väljendus. @et
label: ist Person als Beiträgerin/Beiträger zu einem Aggregat von @de
definition: Setzt eine Person in Beziehung zu einem Aggregat (Manifestation), das eine Expression eines Werks verkörpert, die eine Person erstellt hat. @de
toolkit label: Person als Beiträgerin/Beiträger zu einem Aggregat von @de
toolkit definition: Ein Aggregat (Manifestation), das eine Expression eines Werks verkörpert, die eine Person erstellt hat. @de
label: közreműködő személye a következő aggregátumnak: @hu
definition: Hozzákapcsol egy személyt egy aggregátum megjelenési formához, amely egy személy által létrehozott mű kifejezési formáját testesíti meg. @hu
toolkit label: közreműködő személye a következő aggregátumnak: @hu
toolkit definition: Egy aggregátum megjelenési forma, amely egy személy által létrehozott mű kifejezési formáját testesíti meg. @hu
label: è contributore persona di aggregato di @it
definition: Correla una persona a una manifestazione che è un aggregato che comprende un contributo di una persona. @it
toolkit label: contributore persona di aggregato di @it
toolkit definition: Manifestazione che è un aggregato che comprende un contributo di una persona. @it
label: είναι συντελεστής φυσικό πρόσωπο της συνάθροισης του @el
toolkit label: συντελεστής φυσικό πρόσωπο της συνάθροισης του @el
label: est une personne contributrice à un agrégat de @fr
definition: Met une personne en relation avec une manifestation qui consiste en un agrégat matérialisant une expression d’une œuvre créée par une personne. @fr
toolkit label: personne contributrice à un agrégat de @fr
toolkit definition: Manifestation qui consiste en un agrégat matérialisant une expression d’une œuvre créée par une personne. @fr
label: ir apkopojuma līdzradītājs (persona) @lv
definition: Sasaista personu ar manifestāciju, kas ir apkopojums, kas ietver personas ieguldījumu/līdzdalību. @lv
toolkit label: ir apkopojuma līdzradītājs (persona) @lv
toolkit definition: Manifestācija, kas ir apkopojums, kas ietver personas ieguldījumu/līdzdalību. @lv
label: 是……的合集的贡献者个人 @zh-hans
definition: 将一个个人与作为一种合集、把一个个人所创作的一种作品的内容表达具体化的一种载体表现关联起来。 @zh-hans
toolkit label: ……的合集的贡献者个人 @zh-hans
toolkit definition: 作为一种合集、把一个个人所创作的一种作品的内容表达具体化的一种载体表现 @zh-hans
label: toplanmasına katkıda bulunan kişidir @tr
definition: Bir kişiyi, bir kişi tarafından yaratılan bir eserin ifadesini somutlaştıran bir bütün olan bir gösterimle ilişkilendirir. @tr
toolkit label: topluluğa katkıda bulunan kişi @tr
toolkit definition: Bir kişi tarafından oluşturulan bir eserin anlatımını somutlaştıran topluluk olan bir gösterim. @tr
has subproperty: kartografiaan osallinen henkilö manifestaatiossa
has subproperty: koreografiaan osallinen henkilö manifestaatiossa
has subproperty: digitaaliseen sisältöön osallinen henkilö manifestaatiossa
has subproperty: liikkuvaan kuvaan osallinen henkilö manifestaatiossa
has subproperty: musiikkiin osallinen henkilö manifestaatiossa
has subproperty: esineeseen osallinen henkilö manifestaatiossa
has subproperty: puheeseen osallinen henkilö manifestaatiossa
has subproperty: stillkuvaan osallinen henkilö manifestaatiossa
has subproperty: tekstiin osallinen henkilö manifestaatiossa
has subproperty: P50521

yhdistymään osallinen henkilö ekspressiossa
status: Published
label: is contributor person to amalgamation of @en
lexical alias: contributorPersonToAmalgamationOf.en
definition: Relates a person to an expression that includes a contribution by a person to a seamless mix of kinds of content. @en
toolkit label: contributor person to amalgamation of @en
toolkit definition: An expression that includes a contribution by a person to a seamless mix of kinds of content. @en
type: Property
domain: C10004
has element type: 2
sub property of: ekspression tekijä (henkilö) ekspressiossa
sub property of: yhdistymään osallinen toimija ekspressiossa
definition: Liittää henkilön ekspressioon, jossa henkilö on osallisena sellaisen ekspression tekemisessä, joka on saumaton yhdistelmä erilaisia sisältöjä.
toolkit label: yhdistymään osallinen henkilö ekspressiossa
toolkit definition: Ekspressio, jossa henkilö on osallisena sellaisen ekspression tekemisessä, joka on saumaton yhdistelmä erilaisia sisältöjä.
label: er bidragsyter til sammenslutning for (person) @no
definition: Relaterer en person til et uttrykk som inkluderer et bidrag fra en person til en sømløs blanding av forskjellig innhold. @no
toolkit label: bidragsyter til sammenslutning for (person) @no
toolkit definition: Et uttrykk som inkluderer et bidrag fra en person til en sømløs blanding av forskjellig innhold. @no
label: is bijdrager-persoon aan amalgamering van @nl
definition: Relateert een persoon aan een expressie die omvat een bijdrage door een persoon aan een naadloze mix van soorten content. @nl
toolkit label: bijdrager-persoon aan amalgamering van @nl
toolkit definition: Een expressie die omvat een bijdrage door een persoon aan een naadloze mix van soorten content. @nl
label: هو شخص مساهم في دمج لـ @ar
definition: يربط شخصا بتعبيرة تتضمن إسهام شخص في مزج سلس لأنواع من المحتوى. @ar
toolkit label: شخص مساهم في مزج @ar
toolkit definition: تعبيرة تتضمن إسهام شخص في مزج سلس لأنواع من المحتوى. @ar
label: és persona contribuïdora a una amalgama de @ca
definition: Relaciona una persona amb una expressió que inclou una contribució d’una persona a una mescla sense continuïtat de classes de contingut. @ca
toolkit label: persona contribuïdora a una amalgama de @ca
toolkit definition: Expressió que inclou una contribució d’una persona a una mescla sense continuïtat de classes de contingut. @ca
label: er person, som er bidragsyder til sammensmeltning af @da
definition: Relaterer en person til et udtryk, som omfatter en persons bidrag til en glat kombinering af forskellige slags af indhold. @da
toolkit label: person, som er bidragsyder til sammensmeltning af @da
toolkit definition: Udtryk, som omfatter en persons bidrag til en glat kombinering af forskellige slags af indhold. @da
label: sulami kaastööline (isik) väljenduses @et
definition: Seostab isiku väljendusega, millesse isik on andnud panuse, osaledes eri liiki sisu lahutamatu segu loomisel. @et
toolkit label: sulami kaastööline (isik) väljenduses @et
toolkit definition: Väljendus, millesse isik on andnud panuse, osaledes sellise väljenduse loomisel, mis on eri liiki sisu lahutamatu segu. @et
label: ist Person als Beiträgerin/Beiträger zu einer Verschmelzung von @de
definition: Setzt eine Person in Beziehung zu einer Expression, bei der eine Person zu einer nahtlosen Mischung von Inhalten beiträgt. @de
toolkit label: Person als Beiträgerin/Beiträger zu einer Verschmelzung von @de
toolkit definition: Eine Expression, bei der eine Person zu einer nahtlosen Mischung von Inhalten beiträgt. @de
label: közreműködő személye a következő vegyes tartalomnak: @hu
definition: Hozzákapcsol egy személyt egy kifejezési formához, amely magában foglalja egy személy közreműködését a tartalom fajtáinak szabad keverésében. @hu
toolkit label: közreműködő személye a következő vegyes tartalomnak: @hu
toolkit definition: Egy kifejezési forma, amely magában foglalja egy személy közreműködését a tartalom fajtáinak szabad keverésében. @hu
label: è contributore persona di fusione di @it
definition: Correla una persona a un'espressione che comprende un contributo di una persona a una varietà di tipi di contenuto senza soluzione di continuità. @it
toolkit label: contributore persona di fusione di @it
toolkit definition: Espressione che comprende un contributo di una persona a una varietà di tipi di contenuto senza soluzione di continuità. @it
label: είναι συντελεστής φυσικό πρόσωπο σε μείξη του (?) @el
toolkit label: συντελεστής φυσικό πρόσωπο σε μείξη του (?) @el
label: est une personne contributrice à un amalgame de @fr
definition: Met une personne en relation avec une expression qui intègre une contribution de la part d’une personne à un mélange intégré de différents genres de contenu. @fr
toolkit label: personne contributrice à un amalgame de @fr
toolkit definition: Expression qui intègre une contribution de la part d’une personne à un mélange intégré de différents genres de contenu. @fr
label: ir amalgamāta līdzradītājs (persona) @lv
definition: Sasaista personu ar izteiksmi, kas ietver personas ieguldījumu dažādu satura veidu vienlaidu sajaukumā. @lv
toolkit label: ir amalgamāta līdzradītājs (persona) @lv
toolkit definition: Izteiksme, kas ietver personas ieguldījumu dažādu satura veidu vienlaidu sajaukumā. @lv
label: 是……的融合体的贡献者个人 @zh-hans
definition: 将一个个人与包括将各种内容无缝融合的一个个人的贡献的一种内容表达关联起来。 @zh-hans
toolkit label: ……的融合体的贡献者个人 @zh-hans
toolkit definition: 包括将各种内容无缝融合的一个个人的贡献的一种内容表达 @zh-hans
label: birleşimine katkıda bulunan kişidir @tr
definition: Bir kişiyi, kişinin içerik türlerinin kusursuz bir şekilde birleşmesine yaptığı katkıyı içeren anlatımla ilişkilendirir. @tr
toolkit label: birleşmeye katkıda bulunan kişi @tr
toolkit definition: Farklı türde içeriklerin kusursuz karışımını sağlayan bir kişinin katkısını içeren bir anlatım.​ @tr
has subproperty: värittäjä (henkilö) ekspressiossa
has subproperty: esitykseen osallinen henkilö ekspressiossa
has subproperty: tuomioistuimen kirjuri (henkilö) ekspressiossa
has subproperty: piirtäjä (henkilö) ekspressiossa
has subproperty: toimittaja (henkilö) ekspressiossa
has subproperty: tekstaaja (henkilö) ekspressiossa
has subproperty: pöytäkirjan laatija (henkilö) ekspressiossa
has subproperty: ohjelmistokehittäjä (henkilö) ekspressiossa
has subproperty: P50624

esitykseen osallinen henkilö ekspressiossa
status: Published
label: is contributor person to performance of @en
lexical alias: contributorPersonToPerformanceOf.en
definition: Relates a person to an expression that includes a contribution by a person to a performance. @en
toolkit label: contributor person to performance of @en
toolkit definition: An expression that includes a contribution by a person to a performance. @en
type: Property
domain: C10004
has element type: 2
sub property of: yhdistymään osallinen henkilö ekspressiossa
sub property of: esitykseen osallinen toimija ekspressiossa
definition: Liittää henkilön ekspressioon, jossa henkilö on osallisena sellaisen ekspression tekemisessä, joka on esitys.
toolkit label: esitykseen osallinen henkilö ekspressiossa
toolkit definition: Ekspressio, jossa henkilö on osallisena sellaisen ekspression tekemisessä, joka on esitys.
label: er bidragsyter til framføring for (person) @no
definition: Relaterer en person til et uttrykk som inkluderer et bidrag fra en person til en framføring. @no
toolkit label: bidragsyter til framføring for (person) @no
toolkit definition: Et uttrykk som inkluderer et bidrag fra en person til en framføring. @no
label: is bijdrager-persoon aan uitvoering van @nl
definition: Relateert een persoon aan een expressie die omvat een bijdrage door een persoon aan een uitvoering. @nl
toolkit label: bijdrager-persoon aan uitvoering van @nl
toolkit definition: Een expressie die omvat een bijdrage door een persoon aan een uitvoering. @nl
label: هو شخص مساهم في أداء لـ @ar
definition: يربط شخصا بتعبيرة تتضمن إسهام شخص في أداء @ar
toolkit label: شخص مساهم في أداء @ar
toolkit definition: تعبيرة تتضمن إسهام شخص في أداء. @ar
label: és persona contribuïdora a una interpretació de @ca
definition: Relaciona una persona amb una expressió que inclou una contribució d’una persona a una interpretació. @ca
toolkit label: persona contribuïdora a una interpretació de @ca
toolkit definition: Expressió que inclou una contribució d’una persona a una interpretació. @ca
label: er person, som er bidragsyder til optræden af @da
definition: Relaterer en person til et udtryk, som omfatter en persons bidrag til en optræden. @da
toolkit label: person, som er bidragsyder til optræden af @da
toolkit definition: Udtryk, som omfatter en persons bidrag til en optræden. @da
label: esituse kaastööline (isik) väljenduses @et
definition: Seostab isiku väljendusega, millesse isik on andnud panuse, osaledes esituse loomisel. @et
toolkit label: esituse kaastööline (isik) väljenduses @et
toolkit definition: Väljendus, millesse isik on andnud panuse, osaledes esituse loomisel. @et
label: ist Person als Beiträgerin/Beiträger zu einer Darbietung von @de
definition: Setzt eine Person in Beziehung zu einer Expression, bei der eine Person zu einer Darbietung beiträgt @de
toolkit label: Person als Beiträgerin/Beiträger zu einer Darbietung von @de
toolkit definition: Eine Expression, bei der eine Person zu eine Darbietung beiträgt. @de
label: közreműködő személye a következő előadásnak: @hu
definition: Hozzákapcsol egy személyt egy kifejezési formához, amely magában foglalja egy személy közreműködését egy előadásban. @hu
toolkit label: közreműködő személye a következő előadásnak: @hu
toolkit definition: Egy kifejezési forma, amely magában foglalja egy személy közreműködését egy előadásban. @hu
label: è contributore persona di esibizione di @it
definition: Correla una persona a un'espressione che comprende un contributo di una persona a un'esibizione. @it
toolkit label: contributore persona di performance di @it
toolkit definition: Espressione che comprende un contributo di una persona a un'esibizione. @it
label: είναι συντελεστής φυσικό πρόσωπο σε εκτέλεση του @el
toolkit label: συντελεστής φυσικό πρόσωπο σε εκτέλεση του @el
label: est une personne contributrice à une prestation de @fr
definition: Met une personne en relation avec une expression qui intègre une contribution de la part d’une personne à une prestation. @fr
toolkit label: personne contributrice à une prestation de @fr
toolkit definition: Expression qui intègre une contribution de la part d’une personne à une prestation. @fr
label: ir uzveduma līdzradītājs (persona) @lv
definition: Sasaista personu ar izteiksmi, kas ietver personas ieguldījumu uzvedumā. @lv
toolkit label: ir uzveduma līdzradītājs (persona) @lv
toolkit definition: Izteiksme, kas ietver personas ieguldījumu uzvedumā. @lv
label: 是……的表演的贡献者个人 @zh-hans
definition: 将一个个人与包括一个个人对一个表演之贡献的一种内容表达关联起来。 @zh-hans
toolkit label: ……的表演的贡献者个人 @zh-hans
toolkit definition: 包括一个个人对一个表演之贡献的一种内容表达 @zh-hans
label: performansına katkıda bulunan kişidir @tr
definition: Bir kişiyi, kişinin bir performansa katkısını içeren anlatımla ilişkilendirir. @tr
toolkit label: performansa katkıda bulunan kişi @tr
toolkit definition: Bir kişinin bir performansa katkısını içeren bir anlatım. @tr
has subproperty: animaattori (henkilö) ekspressiossa
has subproperty: lavastaja (henkilö) ekspressiossa
has subproperty: ääniteknikko (henkilö) ekspressiossa
has subproperty: puvustaja (henkilö) ekspressiossa
has subproperty: DJ (henkilö) ekspressiossa
has subproperty: dubbausohjaaja (henkilö) ekspressiossa
has subproperty: leikkaaja (henkilö) ekspressiossa
has subproperty: ekspression haastateltava (henkilö) ekspressiossa
has subproperty: ekspression haastattelija (henkilö) ekspressiossa
has subproperty: valosuunnittelija (henkilö) ekspressiossa
has subproperty: maskeeraaja (henkilö) ekspressiossa

is contributor to aggregated content of (Deprecated)
status: Deprecated
type: Property
has element type: 2
lexical alias: contributorToAggregatedContentOf.en
has subproperty: valokuva (ekspressio)
has subproperty: maanmittaus
has subproperty: kuvittajana kuvituksessa
has subproperty: koreografina koreografiassa (ekspressio)
has subproperty: toimittajana aineistossa
has subproperty: kartantekijänä kartassa (ekspressio)
has subproperty: sävellys (ekspressio)
has subproperty: P50451

yhteistoimijan yhteisöjäsen
status: Published
label: has corporate body member of collective agent @en
type: Property
lexical alias: corporateBodyMemberOfCollectiveAgent.en
definition: Relates a collective agent to a corporate body who is a member of a collective agent. @en
domain: C10011
toolkit label: corporate body member of collective agent @en
toolkit definition: A corporate body who is a member of a collective agent. @en
sub property of: yhteistoimijaan liittyvä yhteisö
has element type: 2
definition: Liittää yhteistoimijan yhteisöön, joka on yhteistoimijan jäsen.
toolkit label: yhteistoimijan yhteisöjäsen
toolkit definition: Yhteisö, joka on yhteistoimijan jäsen.
label: har korporasjon som medlem av kollektiv agent @no
definition: Relaterer en kollektiv agent til en korporasjon som er et medlem av en kollektiv agent. @no
toolkit label: korporasjon som medlem av kollektiv agent @no
toolkit definition: En korporasjon som er et medlem av en kollektiv agent. @no
label: heeft corporatief lid van collectieve actor @nl
definition: Relateert een collectieve actor aan een corporatie die een lid is van een collectieve actor. @nl
toolkit label: corporatief lid van collectieve actor @nl
toolkit definition: Een corporatie die een lid is van een collectieve actor. @nl
label: له هيئة عضو في وكيل جماعي @ar
definition: يربط وكيلا جماعيا بهيئة هي عضو في وكيل جماعي. @ar
toolkit label: هيئة عضو في وكيل جماعي @ar
toolkit definition: هيئة هي عضو في وكيل جماعي. @ar
label: té com a entitat corporativa membre d’un agent col·lectiu @ca
definition: Relaciona un agent col·lectiu amb una entitat corporativa que és un membre d’un agent col·lectiu. @ca
toolkit label: entitat corporativa membre d’un agent col·lectiu @ca
toolkit definition: Entitat corporativa que és un membre d’un agent col·lectiu. @ca
label: har korporation, som er medlem af kollektiv agent @da
definition: Relaterer en kollektiv agent til en korporation, som er et medlem af en kollektiv agent. @da
toolkit label: korporation, som er medlem af kollektiv agent @da
toolkit definition: Korporation, som er et medlem af en kollektiv agent. @da
label: kollektiivi liige (asutus) @et
definition: Seostab kollektiivi asutusega, mis on kollektiivi liige. @et
toolkit label: kollektiivi liige (asutus) @et
toolkit definition: Asutus, mis on kollektiivi liige. @et
label: hat Mitglied eines gemeinschaftlichen Akteurs (Körperschaft) @de
definition: Setzt einen gemeinschaftlichen Akteur in Beziehung zu einer Körperschaft, die Mitglied eines gemeinschaftlichen Akteurs ist. @de
toolkit label: Mitglied eines gemeinschaftlichen Akteurs (Körperschaft) @de
toolkit definition: Eine Körperschaft, die Mitglied eines gemeinschaftlichen Akteurs ist. @de
label: kollektív ágens testületi tagja a következő: @hu
definition: Hozzákapcsol egy kollektív ágenst egy testülethez, amely egy kollektív ágens tagja. @hu
toolkit label: kollektív ágens testületi tagja: @hu
toolkit definition: Egy testület, amely egy kollektív ágens tagja. @hu
label: ha come ente membro di agente collettivo @it
definition: Correla un agente collettivo a un ente che è un membro di un agente collettivo. @it
toolkit label: ente membro di agente collettivo @it
toolkit definition: Ente membro di un agente collettivo. @it
label: έχει συλλογικό όργανο μέλος του συλλογικού φορέα @el
toolkit label: έχει συλλογικό όργανο μέλος του συλλογικού φορέα @el
label: a pour collectivité membre d’un agent collectif @fr
definition: Met un agent collectif en relation avec une collectivité qui est membre d’un agent collectif. @fr
toolkit label: collectivité membre d’un agent collectif @fr
toolkit definition: Collectivité qui est membre d’un agent collectif. @fr
label: grupas dalībnieks (institūcija) @lv
definition: Sasaista grupu ar institūciju, kas ir grupas dalībniece. @lv
toolkit label: grupas dalībnieks (institūcija) @lv
toolkit definition: Institūcija, kas ir grupas dalībniece. @lv
label: 有集体行为者的团体成员 @zh-hans
definition: 将一个集体行为者与是一个集体行为者的一个成员的一个团体关联起来。 @zh-hans
toolkit label: 集体行为者的团体成员 @zh-hans
toolkit definition: 是一个集体行为者的一个成员的一个团体 @zh-hans
label: kolektif temsilcinin tüzel kişi üyesi ile ilişkilidir @tr
definition: Kolektif bir temsilciyi, bir kolektif temsilcinin üyesi olan bir tüzel kişiyle ilişkilendirir. @tr
toolkit label: kolektif temsilcinin tüzel kişi üyesi @tr
toolkit definition: Kolektif bir temsilcinin üyesi olan bir tüzel kişi @tr
has subproperty: suvun yhteisöjäsen
has subproperty: yhteisön yhteisöjäsen
has subproperty: P50433

yhteisöjäsen yhteistoimijassa
status: Published
label: is corporate body member of collective agent of @en
type: Property
lexical alias: corporateBodyMemberOfCollectiveAgentOf.en
definition: Relates a corporate body to a collective agent of whom a corporate body is a member. @en
domain: C10005
toolkit label: corporate body member of collective agent of @en
toolkit definition: A collective agent of whom a corporate body is a member. @en
sub property of: yhteisöön liittyvä yhteistoimija
has element type: 2
definition: Liittää yhteisön yhteistoimijaan, jonka jäsen yhteisö on.
alternative label: yhteisöön kuuluva yhteistoimija
toolkit label: yhteisöjäsen yhteistoimijassa
toolkit definition: Yhteistoimija, jonka jäsen yhteisö on.
label: er korporasjon som medlem av kollektiv agent for @no
definition: Relaterer en korporasjon til en kollektiv agent som en korporasjon er medlem av. @no
toolkit label: korporasjon som medlem av kollektiv agent for @no
toolkit definition: En kollektiv agent som en korporasjon er medlem av. @no
label: is corporatief lid van collectieve actor van @nl
definition: Relateert een corporatie aan een collectieve actor waarvan een corporatie lid is. @nl
toolkit label: corporatief lid van collectieve actor van @nl
toolkit definition: Een collectieve actor waarvan een corporatie lid is. @nl
label: هي هيئة عضو في وكيل جماعي @ar
definition: يربط هيئة بوكيل جماعي هي عضو فيه. @ar
toolkit label: هيئة عضو في وكيل جماعي @ar
toolkit definition: وكيل جماعي حيث الهيئة عضو فيه. @ar
label: és entitat corporativa membre d’un agent col·lectiu de @ca
definition: Relaciona una entitat corporativa amb un agent col·lectiu del qual una entitat corporativa n’és un membre. @ca
toolkit label: entitat corporativa membre d’un agent col·lectiu de @ca
toolkit definition: Agent col·lectiu del qual una entitat corporativa n’és un membre. @ca
label: er korporation, som er medlem af kollektiv agent af @da
definition: Relaterer en korporation til en kollektiv agent, som en korporation er medlem af. @da
toolkit label: korporation, som er medlem af kollektiv agent af @da
toolkit definition: Kollektiv agent, som en korporation er medlem af. @da
label: kollektiivi liige (asutus) kollektiivis @et
definition: Seostab asutuse kollektiiviga, milles asutus on liige. @et
toolkit label: kollektiivi liige (asutus) kollektiivis @et
toolkit definition: Kollektiiv, milles asutus on liige. @et
label: ist Körperschaft als Mitglied eines gemeinschaftlichen Akteurs von @de
definition: Setzt eine Körperschaft in Beziehung zu einem gemeinschaftlichen Akteur, dem eine Körperschaft angehört. @de
toolkit label: Körperschaft als Mitglied eines gemeinschaftlichen Akteurs von @de
toolkit definition: Ein gemeinschaftlicher Akteur, dem eine Körperschaft angehört. @de
label: kollektív ágens testületi tagja a következőnek: @hu
definition: Hozzákapcsol egy testületet egy kollektív ágenshez, amelynek a tagja egy testület. @hu
toolkit label: testületi tagja a következő kollektív ágensnek: @hu
toolkit definition: Egy kollektív ágens, amelynek a tagja egy testület. @hu
label: è ente membro di agente collettivo di @it
definition: Correla un ente a un agente collettivo di cui un ente è un membro. @it
toolkit label: ente membro di agente collettivo di @it
toolkit definition: Agente collettivo di cui un ente è membro. @it
label: είναι συλλογικό όργανο μέλος του συλλογικού φορέα του @el
toolkit label: συλλογικό όργανο μέλος του συλλογικού φορέα του @el
label: est une collectivité membre d’un agent collectif de @fr
definition: Met une collectivité en relation avec un agent collectif dont une collectivité est membre. @fr
toolkit label: collectivité membre d’un agent collectif de @fr
toolkit definition: Agent collectif dont une collectivité est membre. @fr
label: ir grupas dalībnieks (institūcija) @lv
definition: Sasaista institūciju ar grupu, kā dalībniece ir institūcija. @lv
toolkit label: ir grupas dalībnieks (institūcija) @lv
toolkit definition: Grupa, kā dalībniece ir institūcija. @lv
label: 是……的集体行为者的团体成员 @zh-hans
definition: 将一个团体与有一个团体作为其成员的一个集体行为者关联起来。 @zh-hans
toolkit label: ……的集体行为者的团体成员 @zh-hans
toolkit definition: 有一个团体作为其成员的一个集体行为者 @zh-hans
label: kolektif temsilcisinin tüzel kişi üyesidir @tr
definition: Bir tüzel kişiyi, bir tüzel kişinin üyesi olduğu bir kolektif temsilci ile ilişkilendirir. @tr
toolkit label: kolektif temsilcinin tüzel kişi üyesi @tr
toolkit definition: Bir tüzel kişinin üyesi olduğu kolektif bir temsilci @tr
has subproperty: yhteisöjäsen suvussa
has subproperty: yhteisöjäsen yhteisössä
has subproperty: P50439

suvun yhteisöjäsen
status: Published
label: has corporate body member of family @en
type: Property
lexical alias: corporateBodyMemberOfFamily.en
domain: C10008
definition: Relates a family to a corporate body who is a member of a family. @en
toolkit label: corporate body member of family @en
toolkit definition: A corporate body who is a member of a family. @en
sub property of: sukuun liittyvä yhteisö
sub property of: yhteistoimijan yhteisöjäsen
has element type: 2
definition: Liittää suvun yhteisöön, joka on suvun jäsen.
toolkit label: suvun yhteisöjäsen
toolkit definition: Yhteisö, joka on suvun jäsen.
label: har korporasjon som medlem av familie @no
definition: Relaterer en familie til en korporasjon som er et medlem av en familie. @no
toolkit label: korporasjon som medlem av familie @no
toolkit definition: En korporasjon som er et medlem av en familie. @no
label: heeft corporatief lid van familie @nl
definition: Relateert een familie aan een corporatie die een lid is van een familie. @nl
toolkit label: corporatief lid van familie @nl
toolkit definition: Een corporatie die een lid is van een familie. @nl
label: له هيئة عضو في عائلة @ar
definition: يربط عائلة بهيئة هي عضو في عائلة. @ar
toolkit label: هيئة عضو في عائلة @ar
toolkit definition: هيئة هي عضو في عائلة. @ar
label: té com a entitat corporativa membre d’una família @ca
definition: Relaciona una família amb una entitat corporativa que és un membre d’una família. @ca
toolkit label: entitat corporativa membre d’una família @ca
toolkit definition: Entitat corporativa que és un membre d’una família. @ca
label: har korporation, som er medlem af familie @da
definition: Relaterer en familie til en korporation, som er et medlem af en familie. @da
toolkit label: korporation, som er medlem af familie @da
toolkit definition: Korporation, som er et medlem af en familie. @da
label: perekonna liige (asutus) @et
definition: Seostab perekonna asutusega, mis on perekonna liige. @et
toolkit label: perekonna liige (asutus) @et
toolkit definition: Asutus, mis on perekonna liige. @et
label: hat Familienmitglied (Körperschaft) @de
definition: Setzt eine Familie in Beziehung zu einer Körperschaft, die Mitglied einer Familie ist. @de
toolkit label: Familienmitglied (Körperschaft) @de
toolkit definition: Eine Körperschaft, die Mitglied einer Familie ist. @de
label: család testületi tagja a következő: @hu
definition: Hozzákapcsol egy családot egy testülethez, amely egy család tagja. @hu
toolkit label: család testületi tagja: @hu
toolkit definition: Egy testület, amely egy család tagja. @hu
label: ha come ente membro di famiglia @it
definition: Correla una famiglia a un ente che è un membro di una famiglia. @it
toolkit label: ente membro di famiglia @it
toolkit definition: Ente membro di una famiglia. @it
label: έχει συλλογικό όργανο μέλος της οικογένειας @el
toolkit label: συλλογικό όργανο μέλος της οικογένειας @el
label: a pour collectivité membre d’une famille @fr
definition: Met une famille en relation avec une collectivité qui est membre d’une famille. @fr
toolkit label: collectivité membre d’une famille @fr
toolkit definition: Collectivité qui est membre d’une famille. @fr
label: dzimtas/ģimenes dalībnieks (institūcija) @lv
definition: Sasaista dzimtu/ģimeni ar institūciju, kas ir dzimtas/ģimenes dalībniece. @lv
toolkit label: dzimtas/ģimenes dalībnieks (institūcija) @lv
toolkit definition: Institūcija, kas ir dzimtas/ģimenes dalībniece. @lv
label: 有家族的团体成员 @zh-hans
definition: 将一个家族与是一个家族的一个成员的一个团体关联起来。 @zh-hans
toolkit label: 家族的团体成员 @zh-hans
toolkit definition: 是一个家族的一个成员的一个团体 @zh-hans
label: ailenin tüzel kişi üyesi ile ilişkilidir @tr
definition: Bir aileyi, bir ailenin üyesi olan bir tüzel kişiyle ilişkilendirir. @tr
toolkit label: ailenin tüzel kişi üyesi @tr
toolkit definition: Bir ailenin üyesi olan bir tüzel kişi @tr
has subproperty: P50435

yhteisöjäsen suvussa
status: Published
label: is corporate body member of family of @en
type: Property
lexical alias: corporateBodyMemberOfFamilyOf.en
definition: Relates a corporate body to a family of whom a corporate body is a member. @en
domain: C10005
toolkit label: corporate body member of family of @en
toolkit definition: A family of whom a corporate body is a member. @en
sub property of: yhteisöön liittyvä suku
sub property of: yhteisöjäsen yhteistoimijassa
has element type: 2
definition: Liittää yhteisön sukuun, jonka jäsen yhteisö on.
alternative label: yhteisöön kuuluva suku
toolkit label: yhteisöjäsen suvussa
toolkit definition: Suku, jonka jäsen yhteisö on.
label: er korporasjon som medlem av familie for @no
definition: Relaterer en korporasjon til en familie som en korporasjon er medlem av. @no
toolkit label: korporasjon som medlem av familie for @no
toolkit definition: En familie som en korporasjon er medlem av. @no
label: is corporatief lid van familie van @nl
definition: Relateert een corporatie aan een familie waarvan een corporatie lid is. @nl
toolkit label: corporatief lid van familie van @nl
toolkit definition: Een familie waarvan een corporatie lid is. @nl
label: هي هيئة عضو في عائلة @ar
definition: يربط هيئة بعائلة هي عضو فيها. @ar
toolkit label: هيئة عضو في عائلة @ar
toolkit definition: عائلة حيث الهيئة عضو فيها. @ar
label: és entitat corporativa membre d’una família de @ca
definition: Relaciona una entitat corporativa amb una família de la qual una entitat corporativa n’és un membre. @ca
toolkit label: entitat corporativa membre d’una família de @ca
toolkit definition: Família de la qual una entitat corporativa n’és un membre. @ca
label: er korporation, som er medlem af familie af @da
definition: Relaterer en korporation til en familie, som en korporation er medlem af. @da
toolkit label: korporation, som er medlem af familie af @da
toolkit definition: Familie, som en korporation er medlem af. @da
label: perekonna liige (asutus) perekonnas @et
definition: Seostab asutuse perekonnaga, milles asutus on liige. @et
toolkit label: perekonna liige (asutus) perekonnas @et
toolkit definition: Perekond, milles asutus on liige. @et
label: ist Körperschaft als Familienmitglied von @de
definition: Setzt eine Körperschaft in Beziehung zu einer Familie, der eine Körperschaft angehört. @de
toolkit label: Körperschaft als Familienmitglied von @de
toolkit definition: Eine Familie, der eine Körperschaft angehört. @de
label: testületi tagja a következő családnak: @hu
definition: Hozzákapcsol egy testületet egy családhoz, amelynek a tagja egy testület. @hu
toolkit label: testületi tagja a következő családnak: @hu
toolkit definition: Egy család, amelynek a tagja egy testület. @hu
label: è ente membro di famiglia di @it
definition: Correla un ente a una famiglia di cui un ente è un membro. @it
toolkit label: ente membro di famiglia di @it
toolkit definition: Famiglia di cui un ente è membro. @it
label: είναι συλλογικό όργανο μέλος της οικογένειας του @el
toolkit label: συλλογικό όργανο μέλος της οικογένειας του @el
label: est une collectivité membre d’une famille de @fr
definition: Met une collectivité en relation avec une famille dont une collectivité est membre. @fr
toolkit label: collectivité membre d’une famille de @fr
toolkit definition: Famille dont une collectivité est membre. @fr
label: ir dzimtas/ģimenes dalībnieks (institūcija) @lv
definition: Sasaista institūciju ar dzimtu/ģimeni, kas ir institūcija. @lv
toolkit label: ir dzimtas/ģimenes dalībnieks (institūcija) @lv
toolkit definition: Dzimta/ģimene, kas ir institūcija. @lv
label: 是……的家族的团体成员 @zh-hans
definition: 将一个团体与有一个团体作为其成员的一个家族关联起来。 @zh-hans
toolkit label: ……的家族的团体成员 @zh-hans
toolkit definition: 有一个团体作为其成员的一个家族 @zh-hans
label: ailesinin tüzel kişi üyesidir @tr
definition: Bir tüzel kişiyi, bir tüzel kişinin üyesi olduğu bir aileyle ilişkilendirir. @tr
toolkit label: ailenin tüzel kişi üyesi @tr
toolkit definition: Bir tüzel kişinin üyesi olduğu bir aile @tr
has subproperty: P50440

puvustaja (toimija) ekspressiossa
status: Published
label: is costume designer agent of @en
definition: Relates an agent to an expression that includes a contribution by an agent of designing costumes for a moving image production or for a musical or dramatic presentation or entertainment. @en
type: Property
domain: C10002
sub property of: esitykseen osallinen toimija ekspressiossa
lexical alias: costumeDesignerAgentOf.en
label: est un agent concepteur de costumes de @fr
definition: Met un agent en relation avec une expression qui intègre une contribution de la part d’un agent consistant à concevoir des costumes pour une production d’images animées ou bien pour une présentation ou un spectacle musical ou dramatique. @fr
toolkit label: agent concepteur de costumes de @fr
toolkit definition: Expression qui intègre une contribution de la part d’un agent consistant à concevoir des costumes pour une production d’images animées ou bien pour une présentation ou un spectacle musical ou dramatique. @fr
toolkit label: costume designer agent of @en
toolkit definition: An expression that includes a contribution by an agent of designing costumes for a moving image production or for a musical or dramatic presentation or entertainment. @en
instruction number: 18.5
label: είναι ενδυματολόγος φορέας του @el
definition: Συνδέει έναν φορέα, ο οποίος συνεισφέρει σε μια έκφραση ενός έργου μέσα από τον σχεδιασμό των κουστουμιών για μια παραγωγή κινητής εικόνας ή για μια μουσική ή δραματική παράσταση ή άλλη ψυχαγωγία, με μια έκφραση. @el
toolkit label: ενδυματολόγος φορέας του @el
toolkit definition: Μια έκφραση ενός έργου που ενσωματώνει τη συνεισφορά του σχεδιασμού των κουστουμιών για μια παραγωγή κινητής εικόνας ή για μια μουσική ή δραματική παράσταση ή άλλη ψυχαγωγία. @el
definition: Setzt einen Akteur in Beziehung zu einer Expression, zu der ein Akteur beiträgt, indem er die Kostüme für eine Bewegtbildproduktion oder für eine musikalische oder dramatische Darbietung oder Aufführung entwirft. @de
toolkit label: Akteur als Kostümbildnerin/Kostümbildner von @de
toolkit definition: Eine Expression, zu der ein Akteur beiträgt, indem er die Kostüme für eine Bewegtbildproduktion oder für eine musikalische oder dramatische Darbietung oder Aufführung entwirft. @de
label: er agent, som er kostumedesigner af @da
definition: Relaterer en agent til et udtryk, som omfatter en agents bidrag ved at designe kostumer til en levende billedproduktion eller til en musikalsk eller dramatisk præsentation eller underholdning. @da
toolkit label: agent, som er kostumedesigner af @da
toolkit definition: Udtryk, som omfatter en agents bidrag ved at designe kostumer til en levende billedproduktion eller til en musikalsk eller dramatisk præsentation eller til underholdning. @da
label: és agent dissenyador de vestuari de @ca
definition: Relaciona un agent amb una expressió que inclou una contribució d’un agent amb el disseny del vestuari en el cas d’una producció d’imatge en moviment o una representació o un espectacle musical o dramàtic. @ca
toolkit label: agent dissenyador de vestuari de @ca
toolkit definition: Expressió que inclou una contribució d’un agent amb el disseny del vestuari en el cas d’una producció d’imatge en moviment o una representació o un espectacle musical o dramàtic. @ca
definition: Liittää toimijan ekspressioon, jonka tekemiseen toimija osallistuu suunnittelemalla elokuvatuotannon tai musiikki- tai näytelmäesityksen puvustuksen.
toolkit label: puvustaja (toimija) ekspressiossa
toolkit definition: Ekspressio, jonka tekemiseen toimija osallistuu suunnittelemalla elokuvatuotannon tai musiikki- tai näytelmäesityksen puvustuksen.
toolkit label: kostymedesigner for (agent) @no
toolkit definition: Et uttrykk som inkluderer et bidrag fra en agent i form av å designe kostymene for en produksjon med levende bilder eller en musikalsk eller dramatisk forestilling eller form for underholdning. @no
label: ist Akteur als Kostümbildnerin/Kostümbildner von @de
has element type: 2
label: jelmeztervező ágense a következőnek: @hu
definition: Hozzákapcsol egy ágenst egy kifejezési formához, amely magában foglalja egy ágens közreműködését jelmezek tervezésében mozgókép-produkciókhoz, zenei vagy drámai előadásokhoz vagy szórakoztató műsorokhoz. @hu
toolkit label: jelmeztervező ágense: @hu
toolkit definition: Egy kifejezési forma, amely magában foglalja egy ágens közreműködését jelmezek tervezésében mozgókép-produkciókhoz, zenei vagy drámai előadásokhoz vagy szórakoztató műsorokhoz. @hu
alternative label: costume designer of @en
alternative label: puvustajana esityksessä
label: er kostymedesigner for (agent) @no
definition: Relaterer en agent til et uttrykk som inkluderer et bidrag fra en agent i form av å designe kostymene for en produksjon med levende bilder eller en musikalsk eller dramatisk forestilling eller form for underholdning. @no
alternative label: kostymedesigner for @no
label: is kostuumontwerper-actor van @nl
definition: Relateert een actor aan een expressie die omvat een bijdrage door een actor door ontwerpen van kostuums voor een bewegend beeld-productie of voor een muzikale of dramatische presentatie of vermaak. @nl
toolkit label: kostuumontwerper-actor van @nl
toolkit definition: Een expressie die omvat een bijdrage door een actor door ontwerpen van kostuums voor een bewegend beeld-productie of voor een muzikale of dramatische presentatie of vermaak. @nl
label: هو وكيل مصمم أزياء لـ @ar
definition: يربط وكيلا بتعبيرة تتضمن إسهام وكيل في تصميم أزياء لإنتاج فيلم؛ أو لعرض موسيقي أو درامي أو ترفيهي. @ar
alternative label: مصمم أزياء @ar
toolkit label: وكيل مصمم أزياء @ar
toolkit definition: تعبيرة تتضمن إسهام وكيل في تصميم أزياء تصميم أزياء لإنتاج فيلم؛ أو لعرض موسيقي أو درامي أو ترفيهي. @ar
alternative label: dissenyador de vestuari de @ca
alternative label: kostumedesigner af @da
label: kostüümikunstnik (tegija) väljenduses @et
definition: Seostab tegija väljendusega, millesse tegija on andnud panuse, kujundades kostüüme filmi tootmise, muusika- või draamaetenduse või meelelahutusürituse jaoks. @et
alternative label: kostüümikunstnik väljenduses @et
toolkit label: kostüümikunstnik (tegija) väljenduses @et
toolkit definition: Väljendus, millesse tegija on andnud panuse, kujundades kostüüme filmi tootmise, muusika- või draamaetenduse või meelelahutusürituse jaoks. @et
alternative label: jelmeztervezője: @hu
label: è costumista agente di @it
definition: Correla un agente a un'espressione che include un contributo da parte di un agente nella progettazione di costumi per una produzione di immagini in movimento o per una presentazione o spettacolo musicale o drammatico. @it
scope note: anche tradurre un contenuto linguistico tra forme della stessa lingua di periodi di tempo diversi. @it
alternative label: costumista di @it
toolkit label: costumista agente di @it
toolkit definition: Espressione che include un contributo da parte di un agente nella progettazione di costumi per una produzione di immagini in movimento o per una presentazione o spettacolo musicale o drammatico. @it
alternative label: ενδυματολόγος του @el
alternative label: créateur de costumes de @fr
label: ir kostīmu mākslinieks (aģents) @lv
definition: Sasaista aģentu ar izteiksmi, kas ietver aģenta ieguldījumu, izstrādājot tērpu dizainu filmai, muzikālam vai dramatiskam uzvedumam, vai sarīkojumam. @lv
toolkit label: ir kostīmu mākslinieks (aģents) @lv
toolkit definition: Izteiksme, kas ietver aģenta ieguldījumu, izstrādājot tērpu dizainu filmai, muzikālam vai dramatiskam uzvedumam, vai sarīkojumam. @lv
alternative label: Kostümbildner von @de
alternative label: ……的服装设计者 @zh-hans
toolkit label: ……的服装设计者行为者 @zh-hans
toolkit definition: 包括为动态图像制作或者为音乐或戏剧呈现或娱乐设计服装的一个行为者的贡献的一种内容表达 @zh-hans
toolkit label: kostüm tasarımcısı temsilcisi @tr
toolkit definition: Hareketli bir görüntü prodüksiyonu veya müzikal ya da dramatik bir sunum veya eğlence için kostüm tasarlayan bir temsilcinin katkısını içeren bir anlatım. @tr

puvustaja (yhteistoimija) ekspressiossa
status: Published
label: is costume designer collective agent of @en
lexical alias: costumeDesignerCollectiveAgentOf.en
definition: Relates a collective agent to an expression that includes a contribution by a collective agent of designing costumes for a moving image production or for a musical or dramatic presentation or entertainment. @en
toolkit label: costume designer collective agent of @en
toolkit definition: An expression that includes a contribution by a collective agent of designing costumes for a moving image production or for a musical or dramatic presentation or entertainment. @en
type: Property
domain: C10011
has element type: 2
sub property of: esitykseen osallinen yhteistoimija ekspressiossa
sub property of: puvustaja (toimija) ekspressiossa
definition: Liittää yhteistoimijan ekspressioon, jonka tekemisessä yhteistoimija on osallisena suunnittelemalla elokuvatuotannon tai musiikki- tai näytelmäesityksen puvustuksen.
toolkit label: puvustaja (yhteistoimija) ekspressiossa
toolkit definition: Ekspressio, jonka tekemisessä yhteistoimija on osallisena suunnittelemalla elokuvatuotannon tai musiikki- tai näytelmäesityksen puvustuksen.
label: er kostymedesigner for (kollektiv agent) @no
definition: Relaterer en kollektiv agent til et uttrykk som inkluderer et bidrag fra en kollektiv agent i form av å utforme kostymene for en produksjon med levende bilder eller en musikalsk eller dramatisk forestilling eller form for underholdning. @no
toolkit label: kostymedesigner for (kollektiv agent) @no
toolkit definition: Et uttrykk som inkluderer et bidrag fra en kollektiv agent i form av å utforme kostymene for en produksjon med levende bilder eller en musikalsk eller dramatisk forestilling eller form for underholdning. @no
label: is kostuumontwerper-collectieve actor van @nl
definition: Relateert een collectieve actor aan een expressie die omvat een bijdrage door een collectieve actor door ontwerpen van kostuums voor een bewegend beeld-productie of voor een muzikale of dramatische presentatie of vermaak. @nl
toolkit label: kostuumontwerper-collectieve actor van @nl
toolkit definition: Een expressie die omvat een bijdrage door een collectieve actor door ontwerpen van kostuums voor een bewegend beeld-productie of voor een muzikale of dramatische presentatie of vermaak. @nl
label: هو وكيل جماعي قائد فرقة عزف لـ @ar
definition: تعبيرة تتضمن إسهام وكيل جماعي بوضع مكياج أومكياج ترقيعي في إنتاج صور متحركة أو في عرض موسيقي أو درامي أو ترفيهي. @ar
toolkit label: هو وكيل جماعي قائد فرقة عزف لـ @ar
toolkit definition: تعبيرة تتضمن إسهام وكيل جماعي بوضع مكياج أومكياج ترقيعي في إنتاج صور متحركة أو في عرض موسيقي أو درامي أو ترفيهي. @ar
label: és agent col·lectiu dissenyador de vestuari de @ca
definition: Relaciona un agent amb una expressió que inclou una contribució d’un agent col·lectiu amb el disseny del vestuari en el cas d’una producció d’imatge en moviment o una representació o un espectacle musical o dramàtic. @ca
toolkit label: agent col·lectiu dissenyador de vestuari de @ca
toolkit definition: Expressió que inclou una contribució d’un agent col·lectiu amb el disseny del vestuari en el cas d’una producció d’imatge en moviment o una representació o un espectacle musical o dramàtic. @ca
label: er kollektiv agent, som er kostumedesigner af @da
definition: Relaterer en kollektiv agent til et udtryk, som omfatter en kollektiv agents bidrag ved at designe kostumer til en levende billedproduktion eller til en musikalsk eller dramatisk præsentation eller underholdning. @da
toolkit label: kollektiv agent, som er kostumedesigner af @da
toolkit definition: Udtryk, som omfatter en kollektiv agents bidrag ved at designe kostumer til en levende billedproduktion eller til en musikalsk eller dramatisk præsentation eller underholdning. @da
label: kostüümikunstnik (kollektiiv) väljenduses @et
definition: Seostab kollektiivi väljendusega, millesse kollektiiv on andnud panuse, kujundades kostüüme filmi tootmise, muusika- või draamaetenduse või meelelahutusürituse jaoks. @et
toolkit label: kostüümikunstnik (kollektiiv) väljenduses @et
toolkit definition: Väljendus, millesse kollektiiv on andnud panuse, kujundades kostüüme filmi tootmise, muusika- või draamaetenduse või meelelahutusürituse jaoks. @et
label: ist gemeinschaftlicher Akteur als Kostümbildnerin/Kostümbildner von @de
definition: Setzt einen gemeinschaftlichen Akteur in Beziehung zu einer Expression, zu der ein gemeinschaftlicher Akteur beiträgt, indem er die Kostüme für eine Bewegtbildproduktion oder für eine musikalische oder dramatische Darbietung oder Aufführung entwirft. @de
toolkit label: Gemeinschaftlicher Akteur als Kostümbildnerin/Kostümbildner von @de
toolkit definition: Eine Expression, zu der ein gemeinschaftlicher Akteur beiträgt, indem er die Kostüme für eine Bewegtbildproduktion oder für eine musikalische oder dramatische Darbietung oder Aufführung entwirft. @de
label: jelmeztervező kollektív ágense a következőnek: @hu
definition: Hozzákapcsol egy kollektív ágenst egy kifejezési formához, amely magában foglalja egy kollektív ágens közreműködését jelmezek tervezésében mozgókép-produkciókhoz, zenei vagy drámai előadásokhoz vagy szórakoztató műsorokhoz. @hu
toolkit label: jelmeztervező kollektív ágense: @hu
toolkit definition: Egy kifejezési forma, amely magában foglalja egy kollektív ágens közreműködését jelmezek tervezésében mozgókép-produkciókhoz, zenei vagy drámai előadásokhoz vagy szórakoztató műsorokhoz. @hu
label: è costumista agente collettivo di @it
definition: Correla un agente collettivo a un'espressione che comprende un contributo di un agente collettivo nella progettazione di costumi per una produzione di immagini in movimento o per una presentazione o spettacolo musicale o drammatico. @it
toolkit label: costumista agente collettivo di @it
toolkit definition: Espressione che comprende un contributo di un agente collettivo nella progettazione di costumi per una produzione di immagini in movimento o per una presentazione o spettacolo musicale o drammatico. @it
label: είναι ενδυματολόγος συλλογικός φορέας του @el
toolkit label: ενδυματολόγος συλλογικός φορέας του @el
label: est un agent collectif concepteur de costumes de @fr
definition: Met un agent collectif en relation avec une expression qui intègre une contribution de la part d’un agent collectif consistant à concevoir des costumes pour une production d’images animées ou bien pour une présentation ou un spectacle musical ou dramatique. @fr
toolkit label: agent collectif concepteur de costumes de @fr
toolkit definition: Expression qui intègre une contribution de la part d’un agent collectif consistant à concevoir des costumes pour une production d’images animées ou bien pour une présentation ou un spectacle musical ou dramatique. @fr
label: ir kostīmu mākslinieks (grupa) @lv
definition: Sasaista grupu ar izteiksmi, kas ietver grupas ieguldījumu, izstrādājot tērpu dizainu filmai, muzikālam vai dramatiskam uzvedumam, vai sarīkojumam. @lv
toolkit label: ir kostīmu mākslinieks (grupa) @lv
toolkit definition: Izteiksme, kas ietver grupas ieguldījumu, izstrādājot tērpu dizainu filmai, muzikālam vai dramatiskam uzvedumam, vai sarīkojumam. @lv
label: 是……的服装设计者集体行为者 @zh-hans
definition: 将一个集体行为者与包括为动态图像制作或者为音乐或戏剧呈现或娱乐设计服装的一个集体行为者的贡献的一种内容表达关联起来。 @zh-hans
toolkit label: ……的服装设计者集体行为者 @zh-hans
toolkit definition: 包括为动态图像制作或者为音乐或戏剧呈现或娱乐设计服装的一个集体行为者的贡献的一种内容表达 @zh-hans
label: kostüm tasarımcısı kolektif temsilcidir @tr
definition: Kolektif bir temsilciyi, hareketli bir görüntü üretimi veya müzikal veya dramatik bir sunum veya eğlence için kostüm tasarlamaya yönelik kolektif bir temsilcinin katkısını içeren bir anlatımla ilişkilendirir. @tr
toolkit label: kostüm tasarımcısı kolektif temsilci @tr
toolkit definition: Hareketli bir görüntü üretimi ya da müzikal ya da dramatik bir sunum ya da eğlence için kostüm tasarlanmasında kolektif bir temsilcinin katkısını içeren bir anlatım. @tr
has subproperty: puvustaja (yhteisö) ekspressiossa
has subproperty: puvustaja (suku) ekspressiossa
has subproperty: P50733

puvustaja (yhteisö) ekspressiossa
status: Published
label: is costume designer corporate body of @en
lexical alias: costumeDesignerCorporateBodyOf.en
definition: Relates a corporate body to an expression that includes a contribution by a corporate body of designing costumes for a moving image production or for a musical or dramatic presentation or entertainment. @en
toolkit label: costume designer corporate body of @en
toolkit definition: An expression that includes a contribution by a corporate body of designing costumes for a moving image production or for a musical or dramatic presentation or entertainment. @en
type: Property
domain: C10005
has element type: 2
sub property of: esitykseen osallinen yhteisö ekspressiossa
sub property of: puvustaja (yhteistoimija) ekspressiossa
definition: Liittää yhteisön ekspressioon, jonka tekemisessä yhteisö on osallisena suunnittelemalla elokuvatuotannon tai musiikki- tai näytelmäesityksen puvustuksen.
toolkit label: puvustaja (yhteisö) ekspressiossa
toolkit definition: Ekspressio, jonka tekemisessä yhteisö on osallisena suunnittelemalla elokuvatuotannon tai musiikki- tai näytelmäesityksen puvustuksen.
label: er kostymedesigner for (korporasjon) @no
definition: Relaterer en korporasjon til et uttrykk som inkluderer et bidrag fra en korporasjon i form av å utforme kostymene for en produksjon med levende bilder eller en musikalsk eller dramatisk forestilling eller form for underholdning. @no
toolkit label: kostymedesigner for (korporasjon) @no
toolkit definition: Et uttrykk som inkluderer et bidrag fra en korporasjon i form av å utforme kostymene for en produksjon med levende bilder eller en musikalsk eller dramatisk forestilling eller form for underholdning. @no
label: is kostuumontwerper-corporatie van @nl
definition: Relateert een corporatie aan een expressie die omvat een bijdrage door een corporatie door ontwerpen van kostuums voor een bewegend beeld-productie of voor een muzikale of dramatische presentatie of vermaak. @nl
toolkit label: kostuumontwerper-corporatie van @nl
toolkit definition: Een expressie die omvat een bijdrage door een corporatie door ontwerpen van kostuums voor een bewegend beeld-productie of voor een muzikale of dramatische presentatie of vermaak. @nl
label: هي هيئة مصممة أزياء لـ @ar
definition: يربط هيئة بتعبيرة تتضمن إسهام هيئة في تصميم أزياء لإنتاج فيلم؛ أو لعرض موسيقي أو درامي أو ترفيهي. @ar
toolkit label: هيئة مصممة أزياء @ar
toolkit definition: تعبيرة تتضمن إسهام هيئة في تصميم أزياء لإنتاج فيلم؛ أو لعرض موسيقي أو درامي أو ترفيهي. @ar
label: és entitat corporativa dissenyadora de vestuari de @ca
definition: Relaciona una entitat corporativa amb una expressió que inclou una contribució d’una entitat corporativa amb el disseny del vestuari en el cas d’una producció d’imatge en moviment o una representació o un espectacle musical o dramàtic. @ca
toolkit label: entitat corporativa dissenyadora de vestuari de @ca
toolkit definition: Expressió que inclou una contribució d’una entitat corporativa amb el disseny del vestuari en el cas d’una producció d’imatge en moviment o una representació o un espectacle musical o dramàtic. @ca
label: er korporation, som er kostumedesigner af @da
definition: Relaterer en korporation til et udtryk, som omfatter en korporations bidrag ved at designe kostumer til en levende billedproduktion eller til en musikalsk eller dramatisk præsentation eller underholdning. @da
toolkit label: korporation, som er kostumedesigner af @da
toolkit definition: Udtryk, som omfatter en korporations bidrag ved at designe kostumer til en levende billedproduktion eller til en musikalsk eller dramatisk præsentation eller underholdning. @da
label: kostüümikunstnik (asutus) väljenduses @et
definition: Seostab asutuse väljendusega, millesse asutus on andnud panuse, kujundades kostüüme filmi tootmise, muusika- või draamaetenduse või meelelahutusürituse jaoks. @et
toolkit label: kostüümikunstnik (asutus) väljenduses @et
toolkit definition: Väljendus, millesse asutus on andnud panuse, kujundades kostüüme filmi tootmise, muusika- või draamaetenduse või meelelahutusürituse jaoks. @et
label: ist Körperschaft als Kostümbildnerin/Kostümbildner von @de
definition: Setzt eine Körperschaft in Beziehung zu einer Expression, zu der eine Körperschaft beiträgt, indem sie die Kostüme für eine Bewegtbildproduktion oder für eine musikalische oder dramatische Darbietung oder Aufführung entwirft. @de
toolkit label: Körperschaft als Kostümbildnerin/Kostümbildner von @de
toolkit definition: Eine Expression, zu der eine Körperschaft beiträgt, indem sie die Kostüme für eine Bewegtbildproduktion oder für eine musikalische oder dramatische Darbietung oder Aufführung entwirft. @de
label: jelmeztervező testülete a következőnek: @hu
definition: Hozzákapcsol egy testületet egy kifejezési formához, amely magában foglalja egy testület közreműködését jelmezek tervezésében mozgókép-produkciókhoz, zenei vagy drámai előadásokhoz vagy szórakoztató műsorokhoz. @hu
toolkit label: vizuális effektusokat szolgáltató testülete a következőnek: @hu
toolkit definition: Egy kifejezési forma, amely magában foglalja egy testület közreműködését jelmezek tervezésében mozgókép-produkciókhoz, zenei vagy drámai előadásokhoz vagy szórakoztató műsorokhoz. @hu
label: è costumista ente di @it
definition: Correla un ente a un'espressione che comprende un contributo di un ente nella progettazione di costumi per una produzione di immagini in movimento o per una presentazione o spettacolo musicale o drammatico. @it
toolkit label: costumista ente di @it
toolkit definition: Espressione che comprende un contributo di un ente nella progettazione di costumi per una produzione di immagini in movimento o per una presentazione o spettacolo musicale o drammatico. @it
label: είναι ενδυματολόγος συλλογικό όργανο του @el
toolkit label: ενδυματολόγος συλλογικό όργανο του @el
label: est une collectivité conceptrice de costumes de @fr
definition: Met une collectivité en relation avec une expression qui intègre une contribution de la part d’une collectivité consistant à concevoir des costumes pour une production d’images animées ou bien pour une présentation ou un spectacle musical ou dramatique. @fr
toolkit label: collectivité conceptrice de costumes de @fr
toolkit definition: Expression qui intègre une contribution de la part d’une collectivité consistant à concevoir des costumes pour une production d’images animées ou bien pour une présentation ou un spectacle musical ou dramatique. @fr
label: ir kostīmu mākslinieks (institūcija) @lv
definition: Sasaista institūciju ar izteiksmi, kas ietver institūcijas ieguldījumu, izstrādājot tērpu dizainu filmai, muzikālam vai dramatiskam uzvedumam, vai sarīkojumam. @lv
toolkit label: ir kostīmu mākslinieks (institūcija) @lv
toolkit definition: Izteiksme, kas ietver institūcijas ieguldījumu, izstrādājot tērpu dizainu filmai, muzikālam vai dramatiskam uzvedumam, vai sarīkojumam. @lv
label: 是……的服装设计者团体 @zh-hans
definition: 将一个团体与包括为动态图像制作或者为音乐或戏剧呈现或娱乐设计服装的一个团体的贡献的一种内容表达关联起来。 @zh-hans
toolkit label: ……的服装设计者团体 @zh-hans
toolkit definition: 包括为动态图像制作或者为音乐或戏剧呈现或娱乐设计服装的一个团体的贡献的一种内容表达 @zh-hans
label: kostüm tasarımcısı tüzel kişisidir @tr
definition: Bir tüzel kişiyi, hareketli bir görüntü üretimi veya müzikal veya dramatik bir sunum veya eğlence için kostüm tasarlamaya yönelik bir tüzel kişinin katkısını içeren bir anlatımla ilişkilendirir. @tr
toolkit label: kostüm tasarımcısı tüzel kişisi @tr
toolkit definition: Hareketli bir görüntü üretimi veya müzikal veya dramatik bir sunum veya eğlence için kostüm tasarlayan tüzel bir kişinin katkısını içeren bir anlatım. @tr
has subproperty: P50884

puvustaja (suku) ekspressiossa
status: Published
label: is costume designer family of @en
lexical alias: costumeDesignerFamilyOf.en
definition: Relates a family to an expression that includes a contribution by a family of designing costumes for a moving image production or for a musical or dramatic presentation or entertainment. @en
toolkit label: costume designer family of @en
toolkit definition: An expression that includes a contribution by a family of designing costumes for a moving image production or for a musical or dramatic presentation or entertainment. @en
type: Property
domain: C10008
has element type: 2
sub property of: esitykseen osallinen suku ekspressiossa
sub property of: puvustaja (yhteistoimija) ekspressiossa
definition: Liittää suvun ekspressioon, jonka tekemisessä suku on osallisena suunnittelemalla elokuvatuotannon tai musiikki- tai näytelmäesityksen puvustuksen.
toolkit label: puvustaja (suku) ekspressiossa
toolkit definition: Ekspressio, jonka tekemisessä suku on osallisena suunnittelemalla elokuvatuotannon tai musiikki- tai näytelmäesityksen puvustuksen.
label: er kostymedesigner for (familie) @no
definition: Relaterer en familie til et uttrykk som inkluderer et bidrag fra en familie i form av å utforme kostymene for en produksjon med levende bilder eller en musikalsk eller dramatisk forestilling eller form for underholdning. @no
toolkit label: kostymedesigner for (familie) @no
toolkit definition: Et uttrykk som inkluderer et bidrag fra en familie i form av å utforme kostymene for en produksjon med levende bilder eller en musikalsk eller dramatisk forestilling eller form for underholdning. @no
label: is kostuumontwerper-familie van @nl
definition: Relateert een familie aan een expressie die omvat een bijdrage door een familie door ontwerpen van kostuums voor een bewegend beeld-productie of voor een muzikale of dramatische presentatie of vermaak. @nl
toolkit label: kostuumontwerper-familie van @nl
toolkit definition: Een expressie die omvat een bijdrage door een familie door ontwerpen van kostuums voor een bewegend beeld-productie of voor een muzikale of dramatische presentatie of vermaak. @nl
label: هي عائلة مسئولة عن تصميم الأزياء لـ @ar
definition: يربط عائلة بتعبيرة تتضمن إسهام عائلة في تصميم أزياء لإنتاج فيلم؛ أو لعرض موسيقي أو درامي أو ترفيهي. @ar
toolkit label: عائلة مسئولة عن تصميم الأزياء @ar
toolkit definition: تعبيرة تتضمن إسهام عائلة في تصميم أزياء لإنتاج فيلم؛ أو لعرض موسيقي أو درامي أو ترفيهي. @ar
label: és família dissenyadora de vestuari de @ca
definition: Relaciona una família amb una expressió que inclou una contribució d’una família amb el disseny del vestuari en el cas d’una producció d’imatge en moviment o una representació o un espectacle musical o dramàtic. @ca
toolkit label: família dissenyadora de vestuari de @ca
toolkit definition: Expressió que inclou una contribució d’una família amb el disseny del vestuari en el cas d’una producció d’imatge en moviment o una representació o un espectacle musical o dramàtic. @ca
label: er familie, som er kostumedesigner af @da
definition: Relaterer en familie til et udtryk, som omfatter en families bidrag ved at designe kostumer til en levende billedproduktion eller til en musikalsk eller dramatisk præsentation eller underholdning. @da
toolkit label: familie, som er kostumedesigner af @da
toolkit definition: Udtryk, som omfatter en families bidrag ved at designe kostumer til en levende billedproduktion eller til en musikalsk eller dramatisk præsentation eller underholdning. @da
label: kostüümikunstnik (perekond) väljenduses @et
definition: Seostab perekonna väljendusega, millesse perekond on andnud panuse, kujundades kostüüme filmi tootmise, muusika- või draamaetenduse või meelelahutusürituse jaoks. @et
toolkit label: kostüümikunstnik (perekond) väljenduses @et
toolkit definition: Väljendus, millesse perekond on andnud panuse, kujundades kostüüme filmi tootmise, muusika- või draamaetenduse või meelelahutusürituse jaoks. @et
label: ist Familie als Kostümbildnerin/Kostümbildner von @de
definition: Setzt eine Familie in Beziehung zu einer Expression, zu der eine Familie beiträgt, indem sie die Kostüme für eine Bewegtbildproduktion oder für eine musikalische oder dramatische Darbietung oder Aufführung entwirft. @de
toolkit label: Familie als Kostümbildnerin/Kostümbildner von @de
toolkit definition: Eine Expression, zu der eine Familie beiträgt, indem sie die Kostüme für eine Bewegtbildproduktion oder für eine musikalische oder dramatische Darbietung oder Aufführung entwirft. @de
label: jelmeztervező családja a következőnek: @hu
definition: Hozzákapcsol egy családot egy kifejezési formához, amely magában foglalja egy család közreműködését jelmezek tervezésében mozgókép-produkciókhoz, zenei vagy drámai előadásokhoz vagy szórakoztató műsorokhoz. @hu
toolkit label: jelmeztervező családja: @hu
toolkit definition: Egy kifejezési forma, amely magában foglalja egy család közreműködését jelmezek tervezésében mozgókép-produkciókhoz, zenei vagy drámai előadásokhoz vagy szórakoztató műsorokhoz. @hu
label: è costumista famiglia di @it
definition: Correla una famiglia a un'espressione che comprende un contributo di una famiglia nella progettazione di costumi per una produzione di immagini in movimento o per una presentazione o spettacolo musicale o drammatico. @it
toolkit label: costumista famiglia di @it
toolkit definition: Espressione che comprende un contributo di una famiglia nella progettazione di costumi per una produzione di immagini in movimento o per una presentazione o spettacolo musicale o drammatico. @it
label: είναι ενδυματολόγος οικογένεια του @el
toolkit label: ενδυματολόγος οικογένεια του @el
label: est une famille conceptrice de costumes de @fr
definition: Met une famille en relation avec une expression qui intègre une contribution de la part d’une famille consistant à concevoir des costumes pour une production d’images animées ou bien pour une présentation ou un spectacle musical ou dramatique. @fr
toolkit label: famille conceptrice de costumes de @fr
toolkit definition: Expression qui intègre une contribution de la part d’une famille consistant à concevoir des costumes pour une production d’images animées ou bien pour une présentation ou un spectacle musical ou dramatique. @fr
label: ir kostīmu mākslinieks (dzimta/ģimene) @lv
definition: Sasaista dzimtu/ģimeni ar izteiksmi, kas ietver dzimtas/ģimenes ieguldījumu, izstrādājot tērpu dizainu filmai, muzikālam vai dramatiskam uzvedumam, vai sarīkojumam. @lv
toolkit label: ir kostīmu mākslinieks (dzimta/ģimene) @lv
toolkit definition: Izteiksme, kas ietver dzimtas/ģimenes ieguldījumu, izstrādājot tērpu dizainu filmai, muzikālam vai dramatiskam uzvedumam, vai sarīkojumam. @lv
label: 是……的服装设计者家族 @zh-hans
definition: 将一个家族与包括为动态图像制作或者为音乐或戏剧呈现或娱乐设计服装的一个家族的贡献的一种内容表达关联起来。 @zh-hans
toolkit label: ……的服装设计者家族 @zh-hans
toolkit definition: 包括为动态图像制作或者为音乐或戏剧呈现或娱乐设计服装的一个家族的贡献的一种内容表达 @zh-hans
label: kostüm tasarımcısı ailesidir @tr
definition: Bir aileyi, hareketli bir görüntü prodüksiyonu veya müzikal ya da dramatik bir sunum veya eğlence için kostüm tasarlama katkısını içeren bir anlatımla ilişkilendirir. @tr
toolkit label: kostüm tasarımcısı ailesi @tr
toolkit definition: Hareketli bir görüntü prodüksiyonu veya müzikal ya da dramatik bir sunum veya eğlence için kostüm tasarlayan bir ailenin katkısını içeren bir anlatım. @tr
has subproperty: P51035

puvustaja (henkilö) ekspressiossa
status: Published
label: is costume designer person of @en
lexical alias: costumeDesignerPersonOf.en
definition: Relates a person to an expression that includes a contribution by a person of designing costumes for a moving image production or for a musical or dramatic presentation or entertainment. @en
toolkit label: costume designer person of @en
toolkit definition: An expression that includes a contribution by a person of designing costumes for a moving image production or for a musical or dramatic presentation or entertainment. @en
type: Property
domain: C10004
has element type: 2
sub property of: esitykseen osallinen henkilö ekspressiossa
sub property of: puvustaja (toimija) ekspressiossa
definition: Liittää henkilön ekspressioon, jonka tekemisessä henkilö on osallisena suunnittelemalla elokuvatuotannon tai musiikki- tai näytelmäesityksen puvustuksen.
toolkit label: puvustaja (henkilö) ekspressiossa
toolkit definition: Ekspressio, jonka tekemisessä henkilö on osallisena suunnittelemalla elokuvatuotannon tai musiikki- tai näytelmäesityksen puvustuksen.
label: er kostymedesigner for (person) @no
definition: Relaterer en person til et uttrykk som inkluderer et bidrag fra en person i form av å utforme kostymene for en produksjon med levende bilder eller en musikalsk eller dramatisk forestilling eller form for underholdning. @no
toolkit label: kostymedesigner for (person) @no
toolkit definition: Et uttrykk som inkluderer et bidrag fra en person i form av å utforme kostymene for en produksjon med levende bilder eller en musikalsk eller dramatisk forestilling eller form for underholdning. @no
label: is kostuumontwerper-persoon van @nl
definition: Relateert een persoon aan een expressie die omvat een bijdrage door een persoon door ontwerpen van kostuums voor een bewegend beeld-productie of voor een muzikale of dramatische presentatie of vermaak. @nl
toolkit label: kostuumontwerper-persoon van @nl
toolkit definition: Een expressie die omvat een bijdrage door een persoon door ontwerpen van kostuums voor een bewegend beeld-productie of voor een muzikale of dramatische presentatie of vermaak. @nl
label: هو شخص مصمم أزياء لـ @ar
definition: يربط شخصا بتعبيرة تتضمن إسهام شخص في تصميم أزياء لإنتاج فيلم؛ أو لعرض موسيقي أو درامي أو ترفيهي. @ar
toolkit label: شخص مصمم أزياء @ar
toolkit definition: تعبيرة تتضمن إسهام شخص لتصميم الأزياء في تصميم أزياء لإنتاج فيلم؛ أو لعرض موسيقي أو درامي أو ترفيهي. @ar
label: és persona dissenyadora de vestuari de @ca
definition: Relaciona una persona amb una expressió que inclou una contribució d’una persona amb el disseny del vestuari en el cas d’una producció d’imatge en moviment o una representació o un espectacle musical o dramàtic. @ca
toolkit label: persona dissenyadora de vestuari de @ca
toolkit definition: Expressió que inclou una contribució d’una persona amb el disseny del vestuari en el cas d’una producció d’imatge en moviment o una representació o un espectacle musical o dramàtic. @ca
label: er person, som er kostumedesigner af @da
definition: Relaterer en person til et udtryk, som omfatter en persons bidrag ved at designe kostumer til en levende billedproduktion eller til en musikalsk eller dramatisk præsentation eller underholdning. @da
toolkit label: person, som er kostumedesigner af @da
toolkit definition: Udtryk, som omfatter en persons bidrag ved at designe kostumer til en levende billedproduktion eller til en musikalsk eller dramatisk præsentation eller underholdning. @da
label: kostüümikunstnik (isik) väljenduses @et
definition: Seostab isiku väljendusega, millesse isik on andnud panuse, kujundades kostüüme filmi tootmise, muusika- või draamaetenduse või meelelahutusürituse jaoks. @et
toolkit label: kostüümikunstnik (isik) väljenduses @et
toolkit definition: Väljendus, millesse isik on andnud panuse, kujundades kostüüme filmi tootmise, muusika- või draamaetenduse või meelelahutusürituse jaoks. @et
label: ist Person als Kostümbildnerin/Kostümbildner von @de
definition: Setzt eine Person in Beziehung zu einer Expression, zu der eine Person beiträgt, indem sie die Kostüme für eine Bewegtbildproduktion oder für eine musikalische oder dramatische Darbietung oder Aufführung entwirft. @de
toolkit label: Person als Kostümbildnerin/Kostümbildner von @de
toolkit definition: Eine Expression, zu der eine Person beiträgt, indem sie die Kostüme für eine Bewegtbildproduktion oder für eine musikalische oder dramatische Darbietung oder Aufführung entwirft. @de
label: jelmeztervező személye a következőnek: @hu
definition: Hozzákapcsol egy személyt egy kifejezési formához, amely magában foglalja egy személy közreműködését jelmezek tervezésében mozgókép-produkciókhoz, zenei vagy drámai előadásokhoz vagy szórakoztató műsorokhoz. @hu
toolkit label: jelmeztervező személye: @hu
toolkit definition: Egy kifejezési forma, amely magában foglalja egy személy közreműködését jelmezek tervezésében mozgókép-produkciókhoz, zenei vagy drámai előadásokhoz vagy szórakoztató műsorokhoz. @hu
label: è costumista persona di @it
definition: Correla una persona a un'espressione che comprende un contributo di una persona nella progettazione di costumi per una produzione di immagini in movimento o per una presentazione o spettacolo musicale o drammatico. @it
toolkit label: costumista persona di @it
toolkit definition: Espressione che comprende un contributo di una persona nella progettazione di costumi per una produzione di immagini in movimento o per una presentazione o spettacolo musicale o drammatico. @it
label: είναι ενδυματολόγος φυσικό πρόσωπο του @el
toolkit label: ενδυματολόγος φυσικό πρόσωπο του @el
label: est une personne conceptrice de costumes de @fr
definition: Met une personne en relation avec une expression qui intègre une contribution de la part d’une personne consistant à concevoir des costumes pour une production d’images animées ou bien pour une présentation ou un spectacle musical ou dramatique. @fr
toolkit label: personne conceptrice de costumes de @fr
toolkit definition: Expression qui intègre une contribution de la part d’une personne consistant à concevoir des costumes pour une production d’images animées ou bien pour une présentation ou un spectacle musical ou dramatique. @fr
label: ir kostīmu mākslinieks (persona) @lv
definition: Sasaista personu ar izteiksmi, kas ietver personas ieguldījumu, izstrādājot tērpu dizainu filmai, muzikālam vai dramatiskam uzvedumam, vai sarīkojumam. @lv
toolkit label: ir kostīmu mākslinieks (persona) @lv
toolkit definition: Izteiksme, kas ietver personas ieguldījumu, izstrādājot tērpu dizainu filmai, muzikālam vai dramatiskam uzvedumam, vai sarīkojumam. @lv
label: 是……的服装设计者个人 @zh-hans
definition: 将一个个人与包括为动态图像制作或者为音乐或戏剧呈现或娱乐设计服装的一个个人的贡献的一种内容表达关联起来。 @zh-hans
toolkit label: ……的服装设计者个人 @zh-hans
toolkit definition: 包括为动态图像制作或者为音乐或戏剧呈现或娱乐设计服装的一个个人的贡献的一种内容表达 @zh-hans
label: kostüm tasarımcısı kişisidir @tr
definition: Bir kişiyi, hareketli bir görüntü prodüksiyonu veya müzikal ya da dramatik bir sunum veya gösteri için kostüm tasarlayan bir kişinin katkısını içeren bir anlatımla ilişkilendirir. @tr
toolkit label: kostüm tasarımcısı @tr
toolkit definition: Hareketli bir görüntü prodüksiyonu veya müzikal ya da dramatik bir sunum veya eğlence için kostüm tasarlayan bir kişinin katkısını içeren bir anlatım. @tr
has subproperty: P50582

tuomioistuimen kirjuri (toimija) ekspressiossa
status: Published
label: is court reporter agent of @en
definition: Relates an agent to an expression that includes a contribution by an agent of preparing the opinions of a court for publication. @en
type: Property
domain: C10002
lexical alias: courtReporterAgentOf.en
label: est un agent rapporteur judiciaire de @fr
definition: Met un agent en relation avec une expression qui intègre une contribution de la part d’un agent consistant à préparer une opinion d’un tribunal aux fins de publication. @fr
toolkit label: agent rapporteur judiciaire de @fr
toolkit definition: Expression qui intègre une contribution de la part d’un agent consistant à préparer une opinion d’un tribunal aux fins de publication. @fr
toolkit label: court reporter agent of @en
toolkit definition: An expression that includes a contribution by an agent of preparing an opinion of a court for publication. @en
instruction number: 18.5
label: είναι στενογράφος φορέας του @el
definition: Συνδέει έναν φορέα, ο οποίος συνεισφέρει σε μια έκφραση ενός έργου προετοιμάζοντας τις δικαστικές αποφάσεις προς δημοσίευση, με μια έκφραση. . @el
toolkit label: στενογράφος φορέας του @el
toolkit definition: Μια έκφραση ενός έργου που ενσωματώνει τη συνεισφορά της προετοιμασίας των δικαστικών αποφάσεων προς δημοσίευση. @el
definition: Setzt einen Akteur in Beziehung zu einer Expression, zu der ein Akteur beiträgt, indem er die Urteilsbegründung zur Veröffentlichung vorbereitet. @de
toolkit label: Akteur als Gerichtsstenografin/Gerichtsstenograf von @de
toolkit definition: Eine Expression, zu der ein Akteur beiträgt, indem er die Urteilsbegründung zur Veröffentlichung vorbereitet. @de
label: er agent, som er retsstenograf af @da
definition: Relaterer en agent til et udtryk, som omfatter en agents bidrag ved at klargøre en domstols afgørelser til publicering. @da
toolkit label: agent, som er retsstenograf af @da
toolkit definition: Udtryk, som omfatter en agents bidrag ved at klargøre en domstols afgørelser til publicering. @da
label: és agent relator d’un tribunal de @ca
definition: Relaciona un agent amb una expressió que inclou una contribució d’un agent preparant una opinió d’un tribunal per a la seva publicació. @ca
toolkit label: agent relator d’un tribunal de @ca
toolkit definition: Expressió que inclou una contribució d’un agent preparant una opinió d’un tribunal per a la seva publicació. @ca
definition: Liittää toimijan ekspressioon, jonka tekemiseen toimija osallistuu valmistelemalla tuomioistuimen lausunnon julkaistavaksi.
toolkit label: tuomioistuimen kirjuri (toimija) ekspressiossa
toolkit definition: Ekspressio, jonka tekemiseen toimija osallistuu valmistelemalla tuomioistuimen lausunnon julkaistavaksi.
toolkit label: protokollfører for (agent) @no
toolkit definition: Et uttrykk som inkluderer et bidrag fra en agent i form av å klargjøre en domstols kjennelser for utgivelse. @no
label: ist Akteur als Gerichtsstenografin/Gerichtsstenograf von @de
sub property of: yhdistymään osallinen toimija ekspressiossa
has element type: 2
label: bírósági jegyzőkönyvvezető ágense a következőnek: @hu
definition: Hozzákapcsol egy ágenst egy kifejezési formához, amely magában foglalja egy ágens közreműködését egy bíróság ítéleteinek közlésre való előkészítésében. @hu
toolkit label: bírósági jegyzőkönyvvezető ágense: @hu
toolkit definition: Egy kifejezési forma, amely magában foglalja egy ágens közreműködését egy bíróság ítéleteinek közlésre való előkészítésében. @hu
alternative label: court reporter of @en
alternative label: kirjurina oikeudenkäyntiasiakirjoissa
label: er protokollfører for (agent) @no
definition: Relaterer en agent til et uttrykk som inkluderer et bidrag fra en agent i form av å klargjøre en domstols kjennelser for utgivelse. @no
alternative label: protokollfører for @no
label: is rechtbankverslaggever-actor van @nl
definition: Relateert een actor aan een expressie die omvat een bijdrage door een actor door voorbereiden van een oordeel van een rechtbank voor publicatie. @nl
toolkit label: rechtbankverslaggever-actor van @nl
toolkit definition: Een expressie die omvat een bijdrage door een actor door voorbereiden van een oordeel van een rechtbank voor publicatie. @nl
label: هو وكيل كاتب محكمة لـ @ar
definition: يربط وكيلا بتعبيرة تتضمن إسهام وكيل في إعداد رأي محكمة للنشر. @ar
alternative label: كاتب محكمة @ar
toolkit label: وكيل كاتب محكمة @ar
toolkit definition: تعبيرة تتضمن إسهام وكيل في إعداد رأي محكمة للنشر. @ar
alternative label: relator d’un tribunal de @ca
alternative label: retsstenograf af @da
label: kohtureporter (tegija) väljenduses @et
definition: Seostab tegija väljendusega, millesse tegija on andnud panuse, valmistades avaldamiseks ette kohtu seisukohad. @et
alternative label: kohtureporter väljenduses @et
toolkit label: kohtureporter (tegija) väljenduses @et
toolkit definition: Väljendus, millesse tegija on andnud panuse, valmistades avaldamiseks ette kohtu seisukohad. @et
alternative label: bírósági jegyzőkönyvvezetője: @hu
label: è stenografo del tribunale agente di @it
definition: Correla un agente a un'espressione che include un contributo da parte di un agente nel preparare il parere di tribunale per la pubblicazione. @it
alternative label: stenografo del tribunale di @it
toolkit label: stenografo del tribunale agente di @it
toolkit definition: Espressione che include un contributo da parte di un agente nel preparare il parere di tribunale per la pubblicazione. @it
alternative label: στενογράφος του @el
alternative label: rapporteur judiciaire de @fr
label: ir tiesas sekretārs (aģents) @lv
definition: Sasaista aģentu ar izteiksmi, kas ietver aģenta ieguldījumu, sagatavojot tiesas atzinumu publicēšanai. @lv
toolkit label: ir tiesas sekretārs (aģents) @lv
toolkit definition: Izteiksme, kas ietver aģenta ieguldījumu, sagatavojot tiesas atzinumu publicēšanai. @lv
alternative label: Gerichtsstenograf von @de
alternative label: ……的法院书记官 @zh-hans
toolkit label: ……的法院书记官行为者 @zh-hans
toolkit definition: 包括准备用于公布的法院意见的一个行为者的贡献的一种内容表达 @zh-hans
toolkit label: yazman temsilcisi @tr
toolkit definition: Bir mahkemenin yayınlamak üzere görüşünü hazırlayan bir temsilcinin katkısını içeren bir anlatım. @tr
has subproperty: tuomioistuimen kirjuri (yhteistoimija) ekspressiossa

tuomioistuimen kirjuri (yhteistoimija) ekspressiossa
status: Published
label: is court reporter collective agent of @en
lexical alias: courtReporterCollectiveAgentOf.en
definition: Relates a collective agent to an expression that includes a contribution by a collective agent of preparing the opinions of a court for publication. @en
toolkit label: court reporter collective agent of @en
toolkit definition: An expression that includes a contribution by a collective agent of preparing an opinion of a court for publication. @en
type: Property
domain: C10011
has element type: 2
sub property of: yhdistymään osallinen yhteistoimija ekspressiossa
sub property of: tuomioistuimen kirjuri (toimija) ekspressiossa
definition: Liittää yhteistoimijan ekspressioon, jonka tekemisessä yhteistoimija on osallisena valmistelemalla tuomioistuimen lausunnon julkaistavaksi.
toolkit label: tuomioistuimen kirjuri (yhteistoimija) ekspressiossa
toolkit definition: Ekspressio, jonka tekemisessä yhteistoimija on osallisena valmistelemalla tuomioistuimen lausunnon julkaistavaksi.
label: er protokollfører for (kollektiv agent) @no
definition: Relaterer en kollektiv agent til et uttrykk som inkluderer et bidrag fra en kollektiv agent i form av å klargjøre en domstols kjennelser for utgivelse. @no
toolkit label: protokollfører for (kollektiv agent) @no
toolkit definition: Et uttrykk som inkluderer et bidrag fra en kollektiv agent i form av å klargjøre en domstols kjennelser for utgivelse. @no
label: is rechtbankverslaggever-collectieve actor van @nl
definition: Relateert een collectieve actor aan een expressie die omvat een bijdrage door een collectieve actor door voorbereiden van een oordeel van een rechtbank voor publicatie. @nl
toolkit label: rechtbankverslaggever-collectieve actor van @nl
toolkit definition: Een expressie die omvat een bijdrage door een collectieve actor door voorbereiden van een oordeel van een rechtbank voor publicatie. @nl
label: هو وكيل جماعي كاتب محكمة لـ @ar
definition: يربط وكيلا جماعيا بتعبيرة تتضمن إسهام وكيل جماعي في إعداد رأي محكمة للنشر. @ar
toolkit label: وكيل جماعي كاتب محكمة @ar
toolkit definition: تعبيرة تتضمن إسهام وكيل جماعي في إعداد رأي محكمة للنشر. @ar
label: és agent col·lectiu relator d’un tribunal de @ca
definition: Relaciona un agent col·lectiu amb una expressió que inclou una contribució d’un agent col·lectiu preparant una opinió d’un tribunal per a la seva publicació. @ca
toolkit label: agent col·lectiu relator d’un tribunal de @ca
toolkit definition: Expressió que inclou una contribució d’un agent col·lectiu preparant una opinió d’un tribunal per a la seva publicació. @ca
label: er kollektiv agent, som er retsstenograf af @da
definition: Relaterer en kollektiv agent til et udtryk, som omfatter en kollektiv agents bidrag ved at klargøre en domstols afgørelser til publicering. @da
toolkit label: kollektiv agent, som er retsstenograf af @da
toolkit definition: Udtryk, som omfatter en kollektiv agents bidrag ved at klargøre en domstols afgørelser til publicering. @da
label: kohtureporter (kollektiiv) väljenduses @et
definition: Seostab kollektiivi väljendusega, millesse kollektiiv on andnud panuse, valmistades avaldamiseks ette kohtu seisukohad. @et
toolkit label: kohtureporter (kollektiiv) väljenduses @et
toolkit definition: Väljendus, millesse kollektiiv on andnud panuse, valmistades avaldamiseks ette kohtu seisukohad. @et
label: ist gemeinschaftlicher Akteur als Gerichtsstenografin/Gerichtsstenograf von @de
definition: Setzt einen gemeinschaftlichen Akteur in Beziehung zu einer Expression, zu der ein gemeinschaftlicher Akteur beiträgt, indem er die Urteilsbegründung zur Veröffentlichung vorbereitet. @de
toolkit label: Gemeinschaftlicher Akteur als Gerichtsstenografin/Gerichtsstenograf von @de
toolkit definition: Eine Expression, zu der ein gemeinschaftlicher Akteur beiträgt, indem er die Urteilsbegründung zur Veröffentlichung vorbereitet. @de
label: bírósági jegyzőkönyvvezető kollektív ágense a következőnek: @hu
definition: Hozzákapcsol egy kollektív ágenst egy kifejezési formához, amely magában foglalja egy kollektív ágens közreműködését egy bíróság ítéleteinek közlésre való előkészítésében. @hu
toolkit label: bírósági jegyzőkönyvvezető kollektív ágense: @hu
toolkit definition: Egy kifejezési forma, amely magában foglalja egy kollektív ágens közreműködését egy bíróság ítéleteinek közlésre való előkészítésében. @hu
label: è stenografo del tribunale agente collettivo di @it
definition: Correla un agente collettivo a un'espressione che comprende un contributo di un agente collettivo nella preparazione di un giudizio di un tribunale per la pubblicazione. @it
toolkit label: stenografo del tribunale agente collettivo di @it
toolkit definition: Espressione che comprende un contributo di un agente collettivo nella preparazione di un giudizio di un tribunale per la pubblicazione. @it
label: είναι στενογράφος συλλογικός φορέας του @el
toolkit label: στενογράφος συλλογικός φορέας του @el
label: est un agent collectif rapporteur judiciaire de @fr
definition: Met un agent collectif en relation avec une expression qui intègre une contribution de la part d’un agent collectif consistant à préparer une opinion d’un tribunal aux fins de publication. @fr
toolkit label: agent collectif rapporteur judiciaire de @fr
toolkit definition: Expression qui intègre une contribution de la part d’un agent collectif consistant à préparer une opinion d’un tribunal aux fins de publication. @fr
label: ir tiesas sekretārs (grupa) @lv
definition: Sasaista grupu ar izteiksmi, kas ietver grupas ieguldījumu, sagatavojot tiesas atzinumu publicēšanai. @lv
toolkit label: ir tiesas sekretārs (grupa) @lv
toolkit definition: Izteiksme, kas ietver grupas ieguldījumu, sagatavojot tiesas atzinumu publicēšanai. @lv
label: 是……的法院书记官集体行为者 @zh-hans
definition: 将一个集体行为者与包括准备用于公布的法院意见的一个集体行为者的贡献的一种内容表达关联起来。 @zh-hans
toolkit label: ……的法院书记官集体行为者 @zh-hans
toolkit definition: 包括准备用于公布的法院意见的一个集体行为者的贡献的一种内容表达 @zh-hans
label: yazman temsilcisidir @tr
definition: Kolektif bir temsilciyi, bir mahkemenin yayınlanmak üzere görüşünü hazırlayan bir kolektif temsilcinin katkısını içeren bir anlatım ile ilişkilendirir. @tr
toolkit label: yazman kolektif temsilcisi @tr
toolkit definition: Bir mahkemenin yayınlanmak üzere görüşünü hazırlayan kolektif bir temsilcinin katkısını içeren bir anlatım. @tr
has subproperty: tuomioistuimen kirjuri (yhteisö) ekspressiossa
has subproperty: tuomioistuimen kirjuri (suku) ekspressiossa
has subproperty: P50756

tuomioistuimen kirjuri (yhteisö) ekspressiossa
status: Published
label: is court reporter corporate body of @en
lexical alias: courtReporterCorporateBodyOf.en
definition: Relates a corporate body to an expression that includes a contribution by a corporate body of preparing the opinions of a court for publication. @en
toolkit label: court reporter corporate body of @en
toolkit definition: An expression that includes a contribution by a corporate body of preparing an opinion of a court for publication. @en
type: Property
domain: C10005
has element type: 2
sub property of: yhdistymään osallinen yhteisö ekspressiossa
sub property of: tuomioistuimen kirjuri (yhteistoimija) ekspressiossa
definition: Liittää yhteisön ekspressioon, jonka tekemisessä yhteisö on osallisena valmistelemalla tuomioistuimen lausunnon julkaistavaksi.
toolkit label: tuomioistuimen kirjuri (yhteisö) ekspressiossa
toolkit definition: Ekspressio, jonka tekemisessä yhteisö on osallisena valmistelemalla tuomioistuimen lausunnon julkaistavaksi.
label: er protokollfører for (korporasjon) @no
definition: Relaterer en korporasjon til et uttrykk som inkluderer et bidrag fra en korporasjon i form av å klargjøre en domstols kjennelser for utgivelse. @no
toolkit label: protokollfører for (korporasjon) @no
toolkit definition: Et uttrykk som inkluderer et bidrag fra en korporasjon i form av å klargjøre en domstols kjennelser for utgivelse. @no
label: is rechtbankverslaggever-corporatie van @nl
definition: Relateert een corporatie aan een expressie die omvat een bijdrage door een corporatie door voorbereiden van een oordeel van een rechtbank voor publicatie. @nl
toolkit label: rechtbankverslaggever-corporatie van @nl
toolkit definition: Een expressie die omvat een bijdrage door een corporatie door voorbereiden van een oordeel van een rechtbank voor publicatie. @nl
label: هي هيئة مسئولة عن الكتابة للمحكمة لـ @ar
definition: يربط هيئة بتعبيرة تتضمن إسهام هيئة في إعداد رأي محكمة للنشر. @ar
toolkit label: هيئة مسئولة عن الكتابة للمحكمة @ar
toolkit definition: تعبيرة تتضمن إسهام هيئة في إعداد رأي محكمة للنشر. @ar
label: és entitat corporativa relatora d’un tribunal de @ca
definition: Relaciona una entitat corporativa amb una expressió que inclou una contribució d’una entitat corporativa preparant una opinió d’un tribunal per a la seva publicació. @ca
toolkit label: entitat corporativa relatora d’un tribunal de @ca
toolkit definition: Expressió que inclou una contribució d’una entitat corporativa preparant una opinió d’un tribunal per a la seva publicació. @ca
label: er korporation, som er retsstenograf af @da
definition: Relaterer en korporation til et udtryk, som omfatter en korporations bidrag ved at klargøre en domstols afgørelser til publicering. @da
toolkit label: korporation, som er retsstenograf af @da
toolkit definition: Udtryk, som omfatter en korporations bidrag ved at klargøre en domstols afgørelser til publicering. @da
label: kohtureporter (asutus) väljenduses @et
definition: Seostab asutuse väljendusega, millesse asutus on andnud panuse, valmistades avaldamiseks ette kohtu seisukohad. @et
toolkit label: kohtureporter (asutus) väljenduses @et
toolkit definition: Väljendus, millesse asutus on andnud panuse, valmistades avaldamiseks ette kohtu seisukohad. @et
label: ist Körperschaft als Gerichtsstenografin/Gerichtsstenograf von @de
definition: Setzt eine Körperschaft in Beziehung zu einer Expression, zu der eine Körperschaft beiträgt, indem sie die Urteilsbegründung zur Veröffentlichung vorbereitet. @de
toolkit label: Körperschaft als Gerichtsstenografin/Gerichtsstenograf von @de
toolkit definition: Eine Expression, zu der eine Körperschaft beiträgt, indem sie die Urteilsbegründung zur Veröffentlichung vorbereitet. @de
label: bírósági jegyzőkönyvvezető testülete a következőnek: @hu
definition: Hozzákapcsol egy testületet egy kifejezési formához, amely magában foglalja egy testület közreműködését egy bíróság ítéleteinek közlésre való előkészítésében. @hu
toolkit label: bírósági jegyzőkönyvvezető testülete: @hu
toolkit definition: Egy kifejezési forma, amely magában foglalja egy testület közreműködését egy bíróság ítéleteinek közlésre való előkészítésében. @hu
label: è stenografo del tribunale ente di @it
definition: Correla un ente a un'espressione che comprende un contributo di un ente nella preparazione di un giudizio di un tribunale per la pubblicazione. @it
toolkit label: stenografo del tribunale ente di @it
toolkit definition: Espressione che comprende un contributo di un ente nella preparazione di un giudizio di un tribunale per la pubblicazione. @it
label: είναι στενογράφος συλλογικό όργανο του @el
toolkit label: στενογράφος συλλογικό όργανο του @el
label: est une collectivité rapporteuse judiciaire de @fr
definition: Met une collectivité en relation avec une expression qui intègre une contribution de la part d’une collectivité consistant à préparer une opinion d’un tribunal aux fins de publication. @fr
toolkit label: collectivité rapporteuse judiciaire de @fr
toolkit definition: Expression qui intègre une contribution de la part d’une collectivité consistant à préparer une opinion d’un tribunal aux fins de publication. @fr
label: ir tiesas sekretārs (institūcija) @lv
definition: Sasaista institūciju ar izteiksmi, kas ietver institūcijas ieguldījumu, sagatavojot tiesas atzinumu publicēšanai. @lv
toolkit label: ir tiesas sekretārs (institūcija) @lv
toolkit definition: Izteiksme, kas ietver institūcijas ieguldījumu, sagatavojot tiesas atzinumu publicēšanai. @lv
label: 是……的法院书记官团体 @zh-hans
definition: 将一个团体与包括准备用于公布的法院意见的一个团体的贡献的一种内容表达关联起来。 @zh-hans
toolkit label: ……的法院书记官团体 @zh-hans
toolkit definition: 包括准备用于公布的法院意见的一个团体的贡献的一种内容表达 @zh-hans
label: yazman tüzel kişisidir @tr
definition: Bir tüzel kişiyi, bir mahkeme görüşünün yayınlanmak üzere hazırlanmasına tüzel kişinin yaptığı katkıyı içeren bir anlatımla ilişkilendirir. @tr
toolkit label: yazman tüzel kişisi @tr
toolkit definition: Bir mahkeme görüşünün yayınlanmak üzere hazırlanmasına tüzel bir kişinin katkısını içeren bir anlatım. @tr
has subproperty: P50907

tuomioistuimen kirjuri (suku) ekspressiossa
status: Published
label: is court reporter family of @en
lexical alias: courtReporterFamilyOf.en
definition: Relates a family to an expression that includes a contribution by a family of preparing the opinions of a court for publication. @en
toolkit label: court reporter family of @en
toolkit definition: An expression that includes a contribution by a family of preparing an opinion of a court for publication. @en
type: Property
domain: C10008
has element type: 2
sub property of: yhdistymään osallinen suku ekspressiossa
sub property of: tuomioistuimen kirjuri (yhteistoimija) ekspressiossa
definition: Liittää suvun ekspressioon, jonka tekemisessä suku on osallisena valmistelemalla tuomioistuimen lausunnon julkaistavaksi.
toolkit label: tuomioistuimen kirjuri (suku) ekspressiossa
toolkit definition: Ekspressio, jonka tekemisessä suku on osallisena valmistelemalla tuomioistuimen lausunnon julkaistavaksi.
label: er protokollfører for (familie) @no
definition: Relaterer en familie til et uttrykk som inkluderer et bidrag fra en familie i form av å klargjøre en domstols kjennelser for utgivelse. @no
toolkit label: protokollfører for (familie) @no
toolkit definition: Et uttrykk som inkluderer et bidrag fra en familie i form av å klargjøre en domstols kjennelser for utgivelse. @no
label: is rechtbankverslaggever-familie van @nl
definition: Relateert een familie aan een expressie die omvat een bijdrage door een familie door voorbereiden van een oordeel van een rechtbank voor publicatie. @nl
toolkit label: rechtbankverslaggever-familie van @nl
toolkit definition: Een expressie die omvat een bijdrage door een familie door voorbereiden van een oordeel van een rechtbank voor publicatie. @nl
label: هي عائلة مسئولة عن الكتابة للمحكمة لـ @ar
definition: يربط عائلة بتعبيرة تتضمن إسهام عائلة في إعداد رأي محكمة للنشر. @ar
toolkit label: عائلة مسئولة عن الكتابة للمحكمة @ar
toolkit definition: تعبيرة تتضمن إسهام عائلة في إعداد رأي محكمة للنشر. @ar
label: és família relatora d’un tribunal de @ca
definition: Relaciona una família amb una expressió que inclou una contribució d’una família preparant una opinió d’un tribunal per a la seva publicació. @ca
toolkit label: família relatora d’un tribunal de @ca
toolkit definition: Expressió que inclou una contribució d’una família preparant una opinió d’un tribunal per a la seva publicació. @ca
label: er familie, som er retsstenograf af @da
definition: Relaterer en familie til et udtryk, som omfatter en families bidrag ved at klargøre en domstols afgørelser til publicering. @da
toolkit label: familie, som er retsstenograf af @da
toolkit definition: Udtryk, som omfatter en families bidrag ved at klargøre en domstols afgørelser til publicering. @da
label: kohtureporter (perekond) väljenduses @et
definition: Seostab perekonna väljendusega, millesse perekond on andnud panuse, valmistades avaldamiseks ette kohtu seisukohad. @et
toolkit label: kohtureporter (perekond) väljenduses @et
toolkit definition: Väljendus, millesse perekond on andnud panuse, valmistades avaldamiseks ette kohtu seisukohad. @et
label: ist Familie als Gerichtsstenografin/Gerichtsstenograf von @de
definition: Setzt eine Familie in Beziehung zu einer Expression, zu der eine Familie beiträgt, indem sie die Urteilsbegründung zur Veröffentlichung vorbereitet. @de
toolkit label: Familie als Gerichtsstenografin/Gerichtsstenograf von @de
toolkit definition: Eine Expression, zu der eine Familie beiträgt, indem sie die Urteilsbegründung zur Veröffentlichung vorbereitet. @de
label: bírósági jegyzőkönyvvezető családja a következőnek: @hu
definition: Hozzákapcsol egy családot egy kifejezési formához, amely magában foglalja egy család közreműködését egy bíróság ítéleteinek közlésre való előkészítésében. @hu
toolkit label: bírósági jegyzőkönyvvezető családja: @hu
toolkit definition: Egy kifejezési forma, amely magában foglalja egy család közreműködését egy bíróság ítéleteinek közlésre való előkészítésében. @hu
label: è stenografo del tribunale famiglia di @it
definition: Correla una famiglia a un'espressione che comprende un contributo di una famiglia nella preparazione di un giudizio di un tribunale per la pubblicazione. @it
toolkit label: stenografo del tribunale famiglia di @it
toolkit definition: Espressione che comprende un contributo di una famiglia nella preparazione di un giudizio di un tribunale per la pubblicazione. @it
label: είναι στενογράφος οικογένεια του @el
toolkit label: στενογράφος οικογένεια του @el
label: est une famille rapporteuse judiciaire de @fr
definition: Met une famille en relation avec une expression qui intègre une contribution de la part d’une famille consistant à préparer une opinion d’un tribunal aux fins de publication. @fr
toolkit label: famille rapporteuse judiciaire de @fr
toolkit definition: Expression qui intègre une contribution de la part d’une famille consistant à préparer une opinion d’un tribunal aux fins de publication. @fr
label: ir tiesas sekretārs (dzimta/ģimene) @lv
definition: Sasaista dzimtu/ģimeni ar izteiksmi, kas ietver dzimtas/ģimenes ieguldījumu, sagatavojot tiesas atzinumu publicēšanai. @lv
toolkit label: ir tiesas sekretārs (dzimta/ģimene) @lv
toolkit definition: Izteiksme, kas ietver dzimtas/ģimenes ieguldījumu, sagatavojot tiesas atzinumu publicēšanai. @lv
label: 是……的法院书记官家族 @zh-hans
definition: 将一个家族与包括准备用于公布的法院意见的一个家族的贡献的一种内容表达关联起来。 @zh-hans
toolkit label: ……的法院书记官家族 @zh-hans
toolkit definition: 包括准备用于公布的法院意见的一个家族的贡献的一种内容表达 @zh-hans
label: yazman ailesidir @tr
definition: Bir aileyi, bir mahkeme görüşünü yayınlanmak üzere hazırlamaya ailenin katkısını içeren bir anlatımla ilişkilendirir. @tr
toolkit label: yazman ailesi @tr
toolkit definition: Bir mahkemenin yayınlamak üzere görüşünü hazırlayan bir ailenin katkısını içeren bir anlatım. @tr
has subproperty: P51058

tuomioistuimen kirjuri (henkilö) ekspressiossa
status: Published
label: is court reporter person of @en
lexical alias: courtReporterPersonOf.en
definition: Relates a person to an expression that includes a contribution by a person of preparing the opinions of a court for publication. @en
toolkit label: court reporter person of @en
toolkit definition: An expression that includes a contribution by a person of preparing an opinion of a court for publication. @en
type: Property
domain: C10004
has element type: 2
sub property of: yhdistymään osallinen henkilö ekspressiossa
sub property of: tuomioistuimen kirjuri (toimija) ekspressiossa
definition: Liittää henkilön ekspressioon, jonka tekemisessä henkilö on osallisena valmistelemalla tuomioistuimen lausunnon julkaistavaksi.
toolkit label: tuomioistuimen kirjuri (henkilö) ekspressiossa
toolkit definition: Ekspressio, jonka tekemisessä henkilö on osallisena valmistelemalla tuomioistuimen lausunnon julkaistavaksi.
label: er protokollfører for (person) @no
definition: Relaterer en person til et uttrykk som inkluderer et bidrag fra en person i form av å klargjøre en domstols kjennelser for utgivelse. @no
toolkit label: protokollfører for (person) @no
toolkit definition: Et uttrykk som inkluderer et bidrag fra en person i form av å klargjøre en domstols kjennelser for utgivelse. @no
label: is rechtbankverslaggever-persoon van @nl
definition: Relateert een persoon aan een expressie die omvat een bijdrage door een persoon door voorbereiden van een oordeel van een rechtbank voor publicatie. @nl
toolkit label: rechtbankverslaggever-persoon van @nl
toolkit definition: Een expressie die omvat een bijdrage door een persoon door voorbereiden van een oordeel van een rechtbank voor publicatie. @nl
label: هو شخص كاتب محكمة لـ @ar
definition: يربط شخصا بتعبيرة تتضمن إسهام شخص في إعداد رأي محكمة للنشر. @ar
toolkit label: شخص كاتب محكمة @ar
toolkit definition: تعبيرة تتضمن إسهام شخص في إعداد رأي محكمة للنشر. @ar
label: és persona relatora d’un tribunal de @ca
definition: Relaciona una persona amb una expressió que inclou una contribució d’una persona preparant una opinió d’un tribunal per a la seva publicació. @ca
toolkit label: persona relatora d’un tribunal de @ca
toolkit definition: Expressió que inclou una contribució d’una persona preparant una opinió d’un tribunal per a la seva publicació. @ca
label: er person, som er retsstenograf af @da
definition: Relaterer en person til et udtryk, som omfatter en persons bidrag ved at klargøre en domstols afgørelser til publicering. @da
toolkit label: person, som er retsstenograf af @da
toolkit definition: Udtryk, som omfatter en persons bidrag ved at klargøre en domstols afgørelser til publicering. @da
label: kohtureporter (isik) väljenduses @et
definition: Seostab isiku väljendusega, millesse isik on andnud panuse, valmistades avaldamiseks ette kohtu seisukohad. @et
toolkit label: kohtureporter (isik) väljenduses @et
toolkit definition: Väljendus, millesse isik on andnud panuse, valmistades avaldamiseks ette kohtu seisukohad. @et
label: ist Person als Gerichtsstenografin/Gerichtsstenograf von @de
definition: Setzt eine Person in Beziehung zu einer Expression, zu der eine Person beiträgt, indem sie die Urteilsbegründung zur Veröffentlichung vorbereitet. @de
toolkit label: Person als Gerichtsstenografin/Gerichtsstenograf von @de
toolkit definition: Eine Expression, zu der eine Person beiträgt, indem sie die Urteilsbegründung zur Veröffentlichung vorbereitet. @de
label: bírósági jegyzőkönyvvezető személye a következőnek: @hu
definition: Hozzákapcsol egy személyt egy kifejezési formához, amely magában foglalja egy személy közreműködését egy bíróság ítéleteinek közlésre való előkészítésében. @hu
toolkit label: bírósági jegyzőkönyvvezető személye: @hu
toolkit definition: Egy kifejezési forma, amely magában foglalja egy személy közreműködését egy bíróság ítéleteinek közlésre való előkészítésében. @hu
label: è stenografo del tribunale persona di @it
definition: Correla una persona a un'espressione che comprende un contributo di una persona nella preparazione di un giudizio di un tribunale per la pubblicazione. @it
toolkit label: stenografo del tribunale persona di @it
toolkit definition: Espressione che comprende un contributo di una persona nella preparazione di un giudizio di un tribunale per la pubblicazione. @it
label: είναι στενογράφος φυσικό πρόσωπο του @el
toolkit label: στενογράφος φυσικό πρόσωπο του @el
label: est une personne rapporteuse judiciaire de @fr
definition: Met une personne en relation avec une expression qui intègre une contribution de la part d’une personne consistant à préparer une opinion d’un tribunal aux fins de publication. @fr
toolkit label: personne rapporteuse judiciaire de @fr
toolkit definition: Expression qui intègre une contribution de la part d’une personne consistant à préparer une opinion d’un tribunal aux fins de publication. @fr
label: ir tiesas sekretārs (persona) @lv
definition: Sasaista personu ar izteiksmi, kas ietver personas ieguldījumu, sagatavojot tiesas atzinumu publicēšanai. @lv
toolkit label: ir tiesas sekretārs (persona) @lv
toolkit definition: Izteiksme, kas ietver personas ieguldījumu, sagatavojot tiesas atzinumu publicēšanai. @lv
label: 是……的法院书记官个人 @zh-hans
definition: 将一个个人与包括准备用于公布的法院意见的一个个人的贡献的一种内容表达关联起来。 @zh-hans
toolkit label: ……的法院书记官个人 @zh-hans
toolkit definition: 包括准备用于公布的法院意见的一个个人的贡献的一种内容表达 @zh-hans
label: yazman kişisidir @tr
definition: Bir kişiyi, bir mahkeme görüşünü yayınlanmak üzere hazırlamaya bir kişinin katkısını içeren bir anlatımla ilişkilendirir. @tr
toolkit label: yazman @tr
toolkit definition: Bir mahkemenin yayınlamak üzere görüşünü hazırlayan bir kişinin katkısını içeren bir anlatım. @tr
has subproperty: P50605

ekspression tekijä (toimija) ekspressiossa
status: Published
label: is creator agent of expression of @en
definition: Relates an agent to an expression that involves a responsibility of an agent for creation or contribution. @en
type: Property
scope note: Editors, translators, arrangers of music, performers, etc., are included. @en
domain: C10002
lexical alias: creatorAgentOfExpressionOf.en
label: est un agent créateur d’une expression de @fr
definition: Met un agent en relation avec une expression qui comporte une responsabilité de la part d’un agent en ce qui concerne la création ou la contribution. @fr
scope note: Sont inclus les éditeurs intellectuels, les traducteurs, les arrangeurs de musique, les interprètes, etc. @fr
toolkit label: agent créateur d’une expression de @fr
toolkit definition: Expression qui comporte une responsabilité de la part d’un agent en ce qui concerne la création ou la contribution. @fr
toolkit label: creator agent of expression of @en
toolkit definition: An expression that involves a responsibility of an agent for creation or contribution. @en
sub property of: toimijaan liittyvä ekspressio
label: είναι δημιουργός φορέας της έκφρασης του @el
definition: Συνδέει έναν φορέα, ο οποίος συνεισφέρει σε μια έκφραση, με μια έκφραση. @el
scope note: Περιλαμβάνονται επιμελητές, μεταφραστές, διασκευαστές μουσικής, εκτελεστές κ.λπ. @el
toolkit label: δημιουργός φορέας της έκφρασης του @el
toolkit definition: Μια έκφραση που ενσωματώνει μια συνεισφορά. @el
definition: Setzt einen Akteur in Beziehung zu einer Expression, bei der ein Akteur für die Erstellung oder Mitwirkung verantwortlich ist. @de
scope note: Darunter fallen Herausgeberinnen/Herausgeber, Übersetzerinnen/Übersetzer, Musikarrangeurinnen/Musikarrangeure, Ausführende und so weiter. @de
toolkit label: Akteur als Mitwirkende/Mitwirkender von @de
toolkit definition: Eine Expression, bei der ein Akteur für die Erstellung oder Mitwirkung verantwortlich ist. @de
label: er agent, som er ophav til udtryk af @da
definition: Relaterer en agent til et udtryk, som involverer en agents ansvar for skabelse eller bidrag. @da
scope note: Redaktører, oversættere, musikarrangører, udøvere etc. er omfattet. @da
toolkit label: agent, som er ophav til udtryk af @da
toolkit definition: Udtryk, som involverer en agents ansvar for skabelse eller bidrag. @da
label: és agent creador d’una expressió de @ca
definition: Relaciona un agent amb una expressió que implica una responsabilitat d’un agent en la creació o la contribució. @ca
toolkit label: agent creador d’una expressió de @ca
toolkit definition: Expressió que implica una responsabilitat d’un agent en la creació o la contribució. @ca
definition: Liittää toimijan ekspressioon, jossa toimijan vastuulla on luoda ekspressio tai osallistua sen tekemiseen.
scope note: Ekspression tekijöihin kuuluvat toimittajat, kääntäjät, musiikin sovittajat, esittäjät tms.
toolkit label: ekspression tekijä (toimija) ekspressiossa
toolkit definition: Ekspressio, jossa toimijan vastuulla on luoda ekspressio tai osallistua sen tekemiseen.
toolkit label: skaper av uttrykk av (agent) @no
toolkit definition: Et uttrykk som involverer ansvar fra en agent for skapelse eller bidrag. @no
label: ist Akteur als Mitwirkende/Mitwirkender von @de
has element type: 2
label: létrehozó ágense a következő kifejezési formának: @hu
definition: Hozzákapcsol egy ágenst egy kifejezési formához, amelyhez hozzátartozik egy ágens felelőssége a létrehozásért vagy a közreműködésért. @hu
scope note: létrehozó ágense a következő kifejezési formának: @hu
toolkit label: Egy kifejezési forma, amelyhez hozzátartozik egy ágens felelőssége a létrehozásért vagy a közreműködésért. @hu
toolkit definition: létrehozója a következő kifejezési formának: @hu
alternative label: contributor of @en
alternative label: creator of expression of @en
label: er skaper av uttrykk av (agent) @no
definition: Relaterer en agent til et uttrykk som involverer ansvar fra en agent for skapelse eller bidrag. @no
scope note: Redaktører, oversettere, arrangører av musikk, utøvere, etc. er inkludert. @no
alternative label: bidragsyter til @no
alternative label: skaper av uttrykk av @no
label: is maker-actor van expressie van @nl
definition: Relateert een actor aan een expressie die met zich meebrengt een verantwoordelijkheid van een actor voor creatie of bijdrage. @nl
scope note: Redacteuren, vertalers, arrangeurs van muziek, uitvoerders etc. zijn inbegrepen. @nl
toolkit label: maker-actor van expressie van @nl
toolkit definition: Een expressie die met zich meebrengt een verantwoordelijkheid van een actor voor creatie of bijdrage. @nl
label: هو وكيل منشئ تعبيرة لـ @ar
definition: يربط وكيلا بتعبيرة تنطوي على مسئولية وكيل عن إنشاء تعبيرة أو الإسهام فيها. @ar
scope note: ويشمل ذلك المحررين، والمترجمين، وموزعي الموسيقي، وفناني الأداء، الخ. @ar
alternative label: منشئة لتعبيرة @ar
toolkit label: وكيل منشئ تعبيرة @ar
toolkit definition: تعبيرة تنطوي على مسئولية وكيل عن الإبداع أو الإسهام . @ar
scope note: Inclou editors literaris, traductors, arranjadors de música, intèrprets, etc. @ca
alternative label: ophav til udryk af @da
label: väljenduse looja (tegija) väljenduses @et
definition: Seostab tegija väljendusega, mis sisaldab tegija vastutust väljenduse loomise või sellesse antud panuse eest. @et
scope note: Hõlmab toimetajaid, tõlkijaid, muusika seadjaid, esitajaid jne. @et
alternative label: väljenduse looja väljenduses @et
alternative label: kaastööline väljenduses @et
toolkit label: väljenduse looja (tegija) väljenduses @et
toolkit definition: Väljendus, mis sisaldab tegija vastutust väljenduse loomise või sellesse antud panuse eest. @et
alternative label: Mitwirkender von @de
label: è creatore agente di espressione di @it
definition: Correla un agente a un'espressione che implica una responsabilità di un agente per la creazione o contributo. @it
scope note: Sono inclusi editori, traduttori, arrangiatori di musica, esecutori, etc. @it
alternative label: creatore di espressione di @it
toolkit label: creatore agebte di espressione di @it

manifestaation tekijä (toimija) manifestaatiossa
status: Published
label: is creator agent of manifestation of @en
lexical alias: creatorAgentOfManifestationOf.en
definition: Relates an agent to a manifestation that involves a responsibility of an agent for creation. @en
toolkit label: creator agent of manifestation of @en
toolkit definition: A manifestation that involves a responsibility of an agent for creation. @en
type: Property
domain: C10002
sub property of: toimijaan liittyvä manifestaatio
has element type: 2
alternative label: creator of manifestation of @en
definition: Liittää toimijan manifestaatioon, jonka luomisesta toimija on vastuussa.
alternative label: manifestaation tekijä manifestaatiossa
toolkit label: manifestaation tekijä (toimija) manifestaatiossa
toolkit definition: Manifestaatio, jonka luomisesta toimija on vastuussa.
label: er skaper av manifestasjon for (agent) @no
definition: Relaterer en agent til en manifestasjon som involverer ansvar for en agent i form av skapelse. @no
alternative label: skaper av manifestasjon for @no
toolkit label: skaper av manifestasjon for (agent) @no
toolkit definition: En manifestasjon som involverer ansvar for en agent i form av skapelse. @no
scope note: A creator of manifestation includes a manufacturer, producer, and publisher. @en
label: is maker-actor van manifestatie van @nl
definition: Relateert een actor aan een manifestatie die met zich meebrengt een verantwoordelijkheid van een actor voor creatie. @nl
toolkit label: maker-actor van manifestatie van @nl
toolkit definition: Een manifestatie die met zich meebrengt een verantwoordelijkheid van een actor voor creatie. @nl
label: هو وكيل منشئ لتجسيدة لـ @ar
definition: يربط وكيلا بتجسيدة تنطوي على مسئولية وكيل عن إنشاء عمل. @ar
alternative label: منشئ تجسيدة لـ @ar
toolkit label: وكيل منشئ تجسيدة لـ @ar
toolkit definition: تجسيدة تنطوي على مسئولية وكيل عن إنشاء عمل. @ar
label: és agent creador d’una manifestació de @ca
definition: Relaciona un agent amb una manifestació que implica una responsabilitat d’un agent en la creació. @ca
alternative label: creador d’una manifestació @ca
toolkit label: agent creador d’una manifestació de @ca
toolkit definition: Manifestació que implica una responsabilitat d’un agent en la creació. @ca
label: er agent, som er ophav til manifestation af @da
definition: Relaterer en agent til en manifestation, som involverer en agents ansvar for skabelse. @da
alternative label: ophav til manifestation af @da
toolkit label: agent, som er ophav til manifestation af @da
toolkit definition: Manifestation, som involverer en agents ansvar for skabelse. @da
label: kehastuse teostaja (tegija) kehastuses @et
definition: Seostab tegija kehastusega, mis sisaldab tegija vastutust kehastuse loomise eest. @et
alternative label: kehastuse teostaja kehastuses @et
toolkit label: kehastuse teostaja (tegija) kehastuses @et
toolkit definition: Kehastus, mis sisaldab tegija vastutust kehastuse loomise eest. @et
label: ist Akteur als Mitwirkende/Mitwirkender an einer Manifestation von @de
definition: Setzt einen Akteur in Beziehung zu einer Manifestation, bei der ein Akteur für die Erstellung verantwortlich ist. @de
toolkit label: Akteur als Mitwirkende/Mitwirkender an einer Manifestation von @de
toolkit definition: Eine Manifestation, bei der ein Akteur für die Erstellung verantwortlich ist. @de
label: létrehozó ágense a következő megjelenési formának: @hu
definition: Hozzákapcsol egy ágenst egy megjelenési formához, amelyhez hozzátartozik egy ágens felelőssége a létrehozásért. @hu
alternative label: létrehozója a következő megjelenési formának: @hu
toolkit label: létrehozó ágense a következő megjelenési formának: @hu
toolkit definition: Egy megjelenési forma, amelyhez hozzátartozik egy ágens felelőssége a létrehozásért. @hu
label: è creatore agente di manifestazione di @it
definition: Correla un agente a una manifestazione che implica una responsabilità di un agente per la creazione. @it
alternative label: creatore di manifestazione di @it
toolkit label: creatore agente di manifestazione di @it
toolkit definition: Manifestazione che implica una responsabilità di un agente per la creazione. @it
label: είναι δημιουργός φορέας της εκδήλωσης του @el
alternative label: δημιουργός της εκδήλωσης του @el
toolkit label: δημιουργός φορέας της εκδήλωσης του @el
label: est un agent créateur d’une manifestation de @fr
definition: Met un agent en relation avec une manifestation qui comporte une responsabilité de la part d’un agent en ce qui concerne la création. @fr
alternative label: créateur d’une manifestation de @fr
toolkit label: agent créateur d’une manifestation de @fr
toolkit definition: Manifestation qui comporte une responsabilité de la part d’un agent en ce qui concerne la création. @fr
scope note: Een maker van manifestatie omvat een vervaardiger, producent en uitgever. @nl
label: ir radītājs (aģents) manifestācijai @lv
definition: Sasaista aģentu ar manifestāciju, kas ietver aģenta atbildību par radīšanu. @lv
toolkit label: ir radītājs (aģents) manifestācijai @lv
toolkit definition: Manifestācija, kas ietver aģenta atbildību par radīšanu. @lv
scope note: Manifestācijas radītāji ir arī izplatītāji, ražotāji, izgatavotāji un izdevēji. @lv
scope note: Manifestaation tekijä sisältää jakelijan, valmistajan, tuottajan ja kustantajan.
scope note: قد يكون منشئ التجسيدة موزعا، أو صانعا، أو منتجا، أو ناشرا. @ar
scope note: Ophav til manifestation omfatter producent, producer og udgiver. @da
alternative label: Mitwirkende/Mitwirkender an einer Manifestation von @de
scope note: Darunter fallen Hersteller, Produzentinnen/Produzenten und Verlage. @de
scope note: Un creador d’una manifestació inclou un fabricant, un productor i un editor. @ca

teoksen tekijä (toimija) teoksessa
status: Published
label: is creator agent of work of @en
definition: Relates an agent to a work that involves a responsibility of an agent for creation. @en
type: Property
domain: C10002
lexical alias: creatorAgentOfWorkOf.en
label: est un agent créateur d’une œuvre de @fr
definition: Met un agent en relation avec une œuvre qui comporte une responsabilité de la part d’un agent en ce qui concerne la création. @fr
toolkit label: agent créateur d’une œuvre de @fr
toolkit definition: Œuvre qui comporte une responsabilité de la part d’un agent en ce qui concerne la création. @fr
toolkit label: creator agent of work of @en
toolkit definition: A work that involves a responsibility of an agent for creation. @en
sub property of: toimijaan liittyvä teos
label: είναι δημιουργός φορέας του έργου του @el
definition: Συνδέει έναν φορέα υπεύθυνο για τη δημιουργία ενός έργου, με ένα έργο. @el
toolkit label: δημιουργός φορέας του έργου του @el
toolkit definition: Ένα έργο που περιλαμβάνει την ευθύνη ενός φορέα για τη δημιουργία. @el
definition: Setzt einen Akteur in Beziehung zu einem Werk, bei dem ein Akteur für dessen Schaffung verantwortlich ist. @de
toolkit label: Akteur als geistige Schöpferin/geistiger Schöpfer eines Werks von @de
toolkit definition: Ein Werk, bei dem ein Akteur für dessen Schaffung verantwortlich ist. @de
label: er agent, som er ophav til værk af @da
definition: Relaterer en agent til et værk, som involverer en agents ansvar for skabelse. @da
toolkit label: agent, som er ophav til værk af @da
toolkit definition: Værk, som involverer en agents ansvar for skabelse. @da
label: és agent creador d’una obra de @ca
definition: Relaciona un agent amb una obra que implica una responsabilitat d’un agent en la creació. @ca
toolkit label: agent creador d’una obra de @ca
toolkit definition: Obra que implica una responsabilitat d’un agent en la creació. @ca
definition: Liittää toimijan teokseen, jonka luomisesta toimija on vastuussa.
toolkit label: teoksen tekijä (toimija) teoksessa
toolkit definition: Teos, jonka luomisesta toimija on vastuussa.
toolkit label: opphaver for verk for (agent) @no
toolkit definition: Et verk som involverer ansvar for en agent i form av skapelse. @no
label: ist Akteur als geistige Schöpferin/geistiger Schöpfer eines Werks von @de
has element type: 2
label: létrehozó ágense a következő műnek: @hu
definition: Hozzákapcsol egy ágenst egy műhöz, amelyhez hozzátartozik egy ágens felelőssége a létrehozásért. @hu
toolkit label: létrehozó ágense a következő műnek: @hu
toolkit definition: Egy mű, amelyhez hozzátartozik egy ágens felelőssége a létrehozásért. @hu
alternative label: creator of @en
alternative label: teoksen tekijänä teoksessa
label: er opphaver for verk for (agent) @no
definition: Relaterer en agent til et verk som involverer ansvar for en agent i form av skapelse. @no
alternative label: opphavsperson for verk for @no
label: is maker-actor van werk van @nl
definition: Relateert een actor aan een werk dat met zich meebrengt een verantwoordelijkheid van een actor voor creatie. @nl
toolkit label: maker-actor van werk van @nl
toolkit definition: Een werk dat met zich meebrengt een verantwoordelijkheid van een actor voor creatie. @nl
label: هو وكيل منشئ عمل @ar
definition: يربط وكيلا بعمل يترتب عليه مسئولية وكيل عن الإنشاء. @ar
alternative label: منشئ عمل @ar
toolkit label: وكيل منشئ عمل @ar
toolkit definition: عمل يترتب عليه مسئولية وكيل عن الإنشاء. @ar
alternative label: creador de @ca
alternative label: ophav til @da
label: teose autor (tegija) teoses @et
definition: Seostab tegija teosega, mis sisaldab tegija vastutust teose loomise eest. @et
alternative label: teose autor teoses @et
toolkit label: teose autor (tegija) teoses @et
toolkit definition: Teos, mis sisaldab tegija vastutust teose loomise eest. @et
alternative label: létrehozója: @hu
label: è creatore agente di @it
definition: Correla un agente a un'opera che implica una responsabilità di un agente per la creazione. @it
alternative label: creatore di opera di @it
toolkit label: creatore agente di opera di @it
toolkit definition: Opera che che implica una responsabilità di un agente per la creazione. @it
alternative label: δημιουργός του έργου του @el
alternative label: créateur de @fr
label: ir radītājs (aģents) darbam @lv
definition: Sasaista aģentu ar darbu, kas ietver aģenta atbildību par radīšanu. @lv
toolkit label: ir radītājs (aģents) darbam @lv
toolkit definition: Darbs, kas ietver aģenta atbildību par radīšanu. @lv
alternative label: Geistige Schöpferin/Geistiger Schöpfer von @de
alternative label: ……的创作者 @zh-hans
toolkit label: ……的作品的创作者行为者 @zh-hans
toolkit definition: 涉及创作的一个行为者的责任的一种作品 @zh-hans
toolkit label: eserin yaratıcı temsilcisi @tr
toolkit definition: Bir temsilcinin yaratım sorumluluğunu içeren bir eser. @tr
has subproperty: aggregaattori (toimija) teoksessa
has subproperty: arkkitehti (toimija) teoksessa

ekspression tekijä (yhteistoimija) ekspressiossa
status: Published
label: is creator collective agent of expression of @en
lexical alias: creatorCollectiveAgentOfExpressionOf.en
definition: Relates a collective agent to an expression that involves a responsibility of a collective agent for creation or contribution. @en
toolkit label: creator collective agent of expression of @en
toolkit definition: An expression that involves a responsibility of a collective agent for creation or contribution. @en
type: Property
domain: C10011
has element type: 2
sub property of: yhteistoimijaan liittyvä ekspressio
sub property of: ekspression tekijä (toimija) ekspressiossa
scope note: Editors, translators, arrangers of music, performers, etc., are included. @en
definition: Liittää yhteistoimijan ekspressioon, jossa yhteistoimijan vastuulla on luoda ekspressio tai osallistua sen tekemiseen.
scope note: Ekspression tekijöihin kuuluvat toimittajat, kääntäjät, musiikin sovittajat, esittäjät tms.
toolkit label: ekspression tekijä (yhteistoimija) ekspressiossa
toolkit definition: Ekspressio, jossa yhteistoimijan vastuulla on luoda ekspressio tai osallistua sen tekemiseen.
label: er skaper av uttrykk for (kollektiv agent) @no
definition: Relaterer en kollektiv agent til et uttrykk som involverer et ansvar for en kollektiv agent i form av skapelse eller bidrag. @no
scope note: Redaktører, oversettere, arrangører av musikk, utøvere etc. er inkludert. @no
toolkit label: skaper av uttrykk for (kollektiv agent) @no
toolkit definition: Et uttrykk som involverer et ansvar for en kollektiv agent i form av skapelse eller bidrag. @no
label: is maker-collectieve actor van expressie van @nl
definition: Relateert een collectieve actor aan een expressie die met zich meebrengt een verantwoordelijkheid van een collectieve actor voor creatie of bijdrage. @nl
scope note: Redacteuren, vertalers, arrangeurs van muziek, uitvoerders etc. zijn inbegrepen. @nl
toolkit label: maker-collectieve actor van expressie van @nl
toolkit definition: Een expressie die met zich meebrengt een verantwoordelijkheid van een collectieve actor voor creatie of bijdrage. @nl
label: هو وكيل جماعي منشئ تعبيرة لـ @ar
definition: يربط وكيلا جماعيا بتعبيرة تتضمن مسئولية وكيل جماعي في الإنشاء أو في المساهمة @ar
scope note: ويشمل ذلك المحررين، المترجمين، موزعي الموسيقى، فناني الأداء، الخ. @ar
toolkit label: وكيل جماعي منشئ تعبيرة @ar
toolkit definition: تعبيرة تنطوي على مسئولية وكيل جماعي عن الإنشاء أو الإسهام . @ar
label: és agent col·lectiu creador d’una expressió de @ca
definition: Relaciona un agent col·lectiu amb una expressió que implica una responsabilitat d’un agent en la creació o contribució. @ca
scope note: Inclou editors literaris, traductors, arranjadors de música, intèrprets, etc. @ca
toolkit label: agent col·lectiu creador d’una expressió de @ca
toolkit definition: Expressió que implica una responsabilitat d’un agent col·lectiu en la creació o contribució. @ca
label: er kollektiv agent, som er ophav til udtryk af @da
definition: Relaterer en kollektiv agent til et udtryk, som involverer en kollektiv agents ansvar for skabelse eller bidrag. @da
scope note: Redaktører, oversættere, musikarrangører, udøvere etc. er omfattet. @da
toolkit label: kollektiv agent, som er ophav til udtryk af @da
toolkit definition: Udtryk, som involverer en kollektiv agents ansvar for skabelse eller bidrag. @da
label: väljenduse looja (kollektiiv) väljenduses @et
definition: Seostab kollektiivi väljendusega, mis sisaldab kollektiivi vastutust väljenduse loomise või sellesse antud panuse eest. @et
scope note: Hõlmab toimetajaid, tõlkijaid, muusika seadjaid, esitajaid jne. @et
toolkit label: väljenduse looja (kollektiiv) väljenduses @et
toolkit definition: Väljendus, mis sisaldab kollektiivi vastutust väljenduse loomise või sellesse antud panuse eest. @et
label: ist gemeinschaftlicher Akteur als Mitwirkende/Mitwirkender von @de
definition: Setzt einen gemeinschaftlichen Akteur in Beziehung zu einer Expression, bei der ein gemeinschaftlicher Akteur für die Erstellung oder Mitwirkung verantwortlich ist. @de
scope note: Darunter fallen Herausgeberinnen/Herausgeber, Übersetzerinnen/Übersetzer, Musikarrangeurinnen/Musikarrangeure, Ausführende und so weiter. @de
toolkit label: Gemeinschaftlicher Akteur als Mitwirkende/Mitwirkender von @de
toolkit definition: Eine Expression, bei der ein gemeinschaftlicher Akteur für die Erstellung oder Mitwirkung verantwortlich ist. @de
label: létrehozó kollektív ágense a következő kifejezési formának: @hu
definition: Hozzákapcsol egy kollektív ágenst egy kifejezési formához, amelyhez hozzátartozik egy kollektív ágens felelőssége a létrehozásért vagy a közreműködésért. @hu
scope note: Szerkesztők, fordítók, hangszerelők, előadók stb. idetartoznak. @hu
toolkit label: létrehozó kollektív ágense a következő kifejezési formának: @hu
toolkit definition: Egy kifejezési forma, amelyhez hozzátartozik egy kollektív ágens felelőssége a létrehozásért vagy a közreműködésért. @hu
label: è creatore agente collettivo di espressione di @it
definition: Correla un agente collettivo a un'espressione che implica la responsabilità di un agente collettivo per la creazione o contributo. @it
scope note: Sono inclusi curatori, traduttori, arrangiatori musicali, artisti etc. @it
toolkit label: creatore agente collettivo di espressione di @it
toolkit definition: Espressione che implica la responsabilità di un agente collettivo per la creazione o contributo. @it
label: είναι δημιουργός συλλογικός φορέας της έκφρασης του @el
toolkit label: δημιουργός συλλογικός φορέας της έκφρασης του @el
label: est un agent collectif créateur d’une expression de @fr
definition: Met un agent collectif en relation avec une expression qui comporte une responsabilité de la part d’un agent collectif en ce qui concerne la création ou la contribution. @fr
scope note: Sont inclus les éditeurs intellectuels, les traducteurs, les arrangeurs de musique, les interprètes, etc. @fr
toolkit label: agent collectif créateur d’une expression de @fr
toolkit definition: Expression qui comporte une responsabilité de la part d’un agent collectif en ce qui concerne la création ou la contribution. @fr
label: ir radītājs (grupa) izteiksmei @lv
definition: Sasaista grupu ar izteiksmi, kas ietver grupas atbildību par radīšanu vai ieguldījumu. @lv
toolkit label: ir radītājs (grupa) izteiksmei @lv
toolkit definition: Izteiksme, kas ietver grupas atbildību par radīšanu vai ieguldījumu. @lv
scope note: Tai skaitā redaktori, tulki, mūzikas aranžētāji, izpildītāji u.tml. @lv
label: 是……的内容表达的创作者集体行为者 @zh-hans
definition: 将一个集体行为者与涉及创作或贡献的一个集体行为者的责任的一种内容表达关联起来。 @zh-hans
toolkit label: ……的内容表达的创作者集体行为者 @zh-hans
toolkit definition: 涉及创作或贡献的一个集体行为者的责任的一种内容表达 @zh-hans
scope note: 包括编者、译者、音乐改编者、表演者等 @zh-hans
label: anlatımının yaratıcı kolektif temsilcisidir @tr

manifestaation tekijä (yhteistoimija) manifestaatiossa
status: Published
label: is creator collective agent of manifestation of @en
lexical alias: creatorCollectiveAgentOfManifestationOf.en
definition: Relates a collective agent to a manifestation that involves a responsibility of a collective agent for creation. @en
toolkit label: creator collective agent of manifestation of @en
toolkit definition: A manifestation that involves a responsibility of a collective agent for creation. @en
type: Property
domain: C10011
has element type: 2
sub property of: yhteistoimijaan liittyvä manifestaatio
sub property of: manifestaation tekijä (toimija) manifestaatiossa
definition: Liittää yhteistoimijan manifestaatioon, jonka luomisesta yhteistoimija on vastuussa.
toolkit label: manifestaation tekijä (yhteistoimija) manifestaatiossa
toolkit definition: Manifestaatio, jonka luomisesta yhteistoimija on vastuussa.
label: er skaper av manifestasjon for (kollektiv agent) @no
definition: Relaterer en kollektiv agent til en manifestasjon som involverer et ansvar for en kollektiv agent i form av skapelse. @no
toolkit label: skaper av manifestasjon for (kollektiv agent) @no
toolkit definition: En manifestasjon som involverer et ansvar for en kollektiv agent i form av skapelse. @no
scope note: A creator of manifestation includes a manufacturer, producer, and publisher. @en
label: is maker-collectieve actor van manifestatie van @nl
definition: Relateert een collectieve actor aan een manifestatie die met zich meebrengt een verantwoordelijkheid van een collectieve actor voor creatie. @nl
toolkit label: maker-collectieve actor van manifestatie van @nl
toolkit definition: Een manifestatie die met zich meebrengt een verantwoordelijkheid van een collectieve actor voor creatie. @nl
label: هو وكيل جماعي منشئ تجسيدة لـ @ar
definition: يربط وكيلا جماعيا بتجسيدة تنطوي على مسئولية وكيل جماعي عن إنشائها. @ar
toolkit label: وكيل جماعي منشئ تجسيدة @ar
toolkit definition: تجسيدة تنطوي على مسئولية وكيل جماعي عن الإنشاء. @ar
label: és agent col·lectiu creador d’una manifestació de @ca
definition: Relaciona un agent col·lectiu amb una manifestació que implica una responsabilitat d’un agent col·lectiu en la creació. @ca
toolkit label: agent col·lectiu creador d’una manifestació de @ca
toolkit definition: Manifestació que implica una responsabilitat d’un agent col·lectiu en la creació. @ca
label: er kollektiv agent, som er ophav til manifestation af @da
definition: Relaterer en kollektiv agent til en manifestation, som involverer en kollektiv agents ansvar for skabelse. @da
toolkit label: kollektiv agent, som er ophav til manifestation af @da
toolkit definition: Manifestation, som involverer en kollektiv agents ansvar for skabelse. @da
label: kehastuse teostaja (kollektiiv) kehastuses @et
definition: Seostab kollektiivi kehastusega, mis sisaldab kollektiivi vastutust kehastuse loomise eest. @et
toolkit label: kehastuse teostaja (kollektiiv) kehastuses @et
toolkit definition: Kehastus, mis sisaldab kollektiivi vastutust kehastuse loomise eest. @et
label: ist gemeinschaftlicher Akteur als Mitwirkende/Mitwirkender an einer Manifestation von @de
definition: Setzt einen gemeinschaftlichen Akteur in Beziehung zu einem Werk, bei dem ein gemeinschaftlicher Akteur für die Choreografie verantwortlich ist. @de
toolkit label: Gemeinschaftlicher Akteur als Mitwirkende/Mitwirkender an einer Manifestation von @de
toolkit definition: Eine Manifestation, bei der ein gemeinschaftlicher Akteur für die Erstellung verantwortlich ist. @de
label: létrehozó kollektív ágense a következő megjelenési formának: @hu
definition: Hozzákapcsol egy kollektív ágenst egy megjelenési formához, amelyhez hozzátartozik egy kollektív ágens felelőssége a létrehozásért. @hu
toolkit label: létrehozó kollektív ágense a következő megjelenési formának: @hu
toolkit definition: Egy megjelenési forma, amelyhez hozzátartozik egy kollektív ágens felelőssége a létrehozásért. @hu
label: è creatore agente collettivo di manifestazione di @it
definition: Correla un agente collettivo a una manifestazione che implica una responsabilità di un agente collettivo per la creazione. @it
toolkit label: creatore agente collettivo di manifestazione di @it
toolkit definition: Manifestazione che implica una responsabilità di un agente collettivo per la creazione. @it
label: είναι δημιουργός συλλογικός φορέας της εκδήλωσης του @el
toolkit label: δημιουργός συλλογικός φορέας της εκδήλωσης του @el
label: est un agent collectif créateur d’une manifestation de @fr
definition: Met un agent collectif en relation avec une manifestation qui comporte une responsabilité de la part d’un agent collectif en ce qui concerne la création. @fr
toolkit label: agent collectif créateur d’une manifestation de @fr
toolkit definition: Manifestation qui comporte une responsabilité de la part d’un agent collectif en ce qui concerne la création. @fr
scope note: Een maker van manifestatie omvat een vervaardiger, producent en uitgever. @nl
label: ir radītājs (grupa) manifestācijai @lv
definition: Sasaista grupu ar manifestāciju, kas ietver grupas atbildību par radīšanu. @lv
toolkit label: ir radītājs (grupa) manifestācijai @lv
toolkit definition: Manifestācija, kas ietver grupas atbildību par radīšanu. @lv
scope note: Manifestācijas radītāji ir arī izplatītāji, ražotāji, izgatavotāji un izdevēji. @lv
scope note: Manifestaation tekijä sisältää jakelijan, valmistajan, tuottajan ja kustantajan.
scope note: يشتمل منشئ التجسيدة على الموزع، والصانع، والمنتج، والناشر. @ar
scope note: Darunter fallen Hersteller, Produzentinnen/Produzenten und Verlage. @de
scope note: Un creador d’una manifestació inclou un fabricant, un productor i un editor. @ca
scope note: Un créateur d’une manifestation comprend un fabricant, un producteur et un éditeur. @fr
label: 是……的载体表现的创建者集体行为者 @zh-hans
definition: 将一个集体行为者与涉及一个集体行为者的创作责任的一种载体表现关联起来。 @zh-hans
toolkit label: ……的载体表现的创建者集体行为者 @zh-hans
toolkit definition: 涉及一个集体行为者的创作责任的一种载体表现 @zh-hans
scope note: 载体表现的创建者包括生产者、制作者和出版者 @zh-hans
scope note: Egy megjelenési forma létrehozója magában foglalja a gyártót, az előállítót és a kiadót. @hu
label: gösteriminin yaratıcı kolektif temsilcisidir @tr
definition: Kolektif bir temsilciyi, kolektif bir temsilcinin yaratma sorumluluğunu içeren bir gösterimle ilişkilendirir. @tr
toolkit label: gösterimin yaratıcı kolektif temsilcisi @tr
toolkit definition: Yaratmak için kolektif bir temsilcinin sorumluluğunu içeren bir gösterim. @tr
scope note: Gösterimin yaratıcısı, bir üretimci, yapımcı ve yayıncıyı içerir. @tr

teoksen tekijä (yhteistoimija) teoksessa
status: Published
label: is creator collective agent of work of @en
lexical alias: creatorCollectiveAgentOfWorkOf.en
definition: Relates a collective agent to a work that involves a responsibility of a collective agent for creation. @en
toolkit label: creator collective agent of work of @en
toolkit definition: A work that involves a responsibility of a collective agent for creation. @en
type: Property
domain: C10011
has element type: 2
sub property of: yhteistoimijaan liittyvä teos
sub property of: teoksen tekijä (toimija) teoksessa
definition: Liittää yhteistoimijan teokseen, jonka luomisesta yhteistoimija on vastuussa.
toolkit label: teoksen tekijä (yhteistoimija) teoksessa
toolkit definition: Teos, jonka luomisesta yhteistoimija on vastuussa.
label: er skaper av verk for (kollektiv agent) @no
definition: Relaterer en kollektiv agent til et verk som involverer et ansvar for en kollektiv agent i form av skapelse. @no
toolkit label: skaper av verk for (kollektiv agent) @no
toolkit definition: Et verk som involverer et ansvar for en kollektiv agent i form av skapelse. @no
label: is maker-collectieve actor van werk van @nl
definition: Relateert een collectieve actor aan een werk dat met zich meebrengt een verantwoordelijkheid van een collectieve actor voor creatie. @nl
toolkit label: maker-collectieve actor van werk van @nl
toolkit definition: Een werk dat met zich meebrengt een verantwoordelijkheid van een collectieve actor voor creatie. @nl
label: هو وكيل جماعي منشئ عمل لـ @ar
definition: يربط وكيلا جماعيا بعمل يترتب عليه مسئولية وكيل جماعي عن الإنشاء. @ar
toolkit label: وكيل جماعي منشئ عمل @ar
toolkit definition: عمل يترتب عليه مسئولية وكيل جماعي عن الإنشاء. @ar
label: és agent col·lectiu creador d’una obra de @ca
definition: Relaciona un agent col·lectiu amb una obra que implica una responsabilitat d’un agent col·lectiu en la creació. @ca
toolkit label: agent col·lectiu creador d’una obra de @ca
toolkit definition: Obra que implica una responsabilitat d’un agent col·lectiu en la creació. @ca
label: er kollektiv agent, som er ophav til værk af @da
definition: Relaterer en kollektiv agent til et værk, som involverer en kollektiv agents ansvar for skabelse. @da
toolkit label: kollektiv agent, som er ophav til værk af @da
toolkit definition: Værk, som involverer en kollektiv agents ansvar for skabelse. @da
label: teose autor (kollektiiv) teoses @et
definition: Seostab kollektiivi teosega, mis sisaldab kollektiivi vastutust teose loomise eest. @et
toolkit label: teose autor (kollektiiv) teoses @et
toolkit definition: Teos, mis sisaldab kollektiivi vastutust teose loomise eest. @et
label: ist gemeinschaftlicher Akteur als geistige Schöpferin/geistiger Schöpfer eines Werks von @de
definition: Setzt einen gemeinschaftlichen Akteur in Beziehung zu einem Werk, bei dem ein gemeinschaftlicher Akteur für dessen Schaffung verantwortlich ist. @de
toolkit label: Gemeinschaftlicher Akteur als geistige Schöpferin/geistiger Schöpfer eines Werks von @de
toolkit definition: Ein Werk, bei dem ein gemeinschaftlicher Akteur für dessen Schaffung verantwortlich ist. @de
label: létrehozó kollektív ágense a következő műnek: @hu
definition: Hozzákapcsol egy kollektív ágenst egy műhöz, amelyhez hozzátartozik egy kollektív ágens felelőssége a létrehozásért. @hu
toolkit label: létrehozó kollektív ágense a következő műnek: @hu
toolkit definition: Egy mű, amelyhez hozzátartozik egy kollektív ágens felelőssége a létrehozásért. @hu
label: è creatore agente collettivo di opera di @it
definition: Correla un agente collettivo a un'opera che implica una responsabilità di un agente collettivo per la creazione. @it
toolkit label: creatore agente collettivo di opera di @it
toolkit definition: Opera che implica una responsabilità di un agente collettivo per la creazione. @it
label: είναι δημιουργός συλλογικός φορέας του έργου του @el
toolkit label: δημιουργός συλλογικός φορέας του έργου του @el
label: est un agent collectif créateur d’une œuvre de @fr
definition: Met un agent collectif en relation avec une œuvre qui comporte une responsabilité de la part d’un agent collectif en ce qui concerne la création. @fr
toolkit label: agent collectif créateur d’une œuvre de @fr
toolkit definition: Œuvre qui comporte une responsabilité de la part d’un agent collectif en ce qui concerne la création. @fr
label: ir radītājs (grupa) darbam @lv
definition: Sasaista grupu ar darbu, kas ietver grupas atbildību par radīšanu. @lv
toolkit label: ir radītājs (grupa) darbam @lv
toolkit definition: Darbs, kas ietver grupas atbildību par radīšanu. @lv
label: 是……的内容表达的创作者集体行为者 @zh-hans
definition: 将一个集体行为者与涉及创作或贡献的一个集体行为者的责任的一种内容表达关联起来。 @zh-hans
toolkit label: ……的内容表达的创作者集体行为者 @zh-hans
toolkit definition: 涉及创作或贡献的一个集体行为者的责任的一种内容表达 @zh-hans
label: eserinin yaratıcı kolektif temsilcisidir @tr
definition: Kolektif bir temsilciyi, kolektif temsilcisinin üretme sorumluluğunu içeren bir eser ile ilişkilendirir. @tr
toolkit label: eserin yaratıcı kolektif temsilcisi @tr
toolkit definition: Kolektif bir temsilcinin yaratım sorumluluğunu içeren bir eser. @tr
has subproperty: aggregaattori (yhteistoimija) teoksessa
has subproperty: arkkitehti (yhteistoimija) teoksessa
has subproperty: taiteilija (yhteistoimija) teoksessa
has subproperty: kirjoittaja (yhteistoimija) teoksessa
has subproperty: teoksen kartantekijä (yhteistoimija) teoksessa
has subproperty: roolittaja (yhteistoimija) teoksessa
has subproperty: koreografi (yhteistoimija) teoksessa
has subproperty: teoksen säveltäjä (yhteistoimija) musiikkiteoksessa
has subproperty: teoksen tekijä (yhteisö) teoksessa
has subproperty: teoksen tekijä (suku) teoksessa
has subproperty: designer (yhteistoimija) teoksessa

ekspression tekijä (yhteisö) ekspressiossa
status: Published
label: is creator corporate body of expression of @en
lexical alias: creatorCorporateBodyOfExpressionOf.en
definition: Relates a corporate body to an expression that involves a responsibility of a corporate body for creation or contribution. @en
toolkit label: creator corporate body of expression of @en
toolkit definition: An expression that involves a responsibility of a corporate body for creation or contribution. @en
type: Property
domain: C10005
has element type: 2
sub property of: yhteisöön liittyvä ekspressio
sub property of: ekspression tekijä (yhteistoimija) ekspressiossa
scope note: Editors, translators, arrangers of music, performers, etc., are included. @en
definition: Liittää yhteisön ekspressioon, jossa yhteisön vastuulla on luoda ekspressio tai osallistua sen tekemiseen.
scope note: Ekspression tekijöihin kuuluvat toimittajat, kääntäjät, musiikin sovittajat, esittäjät tms.
toolkit label: ekspression tekijä (yhteisö) ekspressiossa
toolkit definition: Ekspressio, jossa yhteisön vastuulla on luoda ekspressio tai osallistua sen tekemiseen.
label: er skaper av uttrykk for (korporasjon) @no
definition: Relaterer en korporasjon til et uttrykk som involverer et ansvar for en korporasjon i form av skapelse eller bidrag. @no
scope note: Redaktører, oversettere, arrangører av musikk, utøvere etc. er inkludert. @no
toolkit label: skaper av uttrykk for (korporasjon) @no
toolkit definition: Et uttrykk som involverer et ansvar for en korporasjon i form av skapelse eller bidrag. @no
label: is maker-corporatie van expressie van @nl
definition: Relateert een corporatie aan een expressie die met zich meebrengt een verantwoordelijkheid van een corporatie voor creatie of bijdrage. @nl
scope note: Redacteuren, vertalers, arrangeurs van muziek, uitvoerders etc. zijn inbegrepen. @nl
toolkit label: maker-corporatie van expressie van @nl
toolkit definition: Een expressie die met zich meebrengt een verantwoordelijkheid van een corporatie voor creatie of bijdrage. @nl
label: هي هيئة منشئة تعبيرة لـ @ar
definition: يربط هيئة بتعبيرة تتضمن إسهام هيئة في التعبيرة عن الإنشاء أو الإسهام . @ar
scope note: ويشمل ذلك المحررين، المترجمين، موزعي الموسيقى، فناني الأداء، الخ. @ar
toolkit label: هيئة منشئة لتعبيرة @ar
toolkit definition: تعبيرة تتضمن إسهام هيئة في التعبير عن الإنشاء أو الإسهام . @ar
label: és entitat corporativa creadora d’una expressió de @ca
definition: Relaciona una entitat corporativa amb una expressió que implica una responsabilitat d’una entitat corporativa en la creació o la contribució. @ca
scope note: Inclou editors literaris, traductors, arranjadors de música, intèrprets, etc. @ca
toolkit label: entitat corporativa creadora d’una expressió de @ca
toolkit definition: Expressió que implica una responsabilitat d’una entitat corporativa en la creació o la contribució. @ca
label: er korporation, som er ophav til udtryk af @da
definition: Relaterer en korporation til et udtryk, som involverer en korporations ansvar for skabelse eller bidrag. @da
scope note: Redaktører, oversættere, musikarrangører, udøvere etc. er omfattet. @da
toolkit label: korporation, som er ophav til udtryk af @da
toolkit definition: Udtryk, som involverer en korporations ansvar for skabelse eller bidrag. @da
label: väljenduse looja (asutus) väljenduses @et
definition: Seostab asutuse väljendusega, mis sisaldab asutuse vastutust väljenduse loomise või sellesse antud panuse eest. @et
scope note: Hõlmab toimetajaid, tõlkijaid, muusika seadjaid, esitajaid jne. @et
toolkit label: väljenduse looja (asutus) väljenduses @et
toolkit definition: Väljendus, mis sisaldab asutuse vastutust väljenduse loomise või sellesse antud panuse eest. @et
label: ist Körperschaft als Mitwirkende/Mitwirkender von @de
definition: Setzt eine Körperschaft in Beziehung zu einer Expression, bei der eine Körperschaft für die Erstellung oder Mitwirkung verantwortlich ist. @de
scope note: Darunter fallen Herausgeberinnen/Herausgeber, Übersetzerinnen/Übersetzer, Musikarrangeurinnen/Musikarrangeure, Ausführende und so weiter. @de
toolkit label: Körperschaft als Mitwirkende/Mitwirkender von @de
toolkit definition: Eine Expression, bei der eine Körperschaft für die Erstellung oder Mitwirkung verantwortlich ist. @de
label: létrehozó testülete a következő kifejezési formának: @hu
definition: Hozzákapcsol egy testületet egy kifejezési formához, amelyhez hozzátartozik egy testület felelőssége a létrehozásért vagy a közreműködésért. @hu
scope note: Szerkesztők, fordítók, hangszerelők, előadók stb. idetartoznak. @hu
toolkit label: létrehozó testülete a következő kifejezési formának: @hu
toolkit definition: Egy kifejezési forma, amelyhez hozzátartozik egy testület felelőssége a létrehozásért vagy a közreműködésért. @hu
label: è un creatore ente di espressione di @it
definition: Correla un ente a un'espressione che comprende un contributo di un ente per la creazione o contributo. @it
scope note: Sono inclusi curatori, traduttori, arrangiatori di musica, artisti, etc. @it
toolkit label: creatore ente di espressione di @it
toolkit definition: Espressione che comprende un contributo di un ente per la creazione o contributo. @it
label: είναι δημιουργός συλλογικό όργανο της έκφρασης του @el
scope note: Περιλαμβάνονται επιμελητές, μεταφραστές, διασκευαστές μουσικής, εκτελεστές κ.λπ. @el
toolkit label: δημιουργός συλλογικό όργανο της έκφρασης του @el
label: est une collectivité créatrice d’une expression de @fr
definition: Met une collectivité en relation avec une expression qui comporte une responsabilité de la part d’une collectivité en ce qui concerne la création ou la contribution. @fr
scope note: Sont inclus les éditeurs intellectuels, les traducteurs, les arrangeurs de musique, les interprètes, etc. @fr
toolkit label: collectivité créatrice d’une expression de @fr
toolkit definition: Expression qui comporte une responsabilité de la part d’une collectivité en ce qui concerne la création ou la contribution. @fr
label: ir radītājs (institūcija) izteiksmei @lv
definition: Sasaista institūciju ar izteiksmi, kas ietver institūcijas atbildību par radīšanu vai ieguldījumu. @lv
toolkit label: ir radītājs (institūcija) izteiksmei @lv
toolkit definition: Izteiksme, kas ietver institūcijas atbildību par radīšanu vai ieguldījumu. @lv
scope note: Tai skaitā redaktori, tulki, mūzikas aranžētāji, izpildītāji u.tml. @lv
label: 是……的内容表达的创作者团体 @zh-hans
definition: 将一个团体与涉及创作或贡献的一个团体的责任的一种内容表达关联起来。 @zh-hans
toolkit label: ……的内容表达的创作者团体 @zh-hans
toolkit definition: 涉及创作或贡献的一个团体的责任的一种内容表达 @zh-hans
scope note: 包括编者、译者、音乐改编者、表演者等 @zh-hans

manifestaation tekijä (yhteisö) manifestaatiossa
status: Published
label: is creator corporate body of manifestation of @en
lexical alias: creatorCorporateBodyOfManifestationOf.en
definition: Relates a corporate body to a manifestation that involves a responsibility of a corporate body for creation. @en
toolkit label: creator corporate body of manifestation of @en
toolkit definition: A manifestation that involves a responsibility of a corporate body for creation. @en
type: Property
domain: C10005
has element type: 2
sub property of: yhteisöön liittyvä manifestaatio
sub property of: manifestaation tekijä (yhteistoimija) manifestaatiossa
definition: Liittää yhteisön manifestaatioon, jonka luomisesta yhteisö on vastuussa.
toolkit label: manifestaation tekijä (yhteisö) manifestaatiossa
toolkit definition: Manifestaatio, jonka luomisesta yhteisö on vastuussa.
label: er skaper av manifestasjon for (korporasjon) @no
definition: Relaterer en korporasjon til en manifestasjon som involverer et ansvar for en korporasjon i form av skapelse. @no
toolkit label: skaper av manifestasjon for (korporasjon) @no
toolkit definition: En manifestasjon som involverer et ansvar for en korporasjon i form av skapelse. @no
scope note: A creator of manifestation includes a manufacturer, producer, and publisher. @en
label: is maker-corporatie van manifestatie van @nl
definition: Relateert een corporatie aan een manifestatie die met zich meebrengt een verantwoordelijkheid van een corporatie voor creatie. @nl
toolkit label: maker-corporatie van manifestatie van @nl
toolkit definition: Een manifestatie die met zich meebrengt een verantwoordelijkheid van een corporatie voor creatie. @nl
label: هي هيئة منشئة لتجسيدة لـ @ar
definition: يربط هيئة بتجسيدة تنطوي على مسئولية الهيئة عن إنشائها. @ar
toolkit label: هيئة منشئة لتجسيدة @ar
toolkit definition: تجسيدة تنطوي على مسئولية هيئة عن الإنشاء. @ar
label: és entitat corporativa creadora d’una manifestació de @ca
definition: Relaciona una entitat corporativa amb una manifestació que implica una responsabilitat d’una entitat corporativa en la creació. @ca
toolkit label: entitat corporativa creadora d’una manifestació de @ca
toolkit definition: Manifestació que implica una responsabilitat d’una entitat corporativa en la creació. @ca
label: er korporation, som er ophav til manifestation af @da
definition: Relaterer en korporation til en manifestation, som involverer en korporations ansvar for skabelse. @da
toolkit label: korporation, som er ophav til manifestation af @da
toolkit definition: Manifestation, som involverer en korporations ansvar for skabelse. @da
label: kehastuse teostaja (asutus) kehastuses @et
definition: Seostab asutuse kehastusega, mis sisaldab asutuse vastutust kehastuse loomise eest. @et
toolkit label: kehastuse teostaja (asutus) kehastuses @et
toolkit definition: Kehastus, mis sisaldab asutuse vastutust kehastuse loomise eest. @et
label: ist Körperschaft als Mitwirkende/Mitwirkender an einer Manifestation von @de
definition: Setzt eine Körperschaft in Beziehung zu einer Manifestation, bei der eine Körperschaft für deren Erstellung verantwortlich ist. @de
toolkit label: Körperschaft als Mitwirkende/Mitwirkender an einer Manifestation von @de
toolkit definition: Eine Manifestation, bei der eine Körperschaft für deren Erstellung verantwortlich ist. @de
label: létrehozó testülete a következő megjelenési formának: @hu
definition: Hozzákapcsol egy testületet egy megjelenési formához, amelyhez hozzátartozik egy testület felelőssége a létrehozásért. @hu
toolkit label: létrehozó testülete a következő megjelenési formának: @hu
toolkit definition: Egy megjelenési forma, amelyhez hozzátartozik egy testület felelőssége a létrehozásért. @hu
label: è creatore ente di manifestazione di @it
definition: Correla un ente a una manifestazione che implica una responsabilità di un ente per la creazione. @it
toolkit label: creatore ente di manifestazione di @it
toolkit definition: Manifestazione che implica una responsabilità di un ente per la creazione. @it
label: είναι δημιουργός συλλογικό όργανο της εκδήλωσης του @el
toolkit label: δημιουργός συλλογικό όργανο της εκδήλωσης του @el
label: est une collectivité créatrice d’une manifestation de @fr
definition: Met une collectivité en relation avec une manifestation qui comporte une responsabilité de la part d’une collectivité en ce qui concerne la création. @fr
toolkit label: collectivité créatrice d’une manifestation de @fr
toolkit definition: Manifestation qui comporte une responsabilité de la part d’une collectivité en ce qui concerne la création. @fr
scope note: Een maker van manifestatie omvat een vervaardiger, producent en uitgever. @nl
label: ir radītājs (institūcija) manifestācijai @lv
definition: Sasaista institūciju ar manifestāciju, kas ietver institūcijas atbildību par radīšanu. @lv
toolkit label: ir radītājs (institūcija) manifestācijai @lv
toolkit definition: Manifestācija, kas ietver institūcijas atbildību par radīšanu. @lv
scope note: Manifestācijas radītāji ir arī izplatītāji, ražotāji, izgatavotāji un izdevēji. @lv
scope note: Manifestaation tekijä sisältää jakelijan, valmistajan, tuottajan ja kustantajan.
scope note: قد يكون منشئ التجسيدة موزعا، أو صانعا، أو منتجا، أو ناشرا. @ar
scope note: Ophav til manifestation involverer en producent, producer og udgiver. @da
scope note: Darunter fallen Hersteller, Produzentinnen/Produzenten und Verlage. @de
scope note: Un creador d’una manifestació inclou un fabricant, un productor i un editor. @ca
scope note: Un créateur d’une manifestation comprend un fabricant, un producteur et un éditeur. @fr
label: 是……的载体表现的创建者团体 @zh-hans
definition: 将一个团体与涉及一个团体的创作责任的一种载体表现关联起来。 @zh-hans
toolkit label: ……的载体表现的创建者团体 @zh-hans
toolkit definition: 涉及一个团体的创作责任的一种载体表现 @zh-hans
scope note: 载体表现的创建者包括生产者、制作者和出版者 @zh-hans
scope note: Egy megjelenési forma létrehozója magában foglalja a gyártót, az előállítót és a kiadót. @hu
label: gösteriminin yaratıcı tüzel kişisidir @tr
definition: Bir tüzek kişiyi, tüzel bir kişinin yaratıcılık sorumluluğunu içeren bir gösterimle ileilişkilendirir. @tr
toolkit label: gösterimin yaratıcı tüzel kişisi @tr
toolkit definition: Bir tüzel kişinin yaratılışa yönelik sorumluluğunu içeren bir gösterim. @tr

teoksen tekijä (yhteisö) teoksessa
status: Published
label: is creator corporate body of work of @en
lexical alias: creatorCorporateBodyOfWorkOf.en
definition: Relates a corporate body to a work that involves a responsibility of a corporate body for creation. @en
toolkit label: creator corporate body of work of @en
toolkit definition: A work that involves a responsibility of a corporate body for creation. @en
type: Property
domain: C10005
has element type: 2
sub property of: yhteisöön liittyvä teos
sub property of: teoksen tekijä (yhteistoimija) teoksessa
definition: Liittää yhteisön teokseen, jonka luomisesta yhteisö on vastuussa.
toolkit label: teoksen tekijä (yhteisö) teoksessa
toolkit definition: Teos, jonka luomisesta yhteisö on vastuussa.
label: er skaper av verk for (korporasjon) @no
definition: Relaterer en korporasjon til et verk som involverer et ansvar for en korporasjon i form av skapelse. @no
toolkit label: skaper av verk for (korporasjon) @no
toolkit definition: Et verk som involverer et ansvar for en korporasjon i form av skapelse. @no
label: is maker-corporatie van werk van @nl
definition: Relateert een corporatie aan een werk dat met zich meebrengt een verantwoordelijkheid van een corporatie voor creatie. @nl
toolkit label: maker-corporatie van werk van @nl
toolkit definition: Een werk dat met zich meebrengt een verantwoordelijkheid van een corporatie voor creatie. @nl
label: هي هيئة منشئة لعمل لـ @ar
definition: يربط هيئة بعمل يترتب عليه مسئولية هيئة عن الإنشاء. @ar
toolkit label: هيئة منشئة لعمل @ar
toolkit definition: عمل يترتب عليه مسئولية هيئة عن الإنشاء. @ar
label: és entitat corporativa creadora d’una obra de @ca
definition: Relaciona una entitat corporativa amb una obra que implica una responsabilitat d’una entitat corporativa en la creació. @ca
toolkit label: entitat corporativa creadora d’una obra de @ca
toolkit definition: Obra que implica una responsabilitat d’una entitat corporativa en la creació. @ca
label: er korporation, som er ophav til værk af @da
definition: Relaterer en korporation til et værk, som involverer en korporations ansvar for skabelse. @da
toolkit label: korporation, som er ophav til værk af @da
toolkit definition: Værk, som involverer en korporations ansvar for skabelse. @da
label: teose autor (asutus) teoses @et
definition: Seostab asutuse teosega, mis sisaldab asutuse vastutust teose loomise eest. @et
toolkit label: teose autor (asutus) teoses @et
toolkit definition: Teos, mis sisaldab asutuse vastutust teose loomise eest. @et
label: ist Körperschaft als geistige Schöpferin/geistiger Schöpfer eines Werks von @de
definition: Setzt eine Körperschaft in Beziehung zu einem Werk, bei dem eine Körperschaft für dessen Schaffung verantwortlich ist. @de
toolkit label: Körperschaft als Geistige Schöpferin/Geistiger Schöpfer eines Werks von @de
toolkit definition: Ein Werk, bei dem eine Körperschaft für dessen Schaffung verantwortlich ist. @de
label: létrehozó testülete a következő műnek: @hu
definition: Hozzákapcsol egy testületet egy műhöz, amelyhez hozzátartozik egy testület felelőssége a létrehozásért. @hu
toolkit label: létrehozó testülete a következő műnek: @hu
toolkit definition: Egy mű, amelyhez hozzátartozik egy testület felelőssége a létrehozásért. @hu
label: è creatore ente di opera di @it
definition: Correla un ente a un'opera che implica una responsabilità di un ente per la creazione. @it
toolkit label: creatore ente di opera di @it
toolkit definition: Opera che implica una responsabilità di un ente per la creazione. @it
label: είναι δημιουργός συλλογικό όργανο του έργου του @el
toolkit label: δημιουργός συλλογικό όργανο του έργου του @el
label: est une collectivité créatrice d’une œuvre de @fr
definition: Met une collectivité en relation avec une œuvre qui comporte une responsabilité de la part d’une collectivité en ce qui concerne la création. @fr
toolkit label: collectivité créatrice d’une œuvre de @fr
toolkit definition: Œuvre qui comporte une responsabilité de la part d’une collectivité en ce qui concerne la création. @fr
label: ir radītājs (institūcija) darbam @lv
definition: Sasaista institūciju ar darbu, kas ietver institūcijas atbildību par radīšanu. @lv
toolkit label: ir radītājs (institūcija) darbam @lv
toolkit definition: Darbs, kas ietver institūcijas atbildību par radīšanu. @lv
label: 是……的作品的创作者团体 @zh-hans
definition: 将一个团体与涉及创作的一个团体的责任的一种作品关联起来。 @zh-hans
toolkit label: ……的作品的创作者团体 @zh-hans
toolkit definition: 涉及创作的一个团体的责任的一种作品 @zh-hans
label: eserinin yaratıcı tüzel kişisidir @tr
definition: Bir tüzel kişiyi, bir tüzel kişinin yaratma sorumluluğunu içeren bir eserle ilişkilendirir. @tr
toolkit label: eserin yaratıcı tüzel kişisi @tr
toolkit definition: Bir tüzel kişinin yaratma sorumluluğunu içeren bir eser. @tr
has subproperty: aggregaattori (yhteisö) teoksessa
has subproperty: yhteisö vastaajana kanteessa
has subproperty: arkkitehti (yhteisö) teoksessa
has subproperty: taiteilija (yhteisö) teoksessa
has subproperty: kirjoittaja (yhteisö) teoksessa
has subproperty: teoksen kartantekijä (yhteisö) teoksessa
has subproperty: roolittaja (yhteisö) teoksessa
has subproperty: koreografi (yhteisö) teoksessa
has subproperty: teoksen säveltäjä (yhteisö) musiikkiteoksessa
has subproperty: asiantuntija (yhteisö) teoksessa
has subproperty: omistuskirjoituksen tekijä (yhteisö) teoksessa

ekspression tekijä (suku) ekspressiossa
status: Published
label: is creator family of expression of @en
lexical alias: creatorFamilyOfExpressionOf.en
definition: Relates a family to an expression that involves a responsibility of a family for creation or contribution. @en
toolkit label: creator family of expression of @en
toolkit definition: An expression that involves a responsibility of a family for creation or contribution. @en
type: Property
domain: C10008
has element type: 2
sub property of: sukuun liittyvä ekspressio
sub property of: ekspression tekijä (yhteistoimija) ekspressiossa
scope note: Editors, translators, arrangers of music, performers, etc., are included. @en
definition: Liittää suvun ekspressioon, jossa suvun vastuulla on luoda ekspressio tai osallistua sen tekemiseen.
scope note: Ekspression tekijöihin kuuluvat toimittajat, kääntäjät, musiikin sovittajat, esittäjät tms.
toolkit label: ekspression tekijä (suku) ekspressiossa
toolkit definition: Ekspressio, jossa suvun vastuulla on luoda ekspressio tai osallistua sen tekemiseen.
label: er skaper av uttrykk for (familie) @no
definition: Relaterer en familie til et uttrykk som involverer et ansvar for en familie i form av skapelse eller bidrag. @no
scope note: Redaktører, oversettere, arrangører av musikk, utøvere etc. er inkludert. @no
toolkit label: skaper av uttrykk for (familie) @no
toolkit definition: Et uttrykk som involverer et ansvar for en familie i form av skapelse eller bidrag. @no
label: is maker-familie van expressie van @nl
definition: Relateert een familie aan een expressie die met zich meebrengt een verantwoordelijkheid van een familie voor creatie of bijdrage. @nl
scope note: Redacteuren, vertalers, arrangeurs van muziek, uitvoerders etc. zijn inbegrepen. @nl
toolkit label: maker-familie van expressie van @nl
toolkit definition: Een expressie die met zich meebrengt een verantwoordelijkheid van een familie voor creatie of bijdrage. @nl
label: هي عائلة منشئة لتعبيرة لـ @ar
definition: يربط عائلة بتعبيرة تنطوي على مسئولية عائلة عن الإنشاء أو الإسهام . @ar
scope note: ويشمل ذلك المحررين، المترجمين، موزعي الموسيقى، فناني الأداء، الخ. @ar
toolkit label: عائلة منشئة لتعبيرة @ar
toolkit definition: تعبيرة تنطوي على مسئولية عائلة عن الإنشاء أو الإسهام . @ar
label: és família creadora d’una expressió de @ca
definition: Relaciona una família amb una expressió que implica una responsabilitat d’una família en la creació o contribució. @ca
scope note: Inclou editors literaris, traductors, arranjadors de música, intèrprets, etc. @ca
toolkit label: família creadora d’una expressió de @ca
toolkit definition: Expressió que implica una responsabilitat d’una família en la creació o contribució. @ca
label: er familie, som er ophav til udtryk af @da
definition: Relaterer en familie til et udtryk, som involverer en families ansvar for skabelse eller bidrag. @da
scope note: Redaktører, oversættere, musikarrangører, udøvere etc. er omfattet. @da
toolkit label: familie, som er ophav til udtryk af @da
toolkit definition: Udtryk, som involverer en families ansvar for skabelse eller bidrag. @da
label: väljenduse looja (perekond) väljenduses @et
definition: Seostab perekonna väljendusega, mis sisaldab perekonna vastutust väljenduse loomise või sellesse antud panuse eest. @et
scope note: Hõlmab toimetajaid, tõlkijaid, muusika seadjaid, esitajaid jne. @et
toolkit label: väljenduse looja (perekond) väljenduses @et
toolkit definition: Väljendus, mis sisaldab perekonna vastutust väljenduse loomise või sellesse antud panuse eest. @et
label: Familie als Mitwirkende/Mitwirkender von @de
definition: Setzt eine Familie in Beziehung zu einer Expression, bei der eine Familie für die Erstellung oder Mitwirkung verantwortlich ist. @de
scope note: Darunter fallen Herausgeberinnen/Herausgeber, Übersetzerinnen/Übersetzer, Musikarrangeurinnen/Musikarrangeure, Ausführende und so weiter. @de
toolkit label: Familie als Mitwirkende/Mitwirkender von @de
toolkit definition: Eine Expression, bei der eine Familie für die Schaffung oder Mitwirkung verantwortlich ist. @de
label: létrehozó családja a következő kifejezési formának: @hu
definition: Hozzákapcsol egy családot egy kifejezési formához, amelyhez hozzátartozik egy család felelőssége a létrehozásért vagy a közreműködésért. @hu
scope note: Szerkesztők, fordítók, hangszerelők, előadók stb. idetartoznak. @hu
toolkit label: létrehozó családja a következő kifejezési formának: @hu
toolkit definition: Egy kifejezési forma, amelyhez hozzátartozik egy család felelőssége a létrehozásért vagy a közreműködésért. @hu
label: è creatore famiglia di espressione di @it
definition: Correla una famiglia a un'espressione che implica una responsabilità di una famiglia per la creazione o contributo. @it
scope note: Sono inclusi curatori, traduttori, arrangiatori di musica, esecutori, etc. @it
toolkit label: creatore famiglia di espressione di @it
toolkit definition: Espressione che implica una responsabilità di una famiglia per la creazione o contributo. @it
label: είναι δημιουργός οικογένεια της έκφρασης του @el
definition: Συνδέει μια οικογένεια με μια έκφραση που περιλαμβάνει την ευθύνη μιας οικογένειας για τη δημιουργία ή τη συνεισφορά. @el
scope note: Περιλαμβάνονται επιμελητές, μεταφραστές, διασκευαστές μουσικής, εκτελεστές κ.λπ. @el
toolkit label: δημιουργός οικογένεια της έκφρασης του @el
label: est une famille créatrice d’une expression de @fr
definition: Met une famille en relation avec une expression qui comporte une responsabilité de la part d’une famille en ce qui concerne la création ou la contribution. @fr
scope note: Sont inclus les éditeurs intellectuels, les traducteurs, les arrangeurs de musique, les interprètes, etc. @fr
toolkit label: famille créatrice d’une expression de @fr
toolkit definition: Expression qui comporte une responsabilité de la part d’une famille en ce qui concerne la création ou la contribution. @fr
label: ir radītājs (dzimta/ģimene) izteiksmei @lv
definition: Sasaista dzimtu/ģimeni ar izteiksmi, kas ietver dzimtas/ģimenes atbildību par radīšanu vai ieguldījumu. @lv
toolkit label: ir radītājs (dzimta/ģimene) izteiksmei @lv
toolkit definition: Izteiksme, kas ietver dzimtas/ģimenes atbildību par radīšanu vai ieguldījumu. @lv
scope note: Tai skaitā redaktori, tulki, mūzikas aranžētāji, izpildītāji u.tml. @lv
label: 是……的内容表达的创作者家族 @zh-hans
definition: 将一个家族与涉及创作或贡献的一个家族的责任的一种内容表达关联起来。 @zh-hans
toolkit label: ……的内容表达的创作者家族 @zh-hans
toolkit definition: 涉及创作或贡献的一个家族的责任的一种内容表达 @zh-hans

manifestaation tekijä (suku) manifestaatiossa
status: Published
label: is creator family of manifestation of @en
lexical alias: creatorFamilyOfManifestationOf.en
definition: Relates a family to a manifestation that involves a responsibility of a family for creation. @en
toolkit label: creator family of manifestation of @en
toolkit definition: A manifestation that involves a responsibility of a family for creation. @en
type: Property
domain: C10008
has element type: 2
sub property of: sukuun liittyvä manifestaatio
sub property of: manifestaation tekijä (yhteistoimija) manifestaatiossa
definition: Liittää suvun manifestaatioon, jonka luomisesta suku on vastuussa.
toolkit label: manifestaation tekijä (suku) manifestaatiossa
toolkit definition: Manifestaatio, jonka luomisesta suku on vastuussa.
label: er skaper av manifestasjon for (familie) @no
definition: Relaterer en familie til en manifestasjon som involverer et ansvar for en familie i form av skapelse. @no
toolkit label: skaper av manifestasjon for (familie) @no
toolkit definition: En manifestasjon som involverer et ansvar for en familie i form av skapelse. @no
scope note: A creator of manifestation includes a manufacturer, producer, and publisher. @en
label: is maker-familie van manifestatie van @nl
definition: Relateert een familie aan een manifestatie die met zich meebrengt een verantwoordelijkheid van een familie voor creatie. @nl
toolkit label: maker-familie van manifestatie van @nl
toolkit definition: Een manifestatie die met zich meebrengt een verantwoordelijkheid van een familie voor creatie. @nl
label: هي عائلة منشئة لتجسيدة لـ @ar
definition: يربط عائلة بتجسيدة تنطوي على مسئولية عائلة عن الإنشاء. @ar
toolkit label: عائلة منشئة لتجسيدة @ar
toolkit definition: تجسيدة تنطوي على مسئولية عائلة عن الإنشاء. @ar
label: és família creadora d’una manifestació de @ca
definition: Relaciona una família amb una manifestació que implica una responsabilitat d’una família en la creació. @ca
toolkit label: família creadora d’una manifestació de @ca
toolkit definition: Manifestació que implica una responsabilitat d’una família en la creació. @ca
label: er familie, som er ophav til manifestation af @da
definition: Relaterer en familie til en manifestation, som involverer en families ansvar for skabelse. @da
toolkit label: familie, som er ophav til manifestation af @da
toolkit definition: Manifestation, som involverer en families ansvar for skabelse. @da
label: kehastuse teostaja (perekond) kehastuses @et
definition: Seostab perekonna kehastusega, mis sisaldab perekonna vastutust kehastuse loomise eest. @et
toolkit label: kehastuse teostaja (perekond) kehastuses @et
toolkit definition: Kehastus, mis sisaldab perekonna vastutust kehastuse loomise eest. @et
label: ist Familie als Mitwirkende/Mitwirkender an einer Manifestation von @de
definition: Setzt eine Familie in Beziehung zu einer Manifestation, bei der eine Familie für deren Erstellung verantwortlich ist. @de
toolkit label: Familie als Mitwirkende/Mitwirkender an einer Manifestation von @de
toolkit definition: Eine Manifestation, bei der eine Familie für deren Erstellung verantwortlich ist. @de
label: létrehozó családja a következő megjelenési formának: @hu
definition: Hozzákapcsol egy családot egy megjelenési formához, amelyhez hozzátartozik egy testület felelőssége a létrehozásért. @hu
toolkit label: létrehozó családja a következő megjelenési formának: @hu
toolkit definition: Egy megjelenési forma, amelyhez hozzátartozik egy testület felelőssége a létrehozásért. @hu
label: è creatore famiglia di manifestazione di @it
definition: Correla una famiglia a una manifestazione che implica una responsabilità di una famiglia per la creazione. @it
toolkit label: creatore famiglia di manifestazione di @it
toolkit definition: Manifestazione che implica una responsabilità di una famiglia per la creazione. @it
label: είναι δημιουργός οικογένεια της έκφρασης του @el
toolkit label: δημιουργός οικογένεια της έκφρασης του @el
label: est une famille créatrice d’une manifestation de @fr
definition: Met une famille en relation avec une manifestation qui comporte une responsabilité de la part d’une famille en ce qui concerne la création. @fr
toolkit label: famille créatrice d’une manifestation de @fr
toolkit definition: Manifestation qui comporte une responsabilité de la part d’une famille en ce qui concerne la création. @fr
scope note: Een maker van manifestatie omvat een vervaardiger, producent en uitgever. @nl
label: ir radītājs (dzimta/ģimene) manifestācijai @lv
definition: Sasaista dzimtu/ģimeni ar manifestāciju, kas ietver dzimtas/ģimenes atbildību par radīšanu. @lv
toolkit label: ir radītājs (dzimta/ģimene) manifestācijai @lv
toolkit definition: Manifestācija, kas ietver dzimtas/ģimenes atbildību par radīšanu. @lv
scope note: Manifestācijas radītāji ir arī izplatītāji, ražotāji, izgatavotāji un izdevēji. @lv
scope note: Manifestaation tekijä sisältää jakelijjan, valmistajan, tuottajan ja kustantajan.
scope note: قد يكون منشئ التجسيدة موزعا، أو صانعا، أو منتجا، أو ناشرا. @ar
scope note: Ophav til manifestation omfatter en producent, producer og udgiver. @da
scope note: Darunter fallen Hersteller, Produzentinnen/Produzenten und Verlage. @de
scope note: Un creador d’una manifestació inclou un fabricant, un productor i un editor. @ca
scope note: Un créateur d’une manifestation comprend un fabricant, un producteur et un éditeur. @fr
label: 是……的载体表现的创建者家族 @zh-hans
definition: 将一个家族与涉及一个家族的创作责任的一种载体表现关联起来。 @zh-hans
toolkit label: ……的载体表现的创建者家族 @zh-hans
toolkit definition: 涉及一个家族的创作责任的一种载体表现 @zh-hans
scope note: 载体表现的创建者包括生产者、制作者和出版者 @zh-hans
scope note: Egy megjelenési forma létrehozója magában foglalja a gyártót, az előállítót és a kiadót. @hu
label: gösteriminin yaratıcı ailesidir @tr
definition: Bir aileyi eser yaratma sorumluluğunu içeren gösterimle ilişkilendirir. @tr
toolkit label: gösterimin yaratıcı ailesi @tr
toolkit definition: Bir ailenin yaratma sorumluluğunu içeren bir gösterim. @tr

teoksen tekijä (suku) teoksessa
status: Published
label: is creator family of work of @en
lexical alias: creatorFamilyOfWorkOf.en
definition: Relates a family to a work that involves a responsibility of a family for creation. @en
toolkit label: creator family of work of @en
toolkit definition: A work that involves a responsibility of a family for creation. @en
type: Property
domain: C10008
has element type: 2
sub property of: sukuun liittyvä teos
sub property of: teoksen tekijä (yhteistoimija) teoksessa
definition: Liittää suvun teokseen, jonka luomisesta suku on vastuussa.
toolkit label: teoksen tekijä (suku) teoksessa
toolkit definition: Teos, jonka luomisesta suku on vastuussa.
label: er skaper av verk for (familie) @no
definition: Relaterer en familie til et verk som involverer et ansvar for en familie i form av skapelse. @no
toolkit label: skaper av verk for (familie) @no
toolkit definition: Et verk som involverer et ansvar for en familie i form av skapelse. @no
label: is maker-familie van werk van @nl
definition: Relateert een familie aan een werk dat met zich meebrengt een verantwoordelijkheid van een familie voor creatie. @nl
toolkit label: maker-familie van werk van @nl
toolkit definition: Een werk dat met zich meebrengt een verantwoordelijkheid van een familie voor creatie. @nl
label: هي عائلة منشئة لعمل لـ @ar
definition: يربط عائلة بعمل يترتب عليه مسئولية عائلة عن الإنشاء. @ar
toolkit label: عائلة منشئة لعمل @ar
toolkit definition: عمل يترتب عليه مسئولية عائلة عن الإنشاء. @ar
label: és família creadora d’una obra de @ca
definition: Relaciona una família amb una obra que implica una responsabilitat d’una família en la creació. @ca
toolkit label: família creadora d’una obra de @ca
toolkit definition: Obra que implica una responsabilitat d’una família en la creació. @ca
label: er familie, som er ophav til værk af @da
definition: Relaterer en familie til et værk, som involverer en families ansvar for skabelse. @da
toolkit label: familie, som er ophav til værk af @da
toolkit definition: Værk, som involverer en families ansvar for skabelse. @da
label: teose autor (perekond) teoses @et
definition: Seostab perekonna teosega, mis sisaldab perekonna vastutust teose loomise eest. @et
toolkit label: teose autor (perekond) teoses @et
toolkit definition: Teos, mis sisaldab perekonna vastutust teose loomise eest. @et
label: ist Familie als geistige Schöpferin/geistiger Schöpfer eines Werks von @de
definition: Setzt eine Familie in Beziehung zu einem Werk, bei dem eine Familie für die Schaffung verantwortlich ist. @de
toolkit label: Familie als geistige Schöpferin/geistiger Schöpfer eines Werks von @de
toolkit definition: Ein Werk, bei dem eine Familie für die Schaffung verantwortlich ist. @de
label: létrehozó családja a következő műnek: @hu
definition: Hozzákapcsol egy családot egy műhöz, amelyhez hozzátartozik egy család felelőssége a létrehozásért. @hu
toolkit label: létrehozó családja a következő műnek: @hu
toolkit definition: Egy mű, amelyhez hozzátartozik egy család felelőssége a létrehozásért. @hu
label: è creatore famiglia di opera di @it
definition: Correla una famiglia a un'opera che implica una responsabilità di una famiglia per la creazione. @it
toolkit label: creatore famiglia di opera di @it
toolkit definition: Opera che implica una responsabilità di una famiglia per la creazione. @it
label: είναι δημιουργός οικογένεια του έργου του @el
toolkit label: δημιουργός οικογένεια του έργου του @el
label: est une famille créatrice d’une œuvre de @fr
definition: Met une famille en relation avec une œuvre qui comporte une responsabilité de la part d’une famille en ce qui concerne la création. @fr
toolkit label: famille créatrice d’une œuvre de @fr
toolkit definition: Œuvre qui comporte une responsabilité de la part d’une famille en ce qui concerne la création. @fr
label: ir radītājs (dzimta/ģimene) darbam @lv
definition: Sasaista dzimtu/ģimeni ar darbu, kas ietver dzimtas/ģimenes atbildību par radīšanu. @lv
toolkit label: ir radītājs (dzimta/ģimene) darbam @lv
toolkit definition: Darbs, kas ietver dzimtas/ģimenes atbildību par radīšanu. @lv
label: 是……的作品的创作者家族 @zh-hans
definition: 将一个家族与涉及创作的一个家族的责任的一种作品关联起来。 @zh-hans
toolkit label: ……的作品的创作者家族 @zh-hans
toolkit definition: 涉及创作的一个家族的责任的一种作品 @zh-hans
label: eserinin yaratıcı ailesidir @tr
definition: Bir aileyi, ailenin yaratılış sorumluluğunu içeren bir eserle ilişkilendirir. @tr
toolkit label: eserin yaratıcı ailesi @tr
toolkit definition: Bir ailenin yaratım sorumluluğunu içeren bir eser. @tr
has subproperty: aggregaattori (suku) teoksessa
has subproperty: arkkitehti (suku) teoksessa
has subproperty: taiteilija (suku) teoksessa
has subproperty: kirjoittaja (suku) teoksessa
has subproperty: teoksen kartantekijä (suku) teoksessa
has subproperty: roolittaja (suku) teoksessa
has subproperty: koreografi (suku) teoksessa
has subproperty: teoksen säveltäjä (suku) musiikkiteoksessa
has subproperty: designer (suku) teoksessa
has subproperty: elokuvantekijä (suku) teoksessa
has subproperty: teoksen haastateltava (suku) teoksessa

ekspression tekijä (henkilö) ekspressiossa
status: Published
label: is creator person of expression of @en
lexical alias: creatorPersonOfExpressionOf.en
definition: Relates a person to an expression that involves a responsibility of a person for creation or contribution. @en
toolkit label: creator person of expression of @en
toolkit definition: An expression that involves a responsibility of a person for creation or contribution. @en
type: Property
domain: C10004
has element type: 2
sub property of: henkilöön liittyvä ekspressio
sub property of: ekspression tekijä (toimija) ekspressiossa
scope note: Editors, translators, arrangers of music, performers, etc., are included. @en
definition: Liittää henkilön ekspressioon, jossa henkilön vastuulla on luoda ekspressio tai osallistua sen tekemiseen.
scope note: Ekspression tekijöihin kuuluvat toimittajat, kääntäjät, musiikin sovittajat, esittäjät tms.
toolkit label: ekspression tekijä (henkilö) ekspressiossa
toolkit definition: Ekspressio, jossa henkilön vastuulla on luoda ekspressio tai osallistua sen tekemiseen.
label: er skaper av uttrykk for (person) @no
definition: Relaterer en person til et uttrykk som involverer et ansvar for en person i form av skapelse eller bidrag. @no
scope note: Redaktører, oversettere, arrangører av musikk, utøvere etc. er inkludert. @no
toolkit label: skaper av uttrykk for (person) @no
toolkit definition: Et uttrykk som involverer et ansvar for en person i form av skapelse eller bidrag. @no
label: is maker-persoon van expressie van @nl
definition: Relateert een persoon aan een expressie die met zich meebrengt een verantwoordelijkheid van een persoon voor creatie of bijdrage. @nl
scope note: Redacteuren, vertalers, arrangeurs van muziek, uitvoerders etc. zijn inbegrepen. @nl
toolkit label: maker-persoon van expressie van @nl
toolkit definition: Een expressie die met zich meebrengt een verantwoordelijkheid van een persoon voor creatie of bijdrage. @nl
label: هو شخص منشئ تعبيرة لـ @ar
definition: يربط شخصا بتعبيرة تنطوي على مسئولية شخص عن الإبداع أو الإسهام . @ar
scope note: يشمل ذلك المحررين، المترجمين، موزعي الموسيقى، فناني الأداء، الخ. @ar
toolkit label: شخص منشئ تعبيرة @ar
toolkit definition: تعبيرة تنطوي على مسئولية شخص عن الإبداع أو الإسهام . @ar
label: és persona creadora d’una expressió de @ca
definition: Relaciona una persona amb una expressió que implica una responsabilitat d’una persona en la creació o contribució. @ca
scope note: Inclou editors literaris, traductors, arranjadors de música, intèrprets, etc. @ca
toolkit label: persona creadora d’una expressió de @ca
toolkit definition: Expressió que implica una responsabilitat d’una persona en la creació o contribució. @ca
label: er person, som er ophav til udtryk af @da
definition: Relaterer en person til et udtryk, som involverer en persons ansvar for skabelse eller bidrag. @da
scope note: Redaktører, oversættere, musikarrangører, udøvere etc. er omfattet. @da
toolkit label: person, som er ophav til udtryk af @da
toolkit definition: Udtryk, som involverer en persons ansvar for skabelse eller bidrag. @da
label: väljenduse looja (isik) väljenduses @et
definition: Seostab isiku väljendusega, mis sisaldab isiku vastutust väljenduse loomise või sellesse antud panuse eest. @et
scope note: Hõlmab toimetajaid, tõlkijaid, muusika seadjaid, esitajaid jne. @et
toolkit label: väljenduse looja (isik) väljenduses @et
toolkit definition: Väljendus, mis sisaldab isiku vastutust väljenduse loomise või sellesse antud panuse eest. @et
label: ist Person als Mitwirkende/Mitwirkender von @de
definition: Setzt eine Person in Beziehung zu einer Expression, bei der eine Person für die Erstellung oder Mitwirkung verantwortlich ist. @de
scope note: Darunter fallen Herausgeberinnen/Herausgeber, Übersetzerinnen/Übersetzer, Musikarrangeurinnen/Musikarrangeure, Ausführende und so weiter. @de
toolkit label: Person als Mitwirkende/Mitwirkender von @de
toolkit definition: Eine Expression, bei der eine Person für die Erstellung oder Mitwirkung verantwortlich ist. @de
label: létrehozó személye a következő kifejezési formának: @hu
definition: Hozzákapcsol egy személyt egy kifejezési formához, amelyhez hozzátartozik egy személy felelőssége a létrehozásért vagy a közreműködésért. @hu
scope note: Szerkesztők, fordítók, hangszerelők, előadók stb. idetartoznak. @hu
toolkit label: létrehozó személye a következő kifejezési formának: @hu
toolkit definition: Egy kifejezési forma, amelyhez hozzátartozik egy személy felelőssége a létrehozásért vagy a közreműködésért. @hu
label: è creatore persona di espressione di @it
definition: Correla una persona a un'espressione che implica una responsabilità di una persona per la creazione o contributo. @it
scope note: Sono inclusi curatori, traduttori, arrangiatori di musica, esecutori, etc. @it
toolkit label: creatore persona di espressione di @it
toolkit definition: Espressione che implica una responsabilità di una persona per la creazione o contributo. @it
label: είναι δημιουργός φυσικό πρόσωπο της έκφρασης του @el
toolkit label: δημιουργός φυσικό πρόσωπο της έκφρασης του @el
label: est une personne créatrice d’une expression de @fr
definition: Met une personne en relation avec une expression qui comporte une responsabilité de la part d’une personne en ce qui concerne la création ou la contribution. @fr
scope note: Sont inclus les éditeurs intellectuels, les traducteurs, les arrangeurs de musique, les interprètes, etc. @fr
toolkit label: personne créatrice d’une expression de @fr
toolkit definition: Expression qui comporte une responsabilité de la part d’une personne en ce qui concerne la création ou la contribution. @fr
label: ir radītājs (persona) izteiksmei @lv
definition: Sasaista personu ar izteiksmi, kas ietver personas atbildību par radīšanu vai ieguldījumu. @lv
toolkit label: ir radītājs (persona) izteiksmei @lv
toolkit definition: Izteiksme, kas ietver personas atbildību par radīšanu vai ieguldījumu. @lv
scope note: Tai skaitā redaktori, tulki, mūzikas aranžētāji, izpildītāji u.tml. @lv
label: 是……的内容表达的创作者个人 @zh-hans
definition: 将一个个人与涉及创作或贡献的一个个人的责任的一种内容表达关联起来。 @zh-hans
toolkit label: ……的内容表达的创作者个人 @zh-hans
toolkit definition: 涉及创作或贡献的一个个人的责任的一种内容表达 @zh-hans
scope note: 包括编者、译者、音乐改编者、表演者等 @zh-hans
label: anlatımının yaratıcı kişisidir @tr

manifestaation tekijä (henkilö) manifestaatiossa
status: Published
label: is creator person of manifestation of @en
lexical alias: creatorPersonOfManifestationOf.en
definition: Relates a person to a manifestation that involves a responsibility of a person for creation. @en
toolkit label: creator person of manifestation of @en
toolkit definition: A manifestation that involves a responsibility of a person for creation. @en
type: Property
domain: C10004
has element type: 2
sub property of: henkilöön liittyvä manifestaatio
sub property of: manifestaation tekijä (toimija) manifestaatiossa
definition: Liittää henkilön manifestaatioon, jonka luomisesta henkilö on vastuussa.
toolkit label: manifestaation tekijä (henkilö) manifestaatiossa
toolkit definition: Manifestaatio, jonka luomisesta henkilö on vastuussa.
label: er skaper av manifestasjon for (person) @no
definition: Relaterer en person til en manifestasjon som involverer et ansvar for en person i form av skapelse. @no
toolkit label: skaper av manifestasjon for (person) @no
toolkit definition: En manifestasjon som involverer et ansvar for en person i form av skapelse. @no
scope note: A creator of manifestation includes a manufacturer, producer, and publisher. @en
label: is maker-persoon van manifestatie van @nl
definition: Relateert een persoon aan een manifestatie die met zich meebrengt een verantwoordelijkheid van een persoon voor creatie. @nl
toolkit label: maker-persoon van manifestatie van @nl
toolkit definition: Een manifestatie die met zich meebrengt een verantwoordelijkheid van een persoon voor creatie. @nl
label: هو شخص منشئ لتجسيدة لـ @ar
definition: يربط شخصا بتجسيدة تنطوي على مسئولية شخص عن الإنشاء. @ar
toolkit label: شخص منشئ لتجسيدة لـ @ar
toolkit definition: تجسيدة تنطوي على مسئولية شخص عن الإنشاء. @ar
label: és persona creadora d’una manifestació de @ca
definition: Relaciona una persona amb una manifestació que implica una responsabilitat d’una persona en la creació. @ca
toolkit label: persona creadora d’una manifestació de @ca
toolkit definition: Manifestació que implica una responsabilitat d’una persona en la creació. @ca
label: er person, som er ophav til manifestation af @da
definition: Relaterer en person til en manifestation, som involverer en persons ansvar for skabelse. @da
toolkit label: person, som er ophav til manifestation af @da
toolkit definition: Manifestation, som involverer en persons ansvar for skabelse. @da
label: kehastuse teostaja (isik) kehastuses @et
definition: Seostab isiku kehastusega, mis sisaldab isiku vastutust kehastuse loomise eest. @et
toolkit label: kehastuse teostaja (isik) kehastuses @et
toolkit definition: Kehastus, mis sisaldab isiku vastutust kehastuse loomise eest. @et
label: ist Person als Mitwirkende/Mitwirkender an einer Manifestation von @de
definition: Setzt eine Person in Beziehung zu einer Manifestation, bei der eine Person für deren Erstellung verantwortlich ist. @de
toolkit label: Person als Mitwirkende/Mitwirkender an einer Manifestation von @de
toolkit definition: Eine Manifestation, bei der eine Person für deren Erstellung verantwortlich ist. @de
label: létrehozó személye a következő megjelenési formának: @hu
definition: Hozzákapcsol egy személyt egy megjelenési formához, amelyhez hozzátartozik egy személy felelőssége a létrehozásért. @hu
toolkit label: létrehozó személye a következő megjelenési formának: @hu
toolkit definition: Egy megjelenési forma, amelyhez hozzátartozik egy személy felelőssége a létrehozásért. @hu
label: è creatore persona di manifestazione di @it
definition: Correla una persona a una manifestazione che implica una responsabilità di una persona per la creazione. @it
toolkit label: creatore persona di manifestazione di @it
toolkit definition: Manifestazione che implica una responsabilità di una persona per la creazione. @it
label: είναι δημιουργός φυσικό πρόσωπο της εκδήλωσης του @el
toolkit label: δημιουργός φυσικό πρόσωπο της εκδήλωσης του @el
label: est une personne créatrice d’une manifestation de @fr
definition: Met une personne en relation avec une manifestation qui comporte une responsabilité de la part d’une personne en ce qui concerne la création. @fr
toolkit label: personne créatrice d’une manifestation de @fr
toolkit definition: Manifestation qui comporte une responsabilité de la part d’une personne en ce qui concerne la création. @fr
scope note: Een maker van manifestatie omvat een vervaardiger, producent en uitgever. @nl
label: ir radītājs (persona) manifestācijai @lv
definition: Sasaista personu ar manifestāciju, kas ietver personas atbildību par radīšanu. @lv
toolkit label: ir radītājs (persona) manifestācijai @lv
toolkit definition: Manifestācija, kas ietver personas atbildību par radīšanu. @lv
scope note: Manifestācijas radītāji ir arī izplatītāji, ražotāji, izgatavotāji un izdevēji. @lv
scope note: Manifestaation tekijä sisältää jakelijan, valmistajan, tuottajan ja kustantajan.
scope note: قد يكون منشئ التجسيدة موزعا، أو صانعا، أو منتجا، أو ناشرا. @ar
scope note: Skaber af manifestation omfatter en producent, producer og udgiver. @da
scope note: Darunter fallen Hersteller, Produzentinnen/Produzenten und Verlage. @de
scope note: Un creador d’una manifestació inclou un fabricant, un productor i un editor. @ca
scope note: Un créateur d’une manifestation comprend un fabricant, un producteur et un éditeur. @fr
label: 是……的载体表现的创建者个人 @zh-hans
definition: 将一个个人与涉及一个创作个人的责任的一种载体表现关联起来。 @zh-hans
toolkit label: ……的载体表现的创建者个人 @zh-hans
toolkit definition: 涉及一个创作个人的责任的一种载体表现 @zh-hans
scope note: 载体表现的创建者包括生产者、制作者和出版者 @zh-hans
scope note: Egy megjelenési forma létrehozója magában foglalja a gyártót, az előállítót és a kiadót. @hu
label: gösteriminin yaratıcı kişisidir @tr
definition: Bir kişiyi, bir kişinin yaratım sorumluluğunu içeren gösterimle ilişkilendirir. @tr
toolkit label: gösterimin yaratıcısı @tr
toolkit definition: Bir kişinin yaratımdaki sorumlulunuğunu içeren bir gösterim. @tr

teoksen tekijä (henkilö) teoksessa
status: Published
label: is creator person of work of @en
lexical alias: creatorPersonOfWorkOf.en
definition: Relates a person to a work that involves a responsibility of a person for creation. @en
toolkit label: creator person of work of @en
toolkit definition: A work that involves a responsibility of a person for creation. @en
type: Property
domain: C10004
has element type: 2
sub property of: henkilöön liittyvä teos
sub property of: teoksen tekijä (toimija) teoksessa
definition: Liittää henkilön teokseen, jonka luomisesta henkilö on vastuussa.
toolkit label: teoksen tekijä (henkilö) teoksessa
toolkit definition: Teos, jonka luomisesta henkilö on vastuussa.
label: er skaper av verk for (person) @no
definition: Relaterer en person til et verk som involverer et ansvar for en person i form av skapelse. @no
toolkit label: skaper av verk for (person) @no
toolkit definition: Et verk som involverer et ansvar for en person i form av skapelse. @no
label: is maker-persoon van werk van @nl
definition: Relateert een persoon aan een werk dat met zich meebrengt een verantwoordelijkheid van een persoon voor creatie. @nl
toolkit label: maker-persoon van werk van @nl
toolkit definition: Een werk dat met zich meebrengt een verantwoordelijkheid van een persoon voor creatie. @nl
label: هو شخص منشئ عمل لـ @ar
definition: يربط شخصا بعمل يترتب عليه مسئولية شخص عن الإنشاء. @ar
toolkit label: شخص منشئ عمل لـ @ar
toolkit definition: عمل يترتب عليه مسئولية شخص عن إنشاء عمل. @ar
label: és persona creadora d’una obra de @ca
definition: Relaciona una persona amb una obra que implica una responsabilitat d’una persona en la creació. @ca
toolkit label: persona creadora d’una obra de @ca
toolkit definition: Obra que implica una responsabilitat d’una persona en la creació. @ca
label: er person, som er ophav til værk af @da
definition: Relaterer en person til et værk, som involverer en persons ansvar for skabelse. @da
toolkit label: person, som er ophav til værk af @da
toolkit definition: Værk, som involverer en persons ansvar for skabelse. @da
label: teose autor (isik) teoses @et
definition: Seostab isiku teosega, mis sisaldab isiku vastutust teose loomise eest. @et
toolkit label: teose autor (isik) teoses @et
toolkit definition: Teos, mis sisaldab isiku vastutust teose loomise eest. @et
label: ist Person als geistige Schöpferin/geistiger Schöpfer eines Werks von @de
definition: Setzt eine Person in Beziehung zu einem Werk, bei dem eine Person für dessen Schaffung verantwortlich ist. @de
toolkit label: Person als geistige Schöpferin/geistiger Schöpfer eines Werks von @de
toolkit definition: Ein Werk, bei dem eine Person für dessen Schaffung verantwortlich ist. @de
label: létrehozó személye a következő műnek: @hu
definition: Hozzákapcsol egy személyt egy műhöz, amelyhez hozzátartozik egy személy felelőssége a létrehozásért. @hu
toolkit label: létrehozó személye a következő műnek: @hu
toolkit definition: Egy mű, amelyhez hozzátartozik egy személy felelőssége a létrehozásért. @hu
label: è creatore persona di opera di @it
definition: Correla una persona a un'opera che implica una responsabilità di una persona nella creazione. @it
toolkit label: creatore persona di opera di @it
toolkit definition: Opera che implica una responsabilità di una persona nella creazione. @it
label: είναι δημιουργός φυσικό πρόσωπο του έργου του @el
toolkit label: δημιουργός φυσικό πρόσωπο του έργου του @el
label: est une personne créatrice d’une œuvre de @fr
definition: Met une personne en relation avec une œuvre qui comporte une responsabilité de la part d’une personne en ce qui concerne la création. @fr
toolkit label: personne créatrice d’une œuvre de @fr
toolkit definition: Œuvre qui comporte une responsabilité de la part d’une personne en ce qui concerne la création. @fr
label: ir radītājs (persona) darbam @lv
definition: Sasaista personu ar darbu, kas ietver personas atbildību par radīšanu. @lv
toolkit label: ir radītājs (persona) darbam @lv
toolkit definition: Darbs, kas ietver personas atbildību par radīšanu. @lv
label: 是……的作品的创作者个人 @zh-hans
definition: 将一个个人与涉及一个创作个人的责任的一种作品关联起来。 @zh-hans
toolkit label: ……的作品的创作者个人 @zh-hans
toolkit definition: 涉及一个创作个人的责任的一种作品 @zh-hans
label: eserinin yaratıcı kişisidir @tr
definition: Bir kişiyi, yaratma sorumluluğunu içeren bir eserle ilişkilendirir. @tr
toolkit label: eserin yaratıcısı @tr
toolkit definition: Bir kişinin yaratım sorumluluğunu içeren bir eser. @tr
has subproperty: aggregaattori (henkilö) teoksessa
has subproperty: respondentti teoksessa
has subproperty: henkilö muutoksenhakijan vastapuolena teoksessa
has subproperty: henkilö vastaajana kanteessa
has subproperty: arkkitehti (henkilö) teoksessa
has subproperty: taiteilija (henkilö) teoksessa
has subproperty: kirjoittaja (henkilö) teoksessa
has subproperty: tuomari teoksessa
has subproperty: teoksen kartantekijä (henkilö) teoksessa
has subproperty: roolittaja (henkilö) teoksessa
has subproperty: koreografi (henkilö) teoksessa

yhteisövastaaja rikosoikeudessa teoksessa
status: Published
label: is criminal defendant corporate body of @en
lexical alias: criminalDefendantCorporateBodyOf.en
definition: Relates a corporate body to a work that involves a responsibility for being accused as a corporate body in a criminal proceeding. @en
toolkit label: criminal defendant corporate body of @en
toolkit definition: A work that involves a responsibility for being accused as a corporate body in a criminal proceeding. @en
type: Property
domain: C10005
sub property of: yhteisö vastaajana kanteessa
has element type: 2
definition: Liittää yhteisön teokseen, jossa yhteisö on syytettynä rikosprosessissa.
toolkit label: yhteisövastaaja rikosoikeudessa teoksessa
toolkit definition: Teos, jossa yhteisö on syytettynä rikosprosessissa.
label: er strafferettslig saksøkt korporasjon for @no
definition: Relaterer en korporasjon til et verk som involverer et ansvar for å være en saksøkt korporasjon i en straffesak. @no
toolkit label: strafferettslig saksøkt korporasjon for @no
toolkit definition: Et verk som involverer et ansvar for å være en saksøkt korporasjon i en straffesak. @no
label: is criminele verdachte-corporatie van @nl
definition: Relateert een corporatie aan een werk dat met zich meebrengt een verantwoordelijkheid voor het beschuldigd worden als een corporatie in een strafproces. @nl
toolkit label: criminele verdachte-corporatie van @nl
toolkit definition: Een werk dat met zich meebrengt een verantwoordelijkheid voor het beschuldigd worden als een corporatie in een strafproces. @nl
label: هي هيئة مدعى عليها جنائياً لـ @ar
definition: يربط هيئة بعمل يترتب عليه مسئولية اتهامها كهيئة في دعوى جنائية. @ar
toolkit label: هيئة مدعى عليها جنائياً @ar
toolkit definition: عمل يترتب عليه مسئولية اتهامها كهيئة في دعوى جنائية. @ar
label: és entitat corporativa acusada penal de @ca
definition: Relaciona una entitat corporativa amb una obra que implica una responsabilitat de ser acusada com a entitat corporativa en un procés penal. @ca
toolkit label: entitat corporativa acusada penal de @ca
toolkit definition: Obra que implica una responsabilitat de ser acusada com a entitat corporativa en un procés penal. @ca
label: er korporation, som er sagsøgt af @da
definition: Relaterer en korporation til et værk, som involverer et ansvar for at være en anklaget korporation i en straffesag. @da
toolkit label: korporation, som er sagsøgt af @da
toolkit definition: Værk, som involverer et ansvar for at være en anklaget korporation i en straffesag. @da
label: süüdistatav (asutus) teoses @et
definition: Seostab asutuse teosega, mis sisaldab asutuse vastu esitatud süüdistust kriminaalkohtumenetluses. @et
toolkit label: süüdistatav (asutus) teoses @et
toolkit definition: Teos, mis sisaldab asutuse vastu esitatud süüdistust kriminaalkohtumenetluses. @et
label: ist Körperschaft als Angeklagte/Angeklagter in einem Strafverfahren von @de
definition: Setzt eine Körperschaft in Beziehung zu einem Werk, das mit einer Verantwortung verbunden ist, als Körperschaft in einem Strafverfahren angeklagt zu sein. @de
toolkit label: Körperschaft als Angeklagte/Angeklagter in einem Strafverfahren von @de
toolkit definition: Ein Werk, das mit einer Verantwortung verbunden ist, als Körperschaft in einem Strafverfahren angeklagt zu sein. @de
label: bűnvádi eljárás alperes testülete a következőnek: @hu
definition: Hozzákapcsol egy testületet egy műhöz, amelyhez hozzátartozik annak felelőssége, hogy egy testületet egy büntetőeljárásban megvádolnak. @hu
toolkit label: bűnvádi eljárás alperes testülete: @hu
toolkit definition: Egy mű, amelyhez hozzátartozik annak felelőssége, hogy egy testületet egy büntetőeljárásban megvádolnak. @hu
label: è imputato penale ente di @it
definition: Correla un ente a un'opera che implica una responsabilità nell'essere accusato come ente in un processo criminale. @it
toolkit label: imputato penale ente di @it
toolkit definition: Opera che implica una responsabilità nell'essere accusato come ente in un processo criminale. @it
label: είναι ποινικά εναγόμενο συλλογικό όργανο του @el
toolkit label: ποινικά εναγόμενο συλλογικό όργανο του @el
label: est une collectivité défenderesse criminelle de @fr
definition: Met une collectivité en relation avec une œuvre qui comporte une responsabilité consistant à être accusée en tant que collectivité dans une poursuite criminelle. @fr
toolkit label: collectivité défenderesse criminelle de @fr
toolkit definition: Œuvre qui comporte une responsabilité consistant à être accusée en tant que collectivité dans une poursuite criminelle. @fr
label: ir atbildētājs kriminālprocesā (institūcija) @lv
definition: Sasaista institūciju ar darbu, kas ietver atbildību par to, ka institūcija apsūdzēta kriminālprocesā. @lv
toolkit label: ir atbildētājs kriminālprocesā (institūcija) @lv
toolkit definition: Darbs, kas ietver atbildību par to, ka institūcija apsūdzēta kriminālprocesā. @lv
label: 是……的刑事被告团体 @zh-hans
definition: 将一个团体与涉及在一项刑事诉讼中作为团体被指控的一个责任的一种作品关联起来。 @zh-hans
toolkit label: ……的刑事被告团体 @zh-hans
toolkit definition: 涉及在一项刑事诉讼中作为团体被指控的一个责任的一种作品 @zh-hans
label: sanık tüzel kişisidir @tr
definition: Bir tüzel kişiyi, bir ceza davasında tüzel kişi olarak suçlanma sorumluluğunu içeren bir eserle ilişkilendirir. @tr
toolkit label: suç sanığı tüzel kişi @tr
toolkit definition: Bir ceza davasında tüzel bir kişi olarak suçlanma sorumluluğunu içeren bir çalışma. @tr
has subproperty: P50454

henkilövastaaja rikosoikeudessa teoksessa
status: Published
label: is criminal defendant person of @en
lexical alias: criminalDefendantPersonOf.en
definition: Relates a person to a work that involves a responsibility for being accused as a person in a criminal proceeding. @en
toolkit label: criminal defendant person of @en
toolkit definition: A work that involves a responsibility for being accused as a person in a criminal proceeding. @en
type: Property
domain: C10004
sub property of: henkilö vastaajana kanteessa
has element type: 2
definition: Liittää rikosprosessissa syytetyn henkilön teokseen.
toolkit label: henkilövastaaja rikosoikeudessa teoksessa
toolkit definition: Teos, jossa henkilö on syytettynä rikosprosessissa.
label: er strafferettslig saksøkt person for @no
definition: Relaterer en person til et verk som involverer et ansvar for å være en saksøkt person i en straffesak. @no
toolkit label: strafferettslig saksøkt person for @no
toolkit definition: Et verk som involverer et ansvar for å være en saksøkt person i en straffesak. @no
label: is criminele verdachte-persoon van @nl
definition: Relateert een persoon aan een werk dat met zich meebrengt een verantwoordelijkheid voor het beschuldigd worden als een persoon in een strafproces. @nl
toolkit label: criminele verdachte-persoon van @nl
toolkit definition: Een werk dat met zich meebrengt een verantwoordelijkheid voor het beschuldigd worden als een persoon in een strafproces. @nl
label: هو شخص مدعى عليه جنائيا لـ @ar
definition: يربط شخصا بعمل يترتب عليه مسئولية اتهامه كشخص في دعوى جنائية. @ar
toolkit label: شخص مدعى عليه جنائيا @ar
toolkit definition: عمل يترتب عليه مسئولية اتهامه كشخص في دعوى جنائية. @ar
label: és persona acusada penal de @ca
definition: Relaciona una persona amb una obra que implica una responsabilitat de ser acusada com a persona en un procés penal. @ca
toolkit label: persona acusada penal de @ca
toolkit definition: Obra que implica una responsabilitat de ser acusada com a persona en un procés penal. @ca
label: er person, som er sagsøgt af @da
definition: Relaterer en person til et værk, som involverer et ansvar for at være en anklaget person i en straffesag. @da
toolkit label: person, som er sagsøgt af @da
toolkit definition: Værk, som involverer et ansvar for at være en anklaget person i en straffesag. @da
label: süüdistatav (isik) teoses @et
definition: Seostab isiku teosega, mis sisaldab isiku vastu esitatud süüdistust kriminaalkohtumenetluses. @et
toolkit label: süüdistatav (isik) teoses @et
toolkit definition: Teos, mis sisaldab isiku vastu esitatud süüdistust kriminaalkohtumenetluses. @et
label: ist Person als Angeklagte/Angeklagter in einem Strafverfahren von @de
definition: Setzt eine Person in Beziehung zu einem Werk, das mit einer Verantwortung verbunden ist, als Person in einem Strafverfahren angeklagt zu sein. @de
toolkit label: Person als Angeklagte/Angeklagter in einem Strafverfahren von @de
toolkit definition: Ein Werk, das mit einer Verantwortung verbunden ist, als Person in einem Strafverfahren angeklagt zu sein. @de
label: bűnvádi eljárás alperes személye a következőnek: @hu
definition: Hozzákapcsol egy személyt egy műhöz, amelyhez hozzátartozik annak felelőssége, hogy egy személyt egy büntetőeljárásban megvádolnak. @hu
toolkit label: bűnvádi eljárás alperes személye: @hu
toolkit definition: Egy mű, amelyhez hozzátartozik annak felelőssége, hogy egy személyt egy büntetőeljárásban megvádolnak. @hu
label: è imputato penale persona di @it
definition: Correla una persona a un'opera che implica una responsabilità nell'essere accusato come persona in un processo criminale. @it
toolkit label: imputato penale persona di @it
toolkit definition: Opera che implica una responsabilità nell'essere accusato come persona in un processo criminale. @it
label: είναι ποινικά εναγόμενο φυσικό πρόσωπο του @el
toolkit label: ποινικά εναγόμενο φυσικό πρόσωπο του @el
label: est une personne défenderesse criminelle de @fr
definition: Met une personne en relation avec une œuvre qui comporte une responsabilité consistant à être accusée en tant que personne dans une poursuite criminelle. @fr
toolkit label: personne défenderesse criminelle de @fr
toolkit definition: Œuvre qui comporte une responsabilité consistant à être accusée en tant que personne dans une poursuite criminelle. @fr
label: ir atbildētājs kriminālprocesā (persona) @lv
definition: Sasaista personu ar darbu, kas ietver atbildību par to, ka persona apsūdzēta kriminālprocesā. @lv
toolkit label: ir atbildētājs kriminālprocesā (persona) @lv
toolkit definition: Darbs, kas ietver atbildību par to, ka persona apsūdzēta kriminālprocesā. @lv
label: 是……的刑事被告个人 @zh-hans
definition: 将一个个人与涉及在一项刑事诉讼中作为个人被指控的一个责任的一种作品关联起来。 @zh-hans
toolkit label: ……的刑事被告个人 @zh-hans
toolkit definition: 涉及在一项刑事诉讼中作为个人被指控的一个责任的一种作品 @zh-hans
label: sanık kişisidir @tr
definition: Bir kişiyi, bir ceza davasında kişi olarak suçlanma sorumluluğunu içeren bir eserle ilişkilendirir. @tr
toolkit label: suç sanığı kişi @tr
toolkit definition: Bir ceza davasında kişi olarak suçlanma sorumluluğunu içeren bir çalışma. @tr
has subproperty: P50455

henkilöjäsen suvussa
status: Published
label: is person member of family of @en
definition: Relates a person to a family of whom a person is a member. @en
type: Property
domain: C10004
lexical alias: personMemberOfFamilyOf.en
toolkit label: person member of family of @en
toolkit definition: A family of whom a person is a member. @en
label: est une personne membre d’une famille de @fr
definition: Met une personne en relation avec une famille dont une personne est membre. @fr
toolkit label: personne membre d’une famille de @fr
toolkit definition: Famille dont une personne est membre. @fr
toolkit label: familia @es
toolkit definition: Una familia a la cual la persona pertenece. @es
instruction number: 29.5
label: είναι φυσικό πρόσωπο μέλος της οικογένειας του @el
definition: Συνδέει ένα φυσικό πρόσωπο με μια οικογένεια στην οποία ανήκει το φυσικό πρόσωπο. @el
toolkit label: φυσικό πρόσωπο μέλος της οικογένειας του @el
toolkit definition: Μια οικογένεια στην οποία ανήκει ένα φυσικό πρόσωπο. @el
definition: Setzt eine Person in Beziehung zu einer Familie, zu der eine Person gehört. @de
toolkit label: Person als Familienmitglied von @de
toolkit definition: Eine Familie, zu der eine Person gehört. @de
label: er person, som er medlem af familie af @da
definition: Relaterer en person til en familie, som en person er medlem af. @da
toolkit label: person, som er medlem af familie af @da
toolkit definition: Familie, som en person er medlem af. @da
label: és persona membre d’una família de @ca
definition: Relaciona una persona amb una família de la qual una persona n’és membre. @ca
toolkit label: persona membre d’una família de @ca
toolkit definition: Família de la qual una persona n’és membre. @ca
definition: Liittää henkilön sukuun, johon henkilö kuuluu.
toolkit label: henkilöjäsen suvussa
toolkit definition: Suku, johon henkilö kuuluu.
toolkit label: medlem av familie for (person) @no
toolkit definition: En familie som en person er medlem av. @no
label: ist Person als Familienmitglied von @de
alternative label: family @en
sub property of: henkilöön liittyvä suku
sub property of: henkilöjäsen yhteistoimijassa
has element type: 2
label: személy tagja a következő családnak: @hu
definition: Hozzákapcsol egy személyt egy családhoz, amelynek egy személy a tagja. @hu
toolkit label: személy tagja a következő családnak: @hu
toolkit definition: Egy család, amelynek egy személy a tagja. @hu
alternative label: suku
label: er medlem av familie for (person) @no
definition: Relaterer en person til en familie som en person er medlem av. @no
alternative label: familie @no
label: is persoonlijk lid van familie van @nl
definition: Relateert een persoon aan een familie waarvan een persoon lid is. @nl
toolkit label: persoonlijk lid van familie van @nl
toolkit definition: Een familie waarvan een persoon lid is. @nl
label: هو شخص عضو في عائلة لـ @ar
definition: يربط شخصا بعائلة لديها شخص عضو فيها. @ar
alternative label: عائلة @ar
toolkit label: شخص عضو في عائلة @ar
toolkit definition: عائلة لديها شخص عضو. @ar
alternative label: família @ca
label: perekonna liige (isik) perekonnas @et
definition: Seostab isiku perekonnaga, mille liige isik on. @et
alternative label: perekond @et
toolkit label: perekonna liige (isik) perekonnas @et
toolkit definition: Perekond, mille liige isik on. @et
alternative label: Familie @de
alternative label: családja: @hu
label: è membro persona di famiglia @it
definition: Correla una persona a una famiglia di cui una persona è membro. @it
alternative label: famiglia @it
toolkit label: persona membro di famiglia @it
toolkit definition: Famiglia di cui una persona è membro. @it
alternative label: οικογένεια @el
alternative label: famille @fr
label: ir dzimtas/ģimenes dalībnieks (persona) @lv
definition: Sasaista personu ar dzimtu/ģimeni, kam pievienojas persona. @lv
toolkit label: ir dzimtas/ģimenes dalībnieks (persona) @lv
toolkit definition: Dzimta/ģimene, kam pievienojas persona. @lv
alternative label: 家族 @zh-hans
label: 是……家族的个人成员 @zh-hans
toolkit label: ……家族的个人成员 @zh-hans
toolkit definition: 一个个人是其成员的一个家族 @zh-hans

suvun tunniste
status: Published
label: has identifier for family @en
definition: Relates a family to a nomen that is an appellation of family that consists of a code, number, or other string, usually independent of natural language and social naming conventions, used to identify a family. @en
type: Property
domain: C10008
lexical alias: identifierForFamily.en
toolkit label: identifier for family @en
toolkit definition: A nomen that is an appellation of family that consists of a code, number, or other string, usually independent of natural language and social naming conventions, used to identify a family. @en
label: a pour identifiant de famille @fr
definition: Met une famille en relation avec un nomen qui est une appellation de famille consistant en un code, un nombre ou une autre chaîne, généralement indépendante du langage naturel et des conventions sociales de dénomination, utilisée pour identifier une famille. @fr
scope note: L’identifiant sert à différencier une famille d’autres familles. @fr
toolkit label: identifiant de famille @fr
toolkit definition: Nomen qui est une appellation de famille consistant en un code, un nombre ou une autre chaîne, généralement indépendante du langage naturel et des conventions sociales de dénomination, utilisée pour identifier une famille. @fr
toolkit label: identificador de la familia @es
toolkit definition: Una cadena de caracteres solamente asociada con una familia, o con un sustituto de una familia (por ej., un registro de autoridad). @es
label: har identifikator för familjen/släkten @sv
toolkit label: identifikator för familjen/släkten @sv
label: έχει αναγνωριστικό για την οικογένεια @el
definition: Συνδέει μια οικογένεια με έναν αλφαριθμητικό χαρακτήρα μοναδικά συνδεδεμένο με μία οικογένεια ή με ένα υποκατάστατο, όπως μία καθιερωμένη εγγραφή για μια οικογένεια. @el
scope note: Το αναγνωριστικό χρησιμοποιείται για τη διαφοροποίηση μιας οικογένειας από άλλες οικογένειες. @el
toolkit label: αναγνωριστικό για την οικογένεια @el
toolkit definition: Ένας αλφαριθμητικός χαρακτήρας μοναδικά συνδεδεμένος με μια οικογένεια ή με ένα υποκατάστατο, όπως μία καθιερωμένη εγγραφή για μια οικογένεια. @el
definition: Setzt eine Familie in Beziehung zu einer Bezeichnung für eine Familie, die aus einem Code, einer Nummer oder einer anderen Zeichenkette besteht, der/die normalerweise nicht in natürlicher Sprache und unabhängig von den sozialen Benennungskonventionen ist und zur Identifizierung einer Familie verwendet wird. @de
scope note: Der Identifikator dient dazu, diese Familie von anderen Familien zu unterscheiden. @de
toolkit label: Identifikator für eine Familie @de
toolkit definition: Eine Bezeichnung für eine Familie, die aus einem Code, einer Nummer oder einer anderen Zeichenkette besteht, der/die normalerweise nicht in natürlicher Sprache und unabhängig von den sozialen Benennungskonventionen ist und zur Identifizierung einer Familie verwendet wird. @de
label: har identifikator for familie @da
definition: Relaterer en familie til et nomen, som er en benævnelse på familie, som består af en kode, nummer eller anden streng, sædvanligvis upåvirket af normalsprog og sociale navngivningskonventioner, brugt til at identificere en familie. @da
scope note: Identifikatoren tjener til at skelne en familie fra andre familier. @da
toolkit label: identifikator for familie @da
toolkit definition: Nomen, som er en benævnelse på familie, som består af en kode, nummer eller anden streng, sædvanligvis upåvirket af normalsprog og sociale navngivningskonventioner, brugt til at identificere en familie. @da
label: té com a identificador de família @ca
definition: Relaciona una família amb un nomen que és una apel·lació d’una família que consisteix en un codi, un número o qualsevol altra cadena, normalment independent del llenguatge natural i de les convencions lingüístiques socials, usada per identificar una família. @ca
toolkit label: identificador de família @ca
toolkit definition: Nomen que és una apel·lació d’una família que consisteix en un codi, un número o qualsevol altra cadena, normalment independent del llenguatge natural i de les convencions lingüístiques socials, usada per identificar una família. @ca
definition: Liittää suvun nomeniin, joka on suvun nimitys, joka koostuu koodista, luvusta tai muusta tavallisesti luonnollisesta kielestä ja yleisistä nimeämiskäytännöistä riippumattomasta merkkijonosta, jota käytetään suvun identifiointiin.
scope note: Tunniste erottaa suvun muista suvuista.
toolkit label: suvun tunniste
toolkit definition: Suvun identifioimiseen käytetty nomen, joka on nimitys, joka koostuu koodista, luvusta tai muusta merkkijonosta, joka on tavallisesti riippumaton luonnollisesta kielestä tai yleisistä nimeämiskäytännöistä.
toolkit definition: En betegnelse for familie som består av en kode, et nummer eller annen streng, vanligvis uavhengig av naturlig språk og sosiale navnekonvensjoner, brukt for å identifisere en familie. @no
label: hat Identifikator für eine Familie @de
sub property of: suvun nimitys
sub property of: yhteistoimijan tunniste
has element type: 3
label: család azonosítója a következő: @hu
definition: Hozzákapcsol egy családot egy nomenhez, egy család megnevezéséhez, amely kódból, számból vagy egyéb karakterláncból áll, általában a természetes nyelvtől és társadalmi elnevezési konvencióktól független, és egy család azonosítására használják. @hu
toolkit label: családazonosító: @hu
toolkit definition: Egy nomen, amely egy család megnevezése, kódból, számból vagy egyéb karakterláncból áll, általában a természetes nyelvtől és társadalmi elnevezési konvencióktól független, és egy család azonosítására használják. @hu
instruction number: 10.1
definition: Relaterer en famile til en betegnelse for familie som består av en kode, et nummer eller annen streng, vanligvis uavhengig av naturlig språk og sosiale navnekonvensjoner, brukt for å identifisere en familie. @no
label: heeft identificatie voor familie @nl
definition: Relateert een familie aan een nomen dat is een benaming van familie die bestaat uit een code, nummer of andere tekenreeks, meestal onafhankelijk van natuurlijke taal en gewoonlijke naamgevingsconventies, gebruikt om een familie te identificeren. @nl
toolkit label: identificatie voor familie @nl
toolkit definition: Een nomen dat is een benaming van familie die bestaat uit een code, nummer of andere tekenreeks, meestal onafhankelijk van natuurlijke taal en gewoonlijke naamgevingsconventies, gebruikt om een familie te identificeren. @nl
label: له معرِّف لعائلة @ar
definition: يربط عائلة بتسمية هي اسم عائلة يتكون من رمز، أو رقم، أو سلسلة تمثيلات أخرى، عادة ما تكون مختلفة عن اللغة الطبيعية وعن التسميات المتعارف عليها اجتماعيا، المستخدمة في تعريف عائلة. @ar
toolkit label: معرِّف لعائلة @ar
toolkit definition: تسمية هي اسم عائلة يتكون من رمز، أو رقم، أو سلسلة تمثيلات أخرى، عادة ما تكون مختلفة عن اللغة الطبيعية وعن التسميات المتعارف عليها اجتماعيا، المستخدمة في تعريف عائلة. @ar
label: perekonna identifikaator @et
definition: Seostab perekonna perekonna nimetusega, mis koosneb perekonda identifitseerivast koodist, numbrist või muust loomulikust keelest ja üldtuntud nimetamistavadest sõltumatust stringist. @et
toolkit label: perekonna identifikaator @et
toolkit definition: Perekonna nimetus, mis koosneb perekonda identifitseerivast koodist, numbrist või muust loomulikust keelest ja üldtuntud nimetamistavadest sõltumatust stringist. @et
label: ha come identificatore di famiglia @it
definition: Correla una famiglia a una denominazione di famiglia appartiene che consiste di un codice, numero o altra sequenza di caratteri, solitamente indipendente dal linguaggio naturale e dalle convenzioni sociali di denominazione, usati per identificare una famiglia. @it
toolkit label: identificatore di famiglia @it
toolkit definition: Denominazione di famiglia che consiste di un codice, numero o altra sequenza di caratteri, solitamente indipendente dal linguaggio naturale e dalle convenzioni sociali di denominazione, usati per identificare una famiglia. @it
label: dzimtas/ģimenes identifikators @lv
definition: Sasaista dzimtu/ģimeni ar nomenu, kas ir dzimtas/ģimenes apzīmējums, kas sastāv no koda, skaitļa vai citas virknes, kas parasti ir neatkarīgs no dabiskas valodas vai sabiedrībā pieņemtām nosaukšanas tradīcijām, ko izmanto, lai identificētu dzimti/ģimenei. @lv
toolkit label: dzimtas/ģimenes identifikators @lv
toolkit definition: Dzimtas/ģimenes apzīmējums, kas sastāv no koda, skaitļa vai citas virknes, kas parasti ir neatkarīgs no dabiskas valodas vai sabiedrībā pieņemtām nosaukšanas tradīcijām, ko izmanto, lai identificētu dzimti/ģimenei. @lv
label: 有给家族的标识符 @zh-hans
definition: 将一个家族与一个作为家族的称谓、由代码、数字或其他字符串构成、通常独立于自然语言和社会命名惯例、用以识别一个家族的命名关联起来。 @zh-hans
toolkit label: 给家族的标识符 @zh-hans
toolkit definition: 一个作为家族的称谓、由代码、数字或其他字符串构成、通常独立于自然语言和社会命名惯例、用以识别一个家族的命名 @zh-hans
label: ailenin tanımlayıcısı ile ilişkilidir @tr
definition: Bir aileyi, bir aileyi tanımlamak için kullanılan, genellikle doğal dil ve sosyal adlandırma kurallarından bağımsız bir kod, sayı veya başka bir dizeden oluşan bir aile adı olan bir isimle ilişkilendirir. @tr
toolkit label: ailenin tanımlayıcısı ile ilişkilidir @tr
toolkit definition: Bir aileyi tanımlamak için kullanılan, genellikle doğal dil ve sosyal adlandırma kurallarından bağımsız bir kod, sayı veya başka bir dizeden oluşan bir aile unvanı olan isim. @tr
has subproperty: P50052

sukuun liittyvä paikka
status: Deprecated
label: has place associated with family (Deprecated) @en
definition: Relates a family to a place that is associated with a family. (Deprecated) @en
type: Property
domain: C10008
lexical alias: placeAssociatedWithFamily.en
instruction number: 10.5
toolkit label: place associated with family (Deprecated) @en
toolkit definition: A place that is associated with a family. (Deprecated) @en
label: a pour lieu associé à une famille @fr
definition: Met une famille en relation avec un lieu où une famille réside ou a résidé ou avec lequel elle a une relation quelconque. @fr
toolkit label: lieu associé à une famille @fr
toolkit definition: Lieu où une famille réside ou a résidé ou avec lequel elle a une relation quelconque. @fr
toolkit label: lugar asociado con la familia @es
toolkit definition: Un lugar donde reside la familia, o donde ha residido o que tiene alguna conexión. @es
label: har ort förknippad med familjen/släkten @sv
toolkit label: ort förknippad med familjen/släkten @sv
label: έχει τόπο συνδεδεμένο με την οικογένεια @el
definition: Συνδέει μια οικογένεια με έναν τόπο όπου η οικογένεια κατοικεί ή έχει κατοικήσει ή έχει κάποια σύνδεση. @el
toolkit label: τόπος συνδεδεμένος με την οικογένεια @el
toolkit definition: Ένας τόπος, όπου η οικογένεια κατοικεί ή κατοίκησε ή με τον οποίο διατηρεί κάποια σχέση. @el
definition: Setzt eine Familie mit einem Ort, an dem eine Familie wohnt, gewohnt hat oder zu dem sie eine Verbindung hat, in Beziehung. @de
toolkit label: Ort, der mit einer Familie in Verbindung steht @de
toolkit definition: Ein Ort, an dem eine Familie wohnt, gewohnt hat oder zu dem sie eine Verbindung hat. @de
label: har sted forbundet med familien @da
definition: Relaterer til et sted, hvor en familie bor eller har boet, eller som familien har en forbindelse til. @da
toolkit label: sted forbundet med familien @da
toolkit definition: Sted, hvor en familie bor eller har boet, eller som familien har en forbindelse til. @da
label: té com a lloc associat amb una família @ca
definition: Relaciona una família amb un lloc on una família resideix o ha residit o amb el qual té algun tipus de relació. @ca
toolkit label: lloc associat amb una família @ca
toolkit definition: Lloc on una família resideix o ha residit o amb el qual té algun tipus de relació. @ca
definition: Liittää suvun paikkaan, jossa suku asuu tai on asunut, tai johon sillä on jokin muu yhteys.
toolkit label: sukuun liittyvä paikka
toolkit definition: Paikka, jossa suku asuu tai on asunut, tai johon sillä on jokin muu yhteys.
toolkit label: sted som forbindes med familien @no
toolkit definition: Et sted hvor familien bor, har bodd, eller har tilknytning til. @no
label: hat Ort, der mit einer Familie in Verbindung steht @de
sub property of: sukuun liittyvä paikka
has element type: 2
label: van családdal kapcsolatos helye @hu
definition: Egy családot hozzákapcsol egy helyhez, ahol egy család lakik vagy lakott vagy valami kapcsolata van vele. @hu
toolkit label: családhoz kötődő hely @hu
toolkit definition: Egy hely, ahol egy család lakik vagy lakott, vagy amellyel bizonyos kapcsolata van. @hu
has subproperty: P50057

sukuun liittyvä ajankohta
status: Deprecated
label: has date associated with family (Deprecated) @en
definition: Relates a family to a timespan that has a significant association with a family. (Deprecated) @en
type: Property
domain: C10008
lexical alias: dateAssociatedWithFamily.en
instruction number: 10.4
toolkit label: date associated with family (Deprecated) @en
toolkit definition: A timespan that has a significant association with a family. (Deprecated) @en
label: a pour date associée à une famille @fr
definition: Met une famille en relation avec une date importante associée à une famille. @fr
toolkit label: date associée à une famille @fr
toolkit definition: Date importante associée à une famille. @fr
toolkit label: fecha asociada con la familia @es
toolkit definition: Una fecha significativa asociada con la familia. @es
label: har tid förknippad med famliljen/släkten @sv
toolkit label: tid förknippad med famliljen/släkten @sv
label: έχει χρονολογία συνδεδεμένη με την οικογένεια @el
definition: Συνδέει μια οικογένεια με μια σημαντική χρονολογία συνδεδεμένη με την οικογένεια. @el
toolkit label: χρονολογία συνδεδεμένη με την οικογένεια @el
toolkit definition: Μια σημαντική χρονολογία συνδεδεμένη με μια οικογένεια. @el
definition: Setzt eine Familie mit einem wichtigen Datum, das mit der Geschichte einer Familie in Verbindung steht, in Beziehung. @de
toolkit label: Datum, das mit einer Familie in Verbindung steht @de
toolkit definition: Ein wichtiges Datum, das mit der Geschichte einer Familie in Verbindung steht. @de
label: har dato knyttet til familien @da
definition: Relaterer en familie til et væsentlig dato forbundet med en familie. @da
toolkit label: dato knyttet til familien @da
toolkit definition: Væsentlig dato forbundet med en familie. @da
label: té com a data associada amb una família @ca
definition: Relaciona una família amb una data significativa associada amb una família. @ca
toolkit label: data associada amb una família @ca
toolkit definition: Data significativa associada amb una família. @ca
definition: Liittää suvun sukuun liittyvän merkittävän ajankohdan.
toolkit label: sukuun liittyvä ajankohta
toolkit definition: Sukuun liittyvä merkittävä ajankohta.
toolkit label: tidspunkt som forbindes med familien @no
toolkit definition: Et viktig tidspunkt som kan forbindes med en familie. @no
label: hat Datum, das mit einer Familie in Verbindung steht @de
sub property of: sukuun liittyvä ajanjakso
has element type: 3
label: van családdal kapcsolatos időpontja @hu
definition: Egy családot hozzákapcsol egy családhoz kötődő fontos időponthoz. @hu
toolkit label: családhoz kötődő időpont @hu
toolkit definition: Egy fontos időpont, amely kötődik egy családhoz. @hu
has subproperty: P50058

suvun ensisijainen nimi
status: Published
label: has preferred name of family @en
definition: Relates a family to a nomen that is a name of family that is selected for preference in a specific application or context. @en
type: Property
domain: C10008
sub property of: suvun nimi
lexical alias: preferredNameOfFamily.en
instruction number: 10.2.2
toolkit label: preferred name of family @en
toolkit definition: A nomen that is a name of family that is selected for preference in a specific application or context. @en
label: a pour nom privilégié d’une famille @fr
definition: Met une famille en relation avec un nomen qui est un nom d’une famille faisant l’objet d’un choix privilégié dans une application ou un contexte spécifiques. @fr
toolkit label: nom privilégié d’une famille @fr
toolkit definition: Nomen qui est un nom d’une famille faisant l’objet d’un choix privilégié dans une application ou un contexte spécifiques. @fr
toolkit label: nombre preferido de la familia @es
toolkit definition: El nombre o la forma del nombre elegida para identificar la familia. @es
label: har föredraget namn för familjen/släkten @sv
toolkit label: föredraget namn för familjen/släkten @sv
label: έχει προτιμώμενο όνομα της οικογένειας @el
definition: Συνδέει μια οικογένεια με ένα όνομα ή μορφή ονόματος που έχει επιλεγεί για την ταύτιση μιας οικογένειας. @el
toolkit label: προτιμώμενο όνομα της οικογένειας @el
toolkit definition: Ένα όνομα ή μορφή ονόματος που έχει επιλεγεί για την ταύτιση μιας οικογένειας. @el
definition: Setzt eine Familie in Beziehung zu einem Namen einer Familie, der in einer bestimmten Anwendung oder in einem bestimmten Kontext als Vorzugsform bestimmt wird. @de
toolkit label: Bevorzugter Name einer Familie @de
toolkit definition: Ein Name einer Familie, der in einer bestimmten Anwendung oder in einem bestimmten Kontext als Vorzugsform bestimmt wird. @de
label: har foretrukket navn på familie @da
definition: Relaterer en familie til et nomen, som er et navn på familie, som er valgt som præference i en specifik anvendelse eller kontekst. @da
toolkit label: foretrukket navn på familie @da
toolkit definition: Nomen, som er navn på familie, som er valgt som foretrukken i en specifik applikation eller kontekst. @da
label: té com a nom preferit de família @ca
definition: Relaciona una família amb un nomen que és un nom de família que se selecciona com a preferent en una aplicació o un context específic. @ca
toolkit label: nom preferit de família @ca
toolkit definition: Nomen que és un nom de família que se selecciona com a preferent en una aplicació o un context específic. @ca
definition: Liittää suvun nomeniin, joka on suvun nimi, joka on valittu ensisijaiseksi tietyssä sovelluksessa tai kontekstissa.
toolkit label: suvun ensisijainen nimi
toolkit definition: Nomen, joka on suvun nimi, joka on valittu ensisijaiseksi tietyssä sovelluksessa tai kontekstissa.
toolkit label: foretrukket familienavn @no
toolkit definition: Et navn på familie som er valgt som preferanse i en bestemt applikasjon eller kontekst. @no
label: hat bevorzugten Namen einer Familie @de
sub property of: yhteistoimijan ensisijainen nimi
has element type: 3
label: család előnyben részesített neve a következő: @hu
definition: Hozzákapcsol egy családot egy családnév nomenhez, amelyet egy bizonyos alkalmazásban vagy kontextusban előnyben részesítenek. @hu
toolkit label: család előnyben részesített neve: @hu
toolkit definition: Egy családnév nomen, amelyet egy bizonyos alkalmazásban vagy kontextusban előnyben részesítenek. @hu
alternative label: preferred name for family @en
label: har foretrukket familienavn @no
definition: Relaterer en familie til et navn på familie som er valgt som preferanse i en bestemt applikasjon eller kontekst. @no
label: heeft geprefereerde naam van familie @nl
definition: Relateert een familie aan een nomen dat is een naam van familie die de voorkeur heeft gekregen in een specifieke applicatie of context. @nl
toolkit label: geprefereerde naam van familie @nl
toolkit definition: Een nomen dat is een naam van familie die de voorkeur heeft gekregen in een specifieke applicatie of context. @nl
label: له اسم مفضل لعائلة @ar
definition: يربط عائلة بتسمية لعائلة اختيرت كاسم مفضل في تطبيق أو في سياق محدد. @ar
toolkit label: اسم مفضل لعائلة @ar
toolkit definition: اسم عائلة اختير كاسم مفضل في تطبيق أو في سياق محدد. @ar
label: perekonna eelisnimi @et
definition: Seostab perekonna perekonna nimega, mis kindlas rakenduses või kontekstis on valitud eelistatuks. @et
toolkit label: perekonna eelisnimi @et
toolkit definition: Perekonna nimi, mis kindlas rakenduses või kontekstis on valitud eelistatuks. @et
label: ha come nome preferito di famiglia @it
definition: Correla una famiglia a un nome di famiglia scelto come preferito in una specifica applicazione o contesto. @it
toolkit label: nome preferito di famiglia @it
toolkit definition: Nome di famiglia che è scelto come preferito in una specifica applicazione o contesto. @it
label: dzimtas/ģimenes prioritārais vārds @lv
definition: Sasaista dzimtu/ģimeni ar nomenu, kas ir dzimtas/ģimenes vārds, kurš ir izvēlēts noteiktam lietojumam vai noteiktā kontekstā. @lv
toolkit label: dzimtas/ģimenes prioritārais vārds @lv
toolkit definition: Dzimtas/ģimenes vārds, kurš ir izvēlēts noteiktam lietojumam vai noteiktā kontekstā. @lv
alternative label: اسم مفضل لعائلة @ar
alternative label: Foretrukket navn på familie @da
alternative label: Bevorzugter Name für eine Familie @de
alternative label: -
alternative label: 给家族的首选名称 @zh-hans
label: 有家族的首选名称 @zh-hans
definition: 将家族与作为家族的名称、在特定应用和语境下首选的一个命名关联起来。 @zh-hans
toolkit label: 家族的首选名称 @zh-hans
toolkit definition: 作为家族的名称、在特定应用和语境下首选的一个命名 @zh-hans
alternative label: nombre preferido para familia @es
alternative label: család előnyben részesített neve: @hu

suvusta polveutuva suku
status: Published
label: has descendant family of family @en
definition: Relates a family to a family who descends from another family. @en
type: Property
domain: C10008
lexical alias: descendantFamilyOfFamily.en
toolkit label: descendant family of family @en
toolkit definition: A family who descends from another family. @en
label: a pour famille descendante d’une famille @fr
definition: Met une famille en relation avec une famille qui descend d’une autre famille. @fr
toolkit label: famille descendante d’une famille @fr
toolkit definition: Famille qui descend d’une autre famille. @fr
toolkit label: familia descendiente @es
toolkit definition: Una familia que desciende de otra familia. @es
instruction number: 29.5
label: έχει επίγονο οικογένεια της οικογένειας @el
definition: Συνδέει μια οικογένεια με μια οικογένεια η οποία κατάγεται από μία άλλη οικογένεια. @el
toolkit label: επίγονος οικογένεια της οικογένειας @el
toolkit definition: Μια οικογένεια που κατάγεται από κάποια άλλη οικογένεια. @el
definition: Setzt eine Familie in Beziehung zu einer Familie, die von einer anderen Familie abstammt. @de
toolkit label: Abstammende Familie @de
toolkit definition: Eine Familie, die von einer anderen Familie abstammt. @de
label: har familie nedstammende af familie @da
definition: Relaterer en familie til en familie, som nedstammer fra en anden familie. @da
toolkit label: familie nedstammende af familie @da
toolkit definition: Familie, som nedstammer fra en anden familie. @da
label: té com a família descendent d’una família @ca
definition: Relaciona una família amb una família que descendeix d’una altra família. @ca
toolkit label: família descendent d’una família @ca
toolkit definition: Família que descendeix d’una altra família. @ca
definition: Liittää suvun sukuun, joka polveutuu toisesta suvusta.
toolkit label: suvusta polveutuva suku
toolkit definition: Suku, joka polveutuu toisesta suvusta.
toolkit label: etterkommende familie av familie @no
toolkit definition: En familie som er etterkommere av en annen familie. @no
label: hat abstammende Familie @de
has element type: 2
label: család leszármazott családja a következő: @hu
definition: Hozzákapcsol egy családot egy családhoz, amely egy másik családból származik. @hu
toolkit label: egy család leszármazott családja: @hu
toolkit definition: Egy család, amely egy másik családból származik. @hu
alternative label: descendant family @en
alternative label: polveutuva suku
label: har etterkommende familie av familie @no
definition: Relaterer en familie til en familie som er etterkommere av en annen familie. @no
sub property of: suvun sukuhaara
label: heeft afstammeling-familie van familie van @nl
definition: Relateert een familie aan een familie die afstamt van een andere familie. @nl
toolkit label: afstammeling-familie van familie van @nl
toolkit definition: Een familie die afstamt van een andere familie. @nl
label: له عائلة منحدرة من عائلة @ar
definition: يربط عائلة بعائلة منحدرة من عائلة أخرى. @ar
toolkit label: عائلة منحدرة من عائلة @ar
toolkit definition: عائلة منحدرة من عائلة أخرى. @ar
label: perekonnast põlvnev perekond @et
definition: Seostab perekonna perekonnaga, kes põlvneb teisest perekonnast. @et
toolkit label: perekonnast põlvnev perekond @et
toolkit definition: Perekond, kes põlvneb teisest perekonnast. @et
label: ha come famiglia discendente di famiglia @it
definition: Correla una famiglia a una famiglia che discende da un'altra famiglia. @it
toolkit label: famiglia discendente di famiglia @it
toolkit definition: Famiglia che discende da un'altra famiglia. @it
label: dzimtas/ģimenes pēcnācējs (dzimta/ģimene) @lv
definition: Sasaista dzimtu/ģimeni ar dzimtu/ģimeni, kas cēlusies no citas dzimtas/ģimenes. @lv
toolkit label: dzimtas/ģimenes pēcnācējs (dzimta/ģimene) @lv
toolkit definition: Dzimta/ģimene, kas cēlusies no citas dzimtas/ģimenes. @lv
alternative label: عائلة منحدرة @ar
alternative label: nedstammende familie @da
alternative label: família descendent @ca
alternative label: 后裔家族 @zh-hans
label: 有家族的后裔家族 @zh-hans
definition: 将一个家族与作为另一个家族后裔的一个家族关联起来。 @zh-hans
toolkit label: 家族的后裔家族 @zh-hans
toolkit definition: 作为另一个家族后裔的一个家族 @zh-hans
alternative label: familia descendiente @es
alternative label: famille descendante @fr
alternative label: leszármazott család: @hu
alternative label: soyundan gelen aile @tr
label: ailenin alt soy ailesi ile ilişkilidir @tr
toolkit label: alt soy ailesi @tr

suvun nimi
status: Published
label: has name of family @en
definition: Relates a family to a nomen that is an appellation of family in natural language and phrasing used in common discourse. @en
type: Property
domain: C10008
lexical alias: nameOfFamily.en
instruction number: 10.2
toolkit label: name of family @en
toolkit definition: A nomen that is an appellation of family in natural language and phrasing used in common discourse. @en
label: a pour nom d’une famille @fr
definition: Met une famille en relation avec un nomen qui est une appellation de famille exprimée dans un langage et une formulation naturels et utilisée dans le langage courant. @fr
toolkit label: nom d’une famille @fr
toolkit definition: Nomen qui est une appellation de famille exprimée dans un langage et une formulation naturels et utilisée dans le langage courant. @fr
toolkit label: nombre de la familia @es
toolkit definition: Una palabra, un carácter o grupo de palabras y/o caracteres mediante los cuales se conoce una familia. @es
label: έχει όνομα της οικογένειας @el
definition: Συνδέει μια οικογένεια με μια λέξη, χαρακτήρα ή ομάδα λέξεων ή/και χαρακτήρων με τους οποίους μια οικογένεια είναι γνωστή. @el
toolkit label: όνομα της οικογένειας @el
toolkit definition: Μια λέξη, χαρακτήρας ή ομάδα λέξων ή/και χαρακτήρων μέσω των οποίων είναι γνωστή μια οικογένεια. @el
definition: Setzt eine Familie in Beziehung zu einer Bezeichnung für eine Familie in natürlicher Sprache und Ausdrucksweise, die beim normalen Sprechen und Schreiben verwendet wird. @de
toolkit label: Name einer Familie @de
toolkit definition: Eine Bezeichnung für eine Familie in natürlicher Sprache und Ausdrucksweise, die beim normalen Sprechen und Schreiben verwendet wird. @de
label: har navn på familie @da
definition: Relaterer en familie til et nomen, som er en benævnelse på familie på normalsprog og med formuleringer, som bruges alment. @da
toolkit label: navn på familie @da
toolkit definition: Nomen, som er en benævnelse på familie på normalsprog og med formuleringer, som bruges alment. @da
label: té com a nom de família @ca
definition: Relaciona una família amb un nomen que és una apel·lació de família en llenguatge i frases naturals usada en el discurs comú. @ca
toolkit label: nom de família @ca
toolkit definition: Nomen que és una apel·lació de família en llenguatge i frases naturals usada en el discurs comú. @ca
definition: Liittää suvun nomeniin, joka on luonnollisella kielellä ja sanamuodolla oleva, yleisessä diskurssissa käytetty nimitys suvusta.
toolkit label: suvun nimi
toolkit definition: Nomen, joka on suvusta yleisessä diskurssissa käytetty nimitys, joka on luonnollisella kielellä ja luonnollisessa sanamuodossa.
toolkit label: familienavn @no
toolkit definition: En betegnelse for familie på et naturlig språk og med frasering brukt i alminnelig diskurs. @no
label: hat Namen einer Familie @de
sub property of: suvun nimitys
sub property of: yhteistoimijan nimi
has element type: 3
label: család neve a következő: @hu
definition: Hozzákapcsol egy családot egy nomenhez, egy család megnevezéséhez természetes nyelven és közbeszédben használt kifejezéssel. @hu
toolkit label: családnév: @hu
toolkit definition: Egy nomen, egy család megnevezése természetes nyelven és közbeszédben használt kifejezéssel. @hu
label: har familienavn @no
definition: Relaterer en familie til en betegnelse for familie på et naturlig språk og med frasering brukt i alminnelig diskurs. @no
label: heeft naam van familie @nl
definition: Relateert een familie aan een nomen dat is een benaming van familie in natuurlijke taal en formulering gebruikt in alledaags taalgebruik. @nl
toolkit label: naam van familie @nl
toolkit definition: Een nomen dat is een benaming van familie in natuurlijke taal en formulering gebruikt in alledaags taalgebruik. @nl
label: له اسم عائلة @ar
definition: يربط عائلة بتسمية لعائلة في اللغة الطبيعية وفي العبارات المستخدمة في الخطاب العام. @ar
toolkit label: اسم عائلة @ar
toolkit definition: تسمية هي اسم عائلة في اللغة الطبيعية وفي العبارات المستخدمة في الخطاب العام. @ar
label: perekonna nimi @et
definition: Seostab perekonna perekonna nimetusega loomulikus keeles ja sõnastuses, mida kasutatakse ühises diskursuses. @et
toolkit label: perekonna nimi @et
toolkit definition: Perekonna nimetus loomulikus keeles ja sõnastuses, mida kasutatakse ühises diskursuses. @et
label: dzimtas/ģimenes vārds/nosaukums @lv
definition: Sasaista dzimtu/ģimeni ar nomenu, kas ir dzimtas/ģimenes apzīmējums dabiskajā valodā, ko izmanto savstarpējā saziņā. @lv
toolkit label: dzimtas/ģimenes vārds/nosaukums @lv
toolkit definition: Dzimtas/ģimenes apzīmējums dabiskajā valodā, ko izmanto savstarpējā saziņā. @lv
label: 有家族的名称 @zh-hans
definition: 将一个家族与作为用自然语言和普通话语措词表达的家族的称谓的一个命名关联起来。 @zh-hans
toolkit label: 家族的名称 @zh-hans
toolkit definition: 作为用自然语言和普通话语措词表达的家族的称谓的一个命名 @zh-hans
label: ailenin adı ile ilişkilidir @tr
definition: Bir aileyi, doğal dilde ve ortak söylemde kullanılan ifadelerde, ailenin unvanı olan bir adla ilişkilendirir. @tr
toolkit label: aile adı @tr
toolkit definition: Doğal dilde ve ortak söylemde kullanılan ifadelerde, bir ailenin unvanı olan bir isim. @tr
has subproperty: suvun ensisijainen nimi
has subproperty: suvun varianttinimi
has subproperty: P50061

suvun varianttinimi
status: Published
label: has variant name of family @en
definition: Relates a family to a nomen that is a name of family that is not selected for preference in a specific application or context. @en
type: Property
domain: C10008
sub property of: suvun nimi
lexical alias: variantNameOfFamily.en
instruction number: 10.2.3
toolkit label: variant name of family @en
toolkit definition: A nomen that is a name of family that is not selected for preference in a specific application or context. @en
label: a pour variante de nom d’une famille @fr
definition: Met une famille en relation avec un nomen qui est un nom d’une famille ne faisant pas l’objet d’un choix privilégié dans une application ou un contexte spécifiques. @fr
toolkit label: variante de nom d’une famille @fr
toolkit definition: Nomen qui est un nom d’une famille ne faisant pas l’objet d’un choix privilégié dans une application ou un contexte spécifiques. @fr
toolkit label: variante del nombre de la familia @es
toolkit definition: Un nombre o una forma del nombre mediante el cual se conoce una familia, que difiere del nombre o la forma del nombre elegida como el nombre preferido. @es
label: har variantnamn för familjen/släkten @sv
toolkit label: variantnamn för familjen/släkten @sv
label: έχει εναλλακτικό όνομα της οικογένειας @el
definition: Συνδέει μια οικογένεια με ένα όνομα ή μορφή ονόματος με το οποίο η οικογένεια είναι γνωστή, το οποίο διαφέρει από το όνομα ή τη μορφή ονόματος που επιλέγεται ως το προτιμώμενο όνομα. @el
toolkit label: εναλλακτικό όνομα της οικογένειας @el
toolkit definition: Ένα όνομα ή μορφή ονόματος με το οποίο η οικογένεια είναι γνωστή, το οποίο διαφέρει από ένα όνομα ή μορφή ονόματος που έχει επιλεγεί ως το προτιμώμενο όνομα. @el
definition: Setzt eine Familie in Beziehung zu einem Namen einer Familie, der in einer bestimmten Anwendung oder in einem bestimmten Kontext nicht als Vorzugsform bestimmt wird. @de
scope note: Zu einem abweichenden Namen einer Familie gehört ein Name oder eine Namensform, der/die von einer Familie benutzt wird/werden oder wie er/sie in Nachschlagewerken gefunden wird/werden, ein Name der sich aus einer abweichenden Transliteration ergibt usw. @de
toolkit label: abweichender Name einer Familie @de
toolkit definition: Ein Name einer Familie, der in einer bestimmten Anwendung oder in einem bestimmten Kontext nicht als Vorzugsform bestimmt wird. @de
label: har variant af navn på familie @da
definition: Relaterer en familie til et navn på familie, som ikke er valgt som foretrukken i en specifik applikation eller kontekst. @da
toolkit label: variant af navn på familie @da
toolkit definition: Nomen, som er navn på familie, som ikke er valgt som foretrukken i en specifik applikation eller kontekst. @da
label: té com a variant de nom de família @ca
definition: Relaciona una família amb un nomen que és un nom de família que no se selecciona com a preferent en una aplicació o un context específic. @ca
toolkit label: variant de nom de família @ca
toolkit definition: Nomen que és un nom de família que no se selecciona com a preferent en una aplicació o un context específic. @ca
definition: Liittää suvun nomeniin, joka on nimi, jota ei ole valittu suvun ensisijaiseksi nimeksi tietyssä sovelluksessa tai kontekstissa.
scope note: Suvun varianttinimi käsittää suvun käyttämän nimen tai nimimudon, tietolähteissä käytetyn nimen tai nimimuodon, eri tavoin translitteroidun nimimuodon tms.
toolkit label: suvun varianttinimi
toolkit definition: Nomen, joka on suvun nimi, jota ei ole valittu suvun ensisijaiseksi nimeksi tietyssä sovelluksessa tai kontekstissa.
toolkit label: variantform av familienavn @no
toolkit definition: Et familienavn som ikke er valgt som preferanse i en bestemt applikasjon eller kontekst. @no
label: hat abweichenden Namen einer Familie @de
scope note: Το εναλλακτικό όνομα για την οικογένεια περιλαμβάνει ένα όνομα ή μια μορφή ονόματος που χρησιμοποιείται από μια οικογένεια ή εντοπίζεται στις πηγές αναφοράς, ένα όνομα που προκύπτει από έναν διαφορετικό μεταγραμματισμό ενός ονόματος κ.λπ. @el
scope note: Une variante de nom d’une famille comprend un nom ou une forme de nom utilisée par une famille ou trouvée dans les sources de référence, un nom qui résulte d’une translittération différente d’un nom, etc. @fr
sub property of: yhteistoimijan varianttinimi
has element type: 3
label: család névváltozata a következő: @hu
definition: Hozzákapcsol egy családot egy családnév nomenhez, amelyet egy bizonyos alkalmazásban vagy kontextusban nem részesítenek előnyben. @hu
toolkit label: család névváltozata: @hu
toolkit definition: Egy családnév nomen, amelyet egy bizonyos alkalmazásban vagy kontextusban nem részesítenek előnyben. @hu
alternative label: variant name for family @en
label: har variantform av familienavn @no
definition: Relaterer en familie til et familienavn som ikke er valgt som preferanse i en bestemt applikasjon eller kontekst. @no
label: heeft variant naam van familie @nl
definition: Relateert een familie aan een nomen dat is een naam van familie die niet de voorkeur heeft gekregen in een specifieke applicatie of context. @nl
toolkit label: variant naam van familie @nl
toolkit definition: Een nomen dat is een naam van familie die niet de voorkeur heeft gekregen in een specifieke applicatie of context. @nl
label: لها اسم عائلة مختلف @ar
definition: يربط عائلة باسم عائلة لم يُختر كاسم مفضل في تطبيق أو في سياق محدد. @ar
toolkit label: اسم مختلف لعائلة @ar
toolkit definition: اسم عائلة لم يُختر كاسم مفضل في تطبيق أو في سياق محدد. @ar
label: perekonna variantnimi @et
definition: Seostab perekonna perekonna nimega, mis kindlas rakenduses või kontekstis ei ole valitud eelistatuks. @et
toolkit label: perekonna variantnimi @et
toolkit definition: Perekonna nimi, mis kindlas rakenduses või kontekstis ei ole valitud eelistatuks. @et
label: ha come nome variante di famiglia @it
definition: Correla una famiglia a un nome di famiglia non scelto come preferito in una specifica applicazione o contesto. @it
toolkit label: nome variante di famiglia @it
toolkit definition: Nome di famiglia non scelto come preferito in una specifica applicazione o contesto. @it
label: dzimtas/ģimenes cits vārds @lv
definition: Sasaista dzimtu/ģimeni ar nomenu, kas ir dzimtas/ģimenes vārds, kurš nav izvēlēts kā prioritārs noteiktā lietojumprogrammā vai kontekstā. @lv
toolkit label: dzimtas/ģimenes cits vārds @lv
toolkit definition: Dzimtas/ģimenes vārds, kurš nav izvēlēts kā prioritārs noteiktā lietojumprogrammā vai kontekstā. @lv
alternative label: اسم مختلف لعائلة @ar
alternative label: variantnavn for familie @da
alternative label: Abweichender Name für eine Familie @de
alternative label: -
alternative label: 给家族的变异名称 @zh-hans
label: 有家族的变异名称 @zh-hans
definition: 将家族与作为家族的名称、但在特定应用和语境下不首选的一个命名关联起来。 @zh-hans

suvun käyttämä kieli
status: Published
label: has language of family @en
definition: Relates a family to a language that is used by a family in its communications. @en
type: Property
domain: C10008
lexical alias: languageOfFamily.en
instruction number: 10.8
toolkit label: language of family @en
toolkit definition: A language that is used by a family in its communications. @en
label: a pour langue d’une famille @fr
definition: Met une famille en relation avec une langue qu’une famille utilise pour sa communication. @fr
toolkit label: langue d’une famille @fr
toolkit definition: Langue qu’une famille utilise pour sa communication. @fr
toolkit label: lengua de la familia @es
toolkit definition: Una lengua que una familia usa para sus comunicaciones. @es
label: έχει γλώσσα της οικογένειας @el
definition: Συνδέει μια οικογένεια με μια γλώσσα την οποία χρησιμοποιεί η οικογένεια στις επικοινωνίες της. @el
toolkit label: γλώσσα της οικογένειας @el
toolkit definition: Μια γλώσσα την οποία χρησιμοποιεί η οικογένεια στις επικοινωνίες της. @el
definition: Setzt eine Familie in Beziehung zu einer Sprache, die eine Familie bei ihrer Kommunikation verwendet. @de
toolkit label: Sprache einer Familie @de
toolkit definition: Eine Sprache, die eine Familie bei ihrer Kommunikation verwendet. @de
label: har sprog for familie @da
definition: Relaterer en familie til et sprog, som en familie anvender i sin kommunikation. @da
toolkit label: sprog for familie @da
toolkit definition: Sprog, som en familie anvender i sin kommunikation. @da
label: té com a llengua d’una família @ca
definition: Relaciona una família amb una llengua que és usada per una família en les seves comunicacions. @ca
toolkit label: llengua d’una família @ca
toolkit definition: Llengua que és usada per una família en les seves comunicacions. @ca
definition: Liittää suvun kieleen, jota suku käyttää viestinnässään.
toolkit label: suvun käyttämä kieli
toolkit definition: Kieli, jota suku käyttää viestinnässään.
toolkit label: språk for familie @no
toolkit definition: Et språk som brukes av en familie i sin kommunikasjon. @no
label: hat Sprache einer Familie @de
sub property of: yhteistoimijan käyttämä kieli
has element type: 5
label: család nyelve a következő: @hu
definition: Hozzákapcsol egy családot egy nyelvhez, amelyet egy család használ saját kommunikációjában. @hu
toolkit label: család nyelve: @hu
toolkit definition: Egy nyelv, amelyet egy család saját kommunikációjában használ. @hu
label: har språk for familie @no
definition: Relaterer en familie til et språk som brukes av en familie i sin kommunikasjon. @no
label: heeft taal van familie @nl
definition: Relateert een familie aan een taal die gebruikt is door een familie in haar communicatie. @nl
toolkit label: taal van familie @nl
toolkit definition: Een taal die gebruikt is door een familie in haar communicatie. @nl
label: لها لغة عائلة @ar
definition: يربط أسرة بلغة تستخدمها عائلة في اتصالاتها. @ar
toolkit label: لغة عائلة @ar
toolkit definition: لغة تستخدمها العائلة في اتصالاتها. @ar
label: perekonna keel @et
definition: Seostab perekonna keelega, mida perekond suhtluses kasutab. @et
toolkit label: perekonna keel @et
toolkit definition: Keel, mida perekond suhtluses kasutab. @et
label: ha come lingua di famiglia @it
definition: Correla una famiglia a una lingua utilizzata da una famiglia nelle sue comunicazioni. @it
toolkit label: lingua di famiglia @it
toolkit definition: Lingua utilizzata da una famiglia nelle sue comunicazioni. @it
label: dzimtas/ģimenes valoda @lv
definition: Sasaista dzimtu/ģimeni ar valodu, kuru dzimta/ģimene lieto saziņā. @lv
toolkit label: dzimtas/ģimenes valoda @lv
toolkit definition: Valoda, kuru dzimta/ģimene lieto saziņā. @lv
label: 有家族的语言 @zh-hans
definition: 将一个家族与一个家族在其交流中所用的语言关联起来。 @zh-hans
toolkit label: 家族的语言 @zh-hans
toolkit definition: 一个家族在其交流中所用的语言 @zh-hans
label: ailenin dili ile ilişkilidir @tr
definition: Bir aileyi, ailenin kullandığı dille ilişkilendirir. @tr
toolkit label: Ailenin dili @tr
toolkit definition: Bir ailenin iletişiminde kullandığı dil. @tr
has subproperty: P50235

suvun tunnettu jäsen
status: Published
label: has prominent member of family @en
definition: Relates a family to a person who is a well-known individual who is a member of a family. @en
type: Property
domain: C10008
lexical alias: prominentMemberOfFamily.en
instruction number: 10.6
toolkit label: prominent member of family @en
toolkit definition: A person who is a well-known individual who is a member of a family. @en
label: a pour membre illustre d’une famille @fr
definition: Met une famille en relation avec une personne qui est un individu jouissant d’une certaine notoriété et est membre d’une famille. @fr
toolkit label: membre illustre d’une famille @fr
toolkit definition: Personne qui est un individu jouissant d’une certaine notoriété et est membre d’une famille. @fr
toolkit label: miembro prominente de la familia @es
toolkit definition: Un individuo ampliamente conocido, que es miembro de una familia. @es
label: har välkänd medlem av familjen/släkten @sv
toolkit label: välkänd medlem av familjen/släkten @sv
label: έχει διακεκριμένο μέλος της οικογένειας @el
definition: Συνδέει μια οικογένεια με ένα ευρέως γνωστό άτομο το οποίο είναι μέλος μιας οικογένειας. @el
toolkit label: διακεκριμένο μέλος της οικογένειας @el
toolkit definition: Ένα δημοφιλές άτομο το οποίο είναι μέλος μιας οικογένειας. @el
definition: Setzt eine Familie in Beziehung zu einem bekannten Individuum (Person), das Mitglied einer Familie ist. @de
toolkit label: Bedeutendes Familienmitglied @de
toolkit definition: Ein bekanntes Individuum (Person), das Mitglied einer Familie ist. @de
label: har fremtrædende medlem af familie @da
definition: Relaterer en familie til en person, der er et velkendt individ, som er medlem af en familie. @da
toolkit label: fremtrædende medlem af familien @da
toolkit definition: Person, der er et velkendt individ, som er medlem af en familie. @da
label: té com a membre destacat d’una família @ca
definition: Relaciona una família amb un individu ben conegut que és un membre d’una família. @ca
toolkit label: membre destacat d’una família @ca
toolkit definition: Persona que és un individu ben conegut que és un membre d’una família. @ca
definition: Liittää suvun henkilöön, joka on yleisesti tunnettu suvun jäsen
toolkit label: suvun tunnettu jäsen
toolkit definition: Sukuun kuuluva henkilö, joka on yleisesti tunnettu.
toolkit label: framtredende familiemedlem @no
toolkit definition: En velkjent person som er et familiemedlem. @no
label: hat bedeutendes Familienmitglied @de
sub property of: suvun henkilöjäsen
has element type: 2
label: család prominens tagja a következő: @hu
definition: Hozzákapcsol egy családot egy személyhez, egy jól ismert egyénhez, aki egy család tagja. @hu
toolkit label: család prominens tagja: @hu
toolkit definition: Egy személy, egy jól ismert egyén, aki egy család tagja. @hu
label: har framtredende familiemedlem @no
definition: Relaterer en familie til en velkjent person som er et familiemedlem. @no
label: heeft prominent lid van familie @nl
definition: Relateert een familie aan een persoon die is een welbekend individu die een lid is van een familie. @nl
toolkit label: prominent lid van familie @nl
toolkit definition: Een persoon die is een welbekend individu die een lid is van een familie. @nl
label: لها فرد بارز في العائلة @ar
definition: يربط عائلة بشخص مشهور هو عضو في عائلة @ar
toolkit label: فرد بارز في عائلة @ar
toolkit definition: شخص هو فرد معروف في عائلة. @ar
label: perekonna silmapaistev liige @et
definition: Seostab perekonna üldtuntud üksikisikuga, kes on perekonna liige. @et
toolkit label: perekonna silmapaistev liige @et
toolkit definition: Üldtuntud üksikisik, kes on perekonna liige. @et
label: ha come membro prominente di famiglia @it
definition: Correla una famiglia a un individuo famoso che è membro di una famiglia. @it
toolkit label: membro prominente di famiglia @it
toolkit definition: Un individuo famoso che è membro di una famiglia. @it
label: ievērojams dzimtas/ģimenes piederīgais @lv
definition: Sasaista dzimtu/ģimeni ar personu, kura ir ievērojama persona, kura pieder dzimtai/ ģimenei. @lv
toolkit label: ievērojams dzimtas/ģimenes piederīgais @lv
toolkit definition: Ievērojama persona, kura pieder dzimtai/ ģimenei. @lv
label: 有家族的著名成员 @zh-hans
definition: 将家族与作为名人也作为家族成员的一个个人关联起来。 @zh-hans
toolkit label: 家族的著名成员 @zh-hans
toolkit definition: 作为名人也作为家族成员的一个个人 @zh-hans
label: ailenin seçkin üyesi ile ilişkilidir @tr
definition: Bir aileyi, bir ailenin üyesi olan tanınmış bir birey olan bir kişiyle ilişkilendirir. @tr
toolkit label: ailenin seçkin üyesi @tr
toolkit definition: Bir ailenin üyesi olup tanınmış bir birey olan kişi. @tr
has subproperty: P50060

suvun henkilöjäsen
status: Published
label: has person member of family @en
definition: Relates a family to a person who is a member of a family. @en
type: Property
domain: C10008
lexical alias: personMemberOfFamily.en
toolkit label: person member of family @en
toolkit definition: A person who is a member of a family. @en
label: a pour personne membre d’une famille @fr
definition: Met une famille en relation avec une personne qui est membre d’une famille. @fr
toolkit label: personne membre d’une famille @fr
toolkit definition: Personne qui est membre d’une famille. @fr
toolkit label: miembro de la familia @es
toolkit definition: Una persona que es un miembro de la familia. @es
instruction number: 29.5
label: έχει φυσικό πρόσωπο μέλος της οικογένειας @el
definition: Συνδέει μια οικογένεια με ένα φυσικό πρόσωπο το οποίο είναι μέλος μιας οικογένειας. @el
toolkit label: φυσικό πρόσωπο μέλος της οικογένειας @el
toolkit definition: Ένα φυσικό πρόσωπο το οποίο είναι μέλος μιας οικογένειας. @el
definition: Setzt eine Familie in Beziehung zu einer Person, die ein Mitglied einer Familie ist. @de
toolkit label: Familienmitglied (Person) @de
toolkit definition: Eine Person, die ein Mitglied einer Familie ist. @de
label: har person, som er familiemedlem @da
definition: Relaterer en familie til en person, som er medlem af en familie. @da
toolkit label: person, som er familiemedlem @da
toolkit definition: Person, som er medlem af en familie. @da
label: té com a persona membre d’una família @ca
definition: Relaciona una família amb una persona que és un membre d’una família. @ca
toolkit label: persona membre d’una família @ca
toolkit definition: Persona que és un membre d’una família. @ca
definition: Liittää suvun henkilöön, joka on suvun jäsen.
toolkit label: suvun henkilöjäsen
toolkit definition: Henkilö, joka on suvun jäsen.
toolkit label: familiemedlem (person) @no
toolkit definition: En person som er et medlem av en familie. @no
label: hat Familienmitglied (Person) @de
alternative label: family member @en
sub property of: sukuun liittyvä henkilö
sub property of: yhteistoimijan henkilöjäsen
has element type: 2
label: család személy tagja a következő: @hu
definition: Hozzákapcsol egy családot egy személyhez, aki egy család tagja. @hu
toolkit label: család személy tagja: @hu
toolkit definition: Egy személy, aki egy család tagja. @hu
alternative label: suvun jäsen
label: har familiemedlem (person) @no
definition: Relaterer en familie til en person som er et medlem av en familie. @no
alternative label: familiemedlem @no
label: heeft persoonlijk lid van familie @nl
definition: Relateert een familie aan een persoon die lid is van een familie. @nl
toolkit label: persoonlijk lid van familie @nl
toolkit definition: Een persoon die lid is van een familie. @nl
label: لديه شخص عضو في عائلة @ar
definition: يربط عائلة بشخص هو عضو في عائلة. @ar
alternative label: عضو في عائلة @ar
toolkit label: شخص عضو في عائلة @ar
toolkit definition: شخص هو عضو في عائلة. @ar
alternative label: membre d’una família @ca
label: perekonna liige (isik) @et
definition: Seostab perekonna isikuga, kes on perekonna liige. @et
alternative label: perekonna liige @et
toolkit label: perekonna liige (isik) @et
toolkit definition: Isik, kes on perekonna liige. @et
alternative label: családtag: @hu
label: ha come persona membro di famiglia @it
definition: Correla una famiglia a una persona che è membro di una famiglia. @it
alternative label: membro di famiglia @it
toolkit label: persona membro di famiglia @it
toolkit definition: Persona che è membro di una famiglia. @it
alternative label: μέλος οικογένειας @el
alternative label: membre de famille @fr
label: dzimtas/ģimenes dalībnieks (persona) @lv
definition: Sasaista dzimtu/ģimeni ar personu, kura pievienojas dzimta/ģimene. @lv
toolkit label: dzimtas/ģimenes dalībnieks (persona) @lv
toolkit definition: Persona, kura pievienojas dzimta/ģimene. @lv
alternative label: Familienmitglied @de
alternative label: 家族成员 @zh-hans
label: 有家族的个人成员 @zh-hans
toolkit label: 家族的个人成员 @zh-hans
toolkit definition: 作为一个家族成员的个人 @zh-hans

suku aiheena teoksessa
status: Published
type: Property
label: is subject family of @en
lexical alias: subjectFamilyOf.en
definition: Relates a family to a work that is about a family. @en
domain: C10008
toolkit label: subject family of @en
toolkit definition: A work that is about a family. @en
sub property of: sukuun liittyvä teos
label: είναι θέμα οικογένεια του @el
definition: Συνδέει μια οικογένεια με ένα έργο σχετικά με αυτή την οικογένεια. @el
toolkit label: θέμα οικογένεια του @el
toolkit definition: Ένα έργο που αφορά σε μια οικογένεια. @el
definition: Setzt eine Familie in Beziehung zu einem Werk, das von einer Familie handelt. @de
toolkit label: Familie als Thema von @de
toolkit definition: Ein Werk, das von einer Familie handelt. @de
label: er familie, som er emne af @da
definition: Relaterer en familie til et værk, som handler om en familie. @da
toolkit label: familie, som er emne af @da
toolkit definition: Værk, som handler om en familie. @da
label: és família de matèria de @ca
definition: Relaciona una família amb una obra que tracta d’una família. @ca
toolkit label: família de matèria de @ca
toolkit definition: Obra que tracta d’una família. @ca
definition: Liittää suvun teokseen, joka käsittelee sukua.
toolkit label: suku aiheena teoksessa
toolkit definition: Teos, joka käsittelee sukua.
toolkit label: emne for (familie) @no
toolkit definition: Et verk som handler om en familie. @no
label: ist Familie als Thema von @de
label: est une famille sujet de @fr
definition: Met une famille en relation avec une œuvre qui traite d’une famille. @fr
toolkit label: famille sujet de @fr
toolkit definition: Œuvre qui traite d’une famille. @fr
sub property of: yhteistoimija aiheena teoksessa
has element type: 2
label: család tárgya a következőnek: @hu
definition: Hozzákapcsol egy családot egy műhöz, amely egy családról szól. @hu
toolkit label: család tárgya: @hu
toolkit definition: Egy mű, amely egy családról szól. @hu
alternative label: subject of (family) @en
label: er emne for (familie) @no
definition: Relaterer en familie til et verk som handler om en familie. @no
label: is familie als onderwerp van @nl
definition: Relateert een familie aan een werk dat gaat over een familie. @nl
toolkit label: familie als onderwerp van @nl
toolkit definition: Een werk dat gaat over een familie. @nl
label: هي عائلة موضوع لـ @ar
definition: يربط عائلة بعمل عن عائلة. @ar
toolkit label: عائلة موضوع لـ @ar
toolkit definition: عمل عن عائلة. @ar
label: teema (perekond) teoses @et
definition: Seostab perekonna teosega, mis on perekonna kohta. @et
toolkit label: teema (perekond) teoses @et
toolkit definition: Teos, mis on perekonna kohta. @et
label: è famiglia soggetto di @it
definition: Collega una famiglia a un'opera che tratta di una famiglia. @it
toolkit label: famiglia soggetto di @it
toolkit definition: Opera che tratta di una famiglia. @it
label: ir temats (dzimta/ģimene) @lv
definition: Sasaista dzimtu/ģimeni ar darbu, kura temats ir dzimta/ģimene. @lv
toolkit label: ir temats (dzimta/ģimene) @lv
toolkit definition: Darbs, kura temats ir dzimta/ģimene. @lv
alternative label: aiheena teoksessa (suku)
alternative label: عائلة موضوع @ar
alternative label: emne af (familie) @da
alternative label: Thema von (Familie) @de
alternative label: （家族）的主题 @zh-hans
label: 是……的主题家族 @zh-hans
definition: 将一个家族与关于一个家族的一种作品关联起来。 @zh-hans
toolkit label: ……的主题家族 @zh-hans
toolkit definition: 关于一个家族的一种作品 @zh-hans
alternative label: tema de (familia) @es
alternative label: sujet de (famille) @fr
alternative label: tárgya a következőnek (család): @hu
alternative label: (ailenin) konusu @tr
label: konu ailesidir @tr
toolkit label: konu alınan aile @tr
toolkit definition: Bir aile hakkındaki eser. @tr
has subproperty: sukua kuvaava teos

suvun perustama yhteisö
status: Published
label: has founded corporate body of family @en
definition: Relates a family to a corporate body who is initiated by a family. @en
type: Property
domain: C10008
lexical alias: foundedCorporateBodyOfFamily.en
toolkit label: founded corporate body of family @en
toolkit definition: A corporate body who is initiated by a family. @en
label: a pour collectivité fondée d’une famille @fr
definition: Met une famille en relation avec une collectivité qui est établie par une famille. @fr
toolkit label: collectivité fondée d’une famille @fr
toolkit definition: Collectivité qui est établie par une famille. @fr
toolkit label: entidad corporativa fundada @es
toolkit definition: Una entidad corporativa que la familia fundó. @es
instruction number: 29.5
label: έχει ιδρύσει συλλογικό όργανο της οικογένειας @el
definition: Συνδέει μια οικογένεια με έναν οργανισμό που ίδρυσε μια οικογένεια. @el
toolkit label: ιδρυθέν συλλογικό όργανο της οικογένειας @el
toolkit definition: Ένας οργανισμός τον οποίο ίδρυσε μια οικογένεια. @el
definition: Setzt eine Familie in Beziehung zu einer Körperschaft, die von einer Familie gegründet wurde. @de
toolkit label: Von einer Familie gegründete Körperschaft @de
toolkit definition: Eine Körperschaft, die von einer Familie gegründet wurde. @de
label: har korporation grundlagt af familie @da
definition: Relaterer en familie til en korporation, som er igangsat af en familie. @da
toolkit label: korporation grundlagt af familie @da
toolkit definition: Korporation, som er igangsat af en familie. @da
label: té com a entitat corporativa fundada per una família @ca
definition: Relaciona una família amb una entitat corporativa que és iniciada per una família. @ca
toolkit label: entitat corporativa fundada per una família @ca
toolkit definition: Entitat corporativa que és iniciada per una família. @ca
definition: Liittää suvun yhteisöön, jonka suku on perustanut.
toolkit label: suvun perustama yhteisö
toolkit definition: Yhteisö, jonka suku on perustanut.
toolkit label: korporasjon grunnlagt av familie @no
toolkit definition: En korporasjon som er opprettet av en familie. @no
label: hat von einer Familie gegründete Körperschaft @de
has element type: 2
sub property of: sukuun liittyvä yhteisö
label: család által alapított testület a következő: @hu
definition: Hozzákapcsol egy családot egy testülethez, amelynek létrehozását egy család kezdeményezte. @hu
toolkit label: család által alapított testület: @hu
toolkit definition: Egy testület, amelynek létrehozását egy család kezdeményezte. @hu
sub property of: yhteistoimijan perustama yhteisö
label: har korporasjon grunnlagt av familie @no
definition: Relaterer en familie til en korporasjon som er opprettet av en familie. @no
label: heeft opgerichte corporatie van familie @nl
definition: Relateert een familie aan een corporatie die is gesticht door een familie. @nl
toolkit label: opgerichte corporatie van familie @nl
toolkit definition: Een corporatie die is gesticht door een familie. @nl
label: أسست هيئة لعائلة @ar
definition: يربط عائلة بهيئة بادرت بتأسيسها عائلة. @ar
toolkit label: أسست هيئة لعائلة @ar
toolkit definition: هيئة بادرت بتأسيسها عائلة. @ar
label: perekonna asutatud asutus @et
definition: Seostab perekonna asutusega, millele perekond on aluse pannud. @et
toolkit label: perekonna asutatud asutus @et
toolkit definition: Asutus, millele perekond on aluse pannud. @et
label: ha ente fondato di famiglia @it
definition: Correla una famiglia a un ente istituito da una famiglia. @it
toolkit label: ente fondato di famiglia @it
toolkit definition: Ente istituito da una famiglia. @it
label: dzimtas/ģimenes dibinātā institūcija @lv
definition: Sasaista dzimtu/ģimeni ar institūciju, ko dibinājusi dzimta/ģimene. @lv
toolkit label: dzimtas/ģimenes dibinātā institūcija @lv
toolkit definition: Institūcija, ko dibinājusi dzimta/ģimene. @lv
label: 有家族的被创办团体 @zh-hans
definition: 将一个家族与一个家族发起的一个团体关联起来。 @zh-hans
toolkit label: 家族的被创办团体 @zh-hans
toolkit definition: 被一个家族发起的一个团体 @zh-hans
label: ailenin kurduğu tüzel kişi ile ilişkilidir @tr
definition: Bir aileyi, bir aile tarafından üyeliğe kabul edilmiş bir tüzel kişilik ile ilişkilendirir. @tr
toolkit label: aile tarafından kurulan tüzel kişi @tr
toolkit definition: Bir aile tarafından üyeliğe kabul edilmiş bir tüzel kişi. @tr
has subproperty: P50062

suvun sponsoroima yhteisö
status: Published
label: has sponsored corporate body of family @en
definition: Relates a family to a corporate body who is sponsored by a family. @en
type: Property
domain: C10008
lexical alias: sponsoredCorporateBodyOfFamily.en
toolkit label: sponsored corporate body of family @en
toolkit definition: A corporate body who is sponsored by a family. @en
label: a pour collectivité parrainée d’une famille @fr
definition: Met une famille en relation avec une collectivité qui est parrainée par une famille. @fr
toolkit label: collectivité parrainée d’une famille @fr
toolkit definition: Collectivité qui est parrainée par une famille. @fr
toolkit label: entidad corporativa patrocinada @es
toolkit definition: Una entidad corporativa que la familia patrocina. @es
instruction number: 29.5
label: έχει χορηγήσει συλλογικό όργανο της οικογένειας @el
definition: Συνδέει μια οικογένεια με έναν οργανισμό που μια οικογένεια υποστηρίζει μέσω χορηγίας, χρηματοδότησης κ.λπ. @el
toolkit label: επιχορηγούμενο συλλογικό όργανο της οικογένειας @el
toolkit definition: Ένας οργανισμός τον οποίο η οικογένεια υποστηρίζει μέσω χορηγίας, χρηματοδότησης κ.λπ. @el
definition: Setzt eine Familie in Beziehung zu einer Körperschaft, die von einer Familie gefördert wird. @de
toolkit label: Familie als Sponsorin/Sponsor einer Körperschaft von @de
toolkit definition: Eine Körperschaft, die von einer Familie gefördert wird. @de
label: har korporation sponsoreret af familie @da
definition: Relaterer en familie til en korporation, som er sponsoreret af en familie. @da
toolkit label: korporation sponsoreret af familie @da
toolkit definition: Korporation, som er sponsoreret af en familie. @da
label: té com a entitat corporativa patrocinada per una família @ca
definition: Relaciona una família amb una entitat corporativa que és patrocinada per una família. @ca
toolkit label: entitat corporativa patrocinada per una família @ca
toolkit definition: Entitat corporativa que és patrocinada per una família. @ca
definition: Liittää suvun yhteisöön, jota suku sponsoroi.
toolkit label: suvun sponsoroima yhteisö
toolkit definition: Yhteisö, jota suku sponsoroi.
toolkit label: korporasjon sponset av familie @no
toolkit definition: En korporasjon som en familie er sponsor av. @no
label: hat Familie als Sponsorin/Sponsor einer Körperschaft von @de
has element type: 2
sub property of: sukuun liittyvä yhteisö
label: család szponzorált testülete a következő: @hu
definition: Hozzákapcsol egy családot egy testülethez, amelyet egy család szponzorál. @hu
toolkit label: család által szponzorált testület: @hu
toolkit definition: Egy testület, amelyet egy család szponzorál. @hu
sub property of: yhteistoimijan sponsoroima yhteisö
label: har korporasjon sponset av familie @no
definition: Relaterer en familie til en korporasjon som en familie er sponsor av. @no
label: heeft gesponsorde corporatie van familie @nl
definition: Relateert een familie aan een corporatie die is gesponsord door een familie. @nl
toolkit label: gesponsorde corporatie van familie @nl
toolkit definition: Een corporatie die is gesponsord door een familie. @nl
label: لها هيئة ترعاها عائلة @ar
definition: يربط عائلة بهيئة ترعاها عائلة. @ar
toolkit label: هيئة تحت رعاية عائلة @ar
toolkit definition: هيئة ترعاها عائلة. @ar
label: perekonna toetatud asutus @et
definition: Seostab perekonna asutusega, mida perekond majanduslikult toetab. @et
toolkit label: perekonna toetatud asutus @et
toolkit definition: Asutus, mida perekond majanduslikult toetab. @et
label: ha sostenuto un ente di famiglia @it
definition: Correla una famiglia a un ente sponsorizzato da una famiglia. @it
toolkit label: ente sponsorizzato di famiglia @it
toolkit definition: Ente sponsorizzato da una famiglia. @it
label: dzimtas/ģimenes sponsorētā institūcija @lv
definition: Sasaista dzimtu/ģimeni ar institūciju, ko sponsorē dzimta/ģimene. @lv
toolkit label: dzimtas/ģimenes sponsorētā institūcija @lv
toolkit definition: Institūcija, ko sponsorē dzimta/ģimene. @lv
label: 有家族的被赞助的团体 @zh-hans
definition: 将一个家族与被一个家族赞助的一个团体关联起来。 @zh-hans
toolkit label: 家族的被赞助的团体 @zh-hans
toolkit definition: 被一个家族赞助的一个团体 @zh-hans
alternative label: collectivité commanditée d’une famille @fr
label: ailenin sponsor olduğu tüzel kişi ile ilişkilidir @tr
definition: Bir aileyi, bir aile tarafından desteklenen bir tüzel kişilikle ilişkilendirir. @tr
toolkit label: ailenin sponsor olduğu tüzel kişi @tr
toolkit definition: Bir aile tarafından desteklenen tüzel kişi. @tr
has subproperty: P50063

sukuhistoria
status: Published
label: has family history @en
definition: Relates a family to a summary of information about the history of a family or its members. @en
type: Property
domain: C10008
lexical alias: familyHistory.en
instruction number: 10.9
toolkit label: family history @en
toolkit definition: A summary of information about the history of a family or its members. @en
label: a pour historique d’une famille @fr
definition: Met une famille en relation avec un résumé d’informations sur l’histoire d’une famille ou de ses membres. @fr
toolkit label: historique d’une famille @fr
toolkit definition: Résumé d’informations sur l’histoire d’une famille ou de ses membres. @fr
toolkit label: historia de la familia @es
toolkit definition: Información biográfica sobre la familia y sus miembros @es
label: έχει οικογενειακή ιστορία @el
definition: Συνδέει μια οικογένεια με μια περίληψη πληροφοριών σχετικών με την ιστορία μιας οικογένειας ή/και των μελών της. @el
toolkit label: οικογενειακή ιστορία @el
toolkit definition: Μια συνοπτική πληροφόρηση αναφορικά με το ιστορικό της οικογένιας ή/και τα μέλη της. @el
definition: Setzt eine Familie in Beziehung zu Informationen über die Geschichte einer Familie oder ihrer Mitglieder. @de
toolkit label: Familiengeschichte @de
toolkit definition: Informationen über die Geschichte einer Familie oder ihrer Mitglieder. @de
label: har familiehistorie @da
definition: Relaterer en familie til en opsummering af oplysninger om en families- eller dens medlemmers historie. @da
toolkit label: familiehistorie @da
toolkit definition: Opsummering af oplysninger om en families- eller dens medlemmers historie. @da
label: té com a història d’una família @ca
definition: Relaciona una família amb un resum de la informació sobre la història d’una família o dels seus membres. @ca
toolkit label: història d’una família @ca
toolkit definition: Resum de la informació sobre la història d’una família o dels seus membres. @ca
definition: Liittää suvun elämäkerralliseen tietoon suvusta ja/tai suvun jäsenistä.
toolkit label: sukuhistoria
toolkit definition: Elämäkerrallista tietoa suvusta tai suvun jäsenistä.
toolkit definition: Et sammendrag av informasjon om en families eller familiemedlemmenes historie. @no
label: hat Familiengeschichte @de
has element type: 6
label: családtörténete a következő: @hu
definition: Hozzákapcsol egy családot egy család vagy a tagjainak történetéről szóló információk összefoglalásához. @hu
toolkit label: családtörténet: @hu
toolkit definition: Egy család vagy a tagjainak történetéről szóló információk összefoglalása. @hu
definition: Relaterer en familie til et sammendrag av informasjon om en families eller familiemedlemmenes historie. @no
label: heeft familiegeschiedenis @nl
definition: Relateert een familie aan een samenvatting van informatie over de geschiedenis van een familie of haar leden. @nl
toolkit label: familiegeschiedenis @nl
toolkit definition: Een samenvatting van informatie over de geschiedenis van een familie of haar leden. @nl
label: له تاريخ عائلة @ar
definition: يربط عائلة بمعلومات موجزة عن تاريخ عائلة أو عن أفرادها. @ar
toolkit label: تاريخ عائلة @ar
toolkit definition: ملخص للمعلومات المتعلقة بتاريخ العائلة أو أفرادها. @ar
label: perekonnalugu @et
definition: Seostab perekonna kokkuvõtliku infoga perekonna või selle liikmete aja- või eluloost. @et
toolkit label: perekonnalugu @et
toolkit definition: Kokkuvõtlik info perekonna või selle liikmete aja- või eluloost. @et
label: ha come storia di famiglia @it
definition: Correla una famiglia a un sommario d'informazioni sulla storia di una famiglia o dei suoi membri. @it
toolkit label: storia familiare @it
toolkit definition: Sommario d'informazioni sulla storia di una famiglia o dei suoi membri. @it
label: dzimtas/ģimenes vēsture @lv
definition: Sasaista dzimtu/ģimeni ar informāciju par dzimtas/ģimenes vai tās piederīgo vēsturi. @lv
toolkit label: dzimtas/ģimenes vēsture @lv
toolkit definition: Informācija par dzimtas/ģimenes vai tās piederīgo vēsturi. @lv
label: 有家族历史 @zh-hans
definition: 将一个家族与关于一个家族及其成员历史信息的概要关联起来。 @zh-hans
toolkit label: 家族历史 @zh-hans
toolkit definition: 关于一个家族及其成员历史信息的概要 @zh-hans
label: aile geçmişi ile ilişkilidir @tr
definition: Bir aileyi, bir ailenin veya üyelerinin geçmişi hakkındaki bilgilerin bir özetiyle ilişkilendirir. @tr
toolkit label: aile tarihi @tr
toolkit definition: Bir ailenin veya üyelerinin geçmişi hakkındaki bilgilerin özeti. @tr
has subproperty: P50064

kuraattori (toimija) kappaleelle
label: is curator agent of (Deprecated) @en
definition: Relates an agent to an item that involves a responsibility of an agent for conceiving or managing the aggregation of an item in an exhibition or collection. (Deprecated) @en
type: Property
domain: C10002
sub property of: toimijaan liittyvä kappale
lexical alias: curatorAgentOf.en
label: est un agent conservateur de @fr
definition: Met un agent en relation avec un item qui comporte une responsabilité de la part d’un agent consistant à concevoir ou à gérer l’agrégation d’un item dans une exposition ou une collection de ressources. @fr
toolkit label: agent conservateur de @fr
toolkit definition: Item qui comporte une responsabilité de la part d’un agent consistant à concevoir ou à gérer l’agrégation d’un item dans une exposition ou une collection de ressources. @fr
toolkit label: curator agent of (Deprecated) @en
toolkit definition: An item that involves a responsibility of an agent for conceiving or managing the aggregation of an item in an exhibition or collection. (Deprecated) @en
instruction number: 18.5
label: είναι έφορος φορέας του @el
definition: Συνδέει έναν φορέα, που συλλαμβάνει, συγκεντρώνει ή και οργανώνει μια έκθεση, συλλογή ή άλλο αντίτυπο, με ένα αντίτυπο. @el
toolkit label: έφορος φορέας του @el
toolkit definition: Ένα αντίτυπο το οποίο συλλαμβάνεται, συγκεντρώνεται ή/και οργανώνεται σε μια έκθεση, συλλογή ή άλλο αντίτυπο. @el
definition: Setzt einen Akteur in Beziehung zu einem Exemplar, bei dem ein Akteur die Aggregation eines Exemplars in einer Ausstellung oder Sammlung konzipiert oder organisiert. @de
toolkit label: Akteur als Kuratorin/Kurator von @de
toolkit definition: Ein Exemplar, bei dem ein Akteur die Aggregation eines Exemplars in einer Ausstellung oder Sammlung konzipiert oder organisiert. @de
label: er agent, som er kurator af @da
definition: Relaterer en agent til et eksemplar, som involverer en agents ansvar for at udtænke eller administrere samlingen af et eksemplar til en udstilling eller samling. @da
toolkit label: agent, som er kurator af @da
toolkit definition: Eksemplar, som involverer en agents ansvar for at udtænke eller administrere samlingen af et eksemplar til en udstilling eller samling. @da
label: és agent conservador de @ca
definition: Relaciona un agent amb un ítem que implica una responsabilitat d’un agent de concebre o gestionar l’agregació d’un ítem en una exposició o una col·lecció. @ca
toolkit label: agent conservador de @ca
toolkit definition: Ítem que implica una responsabilitat d’un agent de concebre o gestionar l’agregació d’un ítem en una exposició o una col·lecció. @ca
definition: Liittää toimijan kappaleeseen, jonka näyttelyyn tai kokoelmaan kuuluvan kappaleaggregaation aikaasaamisessa tai hallinnoimisessa toimija on osallisena.
toolkit label: kuraattori (toimija) kappaleelle
toolkit definition: Kappale, jonka näyttelyyn tai kokoelmaan kuuluvan kappaleaggregaation aikaasaamisessa tai hallinnoimisessa toimija on osallisena.
toolkit label: kurator for (agent) @no
toolkit definition: Et eksemplar som involverer ansvar for en agent i form av å anskaffe eller håndtere innsamlingen av et eksemplar til en utstilling eller samling. @no
label: ist Akteur als Kuratorin/Kurator von @de
has element type: 2
label: kurátor ágense a következőnek: @hu
definition: Hozzákapcsol egy ágenst egy példányhoz, amelyhez hozzátartozik egy ágens felelőssége egy példány kiállítás vagy gyűjtemény keretében történő összegyűjtésének elgondolásáért vagy kezeléséért. @hu
toolkit label: kurátor ágense: @hu
toolkit definition: Egy példány, amelyhez hozzátartozik egy ágens felelőssége egy példány kiállítás vagy gyűjtemény keretében történő összegyűjtésének elgondolásáért vagy kezeléséért. @hu
alternative label: curator of @en
alternative label: kuratoijana kappaleessa
label: er kurator for (agent) @no
definition: Relaterer en agent til et eksemplar som involverer ansvar for en agent i form av å anskaffe eller håndtere innsamlingen av et eksemplar til en utstilling eller samling. @no
alternative label: kurator for @no
label: is curator-actor van @nl
definition: Relateert een actor aan een item dat met zich meebrengt een verantwoordelijkheid van een actor voor het bedenken of beheren van het aggregeren van een item in een tentoonstelling of collectie. @nl
toolkit label: curator-actor van @nl
toolkit definition: Een item dat met zich meebrengt een verantwoordelijkheid van een actor voor het bedenken of beheren van het aggregeren van een item in een tentoonstelling of collectie. @nl
label: هو وكيل أمين معرض لـ @ar
definition: يربط وكيلا بمفردة يترتب عليها مسئولية وكيل عن فهم أو إدارة تجميع مفردة في معرض أو في مجموعة. @ar
alternative label: أمين متحف @ar
toolkit label: وكيل أمين معرض @ar
toolkit definition: مفردة تنطوي على مسئولية وكيل عن فهم أو إدارة تجميع مفردة في معرض أو في مجموعة. @ar
alternative label: conservador de @ca
alternative label: kurator af @da
label: kuraator (tegija) eksemplarile @et
definition: Seostab tegija eksemplariga, mis sisaldab tegija vastutust eksemplari näituse või koguga liitmise kavandamise või korraldamise eest. @et
alternative label: kuraator eksemplarile @et
toolkit label: kuraator (tegija) eksemplarile @et
toolkit definition: Eksemplar, mis sisaldab tegija vastutust eksemplari näituse või koguga liitmise kavandamise või korraldamise eest. @et
alternative label: kurátora: @hu
label: è curatore agente di @it
definition: Correla un agente a un item che implica una responsabilità di un agente nella concezione o gestione dell'aggregazione di un item a una mostra o collezione. @it
alternative label: curatore di @it
toolkit label: curatore agente di @it
toolkit definition: Item che implica una responsabilità di un agente nella concezione o gestione dell'aggregazione di un item a una mostra o collezione. @it
alternative label: έφορος του @el
alternative label: conservateur de @fr
status: Deprecated
label: ir kurators (aģents) @lv
definition: Sasaista aģentu ar vienību, kas ietver aģenta atbildību par tās iekļaušanu izstādē vai kolekcijā . @lv
toolkit label: ir kurators (aģents) @lv
toolkit definition: Vienība, kas ietver aģenta atbildību par tās iekļaušanu izstādē vai kolekcijā . @lv
alternative label: Kurator von @de
has subproperty: kokoelman luetteloija (toimija) kappaleessa
has subproperty: kokoelman muodostaja (toimija) kappaleessa
has subproperty: kuraattori (yhteistoimija) kappaleessa
has subproperty: kuraattori (henkilö) kappaleessa
has subproperty: P50133

kuraattori (yhteistoimija) kappaleessa
label: is curator collective agent of (Deprecated) @en
lexical alias: curatorCollectiveAgentOf.en
definition: Relates a collective agent to an item that involves a responsibility of a collective agent for conceiving or managing the aggregation of an item in an exhibition or collection. (Deprecated) @en
toolkit label: curator collective agent of (Deprecated) @en
toolkit definition: An item that involves a responsibility of a collective agent for conceiving or managing the aggregation of an item in an exhibition or collection. (Deprecated) @en
type: Property
domain: C10011
has element type: 2
sub property of: yhteistoimijaan liittyvä kappale
sub property of: kuraattori (toimija) kappaleelle
definition: Liittää yhteistoimijan kappaleeseen, jonka näyttelyyn tai kokoelmaan kuuluvan kappaleaggregaation aikaansaamisessa tai hallinnoimisessa yhteistoimija on osallisena.
toolkit label: kuraattori (yhteistoimija) kappaleessa
toolkit definition: Kappale, jonka näyttelyyn tai kokoelmaan kuuluvan kappaleaggregaation aikaansaamisessa tai hallinnoimisessa yhteistoimija on osallisena.
label: er kurator for (kollektiv agent) @no
definition: Relaterer en kollektiv agent til et eksemplar som involverer et ansvar for en kollektiv agent i form av å ha idéen til eller håndtere innsamlingen av et eksemplar i en utstilling eller samling. @no
toolkit label: kurator for (kollektiv agent) @no
toolkit definition: Et eksemplar som involverer et ansvar for en kollektiv agent i form av å ha idéen til eller håndtere innsamlingen av et eksemplar i en utstilling eller samling. @no
label: is curator collectieve actor van @nl
definition: Relateert een collectieve actor aan een item dat met zich meebrengt een verantwoordelijkheid van een collectieve actor voor het bedenken of beheren van het aggregeren van een item in een tentoonstelling of collectie. @nl
toolkit label: curator collectieve actor van @nl
toolkit definition: Een item dat met zich meebrengt een verantwoordelijkheid van een collectieve actor voor het bedenken of beheren van het aggregeren van een item in een tentoonstelling of collectie. @nl
label: هو وكيل جماعي أمين معرض لـ @ar
definition: يربط وكيلا جماعيا بمفردة تنطوي على مسئولية وكيل جماعي عن تصور أو إدارة التجميع لمفردة في معرض أو في مجموعة. @ar
toolkit label: وكيل جماعي أمين معرض @ar
toolkit definition: مفردة تنطوي على مسئولية وكيل جماعي عن فهم أو إدارة تجميع مفردة في معرض أو في مجموعة. @ar
label: és agent col·lectiu conservador de @ca
definition: Relaciona un agent col·lectiu amb un ítem que implica una responsabilitat d’un agent col·lectiu de concebre o gestionar l’agregació d’un ítem en una exposició o una col·lecció. @ca
toolkit label: agent col·lectiu conservador de @ca
toolkit definition: Ítem que implica una responsabilitat d’un agent col·lectiu de concebre o gestionar l’agregació d’un ítem en una exposició o una col·lecció. @ca
label: er kollektiv agent, som er kurator af @da
definition: Relaterer en kollektiv agent til et eksemplar, som involverer en kollektiv agents ansvar for at udtænke eller administrere samlingen af et eksemplar til en udstilling eller samling. @da
toolkit label: kollektiv agent, som er kurator af @da
toolkit definition: Eksemplar, som involverer en kollektiv agents ansvar for at udtænke eller administrere samlingen af et eksemplar til en udstilling eller samling. @da
label: kuraator (kollektiiv) eksemplarile @et
definition: Seostab kollektiivi eksemplariga, mis sisaldab kollektiivi vastutust eksemplari näituse või koguga liitmise kavandamise või korraldamise eest. @et
toolkit label: kuraator (kollektiiv) eksemplarile @et
toolkit definition: Eksemplar, mis sisaldab kollektiivi vastutust eksemplari näituse või koguga liitmise kavandamise või korraldamise eest. @et
label: ist gemeinschaftlicher Akteur als Kuratorin/Kurator von @de
definition: Setzt einen gemeinschaftlichen Akteur in Beziehung zu einem Exemplar, bei dem ein gemeinschaftlicher Akteur die Aggregation eines Exemplars in einer Ausstellung oder Sammlung konzipiert oder organisiert. @de
toolkit label: Gemeinschaftlicher Akteur als Kuratorin/Kurator von @de
toolkit definition: Ein Exemplar, bei dem ein gemeinschaftlicher Akteur die Aggregation eines Exemplars in einer Ausstellung oder Sammlung konzipiert oder organisiert. @de
label: kurátor kollektív ágense a következőnek: @hu
definition: Hozzákapcsol egy kollektív ágenst egy példányhoz, amelyhez hozzátartozik egy kollektív ágens felelőssége egy példány kiállítás vagy gyűjtemény keretében történő összegyűjtésének elgondolásáért vagy kezeléséért. @hu
toolkit label: kurátor kollektív ágense: @hu
toolkit definition: Egy példány, amelyhez hozzátartozik egy kollektív ágens felelőssége egy példány kiállítás vagy gyűjtemény keretében történő összegyűjtésének elgondolásáért vagy kezeléséért. @hu
label: è un curatore agente collettivo di @it
definition: Correla un agente collettivo a un item che implica una responsabilità di un agente collettivo nella concezione o gestione dell'aggregazione di un item a una mostra o collezione. @it
toolkit label: curatore agente collettivo di @it
toolkit definition: Item che implica una responsabilità di un agente collettivo nella concezione o gestione dell'aggregazione di un item a una mostra o collezione. @it
label: είναι έφορος συλλογικός φορέας του @el
toolkit label: έφορος συλλογικός φορέας του @el
label: est un agent collectif conservateur de @fr
definition: Met un agent collectif en relation avec un item qui comporte une responsabilité de la part d’un agent collectif consistant à concevoir ou à gérer l’agrégation d’un item dans une exposition ou une collection de ressources. @fr
toolkit label: agent collectif conservateur de @fr
toolkit definition: Item qui comporte une responsabilité de la part d’un agent collectif consistant à concevoir ou à gérer l’agrégation d’un item dans une exposition ou une collection de ressources. @fr
status: Deprecated
label: ir kurators (grupa) @lv
definition: Sasaista grupu ar vienību, kas ietver grupas atbildību par tās iekļaušanu izstādē vai kolekcijā . @lv
toolkit label: ir kurators (grupa) @lv
toolkit definition: Vienība, kas ietver grupas atbildību par tās iekļaušanu izstādē vai kolekcijā . @lv
has subproperty: kokoelman luetteloija (yhteistoimija) kappaleessa
has subproperty: kokoelman muodostaja (yhteistoimija) kappaleessa
has subproperty: kuraattori (yhteisö) kappaleessa
has subproperty: kuraattori (suku) kappaleessa
has subproperty: P50781

kuraattori (yhteisö) kappaleessa
label: is curator corporate body of (Deprecated) @en
lexical alias: curatorCorporateBodyOf.en
definition: Relates a corporate body to an item that involves a responsibility of a corporate body for conceiving or managing the aggregation of an item in an exhibition or collection. (Deprecated) @en
toolkit label: curator corporate body of (Deprecated) @en
toolkit definition: An item that involves a responsibility of a corporate body for conceiving or managing the aggregation of an item in an exhibition or collection. (Deprecated) @en
type: Property
domain: C10005
has element type: 2
sub property of: yhteisöön liittyvä kappale
sub property of: kuraattori (yhteistoimija) kappaleessa
definition: Liittää yhteisön kappaleeseen, jonka näyttelyyn tai kokoelmaan kuuluvan kappaleaggregaation aikaansaamisessa tai hallinnoimisessa yhteisö on osallisena.
toolkit label: kuraattori (yhteisö) kappaleessa
toolkit definition: Kappale, jonka näyttelyyn tai kokoelmaan kuuluvan kappaleaggregaation aikaansaamisessa tai hallinnoimisessa yhteisö on osallisena.
label: er kurator for (korporasjon) @no
definition: Relaterer en korporasjon til et eksemplar som involverer et ansvar for en korporasjon i form av å ha idéen til eller håndtere innsamlingen av et eksemplar i en utstilling eller samling. @no
toolkit label: kurator for (korporasjon) @no
toolkit definition: Et eksemplar som involverer et ansvar for en korporasjon i form av å ha idéen til eller håndtere innsamlingen av et eksemplar i en utstilling eller samling. @no
label: is curator-corporatie van @nl
definition: Relateert een corporatie aan een item dat met zich meebrengt een verantwoordelijkheid van een corporatie voor het bedenken of beheren van het aggregeren van een item in een tentoonstelling of collectie. @nl
toolkit label: curator-corporatie van @nl
toolkit definition: Een item dat met zich meebrengt een verantwoordelijkheid van een corporatie voor het bedenken of beheren van het aggregeren van een item in een tentoonstelling of collectie. @nl
label: هي هيئة أمينة معرض @ar
definition: يربط هيئة بمفردة تنطوي على مسئولية هيئة عن فهم أو إدارة تجميع مفردة في معرض أو في مجموعة. @ar
toolkit label: هيئة أمينة معرض @ar
toolkit definition: مفردة تنطوي على مسئولية هيئة عن فهم أو إدارة تجميع مفردة في معرض أو في مجموعة. @ar
label: és entitat corporativa conservadora de @ca
definition: Relaciona una entitat corporativa amb un ítem que implica una responsabilitat d’una entitat corporativa de concebre o gestionar l’agregació d’un ítem en una exposició o una col·lecció. @ca
toolkit label: entitat corporativa conservadora de @ca
toolkit definition: Ítem que implica una responsabilitat d’una entitat corporativa de concebre o gestionar l’agregació d’un ítem en una exposició o una col·lecció. @ca
label: er korporation, som er kurator af @da
definition: Relaterer en korporation til et eksemplar, som involverer en korporations ansvar for at udtænke eller administrere samlingen af et eksemplar til en udstilling eller samling. @da
toolkit label: korporation, som er kurator af @da
toolkit definition: Eksemplar, som involverer en korporations ansvar for at udtænke eller administrere samlingen af et eksemplar til en udstilling eller samling. @da
label: kuraator (asutus) eksemplarile @et
definition: Seostab asutuse eksemplariga, mis sisaldab asutuse vastutust eksemplari näituse või koguga liitmise kavandamise või korraldamise eest. @et
toolkit label: kuraator (asutus) eksemplarile @et
toolkit definition: Eksemplar, mis sisaldab asutuse vastutust eksemplari näituse või koguga liitmise kavandamise või korraldamise eest. @et
label: ist Körperschaft als Kuratorin/Kurator von @de
definition: Setzt eine Körperschaft in Beziehung zu einem Exemplar, bei dem eine Körperschaft die Aggregation eines Exemplars in einer Ausstellung oder Sammlung konzipiert oder organisiert. @de
toolkit label: Körperschaft als Kuratorin/Kurator von @de
toolkit definition: Ein Exemplar, bei dem eine Körperschaft die Aggregation eines Exemplars in einer Ausstellung oder Sammlung konzipiert oder organisiert. @de
label: kurátor testülete a következőnek: @hu
definition: Hozzákapcsol egy testületet egy példányhoz, amelyhez hozzátartozik egy testület felelőssége egy példány kiállítás vagy gyűjtemény keretében történő összegyűjtésének elgondolásáért vagy kezeléséért. @hu
toolkit label: kurátor testülete: @hu
toolkit definition: Egy példány, amelyhez hozzátartozik egy testület felelőssége egy példány kiállítás vagy gyűjtemény keretében történő összegyűjtésének elgondolásáért vagy kezeléséért. @hu
label: è curatore ente di @it
definition: Correla un ente a un item che implica una responsabilità di un ente nella concezione o gestione dell'aggregazione di un item a una mostra o collezione. @it
toolkit label: curatore ente di @it
toolkit definition: Item che implica una responsabilità di un ente per ideare o gestire l'aggregazione di un item in una mostra o collezione. @it
label: είναι έφορος συλλογικό όργανο του @el
toolkit label: έφορος συλλογικό όργανο του @el
label: est une collectivité conservatrice de @fr
definition: Met une collectivité en relation avec un item qui comporte une responsabilité de la part d’une collectivité consistant à concevoir ou à gérer l’agrégation d’un item dans une exposition ou une collection de ressources. @fr
toolkit label: collectivité conservatrice de @fr
toolkit definition: Item qui comporte une responsabilité de la part d’une collectivité consistant à concevoir ou à gérer l’agrégation d’un item dans une exposition ou une collection de ressources. @fr
status: Deprecated
label: ir kurators (institūcija) @lv
definition: Sasaista institūciju ar vienību, kas ietver institūcijas atbildību par tās iekļaušanu izstādē vai kolekcijā . @lv
toolkit label: ir kurators (institūcija) @lv
toolkit definition: Vienība, kas ietver institūcijas atbildību par tās iekļaušanu izstādē vai kolekcijā . @lv
has subproperty: kokoelman luetteloija (yhteisö) kappaleessa
has subproperty: kokoelman muodostaja (yhteisö) kappaleessa
has subproperty: P50932

kuraattori (suku) kappaleessa
label: is curator family of (Deprecated) @en
lexical alias: curatorFamilyOf.en
definition: Relates a family to an item that involves a responsibility of a family for conceiving or managing the aggregation of an item in an exhibition or collection. (Deprecated) @en
toolkit label: curator family of (Deprecated) @en
toolkit definition: An item that involves a responsibility of a family for conceiving or managing the aggregation of an item in an exhibition or collection. (Deprecated) @en
type: Property
domain: C10008
has element type: 2
sub property of: sukuun liittyvä kappale
sub property of: kuraattori (yhteistoimija) kappaleessa
definition: Liittää suvun kappaleeseen, jonka näyttelyyn tai kokoelmaan kuuluvan kappaleaggregaation aikaansaamisessa tai hallinnoimisessa suku on osallisena.
toolkit label: kuraattori (suku) kappaleessa
toolkit definition: Kappale, jonka näyttelyyn tai kokoelmaan kuuluvan kappaleaggregaation aikaansaamisessa tai hallinnoimisessa suku on osallisena.
label: er kurator for (familie) @no
definition: Relaterer en familie til et eksemplar som involverer et ansvar for en familie i form av å ha idéen til eller håndtere innsamlingen av et eksemplar i en utstilling eller samling. @no
toolkit label: kurator for (familie) @no
toolkit definition: Et eksemplar som involverer et ansvar for en familie i form av å ha idéen til eller håndtere innsamlingen av et eksemplar i en utstilling eller samling. @no
label: is curator familie van @nl
definition: Relateert een familie aan een item dat met zich meebrengt een verantwoordelijkheid van een familie voor het bedenken of beheren van het aggregeren van een item in een tentoonstelling of collectie. @nl
toolkit label: curator familie van @nl
toolkit definition: Een item dat met zich meebrengt een verantwoordelijkheid van een familie voor het bedenken of beheren van het aggregeren van een item in een tentoonstelling of collectie. @nl
label: هي عائلة أمينة معرض لـ @ar
definition: يربط عائلة بمفردة تنطوي على مسئولية عائلة عن فهم أو إدارة تجميع مفردة في معرض أو في مجموعة. @ar
toolkit label: عائلة أمينة معرض @ar
toolkit definition: مفردة تنطوي على مسئولية عائلة عن فهم أو إدارة تجميع مفردة في معرض أو في مجموعة. @ar
label: és família conservadora de @ca
definition: Relaciona una família amb un ítem que implica una responsabilitat d’una família de concebre o gestionar l’agregació d’un ítem en una exposició o una col·lecció. @ca
toolkit label: família conservadora de @ca
toolkit definition: Ítem que implica una responsabilitat d’una família de concebre o gestionar l’agregació d’un ítem en una exposició o una col·lecció. @ca
label: er familie, som er kurator af @da
definition: Relaterer en familie til et eksemplar, som involverer en families ansvar for at udtænke eller administrere samlingen af et eksemplar til en udstilling eller samling. @da
toolkit label: familie, som er kurator af @da
toolkit definition: Eksemplar, som involverer en families ansvar for at udtænke eller administrere samlingen af et eksemplar til en udstilling eller samling. @da
label: kuraator (perekond) eksemplarile @et
definition: Seostab perekonna eksemplariga, mis sisaldab perekonna vastutust eksemplari näituse või koguga liitmise kavandamise või korraldamise eest. @et
toolkit label: kuraator (perekond) eksemplarile @et
toolkit definition: Eksemplar, mis sisaldab perekonna vastutust eksemplari näituse või koguga liitmise kavandamise või korraldamise eest. @et
label: ist Familie als Kuratorin/Kurator von @de
definition: Setzt eine Familie in Beziehung zu einem Exemplar, bei dem eine Familie die Aggregation eines Exemplars in einer Ausstellung oder Sammlung konzipiert oder organisiert. @de
toolkit label: Familie als Kuratorin/Kurator von @de
toolkit definition: Ein Exemplar, bei dem eine Familie die Aggregation eines Exemplars in einer Ausstellung oder Sammlung konzipiert oder organisiert. @de
label: kurátor családja a következőnek: @hu
definition: Hozzákapcsol egy családot egy példányhoz, amely magában foglalja egy család felelősségét egy példány kiállítás vagy gyűjtemény keretében történő összegyűjtésének elgondolásáért vagy kezeléséért. @hu
toolkit label: kurátor családja: @hu
toolkit definition: Egy példány, amely magában foglalja egy család felelősségét egy példány kiállítás vagy gyűjtemény keretében történő összegyűjtésének elgondolásáért vagy kezeléséért. @hu
label: è curatore famiglia di @it
definition: Correla una famiglia a un item che implica una responsabilità di una famiglia nella concezione o gestione dell'aggregazione di un item a una mostra o collezione. @it
toolkit label: curatore famiglia di @it
toolkit definition: Item che implica una responsabilità di una famiglia nella concezione o gestione dell'aggregazione di un item a una mostra o collezione. @it
label: είναι έφορος οικογένεια του @el
definition: Συνδέει μια οικογένεια με ένα αντίτυπο που περιλαμβάνει την ευθύνη μιας οικογένειας για τη σύλληψη ή τη διαχείριση του ερανισμού ενός αντιτύπου σε μια έκθεση ή συλλογή. @el
toolkit label: έφορος οικογένεια του @el
label: est une famille conservatrice de @fr
definition: Met une famille en relation avec un item qui comporte une responsabilité de la part d’une famille consistant à concevoir ou à gérer l’agrégation d’un item dans une exposition ou une collection de ressources. @fr
toolkit label: famille conservatrice de @fr
toolkit definition: Item qui comporte une responsabilité de la part d’une famille consistant à concevoir ou à gérer l’agrégation d’un item dans une exposition ou une collection de ressources. @fr
status: Deprecated
label: ir kurators (dzimta/ģimene) @lv
definition: Sasaista dzimtu/ģimeni ar vienību, kas ietver dzimtas/ģimenes atbildību par tās iekļaušanu izstādē vai kolekcijā . @lv
toolkit label: ir kurators (dzimta/ģimene) @lv
toolkit definition: Vienība, kas ietver dzimtas/ģimenes atbildību par tās iekļaušanu izstādē vai kolekcijā . @lv
has subproperty: kokoelman luetteloija (suku) kappaleessa
has subproperty: kokoelman muodostaja (suku) kappaleessa
has subproperty: P51083

kuraattori (henkilö) kappaleessa
label: is curator person of (Deprecated) @en
lexical alias: curatorPersonOf.en
definition: Relates a person to an item that involves a responsibility of a person for conceiving or managing the aggregation of an item in an exhibition or collection. (Deprecated) @en
toolkit label: curator person of (Deprecated) @en
toolkit definition: An item that involves a responsibility of a person for conceiving or managing the aggregation of an item in an exhibition or collection. (Deprecated) @en
type: Property
domain: C10004
has element type: 2
sub property of: henkilöön liittyvä kappale
sub property of: kuraattori (toimija) kappaleelle
definition: Liittää henkilön kappaleeseen, jonka näyttelyyn tai kokoelmaan kuuluvan kappaleaggregaation aikaasaamisessa tai hallinnoimisessa henkilö on osallisena.
toolkit label: kuraattori (henkilö) kappaleessa
toolkit definition: Kappale, jonka näyttelyyn tai kokoelmaan kuuluvan kappaleaggregaation aikaasaamisessa tai hallinnoimisessa henkilö on osallisena.
label: er kurator for (person) @no
definition: Relaterer en person til et eksemplar som involverer et ansvar for en person i form av å ha idéen til eller håndtere innsamlingen av et eksemplar i en utstilling eller samling. @no
toolkit label: kurator for (person) @no
toolkit definition: Et eksemplar som involverer et ansvar for en person i form av å ha idéen til eller håndtere innsamlingen av et eksemplar i en utstilling eller samling. @no
label: is curator-persoon van @nl
definition: Relateert een persoon aan een item dat met zich meebrengt een verantwoordelijkheid van een persoon voor het bedenken of beheren van het aggregeren van een item in een tentoonstelling of collectie. @nl
toolkit label: curator-persoon van @nl
toolkit definition: Een item dat met zich meebrengt een verantwoordelijkheid van een persoon voor het bedenken of beheren van het aggregeren van een item in een tentoonstelling of collectie. @nl
label: هو شخص أمين معرض لـ @ar
definition: يربط شخصا بمفردة تنطوي على مسئولية وكيل فهم أو إدارة تجميع مفردة في معرض أو في مجموعة. @ar
toolkit label: شخص أمين معرض @ar
toolkit definition: مفردة تنطوي على مسئولية شخص عن تصور أو إدارة التجميع لمفردة في معرض أو في مجموعة. @ar
label: és persona conservadora de @ca
definition: Relaciona una persona amb un ítem que implica una responsabilitat d’una persona de concebre o gestionar l’agregació d’un ítem en una exposició o una col·lecció. @ca
toolkit label: persona conservadora de @ca
toolkit definition: Ítem que implica una responsabilitat d’una persona de concebre o gestionar l’agregació d’un ítem en una exposició o una col·lecció. @ca
label: er person, som er kurator af @da
definition: Relaterer en person til et eksemplar, som involverer en persons ansvar for at udtænke eller administrere samlingen af et eksemplar til en udstilling eller samling. @da
toolkit label: person, som er kurator af @da
toolkit definition: Eksemplar, som involverer en persons ansvar for at udtænke eller administrere samlingen af et eksemplar til en udstilling eller samling. @da
label: kuraator (isik) eksemplarile @et
definition: Seostab isiku eksemplariga, mis sisaldab isiku vastutust eksemplari näituse või koguga liitmise kavandamise või korraldamise eest. @et
toolkit label: kuraator (isik) eksemplarile @et
toolkit definition: Eksemplar, mis sisaldab isiku vastutust eksemplari näituse või koguga liitmise kavandamise või korraldamise eest. @et
label: ist Person als Kuratorin/Kurator von @de
definition: Setzt eine Person in Beziehung zu einem Exemplar, bei dem eine Person die Aggregation eines Exemplars in einer Ausstellung oder Sammlung konzipiert oder organisiert. @de
toolkit label: Person als Kuratorin/Kurator von @de
toolkit definition: Ein Exemplar, bei dem eine Person die Aggregation eines Exemplars in einer Ausstellung oder Sammlung konzipiert oder organisiert. @de
label: kurátor személye a következőnek: @hu
definition: Hozzákapcsol egy személyt egy példányhoz, amelyhez hozzátartozik egy személy felelőssége egy példány kiállítás vagy gyűjtemény keretében történő összegyűjtésének elgondolásáért vagy kezeléséért. @hu
toolkit label: kurátor személye: @hu
toolkit definition: Egy példány, amelyhez hozzátartozik egy személy felelőssége egy példány kiállítás vagy gyűjtemény keretében történő összegyűjtésének elgondolásáért vagy kezeléséért. @hu
label: è curatore persona di @it
definition: Correla una persona a un item che implica una responsabilità di una persona nella concezione o gestione dell'aggregazione di un item a una mostra o collezione. @it
toolkit label: curatore persona di @it
toolkit definition: Item che implica una responsabilità di una persona nella concezione o gestione dell'aggregazione di un item a una mostra o collezione. @it
label: είναι έφορος φυσικό πρόσωπο του @el
toolkit label: έφορος φυσικό πρόσωπο του @el
label: est une personne conservatrice de @fr
definition: Met une personne en relation avec un item qui comporte une responsabilité de la part d’une personne consistant à concevoir ou à gérer l’agrégation d’un item dans une exposition ou une collection de ressources. @fr
toolkit label: personne conservatrice de @fr
toolkit definition: Item qui comporte une responsabilité de la part d’une personne consistant à concevoir ou à gérer l’agrégation d’un item dans une exposition ou une collection de ressources. @fr
status: Deprecated
label: ir kurators (persona) @lv
definition: Sasaista personu ar vienību, kas ietver personas atbildību par tās iekļaušanu izstādē vai kolekcijā . @lv
toolkit label: ir kurators (persona) @lv
toolkit definition: Vienība, kas ietver personas atbildību par tās iekļaušanu izstādē vai kolekcijā . @lv
has subproperty: kokoelman luetteloija (henkilö) kappaleessa
has subproperty: kokoelman muodostaja (henkilö) kappaleessa
has subproperty: P50630

nykyinen omistaja (toimija) kappaleessa
status: Published
label: is current owner agent of @en
definition: Relates an agent to an item that involves a responsibility of an agent for current legal possession. @en
type: Property
domain: C10002
sub property of: omistaja (toimija) kappaleessa
lexical alias: currentOwnerAgentOf.en
label: est un agent propriétaire actuel de @fr
definition: Met un agent en relation avec un item qui comporte une responsabilité de la part d’un agent en ce qui concerne la propriété légale actuelle. @fr
toolkit label: agent propriétaire actuel de @fr
toolkit definition: Item qui comporte une responsabilité de la part d’un agent en ce qui concerne la propriété légale actuelle. @fr
toolkit label: current owner agent of @en
toolkit definition: An item that involves a responsibility of an agent for current legal possession. @en
instruction number: 18.5
label: είναι τρέχων κάτοχος φορέας του @el
definition: Συνδέει έναν φορέα, ο οποίος επί του παρόντος έχει τη νόμιμη κατοχή ενός αντιτύπου, με ένα αντίτυπο. @el
toolkit label: τρέχων κάτοχος φορέας του @el
toolkit definition: Ένα αντίτυπο που επί του παρόντος βρίσκεται υπό τη νόμιμη κατοχή ενός φορέα. @el
definition: Setzt einen Akteur in Beziehung zu einem Exemplar, das sich derzeit im rechtmäßigen Besitz eines Akteurs befindet. @de
toolkit label: Akteur als gegenwärtige Eigentümerin/gegenwärtiger Eigentümer von @de
toolkit definition: Ein Exemplar, das sich derzeit im rechtmäßigen Besitz eines Akteurs befindet. @de
label: er agent, som er nuværende ejer af @da
definition: Relaterer en agent til et eksemplar, som involverer en agents ansvar for lovlig besiddelse p.t. @da
toolkit label: agent, som er nuværende ejer af @da
toolkit definition: Eksemplar, som involverer en agents ansvar for lovlig besiddelse p.t. @da
label: és agent propietari actual de @ca
definition: Relaciona un agent amb un ítem que implica una responsabilitat d’un agent en la possessió legal actual. @ca
toolkit label: agent propietari actual de @ca
toolkit definition: Ítem que implica una responsabilitat d’un agent en la possessió legal actual. @ca
definition: Liittää toimijan kappaleeseen, joka tällä hetkellä on laillisesti toimijan omistuksessa.
toolkit label: nykyinen omistaja (toimija) kappaleessa
toolkit definition: Kappale, joka tällä hetkellä on laillisesti toimijan omistuksessa.
toolkit label: nåværende eier av (agent) @no
toolkit definition: Et eksemplar som involverer ansvar for en agent i form av å for tiden være den rettmessige eieren. @no
label: ist Akteur als gegenwärtige Eigentümerin/gegenwärtiger Eigentümer von @de
has element type: 2
label: jelenlegi tulajdonos ágense a következőnek: @hu
definition: Hozzákapcsol egy ágenst egy példányhoz, amelyhez hozzátartozik egy ágens jelenlegi tulajdonjog iránti felelőssége. @hu
toolkit label: jelenlegi tulajdonos ágense: @hu
toolkit definition: Egy példány, amelyhez hozzátartozik egy ágens jelenlegi tulajdonjog iránti felelőssége. @hu
alternative label: current owner of @en
alternative label: nykyisenä omistajana kappaleelle
label: er nåværende eier av (agent) @no
definition: Relaterer en agent til et eksemplar som involverer ansvar for en agent i form av å for tiden være den rettmessige eieren. @no
alternative label: nåværende eier av @no
label: is huidige eigenaar-actor van @nl
definition: Relateert een actor aan een item dat met zich meebrengt een verantwoordelijkheid van een actor betreffende huidig wettelijk bezit. @nl
toolkit label: huidige eigenaar-actor van @nl
toolkit definition: Een item dat met zich meebrengt een verantwoordelijkheid van een actor betreffende huidig wettelijk bezit. @nl
label: هو وكيل مالك حاليا لـ @ar
definition: يربط وكيلا بمفردة تنطوي على مسئولية وكيل عن الملكية القانونية الحالية. @ar
alternative label: مالك حاليا @ar
toolkit label: وكيل مالك حاليا @ar
toolkit definition: مفردة تنطوي على مسئولية وكيل عن الملكية القانونية الحالية. @ar
alternative label: propietari actual de @ca
alternative label: nuværende ejer af @da
label: praegune omanik (tegija) eksemplarile @et
definition: Seostab tegija eksemplariga, mis kuulub praegu õiguspäraselt tegijale. @et
alternative label: praegune omanik eksemplarile @et
toolkit label: praegune omanik (tegija) eksemplarile @et
toolkit definition: Eksemplar, mis kuulub praegu õiguspäraselt tegijale. @et
alternative label: jelenlegi tulajdonosa: @hu
label: è agente proprietario attuale @it
definition: Correla un agente con itemche implica la responsabilità di un agente nel possesso legale attuale. @it
alternative label: proprietario attuale di @it
toolkit label: proprietario attuale agente di @it
toolkit definition: Item che implica una responsabilità di un agente nel possesso legale attuale. @it
alternative label: τρέχων κάτοχος του @el
alternative label: propriétaire actuel de @fr
label: ir pašreizējais īpašnieks (aģents) @lv
definition: Sasaista aģentu ar vienību, kas ietver aģenta atbildību par pašreizējo likumīgo īpašumu. @lv
toolkit label: ir pašreizējais īpašnieks (aģents) @lv
toolkit definition: Vienība, kas ietver aģenta atbildību par pašreizējo likumīgo īpašumu. @lv
alternative label: Gegenwärtiger Eigentümer von @de
alternative label: ……的当前拥有者 @zh-hans
toolkit label: ……的当前拥有者行为者 @zh-hans
toolkit definition: 涉及一个当前法定所有权的一个行为者的责任的一个单件 @zh-hans
toolkit label: şu anki sahibi olan temsilci @tr
toolkit definition: Mevcut yasal mülkiyet için bir temsilcinin sorumluluğunu içeren bir kopya. @tr
has subproperty: nykyinen omistaja (yhteistoimija) kappaleessa

nykyinen omistaja (yhteistoimija) kappaleessa
status: Published
label: is current owner collective agent of @en
lexical alias: currentOwnerCollectiveAgentOf.en
definition: Relates a collective agent to an item that involves a responsibility of a collective agent for current legal possession. @en
toolkit label: current owner collective agent of @en
toolkit definition: An item that involves a responsibility of a collective agent for current legal possession. @en
type: Property
domain: C10011
has element type: 2
sub property of: omistaja (yhteistoimija) kappaleessa
sub property of: nykyinen omistaja (toimija) kappaleessa
definition: Liittää yhteistoimijan kappaleeseen, jonka yhteistoimija tällä hetkellä laillisesti omistaa.
toolkit label: nykyinen omistaja (yhteistoimija) kappaleessa
toolkit definition: Kappale, jonka yhteistoimija tällä hetkellä laillisesti omistaa.
label: er nåværende eier av (kollektiv agent) @no
definition: Relaterer en kollektiv agent til et eksemplar som involverer et ansvar for en kollektiv agent i form av å være den nåværende rettmessige eieren. @no
toolkit label: nåværende eier av (kollektiv agent) @no
toolkit definition: Et eksemplar som involverer et ansvar for en kollektiv agent i form av å være den nåværende rettmessige eieren. @no
label: is huidige eigenaar-collectieve actor van @nl
definition: Relateert een collectieve actor aan een item dat met zich meebrengt een verantwoordelijkheid van een collectieve actor betreffende huidig wettelijk bezit. @nl
toolkit label: huidige eigenaar-collectieve actor van @nl
toolkit definition: Een item dat met zich meebrengt een verantwoordelijkheid van een collectieve actor betreffende huidig wettelijk bezit. @nl
label: هو وكيل جماعي مالك حاليا لـ @ar
definition: يربط وكيلا جماعيا بمفردة تنطوي على مسئولية وكيل جماعي عن الملكية القانونية الحالية. @ar
toolkit label: وكيل جماعي مالك حاليا @ar
toolkit definition: مفردة تنطوي على مسئولية وكيل جماعي عنالملكية القانونية الحالية. @ar
label: és agent col·lectiu propietari actual de @ca
definition: Relaciona un agent col·lectiu amb un ítem que implica una responsabilitat d’un agent col·lectiu en la possessió legal actual. @ca
toolkit label: agent col·lectiu propietari actual de @ca
toolkit definition: Ítem que implica una responsabilitat d’un agent col·lectiu en la possessió legal actual. @ca
label: er kollektiv agent, som er nuværende ejer af @da
definition: Relaterer en kollektiv agent til et eksemplar, som involverer en kollektiv agents ansvar for lovlig besiddelse p.t. @da
toolkit label: kollektiv agent, som er nuværende ejer af @da
toolkit definition: Eksemplar, som involverer en kollektiv agents ansvar for lovlig besiddelse p.t. @da
label: praegune omanik (kollektiiv) eksemplarile @et
definition: Seostab kollektiivi eksemplariga, mis kuulub praegu õiguspäraselt kollektiivile. @et
toolkit label: praegune omanik (kollektiiv) eksemplarile @et
toolkit definition: Eksemplar, mis kuulub praegu õiguspäraselt kollektiivile. @et
label: ist gemeinschaftlicher Akteur als gegenwärtige Eigentümerin/gegenwärtiger Eigentümer von @de
definition: Setzt einen gemeinschaftlichen Akteur in Beziehung zu einem Exemplar, das sich derzeit im rechtmäßigen Besitz eines gemeinschaftlichen Akteurs befindet. @de
toolkit label: Gemeinschaftlicher Akteur als Gegenwärtige Eigentümerin/gegenwärtiger Eigentümer von @de
toolkit definition: Ein Exemplar, das sich derzeit im rechtmäßigen Besitz eines gemeinschaftlichen Akteurs befindet. @de
label: jelenlegi tulajdonos kollektív ágense a következőnek: @hu
definition: Hozzákapcsol egy kollektív ágenst egy példányhoz, amelyhez hozzátartozik egy kollektív ágens jelenlegi tulajdonjog iránti felelőssége. @hu
toolkit label: jelenlegi tulajdonos kollektív ágense: @hu
toolkit definition: Egy példány, amelyhez hozzátartozik egy kollektív ágens jelenlegi tulajdonjog iránti felelőssége. @hu
label: è proprietario attuale agente collettivo di @it
definition: Correla un agente collettivo a un item che implica la responsabilità di un agente collettivo per il possesso legale attuale. @it
toolkit label: proprietario attuale agente collettivo di @it
toolkit definition: Item che implica una responsabilità di un agente collettivo per il possesso legale attuale. @it
label: είναι τρέχων κάτοχος συλλογικός φορέας του @el
toolkit label: τρέχων κάτοχος συλλογικός φορέας του @el
label: est un agent collectif propriétaire actuel de @fr
definition: Met un agent collectif en relation avec un item qui comporte une responsabilité de la part d’un agent collectif en ce qui concerne la propriété légale actuelle. @fr
toolkit label: agent collectif propriétaire actuel de @fr
toolkit definition: Item qui comporte une responsabilité de la part d’un agent collectif en ce qui concerne la propriété légale actuelle. @fr
label: ir pašreizējais īpašnieks (grupa) @lv
definition: Sasaista grupu ar vienību, kas ietver grupas atbildību par pašreizējo likumīgo īpašumu. @lv
toolkit label: ir pašreizējais īpašnieks (grupa) @lv
toolkit definition: Vienība, kas ietver grupas atbildību par pašreizējo likumīgo īpašumu. @lv
label: 是……的当前拥有者集体行为者 @zh-hans
definition: 将一个集体行为者与涉及一个当前法定所有权的一个集体行为者的责任的一个单件关联起来。 @zh-hans
toolkit label: ……的当前拥有者集体行为者 @zh-hans
toolkit definition: 涉及一个当前法定所有权的一个集体行为者的责任的一个单件 @zh-hans
label: mevcut sahip kolektif temsilcisidir @tr
definition: Kolektif bir temsilciyi, kolektif temsilcinin mevcut yasal mülkiyet sorumluluğunu içeren bir kopya ile ilgilidir. @tr
toolkit label: şu anki sahibi olan kolektif temsilci @tr
toolkit definition: Mevcut yasal mülkiyet için kolektif bir temsilcinin sorumluluğunu içeren bir kopya. @tr
has subproperty: nykyinen omistaja (yhteisö) kappaleessa
has subproperty: nykyinen omistaja (suku) kappaleessa
has subproperty: tallettaja (yhteistoimija) kappaleessa
has subproperty: P50782

nykyinen omistaja (yhteisö) kappaleessa
status: Published
label: is current owner corporate body of @en
lexical alias: currentOwnerCorporateBodyOf.en
definition: Relates a corporate body to an item that involves a responsibility of a corporate body for current legal possession. @en
toolkit label: current owner corporate body of @en
toolkit definition: An item that involves a responsibility of a corporate body for current legal possession. @en
type: Property
domain: C10005
has element type: 2
sub property of: omistaja (yhteisö) kappaleessa
sub property of: nykyinen omistaja (yhteistoimija) kappaleessa
definition: Liittää yhteisön kappaleeseen, jonka yhteisö tällä hetkellä laillisesti omistaa.
toolkit label: nykyinen omistaja (yhteisö) kappaleessa
toolkit definition: Kappale, jonka yhteisö tällä hetkellä laillisesti omistaa.
label: er nåværende eier av (korporasjon) @no
definition: Relaterer en korporasjon til et eksemplar som involverer et ansvar for en korporasjon i form av å være den nåværende rettmessige eieren. @no
toolkit label: nåværende eier av (korporasjon) @no
toolkit definition: Et eksemplar som involverer et ansvar for en korporasjon i form av å være den nåværende rettmessige eieren. @no
label: is huidige eigenaar-corporatie van @nl
definition: Relateert een corporatie aan een item dat met zich meebrengt een verantwoordelijkheid van een corporatie betreffende huidig wettelijk bezit. @nl
toolkit label: huidige eigenaar-corporatie van @nl
toolkit definition: Een item dat met zich meebrengt een verantwoordelijkheid van een corporatie betreffende huidig wettelijk bezit. @nl
label: هي هيئة مالكة حاليا لـ @ar
definition: يربط هيئة بمفردة تنطوي على مسئولية هيئة عن الحيازة القانونية الحالية. @ar
toolkit label: هيئة مالكة حاليا لـ @ar
toolkit definition: مفردة تنطوي على مسئولية هيئة عن الحيازة القانونية الحالية. @ar
label: és entitat corporativa propietària actual de @ca
definition: Relaciona una entitat corporativa amb un ítem que implica una responsabilitat d’una entitat corporativa en la possessió legal actual. @ca
toolkit label: entitat corporativa propietària actual de @ca
toolkit definition: Ítem que implica una responsabilitat d’una entitat corporativa en la possessió legal actual. @ca
label: er korporation, som er nuværende ejer af @da
definition: Relaterer en korporation til et eksemplar, som involverer en korporations ansvar for lovlig besiddelse p.t. @da
toolkit label: korporation, som er nuværende ejer af @da
toolkit definition: Eksemplar, som involverer en korporations ansvar for lovlig besiddelse p.t. @da
label: praegune omanik (asutus) eksemplarile @et
definition: Seostab asutuse eksemplariga, mis kuulub praegu õiguspäraselt asutusele. @et
toolkit label: praegune omanik (asutus) eksemplarile @et
toolkit definition: Eksemplar, mis kuulub praegu õiguspäraselt asutusele. @et
label: ist Körperschaft als gegenwärtige Eigentümerin/gegenwärtiger Eigentümer von @de
definition: Setzt eine Körperschaft in Beziehung zu einem Exemplar, das sich derzeit im rechtmäßigen Besitz einer Körperschaft befindet. @de
toolkit label: Körperschaft als gegenwärtige Eigentümerin/gegenwärtiger Eigentümer von @de
toolkit definition: Ein Exemplar, das sich derzeit im rechtmäßigen Besitz einer Körperschaft befindet. @de
label: jelenlegi tulajdonos testülete a következőnek: @hu
definition: Hozzákapcsol egy testületet egy példányhoz, amelyhez hozzátartozik egy testület jelenlegi tulajdonjog iránti felelőssége. @hu
toolkit label: jelenlegi tulajdonos testülete: @hu
toolkit definition: Egy példány, amelyhez hozzátartozik egy testület jelenlegi tulajdonjog iránti felelőssége. @hu
label: è proprietario attuale ente di @it
definition: Correla un ente a un item che implica una responsabilità di un ente per il possesso legale attuale. @it
toolkit label: proprietario attuale ente di @it
toolkit definition: Item che implica una responsabilità di un ente per il possesso legale attuale. @it
label: είναι τρέχων κάτοχος συλλογικό όργανο του @el
toolkit label: τρέχων κάτοχος συλλογικό όργανο του @el
label: est une collectivité propriétaire actuelle de @fr
definition: Met une collectivité en relation avec un item qui comporte une responsabilité de la part d’une collectivité en ce qui concerne la propriété légale actuelle. @fr
toolkit label: collectivité propriétaire actuelle de @fr
toolkit definition: Item qui comporte une responsabilité de la part d’une collectivité en ce qui concerne la propriété légale actuelle. @fr
label: ir pašreizējais īpašnieks (institūcija) @lv
definition: Sasaista institūciju ar vienību, kas ietver institūcijas atbildību par pašreizējo likumīgo īpašumu. @lv
toolkit label: ir pašreizējais īpašnieks (institūcija) @lv
toolkit definition: Vienība, kas ietver institūcijas atbildību par pašreizējo likumīgo īpašumu. @lv
label: 是……的当前拥有者团体 @zh-hans
definition: 将一个团体与涉及一个当前法定所有权的一个团体的责任的一个单件关联起来。 @zh-hans
toolkit label: ……的当前拥有者团体 @zh-hans
toolkit definition: 涉及一个当前法定所有权的一个团体的责任的一个单件 @zh-hans
label: mevcut sahip tüzel kişisidir @tr
definition: Bir tüzel kişiyi, mevcut yasal mülkiyet için bir tüzel kişiliğin sorumluluğunu içeren bir kopyayla ilişkilendirir. @tr
toolkit label: şu anki sahibi olan tüzel kişi @tr
toolkit definition: Mevcut yasal mülkiyet için tüzel bir kişinin sorumluluğunu içeren bir kopya. @tr
has subproperty: tallettaja (yhteisö) kappaleessa
has subproperty: P50933

nykyinen omistaja (suku) kappaleessa
status: Published
label: is current owner family of @en
lexical alias: currentOwnerFamilyOf.en
definition: Relates a family to an item that involves a responsibility of a family for current legal possession. @en
toolkit label: current owner family of @en
toolkit definition: An item that involves a responsibility of a family for current legal possession. @en
type: Property
domain: C10008
has element type: 2
sub property of: omistaja (suku) kappaleessa
sub property of: nykyinen omistaja (yhteistoimija) kappaleessa
definition: Liittää suvun kappaleeseen, jonka suku tällä hetkellä laillisesti omistaa.
toolkit label: nykyinen omistaja (suku) kappaleessa
toolkit definition: Kappale, jonka suku tällä hetkellä laillisesti omistaa.
label: er nåværende eier av (familie) @no
definition: Relaterer en familie til et eksemplar som involverer et ansvar for en familie i form av å være den nåværende rettmessige eieren. @no
toolkit label: nåværende eier av (familie) @no
toolkit definition: Et eksemplar som involverer et ansvar for en familie i form av å være den nåværende rettmessige eieren. @no
label: is huidige eigenaar-familie van @nl
definition: Relateert een familie aan een item dat met zich meebrengt een verantwoordelijkheid van een familie betreffende huidig wettelijk bezit. @nl
toolkit label: huidige eigenaar-familie van @nl
toolkit definition: Een item dat met zich meebrengt een verantwoordelijkheid van een familie betreffende huidig wettelijk bezit. @nl
label: هي عائلة مالكة حاليا لـ @ar
definition: يربط عائلة بمفردة تنطوي على مسئولية عائلة عن الحيازة القانونية الحالية. @ar
toolkit label: عائلة مالكة حاليا @ar
toolkit definition: مفردة تنطوي على مسئولية عائلة عن الحيازة القانونية الحالية. @ar
label: és família propietària actual de @ca
definition: Relaciona una família amb un ítem que implica una responsabilitat d’una família en la possessió legal actual. @ca
toolkit label: família propietària actual de @ca
toolkit definition: Ítem que implica una responsabilitat d’una família en la possessió legal actual. @ca
label: er familie, som er nuværende ejer af @da
definition: Relaterer en familie til et eksemplar, som involverer en families ansvar for lovlig besiddelse p.t. @da
toolkit label: familie, som er nuværende ejer af @da
toolkit definition: Eksemplar, som involverer en families ansvar for lovlig besiddelse p.t. @da
label: praegune omanik (perekond) eksemplarile @et
definition: Seostab perekonna eksemplariga, mis kuulub praegu õiguspäraselt perekonnale. @et
toolkit label: praegune omanik (perekond) eksemplarile @et
toolkit definition: Eksemplar, mis kuulub praegu õiguspäraselt perekonnale. @et
label: ist Familie als gegenwärtige Eigentümerin/gegenwärtiger Eigentümer von @de
definition: Setzt eine Familie in Beziehung zu einem Exemplar, das sich derzeit im rechtmäßigen Besitz einer Familie befindet. @de
toolkit label: Familie als gegenwärtige Eigentümerin/gegenwärtiger Eigentümer von @de
toolkit definition: Ein Exemplar, das sich derzeit im rechtmäßigen Besitz einer Familie befindet. @de
label: jelenlegi tulajdonos családja a következőnek: @hu
definition: Hozzákapcsol egy családot egy példányhoz, amelyhez hozzátartozik egy család jelenlegi tulajdonjog iránti felelőssége. @hu
toolkit label: jelenlegi tulajdonos családja: @hu
toolkit definition: Egy példány, amelyhez hozzátartozik egy család jelenlegi tulajdonjog iránti felelőssége. @hu
label: è proprietario attuale famiglia di @it
definition: Correla una famiglia a un item che implica una responsabilità di una famiglia per il possesso legale attuale. @it
toolkit label: proprietario attuale famiglia di @it
toolkit definition: Item che implica una responsabilità di una famiglia per il possesso legale attuale. @it
label: είναι τρέχων κάτοχος οικογένεια του @el
definition: Συνδέει μια οικογένεια με ένα αντίτυπο που περιλαμβάνει την ευθύνη μιας οικογένεια για την τρέχουσα νομική κατοχή. @el
toolkit label: τρέχων κάτοχος οικογένεια του @el
label: est une famille propriétaire actuelle de @fr
definition: Met une famille en relation avec un item qui comporte une responsabilité de la part d’une famille en ce qui concerne la propriété légale actuelle. @fr
toolkit label: famille propriétaire actuelle de @fr
toolkit definition: Item qui comporte une responsabilité de la part d’une famille en ce qui concerne la propriété légale actuelle. @fr
label: ir pašreizējais īpašnieks (dzimta/ģimene) @lv
definition: Sasaista dzimtu/ģimeni ar vienību, kas ietver dzimtas/ģimenes atbildību par pašreizējo likumīgo īpašumu. @lv
toolkit label: ir pašreizējais īpašnieks (dzimta/ģimene) @lv
toolkit definition: Vienība, kas ietver dzimtas/ģimenes atbildību par pašreizējo likumīgo īpašumu. @lv
label: 是……的当前拥有者家族 @zh-hans
definition: 将一个家族与涉及一个当前法定所有权的一个家族的责任的一个单件关联起来。 @zh-hans
toolkit label: ……的当前拥有者家族 @zh-hans
toolkit definition: 涉及一个当前法定所有权的一个家族的责任的一个单件 @zh-hans
label: mevcut sahip ailesidir @tr
definition: Bir aileyi, mevcut yasal mülkiyet için bir ailenin sorumluluğunu içeren bir kopyayla ilişkilendirir @tr
toolkit label: şu anki sahibi olan aile @tr
toolkit definition: Mevcut yasal mülkiyet için bir ailenin sorumluluğunu içeren bir kopya. @tr
has subproperty: tallettaja (suku) kappaleessa
has subproperty: P51084

nykyinen omistaja (henkilö) kappaleessa
status: Published
label: is current owner person of @en
lexical alias: currentOwnerPersonOf.en
definition: Relates a person to an item that involves a responsibility of a person for current legal possession. @en
toolkit label: current owner person of @en
toolkit definition: An item that involves a responsibility of a person for current legal possession. @en
type: Property
domain: C10004
has element type: 2
sub property of: omistaja (henkilö) kappaleessa
sub property of: nykyinen omistaja (toimija) kappaleessa
definition: Liittää henkilön kappaleeseen, jonka henkilö tällä hetkellä laillisesti omistaa.
toolkit label: nykyinen omistaja (henkilö) kappaleessa
toolkit definition: Kappale, jonka henkilö tällä hetkellä laillisesti omistaa.
label: er nåværende eier av (person) @no
definition: Relaterer en person til et eksemplar som involverer et ansvar for en person i form av å være den nåværende rettmessige eieren. @no
toolkit label: nåværende eier av (person) @no
toolkit definition: Et eksemplar som involverer et ansvar for en person i form av å være den nåværende rettmessige eieren. @no
label: is huidige eigenaar-persoon van @nl
definition: Relateert een persoon aan een item dat met zich meebrengt een verantwoordelijkheid van een persoon betreffende huidig wettelijk bezit. @nl
toolkit label: huidige eigenaar-persoon van @nl
toolkit definition: Een item dat met zich meebrengt een verantwoordelijkheid van een persoon betreffende huidig wettelijk bezit. @nl
label: هو شخص مالك حاليا لـ @ar
definition: يربط شخصا بمفردة تنطوي على مسئولية شخص عن الملكية القانونية الحالية. @ar
toolkit label: شخص مالك حاليا @ar
toolkit definition: مفردة تنطوي على مسئولية شخص عن الملكية القانونية الحالية. @ar
label: és persona propietària actual de @ca
definition: Relaciona una persona amb un ítem que implica una responsabilitat d’una persona en la possessió legal actual. @ca
toolkit label: persona propietària actual de @ca
toolkit definition: Ítem que implica una responsabilitat d’una persona en la possessió legal actual. @ca
label: er person, som er nuværende ejer af @da
definition: Relaterer en person til et eksemplar, som involverer en persons ansvar for lovlig besiddelse p.t. @da
toolkit label: person, som er nuværende ejer af @da
toolkit definition: Eksemplar, som involverer en persons ansvar for lovlig besiddelse p.t. @da
label: praegune omanik (isik) eksemplarile @et
definition: Seostab isiku eksemplariga, mis kuulub praegu õiguspäraselt isikule. @et
toolkit label: praegune omanik (isik) eksemplarile @et
toolkit definition: Eksemplar, mis kuulub praegu õiguspäraselt isikule. @et
label: ist Person als gegenwärtige Eigentümerin/gegenwärtiger Eigentümer von @de
definition: Setzt eine Person in Beziehung zu einem Exemplar, das sich derzeit im rechtmäßigen Besitz einer Person befindet. @de
toolkit label: Person als gegenwärtige Eigentümerin/gegenwärtiger Eigentümer von @de
toolkit definition: Ein Exemplar, das sich derzeit im rechtmäßigen Besitz einer Person befindet. @de
label: jelenlegi tulajdonos személye a következőnek: @hu
definition: Hozzákapcsol egy személyt egy példányhoz, amelyhez hozzátartozik egy személy jelenlegi tulajdonjog iránti felelőssége. @hu
toolkit label: jelenlegi tulajdonos személye: @hu
toolkit definition: Egy példány, amelyhez hozzátartozik egy személy jelenlegi tulajdonjog iránti felelőssége. @hu
label: è proprietario attuale persona di @it
definition: Correla una persona a un item che implica una responsabilità di una persona nel possesso legale attuale. @it
toolkit label: proprietario attuale persona di @it
toolkit definition: Item che implica una responsabilità di una persona nel possesso legale attuale. @it
label: είναι τρέχων κάτοχος φυσικό πρόσωπο του @el
toolkit label: τρέχων κάτοχος φυσικό πρόσωπο του @el
label: est une personne propriétaire actuelle de @fr
definition: Met une personne en relation avec un item qui comporte une responsabilité de la part d’une personne en ce qui concerne la propriété légale actuelle. @fr
toolkit label: personne propriétaire actuelle de @fr
toolkit definition: Item qui comporte une responsabilité de la part d’une personne en ce qui concerne la propriété légale actuelle. @fr
label: ir pašreizējais īpašnieks (persona) @lv
definition: Sasaista personu ar vienību, kas ietver personas atbildību par pašreizējo likumīgo īpašumu. @lv
toolkit label: ir pašreizējais īpašnieks (persona) @lv
toolkit definition: Vienība, kas ietver personas atbildību par pašreizējo likumīgo īpašumu. @lv
label: 是……的当前拥有者个人 @zh-hans
definition: 将一个个人与涉及一个当前法定所有权的一个个人的责任的一个单件关联起来。 @zh-hans
toolkit label: ……的当前拥有者个人 @zh-hans
toolkit definition: 涉及一个当前法定所有权的一个个人的责任的一个单件 @zh-hans
label: mevcut sahip kişisidir @tr
definition: Bir kişiyi, kişinin mevcut yasal mülkiyet sorumluluğunu içeren bir kopyayla ilişkilendirir. @tr
toolkit label: şu anki sahibi olan kişi @tr
toolkit definition: Mevcut yasal mülkiyet için bir kişinin sorumluluğunu içeren bir kopya. @tr
has subproperty: tallettaja (henkilö) kappaleessa
has subproperty: P50631

säilyttäjä (toimija) kappaleessa
status: Published
label: is custodian agent of @en
definition: Relates an agent to an item that involves a responsibility of an agent for legal custody. @en
type: Property
domain: C10002
lexical alias: custodianAgentOf.en
label: est un agent dépositaire de @fr
definition: Met un agent en relation avec un item qui comporte une responsabilité de la part d’un agent en ce qui concerne la garde légale. @fr
toolkit label: agent dépositaire de @fr
toolkit definition: Item qui comporte une responsabilité de la part d’un agent en ce qui concerne la garde légale. @fr
toolkit label: custodian agent of @en
toolkit definition: An item that involves a responsibility of an agent for legal custody. @en
instruction number: 18.5
sub property of: toimijaan liittyvä kappale
label: είναι φύλακας φορέας του @el
definition: Συνδέει έναν φορέα, ο οποίος έχει τη νόμιμη επιμέλεια φύλαξης ενός αντιτύπου, με ένα αντίτυπο. @el
toolkit label: φύλακας φορέας του @el
toolkit definition: Ένα αντίτυπο υπό τη νόμιμη επιμέλεια φύλαξης ενός φορέα. @el
definition: Setzt einen Akteur in Beziehung zu einem Exemplar, das sich in der rechtmäßigen Verwahrung eines Akteurs befindet. @de
toolkit label: Akteur als Verwahrerin/Verwahrer von @de
toolkit definition: Ein Exemplar, das sich in der rechtmäßigen Verwahrung eines Akteurs befindet. @de
label: er agent, som er forvalter af @da
definition: Relaterer en agent til et eksemplar, som involverer en agents ansvar for lovlig forvaring. @da
toolkit label: agent, som er forvalter af @da
toolkit definition: Eksemplar, som involverer en agents ansvar for lovlig forvaring. @da
label: és agent dipositari de @ca
definition: Relaciona un agent amb un ítem que implica una responsabilitat d’un agent en la custòdia legal. @ca
toolkit label: agent dipositari de @ca
toolkit definition: Ítem que implica una responsabilitat d’un agent en la custòdia legal. @ca
definition: Liittää toimijan kappaleeseen, joka on laillisesti toimijan säilytyksessä.
toolkit label: säilyttäjä (toimija) kappaleessa
toolkit definition: Kappale, joka on laillisesti toimijan säilytyksessä.
toolkit label: oppbevarer av (agent) @no
toolkit definition: Et eksemplar som involverer ansvar for en agent i form av lovlig forvaring. @no
label: ist Akteur als Verwahrerin/Verwahrer von @de
has element type: 2
label: letétkezelő ágense a következőnek: @hu
definition: Hozzákapcsol egy ágenst egy példányhoz, amelyhez hozzátartozik egy ágens megőrzés iránti felelőssége. @hu
toolkit label: letétkezelő ágense: @hu
toolkit definition: Egy példány, amelyhez hozzátartozik egy ágens megőrzés iránti felelőssége. @hu
alternative label: custodian of @en
alternative label: säilyttäjänä kappaleelle
label: er oppbevarer av (agent) @no
definition: Relaterer en agent til et eksemplar som involverer ansvar for en agent i form av lovlig forvaring. @no
alternative label: oppbevarer av @no
label: is bewaarder-actor van @nl
definition: Relateert een actor aan een item dat met zich meebrengt een verantwoordelijkheid van een actor voor wettelijke bewaring. @nl
toolkit label: bewaarder-actor van @nl
toolkit definition: Een item dat met zich meebrengt een verantwoordelijkheid van een actor voor wettelijke bewaring. @nl
label: هو وكيل وصي على @ar
definition: يربط وكيلا بمفردة تنطوي على مسئولية وكيل عن الوصاية القانونية. @ar
alternative label: وصي على @ar
toolkit label: وكيل وصي على @ar
toolkit definition: مفردة تنطوي على مسئولية وكيل عن الوصاية القانونية. @ar
alternative label: dipositari de @ca
alternative label: forvalter af @da
label: vastutav hoidja (tegija) eksemplarile @et
definition: Seostab tegija eksemplariga, mis on tegija õiguspärasel vastutaval hoiul. @et
alternative label: vastutav hoidja eksemplarile @et
toolkit label: vastutav hoidja (tegija) eksemplarile @et
toolkit definition: Eksemplar, mis on tegija õiguspärasel vastutaval hoiul. @et
alternative label: letétkezelője: @hu
label: è depositario agente di @it
definition: Correla un agente con itemche implica la responsabilità di un agente nella custodia legale. @it
alternative label: despositario di @it
toolkit label: despositario agente di @it
toolkit definition: Item che implica la responsabilità di un agente della custodia legale. @it
alternative label: θεματοφύλακας του @el
alternative label: dépositaire de @fr
label: ir pārvaldītājs (aģents) @lv
definition: Sasaista aģentu ar vienību, kas ietver aģenta atbildību par likumīgu pārvaldību. @lv
toolkit label: ir pārvaldītājs (aģents) @lv
toolkit definition: Vienība, kas ietver aģenta atbildību par likumīgu pārvaldību. @lv
alternative label: Verwahrer von @de
alternative label: ……的保管者 @zh-hans
toolkit label: ……的保管者行为者 @zh-hans
toolkit definition: 涉及合法保管的一个行为者的责任的一个单件 @zh-hans
toolkit label: koruyucu temsilci @tr
toolkit definition: Yasal velayet için bir temsilcinin sorumluluğunu içeren bir kopya. @tr
has subproperty: säilyttäjä (yhteistoimija) kappaleessa

säilyttäjä (yhteistoimija) kappaleessa
status: Published
label: is custodian collective agent of @en
lexical alias: custodianCollectiveAgentOf.en
definition: Relates a collective agent to an item that involves a responsibility of a collective agent for legal custody. @en
toolkit label: custodian collective agent of @en
toolkit definition: An item that involves a responsibility of a collective agent for legal custody. @en
type: Property
domain: C10011
has element type: 2
sub property of: yhteistoimijaan liittyvä kappale
sub property of: säilyttäjä (toimija) kappaleessa
definition: Liittää yhteistoimijan kappaleeseen, joka on laillisesti yhteistoimijan säilytyksessä.
toolkit label: säilyttäjä (yhteistoimija) kappaleessa
toolkit definition: Kappale, joka on laillisesti yhteistoimijan säilytyksessä.
label: er oppbevarer av (kollektiv agent) @no
definition: Relaterer en kollektiv agent til et eksemplar som involverer et ansvar for en kollektiv agent i form av lovlig forvaring. @no
toolkit label: oppbevarer av (kollektiv agent) @no
toolkit definition: Et eksemplar som involverer et ansvar for en kollektiv agent i form av lovlig forvaring. @no
label: is bewaarder collectieve actor van @nl
definition: Relateert een collectieve actor aan een item dat met zich meebrengt een verantwoordelijkheid van een collectieve actor voor wettelijke bewaring. @nl
toolkit label: bewaarder collectieve actor van @nl
toolkit definition: Een item dat met zich meebrengt een verantwoordelijkheid van een collectieve actor voor wettelijke bewaring. @nl
label: هو وكيل جماعي وصي على @ar
definition: يربط وكيلا جماعيا بمفردة تنطوي على مسئولية وكيل جماعي عن الوصاية القانونية. @ar
toolkit label: وكيل جماعي وصي على @ar
toolkit definition: مفردة تنطوي على مسئولية وكيل جماعي عن الوصاية القانونية. @ar
label: és agent col·lectiu dipositari de @ca
definition: Relaciona un agent col·lectiu amb un ítem que implica una responsabilitat d’un agent col·lectiu en la custòdia legal. @ca
toolkit label: agent col·lectiu dipositari de @ca
toolkit definition: Ítem que implica una responsabilitat d’un agent col·lectiu en la custòdia legal. @ca
label: er kollektiv agent, som er forvalter af @da
definition: Relaterer en kollektiv agent til et eksemplar, som involverer en kollektiv agents ansvar for lovlig forvaring. @da
toolkit label: kollektiv agent, som er forvalter af @da
toolkit definition: Eksemplar, som involverer en kollektiv agents ansvar for lovlig forvaring. @da
label: vastutav hoidja (kollektiiv) eksemplarile @et
definition: Seostab kollektiivi eksemplariga, mis on kollektiivi õiguspärasel vastutaval hoiul. @et
toolkit label: vastutav hoidja (kollektiiv) eksemplarile @et
toolkit definition: Eksemplar, mis on kollektiivi õiguspärasel vastutaval hoiul. @et
label: ist gemeinschaftlicher Akteur als Verwahrerin/Verwahrer von @de
definition: Setzt einen gemeinschaftlichen Akteur in Beziehung zu einem Exemplar, das sich in der rechtmäßigen Verwahrung eines gemeinschaftlichen Akteurs befindet. @de
toolkit label: Gemeinschaftlicher Akteur als Verwahrerin/Verwahrer von @de
toolkit definition: Ein Exemplar, das sich in der rechtmäßigen Verwahrung eines gemeinschaftlichen Akteurs befindet. @de
label: letétkezelő kollektív ágense a következőnek: @hu
definition: Hozzákapcsol egy kollektív ágenst egy példányhoz, amelyhez hozzátartozik egy kollektív ágens megőrzés iránti felelőssége. @hu
toolkit label: letétkezelő kollektív ágense: @hu
toolkit definition: Egy példány, amelyhez hozzátartozik egy kollektív ágens megőrzés iránti felelőssége. @hu
label: è depositario agente collettivo di @it
definition: Correla un agente collettivo a un item che implica una responsabilità di un agente collettivo per la custodia legale. @it
toolkit label: depositario agente collettivo di @it
toolkit definition: Item che implica una responsabilità di un agente collettivo per la custodia legale. @it
label: είναι φύλακας συλλογικός φορέας του @el
toolkit label: φύλακας συλλογικός φορέας του @el
label: est un agent collectif dépositaire de @fr
definition: Met un agent collectif en relation avec un item qui comporte une responsabilité de la part d’un agent collectif en ce qui concerne la garde légale. @fr
toolkit label: agent collectif dépositaire de @fr
toolkit definition: Item qui comporte une responsabilité de la part d’un agent collectif en ce qui concerne la garde légale. @fr
label: ir pārvaldītājs (grupa) @lv
definition: Sasaista grupu ar vienību, kas ietver grupas atbildību par likumīgu pārvaldību. @lv
toolkit label: ir pārvaldītājs (grupa) @lv
toolkit definition: Vienība, kas ietver grupas atbildību par likumīgu pārvaldību. @lv
label: 是……的保管者集体行为者 @zh-hans
definition: 将一个集体行为者与涉及合法保管的一个集体行为者的责任的一个单件关联起来。 @zh-hans
toolkit label: ……的保管者集体行为者 @zh-hans
toolkit definition: 涉及合法保管的一个集体行为者的责任的一个单件 @zh-hans
label: koruyucu kolektif temsilcisidir @tr
definition: Kolektif bir temsilciyi, yasal velayet için bir kolektif temsilcinin sorumluluğunu içeren bir kopyayla ilgilendirir. @tr
toolkit label: koruyucu kolektif temsilci @tr
toolkit definition: Yasal velayet için kolektif bir temsilcinin sorumluluğunu içeren bir kopya. @tr
has subproperty: säilyttäjä (yhteisö) kappaleessa
has subproperty: säilyttäjä (suku) kappaleessa
has subproperty: P50784

säilyttäjä (yhteisö) kappaleessa
status: Published
label: is custodian corporate body of @en
lexical alias: custodianCorporateBodyOf.en
definition: Relates a corporate body to an item that involves a responsibility of a corporate body for legal custody. @en
toolkit label: custodian corporate body of @en
toolkit definition: An item that involves a responsibility of a corporate body for legal custody. @en
type: Property
domain: C10005
has element type: 2
sub property of: yhteisöön liittyvä kappale
sub property of: säilyttäjä (yhteistoimija) kappaleessa
definition: Liittää yhteisön kappaleeseen, joka on laillisesti yhteisön säilytyksessä.
toolkit label: säilyttäjä (yhteisö) kappaleessa
toolkit definition: Kappale, joka on laillisesti yhteisön säilytyksessä.
label: er oppbevarer av (korporasjon) @no
definition: Relaterer en korporasjon til et eksemplar som involverer et ansvar for en korporasjon i form av lovlig forvaring. @no
toolkit label: oppbevarer av (korporasjon) @no
toolkit definition: Et eksemplar som involverer et ansvar for en korporasjon i form av lovlig forvaring. @no
label: is bewaarder corporatie van @nl
definition: Relateert een corporatie aan een item dat met zich meebrengt een verantwoordelijkheid van een corporatie voor wettelijke bewaring. @nl
toolkit label: bewaarder corporatie van @nl
toolkit definition: Een item dat met zich meebrengt een verantwoordelijkheid van een corporatie voor wettelijke bewaring. @nl
label: هي هيئة وصية على @ar
definition: يربط هيئة بمفردة تنطوي على مسئولية هيئة عن الوصاية القانونية. @ar
toolkit label: هيئة وصية على @ar
toolkit definition: مفردة تنطوي على مسئولية هيئة عن الوصاية القانونية. @ar
label: és entitat corporativa dipositària de @ca
definition: Relaciona una entitat corporativa amb un ítem que implica una responsabilitat d’una entitat corporativa en la custòdia legal. @ca
toolkit label: entitat corporativa dipositària de @ca
toolkit definition: Ítem que implica una responsabilitat d’una entitat corporativa en la custòdia legal actual o anterior. @ca
label: er korporation, som er forvalter af @da
definition: Relaterer en korporation til et eksemplar, som involverer en korporations ansvar for lovlig forvaring. @da
toolkit label: korporation, som er forvalter af @da
toolkit definition: Eksemplar, som involverer en korporations ansvar for lovlig forvaring. @da
label: vastutav hoidja (asutus) eksemplarile @et
definition: Seostab asutuse eksemplariga, mis on asutuse õiguspärasel vastutaval hoiul. @et
toolkit label: vastutav hoidja (asutus) eksemplarile @et
toolkit definition: Eksemplar, mis on asutuse õiguspärasel vastutaval hoiul. @et
label: ist Körperschaft als Verwahrerin/Verwahrer von @de
definition: Setzt eine Körperschaft in Beziehung zu einem Exemplar, das sich in der rechtmäßigen Verwahrung einer Körperschaft befindet. @de
toolkit label: Körperschaft als Verwahrerin/Verwahrer von @de
toolkit definition: Ein Exemplar, das sich in der rechtmäßigen Verwahrung einer Körperschaft befindet. @de
label: letétkezelő testülete a következőnek: @hu
definition: Hozzákapcsol egy testületet egy példányhoz, amelyhez hozzátartozik egy testület megőrzés iránti felelőssége. @hu
toolkit label: letétkezelő testülete: @hu
toolkit definition: Egy példány, amelyhez hozzátartozik egy testület megőrzés iránti felelőssége. @hu
label: è depositario ente di @it
definition: Correla un ente a un item che implica una responsabilità di un ente per la custodia legale. @it
toolkit label: depositario ente di @it
toolkit definition: Item che implica una responsabilità di un ente per la custodia legale. @it
label: είναι φύλακας συλλογικό όργανο του @el
toolkit label: φύλακας συλλογικό όργανο του @el
label: est une collectivité dépositaire de @fr
definition: Met une collectivité en relation avec un item qui comporte une responsabilité de la part d’une collectivité en ce qui concerne la garde légale. @fr
toolkit label: collectivité dépositaire de @fr
toolkit definition: Item qui comporte une responsabilité de la part d’une collectivité en ce qui concerne la garde légale. @fr
label: ir pārvaldītājs (institūcija) @lv
definition: Sasaista institūciju ar vienību, kas ietver institūcijas atbildību par likumīgu pārvaldību. @lv
toolkit label: ir pārvaldītājs (institūcija) @lv
toolkit definition: Vienība, kas ietver institūcijas atbildību par likumīgu pārvaldību. @lv
label: 是……的保管者团体 @zh-hans
definition: 将一个团体与涉及合法保管的一个团体的责任的一个单件关联起来。 @zh-hans
toolkit label: ……的保管者团体 @zh-hans
toolkit definition: 涉及合法保管的一个团体的责任的一个单件 @zh-hans
label: koruyucu tüzel kişisidir @tr
definition: Bir tüzel kişiyi, bir tüzel kişiliğin yasal velayet sorumluluğunu içeren bir kopyayla ilişkilendirir. @tr
toolkit label: koruyucu tüzel kişi @tr
toolkit definition: Yasal velayet için tüzel bir kişinin sorumluluğunu içeren bir kopya. @tr
has subproperty: P50935

säilyttäjä (suku) kappaleessa
status: Published
label: is custodian family of @en
lexical alias: custodianFamilyOf.en
definition: Relates a family to an item that involves a responsibility of a family for legal custody. @en
toolkit label: custodian family of @en
toolkit definition: An item that involves a responsibility of a family for legal custody. @en
type: Property
domain: C10008
has element type: 2
sub property of: sukuun liittyvä kappale
sub property of: säilyttäjä (yhteistoimija) kappaleessa
definition: Liittää suvun kappaleeseen, joka on laillisesti suvun säilytyksessä.
toolkit label: säilyttäjä (suku) kappaleessa
toolkit definition: Kappale, joka on laillisesti suvun säilytyksessä.
label: er oppbevarer av (familie) @no
definition: Relaterer en familie til et eksemplar som involverer et ansvar for en familie i form av lovlig forvaring. @no
toolkit label: oppbevarer av (familie) @no
toolkit definition: Et eksemplar som involverer et ansvar for en familie i form av lovlig forvaring. @no
label: is bewaarder familie van @nl
definition: Relateert een familie aan een item dat met zich meebrengt een verantwoordelijkheid van een familie voor wettelijke bewaring. @nl
toolkit label: bewaarder familie van @nl
toolkit definition: Een item dat met zich meebrengt een verantwoordelijkheid van een familie voor wettelijke bewaring. @nl
label: هي عائلة وصية على @ar
definition: يربط عائلة بمفردة تنطوي على مسئولية عائلة عن الوصاية القانونية. @ar
toolkit label: عائلة وصية على @ar
toolkit definition: مفردة تنطوي على مسئولية عائلة عن الوصاية القانونية. @ar
label: és família dipositària de @ca
definition: Relaciona una família amb un ítem que implica una responsabilitat d’una família en la custòdia legal. @ca
toolkit label: família dipositària de @ca
toolkit definition: Ítem que implica una responsabilitat d’una família en la custòdia legal. @ca
label: er familie, som er forvalter af @da
definition: Relaterer en familie til et eksemplar, som involverer en families ansvar for lovlig forvaring. @da
toolkit label: familie, som er forvalter af @da
toolkit definition: Eksemplar, som involverer en families ansvar for lovlig forvaring. @da
label: vastutav hoidja (perekond) eksemplarile @et
definition: Seostab perekonna eksemplariga, mis on perekonna õiguspärasel vastutaval hoiul. @et
toolkit label: vastutav hoidja (perekond) eksemplarile @et
toolkit definition: Eksemplar, mis on perekonna õiguspärasel vastutaval hoiul. @et
label: ist Familie als Verwahrerin/Verwahrer von @de
definition: Setzt eine Familie in Beziehung zu einem Exemplar, das sich in der rechtmäßigen Verwahrung einer Familie befindet. @de
toolkit label: Familie als Verwahrerin/Verwahrer von @de
toolkit definition: Ein Exemplar, das sich in der rechtmäßigen Verwahrung einer Familie befindet. @de
label: letétkezelő családja a következőnek: @hu
definition: Hozzákapcsol egy családot egy példányhoz, amelyhez hozzátartozik egy család megőrzés iránti felelőssége. @hu
toolkit label: letétkezelő családja: @hu
toolkit definition: Egy példány, amelyhez hozzátartozik egy család megőrzés iránti felelőssége. @hu
label: è depositario famiglia di @it
definition: Correla una famiglia a un item che implica una responsabilità di una famiglia per la custodia legale. @it
toolkit label: depositario famiglia di @it
toolkit definition: Item che implica una responsabilità di una famiglia per la custodia legale. @it
label: είναι φύλακας οικογένεια του @el
definition: Συνδέει μια οικογένεια με ένα αντίτυπο που περιλαμβάνει την ευθύνη μιας οικογένειας για τη νομική φύλαξη. @el
toolkit label: φύλακας οικογένεια του @el
label: est une famille dépositaire de @fr
definition: Met une famille en relation avec un item qui comporte une responsabilité de la part d’une famille en ce qui concerne la garde légale. @fr
toolkit label: famille dépositaire de @fr
toolkit definition: Item qui comporte une responsabilité de la part d’une famille en ce qui concerne la garde légale. @fr
label: ir pārvaldītājs (dzimta/ģimene) @lv
definition: Sasaista dzimtu/ģimeni ar vienību, kas ietver dzimtas/ģimenes atbildību par likumīgu pārvaldību. @lv
toolkit label: ir pārvaldītājs (dzimta/ģimene) @lv
toolkit definition: Vienība, kas ietver dzimtas/ģimenes atbildību par likumīgu pārvaldību. @lv
label: 是……的保管者家族 @zh-hans
definition: 将一个家族与涉及合法保管的一个家族的责任的一个单件关联起来。 @zh-hans
toolkit label: ……的保管者家族 @zh-hans
toolkit definition: 涉及合法保管的一个家族的责任的一个单件 @zh-hans
label: koruyucu ailesidir @tr
definition: Bir aileyi, bir ailenin yasal velayet sorumluluğunu içeren bir kopyayla ilişkilendirir. @tr
toolkit label: koruyucu aile @tr
toolkit definition: Yasal velayet için bir ailenin sorumluluğunu içeren bir kopya. @tr
has subproperty: P51086

säilyttäjä (henkilö) kappaleessa
status: Published
label: is custodian person of @en
lexical alias: custodianPersonOf.en
definition: Relates a person to an item that involves a responsibility of a person for legal custody. @en
toolkit label: custodian person of @en
toolkit definition: An item that involves a responsibility of a person for legal custody. @en
type: Property
domain: C10004
has element type: 2
sub property of: henkilöön liittyvä kappale
sub property of: säilyttäjä (toimija) kappaleessa
definition: Liittää henkilön kappaleeseen, joka on laillisesti henkilön säilytyksessä.
toolkit label: säilyttäjä (henkilö) kappaleessa
toolkit definition: Kappale, joka on laillisesti henkilön säilytyksessä.
label: er oppbevarer av (person) @no
definition: Relaterer en person til et eksemplar som involverer et ansvar for en person i form av lovlig forvaring. @no
toolkit label: oppbevarer av (person) @no
toolkit definition: Et eksemplar som involverer et ansvar for en person i form av lovlig forvaring. @no
label: is bewaarder-persoon van @nl
definition: Relateert een persoon aan een item dat met zich meebrengt een verantwoordelijkheid van een persoon voor wettelijke bewaring. @nl
toolkit label: bewaarder-persoon van @nl
toolkit definition: Een item dat met zich meebrengt een verantwoordelijkheid van een persoon voor wettelijke bewaring. @nl
label: هو شخص وصي على @ar
definition: يربط شخصا بمفردة تنطوي على مسئولية شخص عن الوصاية القانونية. @ar
toolkit label: شخص وصي على @ar
toolkit definition: مفردة تنطوي على مسئولية شخص عن الوصاية القانونية. @ar
label: és persona dipositària de @ca
definition: Relaciona una persona amb un ítem que implica una responsabilitat d’una persona en la custòdia legal. @ca
toolkit label: persona dipositària de @ca
toolkit definition: Ítem que implica una responsabilitat d’una persona en la custòdia legal. @ca
label: er person, som er forvalter af @da
definition: Relaterer en person til et eksemplar, som involverer en persons ansvar for lovlig forvaring. @da
toolkit label: person, som er forvalter af @da
toolkit definition: Eksemplar, som involverer en persons ansvar for lovlig forvaring. @da
label: vastutav hoidja (isik) eksemplarile @et
definition: Seostab isiku eksemplariga, mis on isiku õiguspärasel vastutaval hoiul. @et
toolkit label: vastutav hoidja (isik) eksemplarile @et
toolkit definition: Eksemplar, mis on isiku õiguspärasel vastutaval hoiul. @et
label: ist Person als Verwahrerin/Verwahrer von @de
definition: Setzt eine Person in Beziehung zu einem Exemplar, das sich in der rechtmäßigen Verwahrung einer Person befindet. @de
toolkit label: Person als Verwahrerin/Verwahrer von @de
toolkit definition: Ein Exemplar, das sich in der rechtmäßigen Verwahrung einer Person befindet. @de
label: letétkezelő személye a következőnek: @hu
definition: Hozzákapcsol egy személyt egy példányhoz, amelyhez hozzátartozik egy személy megőrzés iránti felelőssége. @hu
toolkit label: letétkezelő személye: @hu
toolkit definition: Egy példány, amelyhez hozzátartozik egy személy megőrzés iránti felelőssége. @hu
label: è depositario persona di @it
definition: Correla una persona a un item che implica una responsabilità di una persona per la custodia legale. @it
toolkit label: depositario persona di @it
toolkit definition: Item che implica una responsabilità di una persona per la custodia legale. @it
label: είναι φύλακας φυσικό πρόσωπο του @el
toolkit label: φύλακας φυσικό πρόσωπο του @el
label: est une personne dépositaire de @fr
definition: Met une personne en relation avec un item qui comporte une responsabilité de la part d’une personne en ce qui concerne la garde légale. @fr
toolkit label: personne dépositaire de @fr
toolkit definition: Item qui comporte une responsabilité de la part d’une personne en ce qui concerne la garde légale. @fr
label: ir pārvaldītājs (persona) @lv
definition: Sasaista personu ar vienību, kas ietver personas atbildību par likumīgu pārvaldību. @lv
toolkit label: ir pārvaldītājs (persona) @lv
toolkit definition: Vienība, kas ietver personas atbildību par likumīgu pārvaldību. @lv
label: 是……的保管者个人 @zh-hans
definition: 将一个个人与涉及合法保管的一个个人的责任的一个单件关联起来。 @zh-hans
toolkit label: ……的保管者个人 @zh-hans
toolkit definition: 涉及合法保管的一个个人的责任的一个单件 @zh-hans
label: velayet sahibidir @tr
definition: Bir kişiyi, kişinin yasal velayet sorumluluğunu içeren bir kopyayla ilişkilendirir. @tr
toolkit label: koruyucu @tr
toolkit definition: Yasal velayet için bir kişinin sorumluluğunu içeren bir kopya. @tr
has subproperty: P50633

tanssija (toimija) ekspressiossa
status: Published
label: is dancer agent of @en
definition: Relates an agent to an expression that includes a contribution by an agent of dancing in a musical or dramatic presentation. @en
type: Property
domain: C10002
sub property of: esittäjä (toimija) ekspressiossa
lexical alias: dancerAgentOf.en
label: est un agent danseur de @fr
definition: Met un agent en relation avec une expression qui intègre une contribution de la part d’un agent consistant à danser dans une présentation musicale ou dramatique. @fr
toolkit label: agent danseur de @fr
toolkit definition: Expression qui intègre une contribution de la part d’un agent consistant à danser dans une présentation musicale ou dramatique. @fr
toolkit label: dancer agent of @en
toolkit definition: An expression that includes a contribution by an agent of dancing in a musical or dramatic presentation. @en
instruction number: 18.5
label: είναι χορευτής φορέας του @el
definition: Συνδέει έναν εκτελεστή, ο οποίος συνεισφέρει σε μια έκφραση ενός έργου μέσω του χορού σε μια μουσική, δραματική κ.λπ. παρουσίαση, με μια έκφραση. @el
toolkit label: χορευτής φορέας του @el
toolkit definition: Μια έκφραση ενός έργου που ενσωματώνει τη συνεισφορά της χορευτικής ερμηνείας σε μια μουσική, δραματική κ.λπ. παρουσίαση. @el
definition: Setzt einen Akteur in Beziehung zu einer Expression, zu der ein Akteur beiträgt, indem er in einer musikalischen oder dramatischen Darbietung tanzt. @de
toolkit label: Akteur als Tänzerin/Tänzer von @de
toolkit definition: Eine Expression, zu der ein Akteur beiträgt, indem er in einer musikalischen oder dramatischen Darbietung tanzt. @de
label: er agent, som er danser af @da
definition: Relaterer en agent til et udtryk, som omfatter en agents bidrag ved at danse i en musikalsk eller dramatisk præsentation. @da
toolkit label: agent, som er danser af @da
toolkit definition: Udtryk, som omfatter en agents bidrag ved at danse i en musikalsk eller dramatisk præsentation. @da
label: és agent ballarí de @ca
definition: Relaciona un agent amb una expressió que inclou una contribució d’un agent dansant en una representació musical o dramàtica. @ca
toolkit label: agent ballarí de @ca
toolkit definition: Expressió que inclou una contribució d’un agent dansant en una representació musical o dramàtica. @ca
definition: Liittää toimijan ekspressioon, jonka tekemiseen toimija osallistuu tanssimalla musiikki- tai näyttämöesityksessä.
toolkit label: tanssija (toimija) ekspressiossa
toolkit definition: Ekspressio, jonka tekemiseen toimija osallistuu tanssimalla musiikki- tai näyttämöesityksessä.
toolkit label: danser i (agent) @no
toolkit definition: Et uttrykk som inkluderer et bidrag fra en agent i form av å danse i en musikalsk eller dramatisk forestilling. @no
label: ist Akteur als Tänzerin/Tänzer von @de
has element type: 2
label: táncos ágense a következőnek: @hu
definition: Hozzákapcsol egy ágenst egy kifejezési formához, amely magában foglalja egy zenei vagy drámai bemutatóban táncoló ágens közreműködését. @hu
toolkit label: táncos ágense: @hu
toolkit definition: Egy kifejezési forma, amely magában foglalja egy zenei vagy drámai bemutatóban táncoló ágens közreműködését. @hu
alternative label: dancer of @en
alternative label: tanssiesitys
label: er danser i (agent) @no
definition: Relaterer en agent til et uttrykk som inkluderer et bidrag fra en agent i form av å danse i en musikalsk eller dramatisk forestilling. @no
alternative label: danser i @no
label: is danser-actor van @nl
definition: Relateert een actor aan een expressie die omvat een bijdrage van een actor door het dansen in een muziek- of dramapresentatie. @nl
toolkit label: danser-actor van @nl
toolkit definition: Een expressie die omvat een bijdrage van een actor door het dansen in een muziek- of dramapresentatie. @nl
label: هو وكيل راقص لـ @ar
definition: يربط وكيلا بتعبيرة تتضمن إسهام وكيل بالرقص في عرض موسيقي أو درامي. @ar
alternative label: راقص @ar
toolkit label: وكيل راقص @ar
toolkit definition: تعبيرة تتضمن إسهام وكيل الرقص في عرض موسيقي أو مسرحي. @ar
alternative label: ballarí de @ca
alternative label: danser af @da
label: tantsija (tegija) väljenduses @et
definition: Seostab tegija väljendusega, millesse tegija on andnud panuse, tantsides muusika- või draamaetenduses. @et
alternative label: tantsija väljenduses @et
toolkit label: tantsija (tegija) väljenduses @et
toolkit definition: Väljendus, millesse tegija on andnud panuse, tantsides muusika- või draamaetenduses. @et
alternative label: táncosa: @hu
label: è danzatore agente di @it
definition: Correla un agente a un'espressione che include un contributo da parte di un agente che danza in una presentazione musicale o teatrale. @it
alternative label: danzatore di @it
toolkit label: danzatore agente di @it
toolkit definition: Espressione che include un contributo da parte di un agente che danza in una presentazione musicale o drammatica, @it
alternative label: χορευτής του @el
alternative label: danseur de @fr
label: ir dejotājs (aģents) @lv
definition: Sasaista aģentu ar izteiksmi, kas ietver aģenta ieguldījumu, dejojot muzikālā vai dramatiskā uzvedumā. @lv
toolkit label: ir dejotājs (aģents) @lv
toolkit definition: Izteiksme, kas ietver aģenta ieguldījumu, dejojot muzikālā vai dramatiskā uzvedumā. @lv
alternative label: Tänzer von @de
alternative label: ……的舞蹈者 @zh-hans
toolkit label: ……的舞蹈者行为者 @zh-hans
toolkit definition: 包括在音乐或戏剧呈现中的一个舞蹈行为者的贡献的一种内容表达 @zh-hans
toolkit label: dansçı temsilci @tr
toolkit definition: Müzikal veya dramatik bir sunumda dans eden bir temsilcinin katkısını içeren bir anlatım. @tr
has subproperty: tanssija (yhteistoimija) ekspressiossa

tanssija (yhteistoimija) ekspressiossa
status: Published
label: is dancer collective agent of @en
lexical alias: dancerCollectiveAgentOf.en
definition: Relates a collective agent to an expression that includes a contribution by a collective agent of dancing in a musical or dramatic presentation. @en
toolkit label: dancer collective agent of @en
toolkit definition: An expression that includes a contribution by a collective agent of dancing in a musical or dramatic presentation. @en
type: Property
domain: C10011
has element type: 2
sub property of: esittäjä (yhteistoimija) ekspressiossa
sub property of: tanssija (toimija) ekspressiossa
definition: Liittää yhteistoimijan ekspressioon, jonka tekemisessä yhteistoimija on osallisena tanssimalla musiikki- tai näyttämöesityksessä.
toolkit label: tanssija (yhteistoimija) ekspressiossa
toolkit definition: Ekspressio, jonka tekemisessä yhteistoimija on osallisena tanssimalla musiikki- tai näyttämöesityksessä.
label: er danser for (kollektiv agent) @no
definition: Relaterer en kollektiv agent til et uttrykk som inkluderer et bidrag fra en kollektiv agent i form av dansing i en musikalsk eller dramatisk forestilling. @no
toolkit label: danser for (kollektiv agent) @no
toolkit definition: Et uttrykk som inkluderer et bidrag fra en kollektiv agent i form av dansing i en musikalsk eller dramatisk forestilling. @no
label: is danser-collectieve actor van @nl
definition: Relateert een collectieve actor aan een expressie die omvat een bijdrage van een collectieve actor door het dansen in een muziek- of dramapresentatie. @nl
toolkit label: danser-collectieve actor van @nl
toolkit definition: Een expressie die omvat een bijdrage van een collectieve actor door het dansen in een muziek- of dramapresentatie. @nl
label: هو وكيل جماعي راقص لـ @ar
definition: يربط وكيلا جماعيا بتعبيرة تتضمن إسهام وكيل جماعي في إدارة فرقة عزف وقيادتها في عرض موسيقي أو درامي. @ar
toolkit label: هو وكيل جماعي راقص لـ @ar
toolkit definition: تعبيرة تتضمن إسهام وكيل جماعي في الرقص في عرض موسيقي أو درامي. @ar
label: és agent col·lectiu ballarí de @ca
definition: Relaciona un agent col·lectiu amb una expressió que inclou una contribució d’un agent col·lectiu dansant en una representació musical o dramàtica. @ca
toolkit label: agent col·lectiu ballarí de @ca
toolkit definition: Expressió que inclou una contribució d’un agent col·lectiu dansant en una representació musical o dramàtica. @ca
label: er kollektiv agent, som er danser af @da
definition: Relaterer en kollektiv agent til et udtryk, som omfatter en kollektiv agents bidrag ved at danse i en musikalsk eller dramatisk præsentation. @da
toolkit label: kollektiv agent, som er danser af @da
toolkit definition: Udtryk, som omfatter en kollektiv agents bidrag ved at danse i en musikalsk eller dramatisk præsentation. @da
label: tantsija (kollektiiv) väljenduses @et
definition: Seostab kollektiivi väljendusega, millesse kollektiiv on andnud panuse, tantsides muusika- või draamaetenduses. @et
toolkit label: tantsija (kollektiiv) väljenduses @et
toolkit definition: Väljendus, millesse kollektiiv on andnud panuse, tantsides muusika- või draamaetenduses. @et
label: ist gemeinschaftlicher Akteur als Tänzerin/Tänzer von @de
definition: Setzt einen gemeinschaftlichen Akteur in Beziehung zu einer Expression, zu der ein gemeinschaftlicher Akteur beiträgt, indem er in einer musikalischen oder dramatischen Darbietung tanzt. @de
toolkit label: Gemeinschaftlicher Akteur als Tänzerin/Tänzer von @de
toolkit definition: Eine Expression, zu der ein gemeinschaftlicher Akteur beiträgt, indem er in einer musikalischen oder dramatischen Darbietung tanzt. @de
label: táncos kollektív ágense a következőnek: @hu
definition: Hozzákapcsol egy kollektív ágenst egy kifejezési formához, amely magában foglalja egy zenei vagy drámai bemutatóban táncoló kollektív ágens közreműködését. @hu
toolkit label: táncos kollektív ágense: @hu
toolkit definition: Egy kifejezési forma, amely magában foglalja egy zenei vagy drámai bemutatóban táncoló kollektív ágens közreműködését. @hu
label: è ballerino agente collettivo di @it
definition: Correla un agente collettivo a un'espressione che comprende un contributo di un agente collettivo nella danza in una presentazione musicale o drammatica. @it
toolkit label: ballerino agente collettivo di @it
toolkit definition: Espressione che comprende un contributo di un agente collettivo nella danza in una presentazione musicale o drammatica. @it
label: είναι χορευτής συλλογικός φορέας του @el
toolkit label: χορευτής συλλογικός φορέας του @el
label: est un agent collectif danseur de @fr
definition: Met un agent collectif en relation avec une expression qui intègre une contribution de la part d’un agent collectif consistant à danser dans une présentation musicale ou dramatique. @fr
toolkit label: agent collectif danseur de @fr
toolkit definition: Expression qui intègre une contribution de la part d’un agent collectif consistant à danser dans une présentation musicale ou dramatique. @fr
label: ir dejotājs (grupa) @lv
definition: Sasaista grupu ar izteiksmi, kas ietver grupas ieguldījumu, dejojot muzikālā vai dramatiskā uzvedumā. @lv
toolkit label: ir dejotājs (grupa) @lv
toolkit definition: Izteiksme, kas ietver grupas ieguldījumu, dejojot muzikālā vai dramatiskā uzvedumā. @lv
label: 是……的舞蹈者集体行为者 @zh-hans
definition: 将一个集体行为者与包括在音乐或戏剧呈现中的一个舞蹈集体行为者的贡献的一种内容表达关联起来。 @zh-hans
toolkit label: ……的舞蹈者集体行为者 @zh-hans
toolkit definition: 包括在音乐或戏剧呈现中的一个舞蹈集体行为者的贡献的一种内容表达 @zh-hans
label: dansçı kolektif temsilcisidir @tr
definition: Kolektif bir temsilciyi, müzikal veya dramatik bir sunumda kolektif bir dans temsilcisinin katkısını içeren bir anlatımla ilişkilendirir. @tr
toolkit label: dansçı kolektif temsilci @tr
toolkit definition: Müzikal veya dramatik bir sunumda kolektif bir temsilcinin dans katkısını içeren bir anlatım. @tr
has subproperty: tanssija (yhteisö) ekspressiossa
has subproperty: tanssija (suku) ekspressiossa
has subproperty: P50728

tanssija (yhteisö) ekspressiossa
status: Published
label: is dancer corporate body of @en
lexical alias: dancerCorporateBodyOf.en
definition: Relates a corporate body to an expression that includes a contribution by a corporate body of dancing in a musical or dramatic presentation. @en
toolkit label: dancer corporate body of @en
toolkit definition: An expression that includes a contribution by a corporate body of dancing in a musical or dramatic presentation. @en
type: Property
domain: C10005
has element type: 2
sub property of: esittäjä (yhteisö) ekspressiossa
sub property of: tanssija (yhteistoimija) ekspressiossa
definition: Liittää yhteisön ekspressioon, jonka tekemisessä yhteisö on osallisena tanssimalla musiikki- tai näyttämöesityksessä.
toolkit label: tanssija (yhteisö) ekspressiossa
toolkit definition: Ekspressio, jonka tekemisessä yhteisö on osallisena tanssimalla musiikki- tai näyttämöesityksessä.
label: er danser for (korporasjon) @no
definition: Relaterer en korporasjon til et uttrykk som inkluderer et bidrag fra en korporasjon i form av dansing i en musikalsk eller dramatisk forestilling. @no
toolkit label: danser for (korporasjon) @no
toolkit definition: Et uttrykk som inkluderer et bidrag fra en korporasjon i form av dansing i en musikalsk eller dramatisk forestilling. @no
label: is danser-corporatie van @nl
definition: Relateert een corporatie aan een expressie die omvat een bijdrage van een corporatie door het dansen in een muziek- of dramapresentatie. @nl
toolkit label: danser-corporatie van @nl
toolkit definition: Een expressie die omvat een bijdrage van een corporatie door het dansen in een muziek- of dramapresentatie. @nl
label: هي هيئة مسئولة عن الرقص لـ @ar
definition: يربط هيئة بتعبيرة تتضمن إسهام هيئة الرقص في عرض موسيقي أو درامي. @ar
toolkit label: هيئة مسئولة عن الرقص @ar
toolkit definition: تعبيرة تتضمن إسهام هيئة الرقص في عرض موسيقي أو درامي. @ar
label: és entitat corporativa ballarina de @ca
definition: Relaciona una entitat corporativa amb una expressió que inclou una contribució d’una entitat corporativa dansant en una representació musical o dramàtica. @ca
toolkit label: entitat corporativa ballarina de @ca
toolkit definition: Expressió que inclou una contribució d’una entitat corporativa dansant en una representació musical o dramàtica. @ca
label: er korporation, som er danser af @da
definition: Relaterer en korporation til et udtryk, som omfatter en korporations bidrag ved at danse i en musikalsk eller dramatisk præsentation. @da
toolkit label: korporation, som er danser af @da
toolkit definition: Udtryk, som omfatter en korporations bidrag ved at danse i en musikalsk eller dramatisk præsentation. @da
label: tantsija (asutus) väljenduses @et
definition: Seostab asutuse väljendusega, millesse asutus on andnud panuse, tantsides muusika- või draamaetenduses. @et
toolkit label: tantsija (asutus) väljenduses @et
toolkit definition: Väljendus, millesse asutus on andnud panuse, tantsides muusika- või draamaetenduses. @et
label: ist Körperschaft als Tänzerin/Tänzer von @de
definition: Setzt eine Körperschaft in Beziehung zu einer Expression, zu der eine Körperschaft beiträgt, indem sie in einer musikalischen oder dramatischen Darbietung tanzt. @de
toolkit label: Körperschaft als Tänzerin/Tänzer von @de
toolkit definition: Eine Expression, zu der eine Körperschaft beiträgt, indem sie in einer musikalischen oder dramatischen Darbietung tanzt. @de
label: táncos testülete a következőnek: @hu
definition: Hozzákapcsol egy testületet egy kifejezési formához, amely magában foglalja egy zenei vagy drámai bemutatóban táncoló testület közreműködését. @hu
toolkit label: táncos testülete: @hu
toolkit definition: Egy kifejezési forma, amely magában foglalja egy zenei vagy drámai bemutatóban táncoló testület közreműködését. @hu
label: è ballerino ente di @it
definition: Correla un ente a un'espressione che comprende un contributo di un ente nella danza in una presentazione musicale o drammatica. @it
toolkit label: ballerino ente di @it
toolkit definition: Espressione che comprende un contributo di un ente nella danza in una presentazione musicale o drammatica. @it
label: είναι χορευτής συλλογικό όργανο του @el
toolkit label: χορευτής συλλογικό όργανο του @el
label: est une collectivité danseuse de @fr
definition: Met une collectivité en relation avec une expression qui intègre une contribution de la part d’une collectivité consistant à danser dans une présentation musicale ou dramatique. @fr
toolkit label: collectivité danseuse de @fr
toolkit definition: Expression qui intègre une contribution de la part d’une collectivité consistant à danser dans une présentation musicale ou dramatique. @fr
label: ir dejotājs (institūcija) @lv
definition: Sasaista institūciju ar izteiksmi, kas ietver institūcijas ieguldījumu, dejojot muzikālā vai dramatiskā uzvedumā. @lv
toolkit label: ir dejotājs (institūcija) @lv
toolkit definition: Izteiksme, kas ietver institūcijas ieguldījumu, dejojot muzikālā vai dramatiskā uzvedumā. @lv
label: 是……的舞蹈者团体 @zh-hans
definition: 将一个团体与包括在音乐或戏剧呈现中的一个舞蹈团体的贡献的一种内容表达关联起来。 @zh-hans
toolkit label: ……的舞蹈者团体 @zh-hans
toolkit definition: 包括在音乐或戏剧呈现中的一个舞蹈团体的贡献的一种内容表达 @zh-hans
label: dansçı tüzel kişisidir @tr
definition: Bir tüzel kişiyi, müzikal veya dramatik bir sunumda dans eden bir tüzel kişinin katkısını içeren bir anlatımla ilişkilendirir. @tr
toolkit label: dansçı tüzel kişi @tr
toolkit definition: Müzikal veya dramatik bir sunumda dans etmeye tüzel bir kişinin katkısını içeren bir anlatım. @tr
has subproperty: P50879

tanssija (suku) ekspressiossa
status: Published
label: is dancer family of @en
lexical alias: dancerFamilyOf.en
definition: Relates a family to an expression that includes a contribution by a family of dancing in a musical or dramatic presentation. @en
toolkit label: dancer family of @en
toolkit definition: An expression that includes a contribution by a family of dancing in a musical or dramatic presentation. @en
type: Property
domain: C10008
has element type: 2
sub property of: esittäjä (suku) ekspressiossa
sub property of: tanssija (yhteistoimija) ekspressiossa
definition: Liittää suvun ekspressioon, jonka tekemisessä suku on osallisena tanssimalla musiikki- tai näyttämöesityksessä.
toolkit label: tanssija (suku) ekspressiossa
toolkit definition: Ekspressio, jonka tekemisessä suku on osallisena tanssimalla musiikki- tai näyttämöesityksessä.
label: er danser for (familie) @no
definition: Relaterer en familie til et uttrykk som inkluderer et bidrag fra en familie i form av dansing i en musikalsk eller dramatisk forestilling. @no
toolkit label: danser for (familie) @no
toolkit definition: Et uttrykk som inkluderer et bidrag fra en familie i form av dansing i en musikalsk eller dramatisk forestilling. @no
label: is danser-familie van @nl
definition: Relateert een familie aan een expressie die omvat een bijdrage van een familie door het dansen in een muziek- of dramapresentatie. @nl
toolkit label: danser-familie van @nl
toolkit definition: Een expressie die omvat een bijdrage van een familie door het dansen in een muziek- of dramapresentatie. @nl
label: هي عائلة مسئولة عن الرقص لـ @ar
definition: يربط عائلة بتعبيرة تتضمن إسهام عائلة الرقص في عرض موسيقي أو درامي. @ar
toolkit label: عائلة مسئولة عن الرقص @ar
toolkit definition: تعبيرة تتضمن إسهام عائلة الرقص في عرض موسيقي أو درامي. @ar
label: és família ballarina de @ca
definition: Relaciona una família amb una expressió que inclou una contribució d’una família dansant en una representació musical o dramàtica. @ca
toolkit label: família ballarina de @ca
toolkit definition: Expressió que inclou una contribució d’una família dansant en una representació musical o dramàtica. @ca
label: er familie, som er danser af @da
definition: Relaterer en familie til et udtryk, som omfatter en families bidrag ved at danse i en musikalsk eller dramatisk præsentation. @da
toolkit label: familie, som er danser af @da
toolkit definition: Udtryk, som omfatter en families bidrag ved at danse i en musikalsk eller dramatisk præsentation. @da
label: tantsija (perekond) väljenduses @et
definition: Seostab perekonna väljendusega, millesse perekond on andnud panuse, tantsides muusika- või draamaetenduses. @et
toolkit label: tantsija (perekond) väljenduses @et
toolkit definition: Väljendus, millesse perekond on andnud panuse, tantsides muusika- või draamaetenduses. @et
label: ist Familie als Tänzerin/Tänzer von @de
definition: Setzt eine Familie in Beziehung zu einer Expression, zu der eine Familie beiträgt, indem sie in einer musikalischen oder dramatischen Darbietung tanzt. @de
toolkit label: Familie als Tänzerin/Tänzer von @de
toolkit definition: Eine Expression, zu der eine Familie beiträgt, indem sie in einer musikalischen oder dramatischen Darbietung tanzt. @de
label: táncos családja a következőnek: @hu
definition: Hozzákapcsol egy családot egy kifejezési formához, amely magában foglalja egy zenei vagy drámai bemutatóban táncoló család közreműködését. @hu
toolkit label: táncos családja: @hu
toolkit definition: Egy kifejezési forma, amely magában foglalja egy zenei vagy drámai bemutatóban táncoló család közreműködését. @hu
label: è ballerino famiglia di @it
definition: Correla una famiglia a un'espressione che comprende un contributo di una famiglia nella danza in una presentazione musicale o drammatica. @it
toolkit label: ballerino famiglia di @it
toolkit definition: Espressione che comprende un contributo di una famiglia nella danza in una presentazione musicale o drammatica. @it
label: είναι χορευτής οικογένεια του @el
toolkit label: χορευτής οικογένεια του @el
label: est une famille danseuse de @fr
definition: Met une famille en relation avec une expression qui intègre une contribution de la part d’une famille consistant à danser dans une présentation musicale ou dramatique. @fr
toolkit label: famille danseuse de @fr
toolkit definition: Expression qui intègre une contribution de la part d’une famille consistant à danser dans une présentation musicale ou dramatique. @fr
label: ir dejotājs (dzimta/ģimene) @lv
definition: Sasaista dzimtu/ģimeni ar izteiksmi, kas ietver dzimtas/ģimenes ieguldījumu, dejojot muzikālā vai dramatiskā uzvedumā. @lv
toolkit label: ir dejotājs (dzimta/ģimene) @lv
toolkit definition: Izteiksme, kas ietver dzimtas/ģimenes ieguldījumu, dejojot muzikālā vai dramatiskā uzvedumā. @lv
label: 是……的舞蹈者家族 @zh-hans
definition: 将一个家族与包括在音乐或戏剧呈现中的一个舞蹈家族的贡献的一种内容表达关联起来。 @zh-hans
toolkit label: ……的舞蹈者家族 @zh-hans
toolkit definition: 包括在音乐或戏剧呈现中的一个舞蹈家族的贡献的一种内容表达 @zh-hans
label: dansçı ailesidir @tr
definition: Bir aileyi, müzikal veya dramatik bir sunumda dans eden bir ailenin katkısını içeren bir anlatımla ilişkilendirir. @tr
toolkit label: dansçı aile @tr
toolkit definition: Müzikal veya dramatik bir sunumda dans eden bir ailenin katkısını içeren bir anlatım. @tr
has subproperty: P51030

tanssija (henkilö) ekspressiossa
status: Published
label: is dancer person of @en
lexical alias: dancerPersonOf.en
definition: Relates a person to an expression that includes a contribution by a person of dancing in a musical or dramatic presentation. @en
toolkit label: dancer person of @en
toolkit definition: An expression that includes a contribution by a person of dancing in a musical or dramatic presentation. @en
type: Property
domain: C10004
has element type: 2
sub property of: esittäjä (henkilö) ekspressiossa
sub property of: tanssija (toimija) ekspressiossa
definition: Liittää henkilön ekspressioon, jonka tekemisessä henkilö on osallisena tanssimalla musiikki- tai näyttämöesityksessä.
toolkit label: tanssija (henkilö) ekspressiossa
toolkit definition: Ekspressio, jonka tekemisessä henkilö on osallisena tanssimalla musiikki- tai näyttämöesityksessä.
label: er danser for (person) @no
definition: Relaterer en person til et uttrykk som inkluderer et bidrag fra en person i form av dansing i en musikalsk eller dramatisk forestilling. @no
toolkit label: danser for (person) @no
toolkit definition: Et uttrykk som inkluderer et bidrag fra en person i form av dansing i en musikalsk eller dramatisk forestilling. @no
label: is danser-persoon van @nl
definition: Relateert een persoon aan een expressie die omvat een bijdrage van een persoon door het dansen in een muziek- of dramapresentatie. @nl
toolkit label: danser-persoon van @nl
toolkit definition: Een expressie die omvat een bijdrage van een persoon door het dansen in een muziek- of dramapresentatie. @nl
label: هو شخص راقص لـ @ar
definition: يربط شخصا بتعبيرة تتضمن إسهام شخص بالرقص في عرض موسيقي أو درامي. @ar
toolkit label: شخص راقص @ar
toolkit definition: تعبيرة تتضمن إسهام شخص بالرقص في عرض موسيقي أو درامي. @ar
label: és persona ballarina de @ca
definition: Relaciona una persona amb una expressió que inclou una contribució d’una persona dansant en una representació musical o dramàtica. @ca
toolkit label: persona ballarina de @ca
toolkit definition: Expressió que inclou una contribució d’una persona dansant en una representació musical o dramàtica. @ca
label: er person, som er danser af @da
definition: Relaterer en person til et udtryk, som omfatter en persons bidrag ved at danse i en musikalsk eller dramatisk præsentation. @da
toolkit label: person, som er danser af @da
toolkit definition: Udtryk, som omfatter en persons bidrag ved at danse i en musikalsk eller dramatisk præsentation. @da
label: tantsija (isik) väljenduses @et
definition: Seostab isiku väljendusega, millesse isik on andnud panuse, tantsides muusika- või draamaetenduses. @et
toolkit label: tantsija (isik) väljenduses @et
toolkit definition: Väljendus, millesse isik on andnud panuse, tantsides muusika- või draamaetenduses. @et
label: ist Person als Tänzerin/Tänzer von @de
definition: Setzt eine Person in Beziehung zu einer Expression, zu der eine Person beiträgt, indem sie in einer musikalischen oder dramatischen Darbietung tanzt. @de
toolkit label: Person als Tänzerin/Tänzer von @de
toolkit definition: Eine Expression, zu der eine Person beiträgt, indem sie in einer musikalischen oder dramatischen Darbietung tanzt. @de
label: táncos személye a következőnek: @hu
definition: Hozzákapcsol egy személyt egy kifejezési formához, amely magában foglalja egy zenei vagy drámai bemutatóban táncoló személy közreműködését. @hu
toolkit label: táncos személye: @hu
toolkit definition: Egy kifejezési forma, amely magában foglalja egy zenei vagy drámai bemutatóban táncoló személy közreműködését. @hu
label: è ballerino persona di @it
definition: Correla una persona a un'espressione che comprende un contributo di una persona nella danza in una presentazione musicale o drammatica. @it
toolkit label: ballerino persona di @it
toolkit definition: Espressione che comprende un contributo di una persona nella danza in una presentazione musicale o drammatica. @it
label: είναι χορευτής φυσικό πρόσωπο του @el
toolkit label: χορευτής φυσικό πρόσωπο του @el
label: est une personne danseuse de @fr
definition: Met une personne en relation avec une expression qui intègre une contribution de la part d’une personne consistant à danser dans une présentation musicale ou dramatique. @fr
toolkit label: personne danseuse de @fr
toolkit definition: Expression qui intègre une contribution de la part d’une personne consistant à danser dans une présentation musicale ou dramatique. @fr
label: ir dejotājs (persona) @lv
definition: Sasaista personu ar izteiksmi, kas ietver personas ieguldījumu, dejojot muzikālā vai dramatiskā uzvedumā. @lv
toolkit label: ir dejotājs (persona) @lv
toolkit definition: Izteiksme, kas ietver personas ieguldījumu, dejojot muzikālā vai dramatiskā uzvedumā. @lv
label: 是……的舞蹈者个人 @zh-hans
definition: 将一个个人与包括在音乐或戏剧呈现中的一个舞蹈个人的贡献的一种内容表达关联起来。 @zh-hans
toolkit label: ……的舞蹈者个人 @zh-hans
toolkit definition: 包括在音乐或戏剧呈现中的一个舞蹈个人的贡献的一种内容表达 @zh-hans
label: dansçı kişisidir @tr
definition: Bir kişiyi, müzikal veya dramatik bir sunumda dans eden bir kişinin katkısını içeren bir anlatımla ilişkilendirir. @tr
toolkit label: dansçı @tr
toolkit definition: Müzikal veya dramatik bir sunumda dans eden bir kişinin katkısını içeren bir anlatım. @tr
has subproperty: P50577

konferenssin ajankohta
status: Published
label: has date of conference @en
definition: Relates a corporate body to a timespan during which a conference, exhibition, or other formally named and convened event is held. @en
type: Property
domain: C10005
sub property of: yhteisöön liittyvä ajanjakso
lexical alias: dateOfConference.en
instruction number: 11.4.2
toolkit label: date of conference @en
toolkit definition: A timespan during which a conference, exhibition, or other formally named and convened event is held. @en
label: a pour date de congrès @fr
definition: Met une collectivité en relation avec un laps de temps pendant lequel se tient un congrès, une exposition ou un autre événement formellement nommé et convoqué. @fr
toolkit label: date de congrès @fr
toolkit definition: Laps de temps pendant lequel se tient un congrès, une exposition ou un autre événement formellement nommé et convoqué. @fr
toolkit label: fecha de la conferencia, etc. @es
toolkit definition: La fecha o rango de fechas en las que se realizó una conferencia, congreso, reunión, exposición, feria, festival, etc. @es
label: har tid för konferens @sv
toolkit label: tid för konferens @sv
label: έχει χρονολογία του συνεδρίου @el
definition: Συνδέει ένα συλλογικό όργανο με ένα χρονικό διάστημα κατά το οποίο ένα συνέδριο,μια έκθεση ή άλλλο επίσημα κατονομαζόμενο και συγκαλούμενο συμβάν το οποίο δίνει έναυσμα για ένα έργο, λαμβάνει χώρα. @el
toolkit label: χρονολογία του συνεδρίου @el
toolkit definition: Μια χρονολογία ή εύρος χρονολογιών κατά τις οποίες ένα συνέδριο, συνάντηση, εορτή, φεστιβάλ κ.λπ. έλαβε χώρα. @el
definition: Setzt eine Körperschaft in Beziehung zu einem Zeitraum, in dem eine Konferenz, eine Ausstellung oder eine andere formal benannte und einberufene Veranstaltung stattfindet. @de
toolkit label: Datum einer Konferenz @de
toolkit definition: Ein Zeitraum, in dem eine Konferenz, eine Ausstellung oder eine andere formal benannte und einberufene Veranstaltung stattfindet. @de
label: har dato for konference @da
definition: Relaterer en korporation til en tidsperiode, hvorunder en konference, udstilling eller anden formelt navngivet og indkaldt begivenhed er afholdt. @da
toolkit label: dato for konference @da
toolkit definition: Tidsperiode, hvorunder en konference, udstilling eller anden formelt navngivet og indkaldt begivenhed er afholdt. @da
label: té com a data de congrés @ca
definition: Relaciona una entitat corporativa amb un interval de temps durant el qual se celebra un congrés, una exposició o qualsevol altre esdeveniment formalment esmentat i convocat. @ca
toolkit label: data de congrés @ca
toolkit definition: Interval de temps durant el qual se celebra un congrés, una exposició o qualsevol altre esdeveniment formalment esmentat i convocat. @ca
definition: Liittää yhteisön ajanjaksoon, jolloin konferenssi, näyttely tai muu nimetty ja kokoontunut tapahtuma järjestettiin.
toolkit label: konferenssin ajankohta
toolkit definition: Ajanjakso, jolloin konferenssi, näyttely tai muu nimetty ja kokoontunut tapahtuma järjestettiin.
toolkit label: tidspunkt for konferanse @no
toolkit definition: Et tidsrom hvor en konferanse, kongress eller annet formelt navngitt arrangement som inspirerer til et verk er avholdt. @no
label: hat Datum einer Konferenz @de
has element type: 3
label: konferencia időpontja a következő: @hu
definition: Hozzákapcsol egy testületet egy időtartamhoz, amely alatt konferenciát, kiállítást vagy más hivatalos névvel rendelkező és szervezett eseményt tartanak. @hu
toolkit label: konferencia időpontja: @hu
toolkit definition: Egy időtartam, amely alatt konferenciát, kiállítást vagy más hivatalos névvel rendelkező és szervezett eseményt tartanak. @hu
alternative label: date of conference, etc. @en
alternative label: konferenssin tms. ajankohta
label: har tidspunkt for konferanse @no
definition: Relaterer en korporasjon til et tidsrom hvor en konferanse, kongress eller annet formelt navngitt arrangement som inspirerer til et verk er avholdt. @no
alternative label: tidspunkt for konferanse etc. @no
label: heeft datum van conferentie @nl
definition: Relateert een corporatie aan een tijdspanne gedurende welke een conferentie, tentoonstelling of andere formeel benoemde en samengekomen gebeurtenis is gehouden. @nl
toolkit label: datum van conferentie @nl
toolkit definition: Een tijdspanne gedurende welke een conferentie, tentoonstelling of andere formeel benoemde en samengekomen gebeurtenis is gehouden. @nl
label: لها تاريخ مؤتمر @ar
definition: يربط هيئة بفترة زمنية تحدد أو عُقد خلالها رسمياً مؤتمر، أو معرض، أو أي فعالية أخرى، وأسفرت عن عمل. @ar
alternative label: تاريخ مؤتمر @ar
toolkit label: تاريخ مؤتمر @ar
toolkit definition: فترة زمنية تحدد أو عُقد خلالها رسمياً مؤتمر، أو معرض، أو أي فعالية أخرى، وأسفرت عن عمل. @ar
alternative label: data de congrés, etc. @ca
alternative label: konferencedato etc. @da
label: konverentsi toimumisaeg @et
definition: Seostab asutuse ajavahemikuga, millal on peetud teosele aluse pannud konverents, näitus või muu vormiliselt nimetatud ja kokku kutsutud üritus. @et
alternative label: konverentsi vms toimumisaeg @et
toolkit label: konverentsi toimumisaeg @et
toolkit definition: Ajavahemik, millal on peetud teosele aluse pannud konverents, näitus või muu vormiliselt nimetatud ja kokku kutsutud üritus. @et
alternative label: konferencia időpontja, stb. @hu
label: ha come data di conferenza @it
definition: Correla un ente a un arco di tempo nel quale una conferenza, mostra, o un altro evento formalmente denominato e indetto che ha generato un lavoro si è tenuto @it
alternative label: data della conferenza, etc. @it
toolkit label: data di conferenza @it
toolkit definition: Arco di tempo nel quale una conferenza, mostra, o un altro evento formalmente denominato e indetto che ha generato un lavoro si è tenuto @it
alternative label: χρονολογία συνεδρίου κ.λπ. @el
alternative label: date de congrès, etc. @fr
label: pasākuma datējums @lv
definition: Sasaista institūciju ar laikposmu, kurā notikusi konference, izstāde vai cits pasākums. @lv
toolkit label: pasākuma datējums @lv
toolkit definition: Laikposms, kurā notikusi konference, izstāde vai cits pasākums. @lv
alternative label: Datum einer Konferenz usw. @de
toolkit label: 会议的日期 @zh-hans
toolkit definition: 会议、展览或其他正式命名并举办的活动的时间跨度 @zh-hans

kappaleen omistuksen kohde (toimija) kappaleessa
status: Published
label: is dedicatee agent of item of @en
definition: Relates an agent to an item that acknowledges the inspiration or support of an agent. @en
type: Property
domain: C10002
sub property of: toimijaan liittyvä kappale
lexical alias: dedicateeAgentOfItemOf.en
label: est un agent dédicataire d’un item de @fr
definition: Met un agent en relation avec un item qui reconnaît l’inspiration ou le soutien d’un agent. @fr
toolkit label: agent dédicataire d’un item de @fr
toolkit definition: Item qui reconnaît l’inspiration ou le soutien d’un agent. @fr
toolkit label: dedicatee agent of item of @en
toolkit definition: An item that acknowledges the inspiration or support of an agent. @en
instruction number: 18.5
label: είναι αποδέκτης αφιέρωσης φορέας του αντιτύπου του @el
definition: Συνδέει έναν φορέα, στον οποίο αφιερώνεται ένα αντίτυπο, με ένα αντίτυπο. @el
toolkit label: αποδέκτης αφιέρωσης φορέας του αντιτύπου του @el
toolkit definition: Ένα αντίτυπο το οποίο αφιερώνεται σε έναν φορέα. @el
definition: Setzt einen Akteur in Beziehung zu einem Exemplar, das einem Akteur gewidmet ist. @de
toolkit label: Akteur als Widmungsempfängerin/Widmungsempfänger eines Exemplars von @de
toolkit definition: Ein Exemplar, das einem Akteur gewidmet ist. @de
label: er agent, som er tilegnet i eksemplar af @da
definition: Relaterer en agent til et eksemplar, som anerkender inspirationen eller støtten fra en agent. @da
toolkit label: agent, som er tilegnet i eksemplar af @da
toolkit definition: Eksemplar, som anerkender inspirationen eller støtten fra en agent. @da
label: és agent dedicatari d’un ítem de @ca
definition: Relaciona un agent amb un ítem que reconeix la inspiració i el suport d’un agent. @ca
toolkit label: agent dedicatari d’un ítem de @ca
toolkit definition: Ítem que reconeix la inspiració i el suport d’un agent. @ca
definition: Liittää toimijan kappaleeseen, joka on omistettu sitä innoittaneelle tai tukeneelle toimijalle.
toolkit label: kappaleen omistuksen kohde (toimija) kappaleessa
toolkit definition: Kappale, joka on omistettu sitä innoittaneelle tai tukeneelle toimijalle.
toolkit label: agent som et eksemplar er dedikert til @no
toolkit definition: Et eksemplar som anerkjenner inspirasjonen eller støtten fra en agent. @no
label: ist Akteur als Widmungsempfängerin/Widmungsempfänger eines Exemplars von @de
has element type: 2
label: dedikált ágense a következő példánynak: @hu
definition: Hozzákapcsol egy ágenst egy példányhoz, amely elismeri egy ágens ösztönzését vagy támogatását. @hu
toolkit label: dedikált ágense a következő példánynak: @hu
toolkit definition: Egy példány, amely elismeri egy ágens ösztönzését vagy támogatását. @hu
alternative label: dedicatee (item) of @en
alternative label: omistuskirjoituksen kohteena kappaleessa
label: er agent som et eksemplar er dedikert til @no
definition: Relaterer en agent til et eksemplar som anerkjenner inspirasjonen eller støtten fra en agent. @no
alternative label: eksemplar dedikert til @no
label: is opgedragene-actor van item van @nl
definition: Relateert een actor aan een item dat erkent de inspiratie of steun van een actor. @nl
toolkit label: opgedragene-actor van item van @nl
toolkit definition: Een item dat erkent de inspiratie of steun van een actor. @nl
label: هو وكيل مُهدى إليه لـ @ar
definition: يربط وكيلا بمفردة تقر بإلهام وكيل أو بدعمه. @ar
alternative label: مهدى إليه (مفردة) لـ @ar
toolkit label: هو وكيل مُهدى إليه لـ @ar
toolkit definition: يربط وكيلا بمفردة تقر بإلهام وكيل أو بدعمه. @ar
alternative label: dedicatari (ítem) de @ca
alternative label: dedikeret (eksemplar) til @da
label: eksemplari pühenduse saaja (tegija) eksemplaris @et
definition: Seostab tegija eksemplariga, millega avaldatakse tänu tegija innustuse või toetuse eest. @et
alternative label: eksemplari pühenduse saaja eksemplaris @et
toolkit label: eksemplari pühenduse saaja (tegija) eksemplaris @et
toolkit definition: Eksemplar, millega avaldatakse tänu tegija innustuse või toetuse eest. @et
alternative label: dedikáltja (példány): @hu
label: è dedicatario agente di item agente di @it
definition: Correla un agente a un item che attesta l'ispirazione o il supporto di un agente. @it
alternative label: dedicatario di item di @it
toolkit label: dedicatario agente di item di @it
toolkit definition: Item che attesta l'ispirazione o il supporto di un agente. @it
alternative label: αποδέκτης αφιέρωσης του αντιτύπου του @el
alternative label: dédicataire (item) de @fr
label: aģentam veltītā vienība @lv
definition: Sasaista aģentu ar vienību, kas ir veltījums aģentam. @lv
toolkit label: aģentam veltītā vienība @lv
toolkit definition: Vienība, kas ir veltījums aģentam. @lv
alternative label: Widmungsempfänger (Exemplar) von @de
alternative label: ……的被题献者（单件） @zh-hans
toolkit label: ……的单件的被题献者行为者 @zh-hans
toolkit definition: 对一个行为者的启发或支持表示感谢的一个单件 @zh-hans
toolkit label: kopyanın adandığı temsilci @tr
toolkit definition: Bir temsilcinin ilhamını veya desteğini kabul eden bir kopya. @tr
has subproperty: kappaleen omistuksen kohde (yhteistoimija) kappaleessa

teoksen omistuksen kohde (toimija) teoksessa
status: Published
label: is dedicatee agent of work of @en
definition: Relates an agent to a work that involves a responsibility of an agent for being commemorated. @en
type: Property
domain: C10002
sub property of: toimijaan liittyvä teos
lexical alias: dedicateeAgentOfWorkOf.en
label: est un agent dédicataire d’une œuvre de @fr
definition: Met un agent en relation avec une œuvre qui comporte une responsabilité de la part d’un agent consistant à être commémoré. @fr
toolkit label: agent dédicataire d’une œuvre de @fr
toolkit definition: Œuvre qui comporte une responsabilité de la part d’un agent consistant à être commémoré. @fr
toolkit label: dedicatee agent of work of @en
toolkit definition: A work that involves a responsibility of an agent for being commemorated. @en
instruction number: 18.5
label: είναι αποδέκτης αφιέρωσης φορέας του έργου του @el
definition: Συνδέει έναν φορέα, στον οποίο είναι αφιερωμένο το έργο, με ένα έργο. @el
toolkit label: αποδέκτης αφιέρωσης φορέας του έργου του @el
toolkit definition: Ένα έργο το οποίο είναι αφιερωμένο σε έναν φορέα. @el
definition: Setzt einen Akteur in Beziehung zu einem Werk, das einem Akteur gewidmet ist. @de
toolkit label: Akteur als Widmungsempfängerin/Widmungsempfänger eines Werks von @de
toolkit definition: Ein Werk, das einem Akteur gewidmet ist. @de
label: er agent, som er tilegnet i værk af @da
definition: Relaterer en agent til et værk, som involverer en agents ansvar for at blive fejret. @da
toolkit label: agent, som er tilegnet i værk af @da
toolkit definition: Værk, som involverer en agents ansvar for at blive fejret. @da
label: és agent dedicatari d’una obra de @ca
definition: Relaciona un agent amb una obra que implica una responsabilitat d’un agent de ser commemorat. @ca
toolkit label: agent dedicatari d’una obra de @ca
toolkit definition: Obra que implica una responsabilitat d’un agent de ser commemorat. @ca
definition: Liittää toimijan teokseen, joka on omistettu toimijalle.
toolkit label: teoksen omistuksen kohde (toimija) teoksessa
toolkit definition: Teos, joka on omistettu toimijalle.
toolkit label: agent som et verk er dedikert til @no
toolkit definition: Et verk som involverer ansvar for en agent i form av å bli minnet. @no
label: ist Akteur als Widmungsempfängerin/Widmungsempfänger eines Werks von @de
has element type: 2
label: dedikált ágense a következő műnek: @hu
definition: Hozzákapcsol egy ágenst egy műhöz, amely magában foglalja egy ágensnek azt a felelősségét, amiért megemlékeznek róla. @hu
toolkit label: dedikált ágense a következő műnek: @hu
toolkit definition: Egy mű, amely magában foglalja egy ágensnek azt a felelősségét, amiért megemlékeznek róla. @hu
alternative label: dedicatee of @en
alternative label: omistuskirjoituksen kohteena teoksessa
label: er agent som et verk er dedikert til @no
definition: Relaterer en agent til et verk som involverer ansvar for en agent i form av å bli minnet. @no
alternative label: verk dedikert til @no
label: is opgedragene-actor van work van @nl
definition: Relateert een actor aan een werk dat met zich meebrengt een verantwoordelijkheid van een actor om herdacht te worden. @nl
toolkit label: opgedragene-actor van work van @nl
toolkit definition: Een werk dat met zich meebrengt een verantwoordelijkheid van een actor om herdacht te worden. @nl
label: هو وكيل مُهدى إليه عمل لـ @ar
definition: يربط وكيلا بعمل يترتب عليه مسئولية وكيل عن الاحتفال بذكراه. @ar
alternative label: مُهدى إليه @ar
toolkit label: هو وكيل مُهدى إليه لـ @ar
toolkit definition: يربط وكيلا بعمل يترتب عليه مسئولية وكيل عن الاحتفال بذكراه. @ar
alternative label: dedicatari de @ca
alternative label: dedikeret til @da
label: teose pühenduse saaja (tegija) teoses @et
definition: Seostab tegija teosega, mis on tegijale pühendatud. @et
alternative label: teose pühenduse saaja teoses @et
toolkit label: teose pühenduse saaja (tegija) teoses @et
toolkit definition: Teos, mis on tegijale pühendatud. @et
alternative label: dedikáltja: @hu
label: è dedicatario di opera agente di @it
definition: Correla un agente a un'opera che implica la responsabilità di un agente per essere commemorato. @it
alternative label: dedicatario di un'opera di @it
toolkit label: dedicatario agente di opera di @it
toolkit definition: Opera che implica la responsabilità di un agente per essere commemorato. @it
alternative label: αποδέκτης αφιέρωσης του έργου του @el
alternative label: dédicataire de @fr
label: ir veltījuma adresāts (aģents) darbā @lv
definition: Sasaista aģentu ar darbu, kas ietver aģenta atbildību par tai adresēto veltījumu. @lv
toolkit label: ir veltījuma adresāts (aģents) darbā @lv
toolkit definition: Darbs, kas ietver aģenta atbildību par tai adresēto veltījumu. @lv
alternative label: Widmungsempfänger von @de
alternative label: ……的被题献者 @zh-hans
toolkit label: ……的作品的被题献者行为者 @zh-hans
toolkit definition: 涉及被纪念的一个行为者的责任的一种作品 @zh-hans
toolkit label: eserin adandığı temsilci @tr
toolkit definition: Bir temsilcinin anılma sorumluluğunu içeren bir eser. @tr
has subproperty: teoksen omistuksen kohde (yhteistoimija) teoksessa

kappaleen omistuksen kohde (yhteistoimija) kappaleessa
status: Published
label: is dedicatee collective agent of item of @en
lexical alias: dedicateeCollectiveAgentOfItemOf.en
definition: Relates a collective agent to an item that acknowledges the inspiration or support of a collective agent. @en
toolkit label: dedicatee collective agent of item of @en
toolkit definition: An item that acknowledges the inspiration or support of a collective agent. @en
type: Property
domain: C10011
has element type: 2
sub property of: yhteistoimijaan liittyvä kappale
sub property of: kappaleen omistuksen kohde (toimija) kappaleessa
definition: Liittää yhteistoimijan kappaleeseen, joka on omistettu yhteistoimijalle.
toolkit label: kappaleen omistuksen kohde (yhteistoimija) kappaleessa
toolkit definition: Kappale, joka on omistettu yhteistoimijalle.
label: er tilegnet kollektiv agent for eksemplar for @no
definition: Relaterer en kollektiv agent til et eksemplar som anerkjenner inpirasjonen eller støttet fra en kollektiv agent. @no
toolkit label: tilegnet kollektiv agent for eksemplar for @no
toolkit definition: Et eksemplar som anerkjenner inpirasjonen eller støttet fra en kollektiv agent. @no
label: is opgedragene-collectieve actor van item van @nl
definition: Relateert een collectieve actor aan een item dat erkent de inspiratie of steun van een collectieve actor. @nl
toolkit label: opgedragene-collectieve actor van item van @nl
toolkit definition: Een item dat erkent de inspiratie of steun van een collectieve actor. @nl
label: هو وكيل جماعي مهدى إليه مفردة لـ @ar
definition: يربط وكيلا جماعيا بمفردة تعترف بإلهام أو دعم وكيل جماعي. @ar
toolkit label: وكيل جماعي مُهدى إليه مفردة @ar
toolkit definition: مفردة تعترف بإلهام أو دعم وكيل جماعي. @ar
label: és agent col·lectiu dedicatari d’un ítem de @ca
definition: Relaciona un agent col·lectiu amb un ítem que reconeix la inspiració i el suport d’un agent col·lectiu. @ca
toolkit label: agent col·lectiu dedicatari d’un ítem de @ca
toolkit definition: Ítem que reconeix la inspiració i el suport d’un agent col·lectiu. @ca
label: er kollektiv agent, som er tilegnet i eksemplar af @da
definition: Relaterer en kollektiv agent til et eksemplar, som anerkender inspirationen eller støtten fra en kollektiv agent. @da
toolkit label: kollektiv agent, som er tilegnet i eksemplar af @da
toolkit definition: Eksemplar, som anerkender inspirationen eller støtten fra en kollektiv agent. @da
label: eksemplari pühenduse saaja (kollektiiv) eksemplaris @et
definition: Seostab kollektiivi eksemplariga, millega avaldatakse tänu kollektiivi innustuse või toetuse eest. @et
toolkit label: eksemplari pühenduse saaja (kollektiiv) eksemplaris @et
toolkit definition: Eksemplar, millega avaldatakse tänu kollektiivi innustuse või toetuse eest. @et
label: ist gemeinschaftlicher Akteur als Widmungsempfängerin/Widmungsempfänger eines Exemplars von @de
definition: Setzt einen gemeinschaftlichen Akteur in Beziehung zu einem Exemplar, das einem gemeinschaftlichen Akteur gewidmet ist. @de
toolkit label: Gemeinschaftlicher Akteur als Widmungsempfängerin/Widmungsempfänger eines Exemplars von @de
toolkit definition: Ein Exemplar, das einem gemeinschaftlichen Akteur gewidmet ist. @de
label: dedikált kollektív ágense a következő példánynak: @hu
definition: Hozzákapcsol egy kollektív ágenst egy példányhoz, amely méltatja egy kollektív ágens ösztönzését vagy támogatását. @hu
toolkit label: dedikált kollektív ágense a következő példánynak: @hu
toolkit definition: Egy példány, amely méltatja egy kollektív ágens ösztönzését vagy támogatását. @hu
label: è dedicatario agente collettivo di item di @it
definition: Correla un agente collettivo a un item che attesta l'ispirazione o il supporto di un agente collettivo. @it
toolkit label: dedicatario agente collettivo di item di @it
toolkit definition: Item che attesta l'ispirazione o il supporto di un agente collettivo. @it
label: είναι αποδέκτης αφιέρωσης συλλογικός φορέας του αντιτύπου του @el
toolkit label: αποδέκτης αφιέρωσης συλλογικός φορέας του αντιτύπου του @el
label: est un agent collectif dédicataire d’un item de @fr
definition: Met un agent collectif en relation avec un item qui reconnaît l’inspiration ou le soutien d’un agent collectif. @fr
toolkit label: agent collectif dédicataire d’un item de @fr
toolkit definition: Item qui reconnaît l’inspiration ou le soutien d’un agent collectif. @fr
label: grupai veltītā vienība @lv
definition: Sasaista grupu ar vienību, kas ir veltījums grupai. @lv
toolkit label: grupai veltītā vienība @lv
toolkit definition: Vienība, kas ir veltījums grupai. @lv
label: 是……的单件的被题献者集体行为者 @zh-hans
definition: 将一个集体行为者与对一个集体行为者的启发或支持表示感谢的一个单件关联起来。 @zh-hans
toolkit label: ……的单件的被题献者集体行为者 @zh-hans
toolkit definition: 对一个集体行为者的启发或支持表示感谢的一个单件 @zh-hans
label: kopyasının ithaf edilen kolektif temsilcisidir @tr
definition: Kolektif bir temsilciyi, bir kolektif temsilcinin ilhamını veya desteğini kabul eden bir kopya ile ilişkilendirir. @tr
toolkit label: kopyanın adandığı kolektif temsilci @tr
toolkit definition: Bir kolektif temsilcinin ilhamını veya desteğini kabul eden bir kopya. @tr
has subproperty: kappaleen omistuksen kohde (yhteisö) kappaleessa
has subproperty: kappaleen omistuksen kohde (suku) kappaleessa
has subproperty: P50778

teoksen omistuksen kohde (yhteistoimija) teoksessa
status: Published
label: is dedicatee collective agent of work of @en
lexical alias: dedicateeCollectiveAgentOfWorkOf.en
definition: Relates a collective agent to a work that involves a responsibility of a collective agent for being commemorated. @en
toolkit label: dedicatee collective agent of work of @en
toolkit definition: A work that involves a responsibility of a collective agent for being commemorated. @en
type: Property
domain: C10011
has element type: 2
sub property of: yhteistoimijaan liittyvä teos
sub property of: teoksen omistuksen kohde (toimija) teoksessa
definition: Liittää yhteistoimijan teokseen, joka on omistettu yhteistoimijalle.
toolkit label: teoksen omistuksen kohde (yhteistoimija) teoksessa
toolkit definition: Teos, joka on omistettu yhteistoimijalle.
label: er kollektiv agent som verk er tilegnet til @no
definition: Relaterer en kollektiv agent til et verk som involverer et ansvar for en kollektiv agent i form av å bli hedret. @no
toolkit label: kollektiv agent som verk er tilegnet til @no
toolkit definition: Et verk som involverer et ansvar for en kollektiv agent i form av å bli hedret. @no
label: is opgedragene-collectieve actor van werk van @nl
definition: Relateert een collectieve actor aan een werk dat met zich meebrengt een verantwoordelijkheid van een collectieve actor om herdacht te worden. @nl
toolkit label: opgedragene-collectieve actor van werk van @nl
toolkit definition: Een werk dat met zich meebrengt een verantwoordelijkheid van een collectieve actor om herdacht te worden. @nl
label: هو وكيل جماعي مُهدى إليه عمل لـ @ar
definition: يربط وكيلا جماعيا بعمل يترتب عليه مسئولية وكيل جماعي عن الاحتفال بذكراه. @ar
toolkit label: وكيل جماعي مُهدى إليه عمل @ar
toolkit definition: عمل يترتب عليه مسئولية وكيل جماعي عن الاحتفال به. @ar
label: és agent col·lectiu dedicatari d’una obra de @ca
definition: Relaciona un agent col·lectiu amb una obra que implica una responsabilitat d’un agent col·lectiu de ser commemorat. @ca
toolkit label: agent col·lectiu dedicatari d’una obra de @ca
toolkit definition: Obra que implica una responsabilitat d’un agent col·lectiu de ser commemorat. @ca
label: er kollektiv agent, som er tilegnet i værk af @da
definition: Relaterer en kollektiv agent til et værk, som involverer en kollektiv agents ansvar for at blive fejret. @da
toolkit label: kollektiv agent, som er tilegnet i værk af @da
toolkit definition: Værk, som involverer en kollektiv agents ansvar for at blive fejret. @da
label: teose pühenduse saaja (kollektiiv) teoses @et
definition: Seostab kollektiivi teosega, mis on kollektiivile pühendatud. @et
toolkit label: teose pühenduse saaja (kollektiiv) teoses @et
toolkit definition: Teos, mis on kollektiivile pühendatud. @et
label: ist gemeinschaftlicher Akteur als Widmungsempfängerin/Widmungsempfänger eines Werks von @de
definition: Setzt einen gemeinschaftlichen Akteur in Beziehung zu einem Werk, das einem gemeinschaftlichen Akteur gewidmet ist. @de
toolkit label: Gemeinschaftlicher Akteur als Widmungsempfängerin/Widmungsempfänger eines Werks von @de
toolkit definition: Ein Werk, das einem gemeinschaftlichen Akteur gewidmet ist. @de
label: dedikált kollektív ágense a következő műnek: @hu
definition: Hozzákapcsol egy kollektív ágenst egy műhöz, amely magában foglalja egy kollektív ágensnek azt a felelősségét, amiért megemlékeznek róla. @hu
toolkit label: dedikált kollektív ágense a következő műnek: @hu
toolkit definition: Egy mű, amely magában foglalja egy kollektív ágensnek azt a felelősségét, amiért megemlékeznek róla. @hu
label: è dedicatario agente collettivo di opera di @it
definition: Correla un agente collettivo a un'opera che implica una responsabilità di un agente collettivo per essere commemorato. @it
toolkit label: dedicatario agente collettivo di opera di @it
toolkit definition: Opera che implica una responsabilità di un agente collettivo per essere commemorato. @it
label: είναι αποδέκτης αφιέρωσης συλλογικός φορέας του έργου του @el
toolkit label: αποδέκτης αφιέρωσης συλλογικός φορέας του έργου του @el
label: est un agent collectif dédicataire d’une œuvre de @fr
definition: Met un agent collectif en relation avec une œuvre qui comporte une responsabilité de la part d’un agent collectif consistant à être commémoré. @fr
toolkit label: agent collectif dédicataire d’une œuvre de @fr
toolkit definition: Œuvre qui comporte une responsabilité de la part d’un agent collectif consistant à être commémoré. @fr
label: ir veltījuma adresāts (grupa) darbā @lv
definition: Sasaista grupu ar darbu, kas ietver grupas atbildību par tai adresēto veltījumu. @lv
toolkit label: ir veltījuma adresāts (grupa) darbā @lv
toolkit definition: Darbs, kas ietver grupas atbildību par tai adresēto veltījumu. @lv
label: 是……的作品的被题献者集体行为者 @zh-hans
definition: 将一个集体行为者与涉及被纪念的一个集体行为者的责任的一种作品关联起来。 @zh-hans
toolkit label: ……的作品的被题献者集体行为者 @zh-hans
toolkit definition: 涉及被纪念的一个集体行为者的责任的一种作品 @zh-hans
label: eserinin ithaf edilen kolektif temsilcisidir @tr
definition: Kolektif bir temsilciyi, kolektif bir temsilcinin belirtme sorumluluğunu içeren bir eserle ilişkilendirir. @tr
toolkit label: eserin adandığı kolektif temsilci @tr
toolkit definition: Kolektif bir temsilcinin anılma sorumluluğunu içeren bir eser. @tr
has subproperty: teoksen omistuksen kohde (yhteisö) teoksessa
has subproperty: teoksen omistuksen kohde (suku) teoksessa
has subproperty: P50686

kappaleen omistuksen kohde (yhteisö) kappaleessa
status: Published
label: is dedicatee corporate body of item of @en
lexical alias: dedicateeCorporateBodyOfItemOf.en
definition: Relates a corporate body to an item that acknowledges the inspiration or support of a corporate body. @en
toolkit label: dedicatee corporate body of item of @en
toolkit definition: An item that acknowledges the inspiration or support of a corporate body. @en
type: Property
domain: C10005
has element type: 2
sub property of: yhteisöön liittyvä kappale
sub property of: kappaleen omistuksen kohde (yhteistoimija) kappaleessa
definition: Liittää yhteisön kappaleeseen, joka on omistettu yhteisölle.
toolkit label: kappaleen omistuksen kohde (yhteisö) kappaleessa
toolkit definition: Kappale, joka on omistettu yhteisölle.
label: er tilegnet korporasjon for eksemplar for @no
definition: Relaterer en korporasjon til et eksemplar som anerkjenner inpirasjonen eller støttet fra en korporasjon. @no
toolkit label: tilegnet korporasjon for eksemplar for @no
toolkit definition: Et eksemplar som anerkjenner inpirasjonen eller støttet fra en korporasjon. @no
label: is opgedragene-corporatie van item van @nl
definition: Relateert een corporatie aan een item dat erkent de inspiratie of steun van een corporatie. @nl
toolkit label: opgedragene-corporatie van item van @nl
toolkit definition: Een item dat erkent de inspiratie of steun van een corporatie. @nl
label: هي هيئة مهدى إليها مفردة لـ @ar
definition: يربط هيئة بمفردة تعترف بإلهام أو دعم هيئة. @ar
toolkit label: هيئة مهدى إليها مفردة لـ @ar
toolkit definition: مفردة تعترف بإلهام أو دعم هيئة. @ar
label: és entitat corporativa dedicatària d’un ítem de @ca
definition: Relaciona una entitat corporativa amb un ítem que reconeix la inspiració i el suport d’una entitat corporativa. @ca
toolkit label: entitat corporativa dedicatària d’un ítem de @ca
toolkit definition: Ítem que reconeix la inspiració i el suport d’una entitat corporativa. @ca
label: er korporation, som er tilegnet i eksemplar af @da
definition: Relaterer en korporation til et eksemplar, som anerkender inspirationen eller støtten fra en korporation. @da
toolkit label: korporation, som er tilegnet i eksemplar af @da
toolkit definition: Eksemplar, som anerkender inspirationen eller støtten fra en korporation. @da
label: eksemplari pühenduse saaja (asutus) eksemplaris @et
definition: Seostab asutuse eksemplariga, millega avaldatakse tänu asutuse innustuse või toetuse eest. @et
toolkit label: eksemplari pühenduse saaja (asutus) eksemplaris @et
toolkit definition: Eksemplar, millega avaldatakse tänu asutuse innustuse või toetuse eest. @et
label: ist Körperschaft als Widmungsempfängerin/Widmungsempfänger eines Exemplars von @de
definition: Setzt eine Körperschaft in Beziehung zu einem Exemplar, das einer Körperschaft gewidmet ist. @de
toolkit label: Körperschaft als Widmungsempfängerin/Widmungsempfänger eines Exemplars von @de
toolkit definition: Ein Exemplar, das einer Körperschaft gewidmet ist. @de
label: dedikált testülete a következő példánynak: @hu
definition: Hozzákapcsol egy testületet egy példányhoz, amely méltatja egy testület ösztönzését vagy támogatását. @hu
toolkit label: dedikált testülete a következő példánynak: @hu
toolkit definition: Egy példány, amely méltatja egy testület ösztönzését vagy támogatását. @hu
label: è dedicatario ente di item di @it
definition: Correla un ente a un item che attesta l'ispirazione o il supporto di un ente. @it
toolkit label: dedicatario ente di item di @it
toolkit definition: Item che attesta l'ispirazione o il supporto di un ente. @it
label: είναι αποδέκτης αφιέρωσης συλλογικό όργανο του αντιτύπου του @el
toolkit label: αποδέκτης αφιέρωσης συλλογικό όργανο του αντιτύπου του @el
label: est une collectivité dédicataire d’un item de @fr
definition: Met une collectivité en relation avec un item qui reconnaît l’inspiration ou le soutien d’une collectivité. @fr
toolkit label: collectivité dédicataire d’un item de @fr
toolkit definition: Item qui reconnaît l’inspiration ou le soutien d’une collectivité. @fr
label: institūcijai veltītā vienība @lv
definition: Sasaista institūciju ar vienību, kas ir veltījums institūcijai. @lv
toolkit label: institūcijai veltītā vienība @lv
toolkit definition: Vienība, kas ir veltījums institūcijai. @lv
label: 是……的单件的被题献者团体 @zh-hans
definition: 将一个团体与对一个团体的启发或支持表示感谢的一个单件关联起来。 @zh-hans
toolkit label: ……的单件的被题献者团体 @zh-hans
toolkit definition: 对一个团体的启发或支持表示感谢的一个单件 @zh-hans
label: kopyasının ithaf edilen tüzel kişisidir @tr
definition: Bir tüzel kişiliği, bir tüzel kişiliğin ciltleme sorumluluğunu içeren bir kopyayla ilişkilendirir. @tr
toolkit label: kopyanın adandığı tüzel ki̇şi @tr
toolkit definition: Bir tüzel kişinin ilhamını veya desteğini kabul eden bir kopya. @tr
has subproperty: P50929

teoksen omistuksen kohde (yhteisö) teoksessa
status: Published
label: is dedicatee corporate body of work of @en
lexical alias: dedicateeCorporateBodyOfWorkOf.en
definition: Relates a corporate body to a work that involves a responsibility of a corporate body for being commemorated. @en
toolkit label: dedicatee corporate body of work of @en
toolkit definition: A work that involves a responsibility of a corporate body for being commemorated. @en
type: Property
domain: C10005
has element type: 2
sub property of: yhteisöön liittyvä teos
sub property of: teoksen omistuksen kohde (yhteistoimija) teoksessa
definition: Liittää yhteisön teokseen, joka on omistettu yhteisölle.
toolkit label: teoksen omistuksen kohde (yhteisö) teoksessa
toolkit definition: Teos, joka on omistettu yhteisölle.
label: er korporasjon som verk er tilegnet til @no
definition: Relaterer en korporasjon til et verk som involverer et ansvar for en korporasjon i form av å bli hedret. @no
toolkit label: korporasjon som verk er tilegnet til @no
toolkit definition: Et verk som involverer et ansvar for en korporasjon i form av å bli hedret. @no
label: is opgedragene-corporatie van werk van @nl
definition: Relateert een corporatie aan een werk dat met zich meebrengt een verantwoordelijkheid van een corporatie om herdacht te worden. @nl
toolkit label: opgedragene-corporatie van werk van @nl
toolkit definition: Een werk dat met zich meebrengt een verantwoordelijkheid van een corporatie om herdacht te worden. @nl
label: هي هيئة مُهدى إليها عمل لـ @ar
definition: يربط هيئة بعمل يترتب عليه مسئولية هيئة عن الاحتفال بها. @ar
toolkit label: هيئة مُهدى إليها عمل @ar
toolkit definition: عمل يترتب عليه مسئولية هيئة عن الاحتفال بها. @ar
label: és entitat corporativa dedicatària d’una obra de @ca
definition: Relaciona una entitat corporativa amb una obra que implica una responsabilitat d’una entitat corporativa de ser commemorada. @ca
toolkit label: entitat corporativa dedicatària d’una obra de @ca
toolkit definition: Obra que implica una responsabilitat d’una entitat corporativa de ser commemorada. @ca
label: er korporation, som er tilegnet i værk af @da
definition: Relaterer en korporation til et værk, som involverer en korporations ansvar for at blive fejret. @da
toolkit label: korporation, som er tilegnet i værk af @da
toolkit definition: Værk, som involverer en korporations ansvar for at blive fejret. @da
label: teose pühenduse saaja (asutus) teoses @et
definition: Seostab asutuse teosega, mis on asutusele pühendatud. @et
toolkit label: teose pühenduse saaja (asutus) teoses @et
toolkit definition: Teos, mis on asutusele pühendatud. @et
label: ist Körperschaft als Widmungsempfängerin/Widmungsempfänger eines Werks von @de
definition: Setzt eine Körperschaft in Beziehung zu einem Werk, das einer Körperschaft gewidmet ist. @de
toolkit label: Körperschaft als Widmungsempfängerin/Widmungsempfänger eines Werks von @de
toolkit definition: Ein Werk, das einer Körperschaft gewidmet ist. @de
label: dedikált testülete a következő műnek: @hu
definition: Hozzákapcsol egy testületet egy műhöz, amely magában foglalja egy testületnek azt a felelősségét, amiért megemlékeznek róla. @hu
toolkit label: dedikált testülete a következő műnek: @hu
toolkit definition: Egy mű, amely magában foglalja egy testületnek azt a felelősségét, amiért megemlékeznek róla. @hu
label: è dedicatario ente di opera di @it
definition: Correla un ente a un'opera che implica una responsabilità di un ente per essere commemorato. @it
toolkit label: dedicatario di opera ente di @it
toolkit definition: Opera che implica una responsabilità di un ente per essere commemorato. @it
label: είναι αποδέκτης αφιέρωσης συλλογικό όργανο του έργου του @el
toolkit label: αποδέκτης αφιέρωσης συλλογικό όργανο του έργου του @el
label: est une collectivité dédicataire d’une œuvre de @fr
definition: Met une collectivité en relation avec une œuvre qui comporte une responsabilité de la part d’une collectivité consistant à être commémoré. @fr
toolkit label: collectivité dédicataire d’une œuvre de @fr
toolkit definition: Œuvre qui comporte une responsabilité de la part d’une collectivité consistant à être commémoré. @fr
label: ir veltījuma adresāts (institūcija) darbā @lv
definition: Sasaista institūciju ar darbu, kas ietver institūcijas atbildību par tai adresēto veltījumu. @lv
toolkit label: ir veltījuma adresāts (institūcija) darbā @lv
toolkit definition: Darbs, kas ietver institūcijas atbildību par tai adresēto veltījumu. @lv
label: 是……的作品的被题献者团体 @zh-hans
definition: 将一个团体与涉及被纪念的一个团体的责任的一种作品关联起来。 @zh-hans
toolkit label: ……的作品的被题献者团体 @zh-hans
toolkit definition: 涉及被纪念的一个团体的责任的一种作品 @zh-hans
label: eserinin ithaf edilen tüzel kişisidir @tr
definition: Bir tüzel kişiyi, anılması için bir tüzel kişinin sorumluluğunu içeren bir eserle ilişkilendirir. @tr
toolkit label: eserin adandığı tüzel kişi @tr
toolkit definition: Bir tüzel kişinin anılma sorumluluğunu içeren bir eser. @tr
has subproperty: P50837

kappaleen omistuksen kohde (suku) kappaleessa
status: Published
label: is dedicatee family of item of @en
lexical alias: dedicateeFamilyOfItemOf.en
definition: Relates a family to an item that acknowledges the inspiration or support of a family. @en
toolkit label: dedicatee family of item of @en
toolkit definition: An item that acknowledges the inspiration or support of a family. @en
type: Property
domain: C10008
has element type: 2
sub property of: sukuun liittyvä kappale
sub property of: kappaleen omistuksen kohde (yhteistoimija) kappaleessa
definition: Liittää suvun kappaleeseen, joka on omistettu suvulle.
toolkit label: kappaleen omistuksen kohde (suku) kappaleessa
toolkit definition: Kappale, joka on omistettu suvulle.
label: er tilegnet familie for eksemplar for @no
definition: Relaterer en familie til et eksemplar som anerkjenner inpirasjonen eller støttet fra en familie. @no
toolkit label: tilegnet familie for eksemplar for @no
toolkit definition: Et eksemplar som anerkjenner inpirasjonen eller støttet fra en familie. @no
label: is opgedragene-familie van item van @nl
definition: Relateert een familie aan een item dat erkent de inspiratie of steun van een familie. @nl
toolkit label: opgedragene-familie van item van @nl
toolkit definition: Een item dat erkent de inspiratie of steun van een familie. @nl
label: هي عائلة مُهدى إليها مفردة لت @ar
definition: يربط عائلة بمفردة تعترف بإلهام أو دعم عائلة. @ar
toolkit label: عائلة مُهدى إليها مفردة @ar
toolkit definition: مفردة تُقر بإلهام أو بدعم عائلة. @ar
label: és família dedicatària d’un ítem de @ca
definition: Relaciona una família amb un ítem que reconeix la inspiració i el suport d’una família. @ca
toolkit label: família dedicatària d’un ítem de @ca
toolkit definition: Ítem que reconeix la inspiració i el suport d’una família. @ca
label: er familie, som er tilegnet i eksemplar af @da
definition: Relaterer en familie til et eksemplar, som anerkender inspirationen eller støtten fra en familie. @da
toolkit label: familie, som er tilegnet i eksemplar af @da
toolkit definition: Eksemplar, som anerkender inspirationen eller støtten fra en familie. @da
label: eksemplari pühenduse saaja (perekond) eksemplaris @et
definition: Seostab perekonna eksemplariga, millega avaldatakse tänu perekonna innustuse või toetuse eest. @et
toolkit label: eksemplari pühenduse saaja (perekond) eksemplaris @et
toolkit definition: Eksemplar, millega avaldatakse tänu perekonna innustuse või toetuse eest. @et
label: ist Familie als Widmungsempfänger eines Exemplars von @de
definition: Setzt eine Familie in Beziehung zu einem Exemplar, das einer Familie gewidmet ist. @de
toolkit label: Familie als Widmungsempfänger eines Exemplars von @de
toolkit definition: Ein Exemplar, das einer Familie gewidmet ist. @de
label: dedikált családja a következő példánynak: @hu
definition: Hozzákapcsol egy családot egy példányhoz, amely méltatja a család ösztönzését vagy támogatását. @hu
toolkit label: dedikált családja a következő példánynak: @hu
toolkit definition: Egy példány, amely méltatja egy család ösztönzését vagy támogatását. @hu
label: è dedicatario famiglia di item di @it
definition: Correla una famiglia a un item che attesta l'ispirazione o il supporto di una famiglia. @it
toolkit label: dedicatario famiglia di item di @it
toolkit definition: Item che attesta l'ispirazione o il supporto di una famiglia. @it
label: είναι αποδέκτης αφιέρωσης οικογένεια του αντιτύπου του @el
definition: Συνδέει μια οικογένεια με ένα αντίτυπο που γνωστοποιεί την έμπνευση ή την υποστήριξη μιας οικογένειας. @el
toolkit label: αποδέκτης αφιέρωσης οικογένεια του αντιτύπου του @el
label: est une famille dédicataire d’un item de @fr
definition: Met une famille en relation avec un item qui reconnaît l’inspiration ou le soutien d’une famille. @fr
toolkit label: famille dédicataire d’un item de @fr
toolkit definition: Item qui reconnaît l’inspiration ou le soutien d’une famille. @fr
label: dzimtai/ģimenei veltītā vienība @lv
definition: Sasaista dzimtu/ģimeni ar vienību, kas ir veltījums dzimtai/ģimenei. @lv
toolkit label: dzimtai/ģimenei veltītā vienība @lv
toolkit definition: Vienība, kas ir veltījums dzimtai/ģimenei. @lv
label: 是……的单件的被题献者家族 @zh-hans
definition: 将一个家族与对一个家族的启发或支持表示感谢的一个单件关联起来。 @zh-hans
toolkit label: ……的单件的被题献者家族 @zh-hans
toolkit definition: 对一个家族的启发或支持表示感谢的一个单件 @zh-hans
label: kopyasının ithaf edilen ailesidir @tr
definition: Bir aileyi, bir ailenin ilhamını veya desteğini kabul eden bir kopyayla ilişkilendirir. @tr
toolkit label: kopyanın adandığı aile @tr
toolkit definition: Bir ailenin ilhamını veya desteğini kabul eden bir kopya. @tr
has subproperty: P51080

teoksen omistuksen kohde (suku) teoksessa
status: Published
label: is dedicatee family of work of @en
lexical alias: dedicateeFamilyOfWorkOf.en
definition: Relates a family to a work that involves a responsibility of a family for being commemorated. @en
toolkit label: dedicatee family of work of @en
toolkit definition: A work that involves a responsibility of a family for being commemorated. @en
type: Property
domain: C10008
has element type: 2
sub property of: sukuun liittyvä teos
sub property of: teoksen omistuksen kohde (yhteistoimija) teoksessa
definition: Liittää suvun teokseen, joka on omistettu suvulle.
toolkit label: teoksen omistuksen kohde (suku) teoksessa
toolkit definition: Teos, joka on omistettu suvulle.
label: er familie som verk er tilegnet til @no
definition: Relaterer en familie til et verk som involverer et ansvar for en familie i form av å bli hedret. @no
toolkit label: familie som verk er tilegnet til @no
toolkit definition: Et verk som involverer et ansvar for en familie i form av å bli hedret. @no
label: is opgedragene-familie van werk van @nl
definition: Relateert een familie aan een werk dat met zich meebrengt een verantwoordelijkheid van een familie om herdacht te worden. @nl
toolkit label: opgedragene-familie van werk van @nl
toolkit definition: Een werk dat met zich meebrengt een verantwoordelijkheid van een familie om herdacht te worden. @nl
label: هي عائلة مُهدى إليها عمل لـ @ar
definition: يربط عائلة بعمل يترتب عليه مسئولية عائلة عن الاحتفال بها. @ar
toolkit label: عائلة مُهدى إليها عمل @ar
toolkit definition: عمل يترتب عليه مسئولية عائلة عن الاحتفال بها. @ar
label: és família dedicatària d’una obra de @ca
definition: Relaciona una família amb una obra que implica una responsabilitat d’una família de ser commemorada. @ca
toolkit label: família dedicatària d’una obra de @ca
toolkit definition: Obra que implica una responsabilitat d’una família de ser commemorada. @ca
label: er familie, som er tilegnet i værk af @da
definition: Relaterer en familie til et værk, som involverer en families ansvar for at blive fejret. @da
toolkit label: familie, som er tilegnet i værk af @da
toolkit definition: Værk, som involverer en families ansvar for at blive fejret. @da
label: teose pühenduse saaja (perekond) teoses @et
definition: Seostab perekonna teosega, mis on perekonnale pühendatud. @et
toolkit label: teose pühenduse saaja (perekond) teoses @et
toolkit definition: Teos, mis on perekonnale pühendatud. @et
label: ist Familie als Widmungsempfängerin/Widmungsempfänger eines Werks von @de
definition: Setzt eine Familie in Beziehung zu einem Werk, das einer Familie gewidmet ist. @de
toolkit label: Familie als Widmungsempfängerin/Widmungsempfänger eines Werks von @de
toolkit definition: Ein Werk, das einer Familie gewidmet ist. @de
label: dedikált családja a következő műnek: @hu
definition: Hozzákapcsol egy családot egy műhöz, amely magában foglalja egy családnak azt a felelősségét, amiért megemlékeznek róla. @hu
toolkit label: dedikált családja a következő műnek: @hu
toolkit definition: Egy mű, amely magában foglalja egy családnak azt a felelősségét, amiért megemlékeznek róla. @hu
label: è dedicatario famiglia di opera di @it
definition: Correla una famiglia a un'opera che implica una responsabilità di una famiglia per essere commemorata. @it
toolkit label: dedicatario famiglia di opera di @it
toolkit definition: Opera che implica una responsabilità di una famiglia per essere commemorata. @it
label: είναι αποδέκτης αφιέρωσης οικογένεια του έργου του @el
toolkit label: είναι αποδέκτης αφιέρωσης οικογένεια του έργου του @el
label: est une famille dédicataire d’une œuvre de @fr
definition: Met une famille en relation avec une œuvre qui comporte une responsabilité de la part d’une famille consistant à être commémoré. @fr
toolkit label: famille dédicataire d’une œuvre de @fr
toolkit definition: Œuvre qui comporte une responsabilité de la part d’une famille consistant à être commémoré. @fr
label: ir veltījuma adresāts (dzimta/ģimene) darbā @lv
definition: Sasaista dzimtu/ģimeni ar darbu, kas ietver dzimtas/ģimenes atbildību par tai adresēto veltījumu. @lv
toolkit label: ir veltījuma adresāts (dzimta/ģimene) darbā @lv
toolkit definition: Darbs, kas ietver dzimtas/ģimenes atbildību par tai adresēto veltījumu. @lv
label: 是……的作品的被题献者家族 @zh-hans
definition: 将一个家族与涉及被纪念的一个家族的责任的一种作品关联起来。 @zh-hans
toolkit label: ……的作品的被题献者家族 @zh-hans
toolkit definition: 涉及被纪念的一个家族的责任的一种作品 @zh-hans
label: eserinin ithaf edilen ailesidir @tr
definition: Bir aileyi, bir ailenin anılma sorumluluğunu içeren bir eserle ilişkilendirir. @tr
toolkit label: eserin adandığı aile @tr
toolkit definition: Bir ailenin anılma sorumluluğunu içeren bir eser. @tr
has subproperty: P50988

kappaleen omistuksen kohde (henkilö) kappaleessa
status: Published
label: is dedicatee person of item of @en
lexical alias: dedicateePersonOfItemOf.en
definition: Relates a person to an item that acknowledges the inspiration or support of a person. @en
toolkit label: dedicatee person of item of @en
toolkit definition: An item that acknowledges the inspiration or support of a person. @en
type: Property
domain: C10004
has element type: 2
sub property of: henkilöön liittyvä kappale
sub property of: kappaleen omistuksen kohde (toimija) kappaleessa
definition: Liittää henkilön kappaleeseen, joka on omistettu henkilölle.
toolkit label: kappaleen omistuksen kohde (henkilö) kappaleessa
toolkit definition: Kappale, joka on omistettu henkilölle.
label: er tilegnet person for eksemplar for @no
definition: Relaterer en person til et eksemplar som anerkjenner inpirasjonen eller støttet fra en person. @no
toolkit label: tilegnet person for eksemplar for @no
toolkit definition: Et eksemplar som anerkjenner inpirasjonen eller støttet fra en person. @no
label: is opgedragene-persoon van item van @nl
definition: Relateert een persoon aan een item dat erkent de inspiratie of steun van een persoon. @nl
toolkit label: opgedragene-persoon van item van @nl
toolkit definition: Een item dat erkent de inspiratie of steun van een persoon. @nl
label: هو شخص مُهدى إليه مفردة لـ @ar
definition: يربط شخصا بمفردة تقر بالإلهام أو الدعم من شخص. @ar
toolkit label: شخص مُهدى إليه مفردة @ar
toolkit definition: مفردة تقر بالإلهام أو الدعم من شخص. @ar
label: és persona dedicatària d’un ítem de @ca
definition: Relaciona una persona amb un ítem que reconeix la inspiració i el suport d’una persona. @ca
toolkit label: persona dedicatària d’un ítem de @ca
toolkit definition: Ítem que reconeix la inspiració i el suport d’una persona. @ca
label: er person, som er tilegnet i eksemplar af @da
definition: Relaterer en person til et eksemplar, som anerkender inspirationen eller støtten fra en person. @da
toolkit label: person, som er tilegnet i eksemplar af @da
toolkit definition: Eksemplar, som anerkender inspirationen eller støtten fra en person. @da
label: eksemplari pühenduse saaja (isik) eksemplaris @et
definition: Seostab isiku eksemplariga, millega avaldatakse tänu isiku innustuse või toetuse eest. @et
toolkit label: eksemplari pühenduse saaja (isik) eksemplaris @et
toolkit definition: Eksemplar, millega avaldatakse tänu isiku innustuse või toetuse eest. @et
label: ist Person als Widmungsempfängerin/Widmungsempfänger eines Exemplars von @de
definition: Setzt eine Person in Beziehung zu einem Exemplar, das einer Person gewidmet ist. @de
toolkit label: Person als Widmungsempfängerin/Widmungsempfänger eines Exemplars von @de
toolkit definition: Ein Exemplar, das einer Person gewidmet ist. @de
label: dedikált személye a következő példánynak: @hu
definition: Hozzákapcsol egy személyt egy példányhoz, amely méltatja egy személy ösztönzését vagy támogatását. @hu
toolkit label: dedikált személye a következő példánynak: @hu
toolkit definition: Egy példány, amely méltatja egy személy ösztönzését vagy támogatását. @hu
label: è dedicatario persona di item di @it
definition: Correla una persona a un item che attesta l'ispirazione o il supporto di una persona. @it
toolkit label: dedicatario persona di item di @it
toolkit definition: Item che attesta l'ispirazione o il supporto di una persona. @it
label: είναι αποδέκτης αφιέρωσης φυσικό πρόσωπο του αντιτύπου του @el
toolkit label: αποδέκτης αφιέρωσης φυσικό πρόσωπο του αντιτύπου του @el
label: est une personne dédicataire d’un item de @fr
definition: Met une personne en relation avec un item qui reconnaît l’inspiration ou le soutien d’une personne. @fr
toolkit label: personne dédicataire d’un item de @fr
toolkit definition: Item qui reconnaît l’inspiration ou le soutien d’une personne. @fr
label: personai veltītā vienība @lv
definition: Sasaista personu ar vienību, kas ir veltījums personai. @lv
toolkit label: personai veltītā vienība @lv
toolkit definition: Vienība, kas ir veltījums personai. @lv
label: 是……的单件的被题献者个人 @zh-hans
definition: 将一个个人与对一个个人的启发或支持表示感谢的一个单件关联起来。 @zh-hans
toolkit label: ……的单件的被题献者个人 @zh-hans
toolkit definition: 对一个个人的启发或支持表示感谢的一个单件 @zh-hans
label: kopyasının ithaf edilen kişisidir @tr
definition: Bir kişiyi, kişinin esin kaynağı olduğu veya desteklediği bir kopyayla ilişkilendirir. @tr
toolkit label: kopyanın adandığı kişi @tr
toolkit definition: Bir kişinin ilhamını veya desteğini kabul eden bir kopya. @tr
has subproperty: P50627

teoksen omistuksen kohde (henkilö) teoksessa
status: Published
label: is dedicatee person of work of @en
lexical alias: dedicateePersonOfWorkOf.en
definition: Relates a person to a work that involves a responsibility of a person for being commemorated. @en
toolkit label: dedicatee person of work of @en
toolkit definition: A work that involves a responsibility of a person for being commemorated. @en
type: Property
domain: C10004
has element type: 2
sub property of: henkilöön liittyvä teos
sub property of: teoksen omistuksen kohde (toimija) teoksessa
definition: Liittää henkilön teokseen, joka on omistettu henkilölle.
toolkit label: teoksen omistuksen kohde (henkilö) teoksessa
toolkit definition: Teos, joka on omistettu henkilölle.
label: er person som verk er tilegnet til @no
definition: Relaterer en person til et verk som involverer et ansvar for en person i form av å bli hedret. @no
toolkit label: person som verk er tilegnet til @no
toolkit definition: Et verk som involverer et ansvar for en person i form av å bli hedret. @no
label: is opgedragene-persoon van werk van @nl
definition: Relateert een persoon aan een werk dat met zich meebrengt een verantwoordelijkheid van een persoon om herdacht te worden. @nl
toolkit label: opgedragene-persoon van werk van @nl
toolkit definition: Een werk dat met zich meebrengt een verantwoordelijkheid van een persoon om herdacht te worden. @nl
label: هو شخص مُهدى إليه عمل لـ @ar
definition: يربط شخصا بعمل يترتب عليه مسئولية شخص عن الاحتفال به. @ar
toolkit label: شخص مُهدى إليه عمل لـ @ar
toolkit definition: عمل يترتب عليه مسئولية شخص عن الاحتفال به. @ar
label: és persona dedicatària d’una obra de @ca
definition: Relaciona una persona amb una obra que implica una responsabilitat d’una persona de ser commemorat. @ca
toolkit label: persona dedicatària d’una obra de @ca
toolkit definition: Obra que implica una responsabilitat d’una persona de ser commemorat. @ca
label: er person, som er tilegnet i værk af @da
definition: Relaterer en person til et værk, som involverer en persons ansvar for at blive fejret. @da
toolkit label: person, som er tilegnet i værk af @da
toolkit definition: Værk, som involverer en persons ansvar for at blive fejret. @da
label: teose pühenduse saaja (isik) teoses @et
definition: Seostab isiku teosega, mis on isikule pühendatud. @et
toolkit label: teose pühenduse saaja (isik) teoses @et
toolkit definition: Teos, mis on isikule pühendatud. @et
label: ist Person als Widmungsempfängerin/Widmungsempfänger eines Werks von @de
definition: Setzt eine Person in Beziehung zu einem Werk, das einer Person gewidmet ist. @de
toolkit label: Person als Widmungsempfängerin/Widmungsempfänger eines Werks von @de
toolkit definition: Ein Werk, das einer Person gewidmet ist. @de
label: dedikált személye a következő műnek: @hu
definition: Hozzákapcsol egy személyt egy műhöz, amely magában foglalja egy személynek azt a felelősségét, amiért megemlékeznek róla. @hu
toolkit label: dedikált személye a következő műnek: @hu
toolkit definition: Egy mű, amely magában foglalja egy személynek azt a felelősségét, amiért megemlékeznek róla. @hu
label: è dedicatario persona di opera di @it
definition: Correla una persona a un'opera che implica una responsabilità di una persona per essere commemorata. @it
toolkit label: dedicatario persona di opera di @it
toolkit definition: Opera che implica una responsabilità di una persona per essere commemorata. @it
label: είναι αποδέκτης αφιέρωσης φυσικό πρόσωπο του έργου του @el
toolkit label: αποδέκτης αφιέρωσης φυσικό πρόσωπο του έργου του @el
label: est une personne dédicataire d’une œuvre de @fr
definition: Met une personne en relation avec une œuvre qui comporte une responsabilité de la part d’une personne consistant à être commémoré. @fr
toolkit label: personne dédicataire d’une œuvre de @fr
toolkit definition: Œuvre qui comporte une responsabilité de la part d’une personne consistant à être commémoré. @fr
label: ir veltījuma adresāts (persona) darbā @lv
definition: Sasaista personu ar darbu, kas ietver personas atbildību par tai adresēto veltījumu. @lv
toolkit label: ir veltījuma adresāts (persona) darbā @lv
toolkit definition: Darbs, kas ietver personas atbildību par tai adresēto veltījumu. @lv
label: 是……的作品的被题献者个人 @zh-hans
definition: 将一个个人与涉及被纪念的一个个人的责任的一种作品关联起来。 @zh-hans
toolkit label: ……的作品的被题献者个人 @zh-hans
toolkit definition: 涉及被纪念的一个个人的责任的一种作品 @zh-hans
label: eserinin ithaf edilen kişisidir @tr
definition: Bir kişiyi, anılması gereken bir sorumluluğunu içeren bir eserle ilişkilendirir. @tr
toolkit label: eserin adandığı kişi @tr
toolkit definition: Bir kişinin anılma sorumluluğunu içeren bir eser. @tr
has subproperty: P50535

omistuskirjoituksen tekijä (toimija) teoksessa
status: Published
label: is dedicator agent of @en
definition: Relates an agent to a work that is assigned as an acknowledgment of the inspiration or support of a related agent. @en
type: Property
domain: C10002
sub property of: toimijaan liittyvä teos
lexical alias: dedicatorAgentOf.en
label: est un agent dédicateur d’une œuvre de @fr
definition: Met un agent en relation avec une œuvre qui est dédiée en reconnaissance de l’inspiration ou du soutien d’un agent en relation. @fr
toolkit label: agent dédicateur d’une œuvre de @fr
toolkit definition: Œuvre qui est dédiée en reconnaissance de l’inspiration ou du soutien d’un agent en relation. @fr
toolkit label: dedicator agent of @en
toolkit definition: A work that is assigned as an acknowledgment of the inspiration or support of a related agent. @en
instruction number: 18.5
label: είναι αφιερωτής φορέας του @el
definition: Συνδέει έναν φορέα, από τον οποίο δημιουργείται η αφιέρωση, με ένα έργο. @el
toolkit label: αφιερωτής φορέας του @el
toolkit definition: Ένα έργο που είναι αφιερωμένο σε έναν φορέα. @el
definition: Setzt einen Akteur in Beziehung zu einem Werk, das als Zeichen der Anerkennung oder Unterstützung einem in Beziehung stehenden Akteur gewidmet ist. @de
toolkit label: Akteur als Widmende/Widmender von @de
toolkit definition: Ein Werk, das als Zeichen der Anerkennung oder Unterstützung einem in Beziehung stehenden Akteur gewidmet ist. @de
label: er agent, som er dedikationsskriver af @da
definition: Relaterer en agent til et værk, som er tilegnet en relateret agent, som en anerkendelse af inspiration eller støtte. @da
toolkit label: agent, som er dedikationsskriver af @da
toolkit definition: Værk, som er tilegnet en relateret agent, som en anerkendelse af inspiration eller støtte. @da
label: és agent dedicant de @ca
definition: Relaciona un agent amb una obra que s’assigna com a reconeixement per la inspiració o suport d’un agent relacionat. @ca
toolkit label: agent dedicant de @ca
toolkit definition: Obra que s’assigna com a reconeixement per la inspiració o suport d’un agent relacionat. @ca
definition: Liittää toimijan teokseen, joka on omistettu sitä innoittaneelle tai tukeneelle toimijalle.
toolkit label: omistuskirjoituksen tekijä (toimija) teoksessa
toolkit definition: Teos, joka on omistettu sitä innoittaneelle tai tukeneelle toimijalle.
toolkit label: agent som dediserer for @no
toolkit definition: Et verk som er tilegnet som anerkjennelse for inspirasjonen eller støtten fra en relatert agent. @no
label: ist Akteur als Widmende/Widmender von @de
has element type: 2
label: dedikáló ágense a következőnek: @hu
definition: Hozzákapcsol egy ágenst egy műhöz, amelyet egy műhöz kapcsolódó ágens ösztönzésének vagy támogatásának köszöneteként jelölnek meg. @hu
toolkit label: dedikáló ágense: @hu
toolkit definition: Egy mű, amelyet egy műhöz kapcsolódó ágens ösztönzésének vagy támogatásának köszöneteként jelölnek meg. @hu
alternative label: dedicator of @en
alternative label: omistuskirjoitus kappaleessa
label: er agent som dediserer for @no
definition: Relaterer en agent til et verk som er tilegnet som anerkjennelse for inspirasjonen eller støtten fra en relatert agent. @no
alternative label: dedikatør for @no
label: is opdrager-actor van @nl
definition: Relateert een actor aan een werk dat toegekend is als erkenning van de inspiratie of hulp van een gerelateerde actor. @nl
toolkit label: opdrager-actor van @nl
toolkit definition: Een werk dat toegekend is als erkenning van de inspiratie of hulp van een gerelateerde actor. @nl
label: هو وكيل مُهدي كتاب لـ @ar
definition: يربط وكيلا بعمل خُصص للإقرار بالإلهام أو الدعم الذي قدمه وكيل ذو صلة. @ar
alternative label: مُهدي كتاب @ar
toolkit label: وكيل مُهدي كتاب @ar
toolkit definition: عمل خُصص للإقرار بالإلهام أو الدعم الذي قدمه وكيل ذو صلة. @ar
alternative label: dedicant de @ca
alternative label: tilegner af @da
label: pühendaja (tegija) teoses @et
definition: Seostab tegija teosega, mille seotud tegija on pühendanud kellelegi tänuavaldusena innustuse või toetuse eest. @et
alternative label: pühendaja teoses @et
toolkit label: pühendaja (tegija) teoses @et
toolkit definition: Teos, mille seotud tegija on pühendanud kellelegi tänuavaldusena innustuse või toetuse eest. @et
alternative label: dedikálója: @hu
label: è dedicante agente di @it
definition: Correla un agente a un'opera che è assegnata come riconoscimento di ispirazione o sostegno di un agente correlato. @it
alternative label: dedicatore di @it
toolkit label: dedicante agente di @it
toolkit definition: Opera che è assegnata come riconoscimento di ispirazione o sostegno di un agente correlato. @it
alternative label: αφιερωτής του @el
alternative label: dédicateur de @fr
label: ir darba veltītājs (aģents) @lv
definition: Sasaista aģentu ar darbu, kas ir veltīts pateicībā par saistītā aģenta iedvesmojumu vai atbalstu. @lv
toolkit label: ir darba veltītājs (aģents) @lv
toolkit definition: Darbs, kas ir veltīts pateicībā par saistītā aģenta iedvesmojumu vai atbalstu. @lv
alternative label: Widmende/Widmender von @de
alternative label: ……的题献者 @zh-hans
toolkit label: ……的题献者行为者 @zh-hans
toolkit definition: 被指定对一个相关行为者的启发或支持之感谢的一种作品 @zh-hans
toolkit label: adayan temsilci @tr
toolkit definition: İlgili bir temsilcinin ilhamı veya desteğinin bir teşekkürü olarak atanan bir eser. @tr
has subproperty: omistuskirjoituksen tekijä (yhteistoimija) teoksessa

omistuskirjoituksen tekijä (yhteistoimija) teoksessa
status: Published
label: is dedicator collective agent of @en
lexical alias: dedicatorCollectiveAgentOf.en
definition: Relates a collective agent to a work that is assigned as an acknowledgment of the inspiration or support of a related collective agent. @en
toolkit label: dedicator collective agent of @en
toolkit definition: A work that is assigned as an acknowledgment of the inspiration or support of a related collective agent. @en
type: Property
domain: C10011
has element type: 2
sub property of: yhteistoimijaan liittyvä teos
sub property of: omistuskirjoituksen tekijä (toimija) teoksessa
definition: Liittää yhteistoimijan teokseen, joka on omistettu sitä innoittaneelle tai tukeneelle yhteistoimijalle.
toolkit label: omistuskirjoituksen tekijä (yhteistoimija) teoksessa
toolkit definition: Teos, joka on omistettu sitä innoittaneelle tai tukeneelle yhteistoimijalle.
label: er dediserende kollektiv agent av @no
definition: Relaterer en kollektiv agent til et verk som er tilegnet som en anerkjennelse for inspirasjonen eller støtten fra en relatert kollektiv agent. @no
toolkit label: dediserende kollektiv agent av @no
toolkit definition: Et verk som er tilegnet som en anerkjennelse for inspirasjonen eller støtten fra en relatert kollektiv agent. @no
label: is opdrager-collectieve actor van @nl
definition: Relateert een collectieve actor aan een werk dat toegekend is als erkenning van de inspiratie of hulp van een gerelateerde collectieve actor. @nl
toolkit label: opdrager-collectieve actor van @nl
toolkit definition: Een werk dat toegekend is als erkenning van de inspiratie of hulp van een gerelateerde collectieve actor. @nl
label: هو وكيل جماعي مُهدي كتاب لـ @ar
definition: يربط وكيلا جماعيا بعمل تم تعيينه كإقرار بالإلهام أو الدعم لوكيل جماعي ذي الصلة. @ar
toolkit label: وكيل جماعي مُهدي كتاب @ar
toolkit definition: عمل تم تعيينه كإقرار بالإلهام أو الدعم لوكيل جماعي ذي الصلة. @ar
label: és agent col·lectiu dedicant de @ca
definition: Relaciona un agent col·lectiu amb una obra que s’assigna com a reconeixement per la inspiració o suport d’un agent col·lectiu relacionat. @ca
toolkit label: agent col·lectiu dedicant de @ca
toolkit definition: Obra que s’assigna com a reconeixement per la inspiració o suport d’un agent col·lectiu relacionat. @ca
label: er kollektiv agent, som er dedikationsskriver af @da
definition: Relaterer en kollektiv agent til et værk, som er tilegnet en relateret kollektiv agent, som en anerkendelse af inspiration eller støtte. @da
toolkit label: kollektiv agent, som er dedikationsskriver af @da
toolkit definition: Værk, som er tilegnet en relateret kollektiv agent, som en anerkendelse af inspiration eller støtte. @da
label: pühendaja (kollektiiv) teoses @et
definition: Seostab kollektiivi teosega, mille seotud kollektiiv on pühendanud kellelegi tänuavaldusena innustuse või toetuse eest. @et
toolkit label: pühendaja (kollektiiv) teoses @et
toolkit definition: Teos, mille seotud kollektiiv on pühendanud kellelegi tänuavaldusena innustuse või toetuse eest. @et
label: ist gemeinschaftlicher Akteur als Widmende/Widmender von @de
definition: Setzt einen gemeinschaftlichen Akteur in Beziehung zu einem Werk, das als Zeichen der Anerkennung oder Unterstützung einem in Beziehung stehenden gemeinschaftlichen Akteur gewidmet ist. @de
toolkit label: Gemeinschaftlicher Akteur als Widmende/Widmender von @de
toolkit definition: Ein Werk, das als Zeichen der Anerkennung oder Unterstützung einem in Beziehung stehenden gemeinschaftlichen Akteur gewidmet ist. @de
label: dedikáló kollektív ágense a következőnek: @hu
definition: Hozzákapcsol egy kollektív ágenst egy műhöz, amelyet egy műhöz kapcsolódó kollektív ágens ösztönzésének vagy támogatásának köszöneteként jelölnek meg. @hu
toolkit label: dedikáló kollektív ágense: @hu
toolkit definition: Egy mű, amelyet egy műhöz kapcsolódó kollektív ágens ösztönzésének vagy támogatásának köszöneteként jelölnek meg. @hu
label: è dedicante agente collettivo di @it
definition: Correla un agente collettivo a un'opera assegnata come riconoscimento dell'ispirazione o supporto di un agente collettivo correlato. @it
toolkit label: dedicante agente collettivo di @it
toolkit definition: Opera assegnata come riconoscimento dell'ispirazione o supporto di un agente collettivo correlato. @it
label: είναι αφιερωτής συλλογικός φορέας του @el
toolkit label: αφιερωτής συλλογικός φορέας του @el
label: est un agent collectif dédicateur d’une œuvre de @fr
definition: Met un agent collectif en relation avec une œuvre qui est dédiée en reconnaissance de l’inspiration ou du soutien d’un agent collectif en relation. @fr
toolkit label: agent collectif dédicateur d’une œuvre de @fr
toolkit definition: Œuvre qui est dédiée en reconnaissance de l’inspiration ou du soutien d’un agent collectif en relation. @fr
label: ir darba veltītājs (grupa) @lv
definition: Sasaista grupu ar darbu, kas ir veltīts pateicībā par saistītās grupas iedvesmojumu vai atbalstu. @lv
toolkit label: ir darba veltītājs (grupa) @lv
toolkit definition: Darbs, kas ir veltīts pateicībā par saistītās grupas iedvesmojumu vai atbalstu. @lv
label: 是……的题献者集体行为者 @zh-hans
definition: 将一个集体行为者与被指定对一个相关集体行为者的启发或支持之感谢的一种作品关联起来。 @zh-hans
toolkit label: ……的题献者集体行为者 @zh-hans
toolkit definition: 被指定对一个相关集体行为者的启发或支持之感谢的一种作品 @zh-hans
label: ithaf eden kolektif temsilcisidir @tr
definition: Kolektif bir temsilciyi, ilgili bir kolektif temsilcinin ilhamının veya desteğinin kabulü olarak atanan bir eserle ilişkilendirir. @tr
toolkit label: adayan kolektif temsilci @tr
toolkit definition: İlgili bir kollektif temsilcinin ilhamının veya desteğinin bir teşekkürü olarak atanan bir eser. @tr
has subproperty: omistuskirjoituksen tekijä (yhteisö) teoksessa
has subproperty: omistuskirjoituksen tekijä (suku) teoksessa
has subproperty: P50717

omistuskirjoituksen tekijä (yhteisö) teoksessa
status: Published
label: is dedicator corporate body of @en
lexical alias: dedicatorCorporateBodyOf.en
definition: Relates a corporate body to a work that is assigned as an acknowledgment of the inspiration or support of a related corporate body. @en
toolkit label: dedicator corporate body of @en
toolkit definition: A work that is assigned as an acknowledgment of the inspiration or support of a related corporate body. @en
type: Property
domain: C10005
has element type: 2
sub property of: teoksen tekijä (yhteisö) teoksessa
sub property of: omistuskirjoituksen tekijä (yhteistoimija) teoksessa
definition: Liittää yhteisön teokseen, joka on omistettu sitä innoittaneelle tai tukeneelle yhteisölle.
toolkit label: omistuskirjoituksen tekijä (yhteisö) teoksessa
toolkit definition: Teos, joka on omistettu sitä innoittaneelle tai tukeneelle yhteisölle.
label: er dediserende korporasjon av @no
definition: Relaterer en korporasjon til et verk som er tilegnet som en anerkjennelse for inspirasjonen eller støtten fra en relatert korporasjon. @no
toolkit label: dediserende korporasjon av @no
toolkit definition: Et verk som er tilegnet som en anerkjennelse for inspirasjonen eller støtten fra en relatert korporasjon. @no
label: is opdrager-corporatie van @nl
definition: Relateert een corporatie aan een werk dat toegekend is als erkenning van de inspiratie of hulp van een gerelateerde corporatie. @nl
toolkit label: opdrager-corporatie van @nl
toolkit definition: Een werk dat toegekend is als erkenning van de inspiratie of hulp van een gerelateerde corporatie. @nl
label: هي هيئة مسئولة عن إهداء كتاب لـ @ar
definition: يربط هيئة بعمل تم تعيينه كإقرار بالإلهام أو الدعم لهيئة مرتبطة . @ar
toolkit label: هيئة مسئولة عن إهداء كتاب @ar
toolkit definition: عمل تم تعيينه كإقرار بالإلهام أو الدعم لهيئة مرتبطة . @ar
label: és entitat corporativa dedicant de @ca
definition: Relaciona una entitat corporativa amb una obra que s’assigna com a reconeixement per la inspiració o suport d’una entitat corporativa relacionada. @ca
toolkit label: entitat corporativa dedicant de @ca
toolkit definition: Obra que s’assigna com a reconeixement per la inspiració o suport d’una entitat corporativa relacionada. @ca
label: er korporation, som er dedikationsskriver af @da
definition: Relaterer en korporation til et værk, som er tilegnet en relateret korporation, som en anerkendelse af inspiration eller støtte. @da
toolkit label: korporation, som er dedikationsskriver af @da
toolkit definition: Værk, som er tilegnet en relateret korporation, som en anerkendelse af inspiration eller støtte. @da
label: pühendaja (asutus) teoses @et
definition: Seostab asutuse teosega, mille seotud asutus on pühendanud kellelegi tänuavaldusena innustuse või toetuse eest. @et
toolkit label: pühendaja (asutus) teoses @et
toolkit definition: Teos, mille seotud asutus on pühendanud kellelegi tänuavaldusena innustuse või toetuse eest. @et
label: ist Körperschaft als Widmende/Widmender von @de
definition: Setzt eine Körperschaft in Beziehung zu einem Werk, das als Zeichen der Anerkennung der Inspiration oder Unterstützung einer in Beziehung stehenden Körperschaft gewidmet ist. @de
toolkit label: Körperschaft als Widmende/Widmender von @de
toolkit definition: Ein Werk, das als Zeichen der Anerkennung der Inspiration oder Unterstützung einer in Beziehung stehenden Körperschaft gewidmet ist. @de
label: dedikáló testülete a következőnek: @hu
definition: Hozzákapcsol egy testületet egy műhöz, amelyet egy műhöz kapcsolódó testület ösztönzésének vagy támogatásának köszöneteként jelölnek meg. @hu
toolkit label: dedikáló testülete: @hu
toolkit definition: Egy mű, egy műhöz kapcsolódó testület ösztönzésének vagy támogatásának köszöneteként jelölnek meg. @hu
label: è dedicante ente di @it
definition: Correla un ente a un'opera assegnata come riconoscimento dell'ispirazione o supporto di un ente correlato. @it
toolkit label: dedicante ente di @it
toolkit definition: Opera assegnata come riconoscimento dell'ispirazione o supporto di un ente correlato. @it
label: αφιερωτής συλλογικό όργανο του @el
toolkit label: αφιερωτής συλλογικό όργανο του @el
label: est une collectivité dédicatrice d’une œuvre de @fr
definition: Met une collectivité en relation avec une œuvre qui est dédiée en reconnaissance de l’inspiration ou du soutien d’une collectivité en relation. @fr
toolkit label: collectivité dédicatrice d’une œuvre de @fr
toolkit definition: Œuvre qui est dédiée en reconnaissance de l’inspiration ou du soutien d’une collectivité en relation. @fr
label: ir darba veltītājs (institūcija) @lv
definition: Sasaista institūciju ar darbu, kas ir veltīts pateicībā par saistītās institūcijas iedvesmojumu vai atbalstu. @lv
toolkit label: ir darba veltītājs (institūcija) @lv
toolkit definition: Darbs, kas ir veltīts pateicībā par saistītās institūcijas iedvesmojumu vai atbalstu. @lv
label: 是……的题献者团体 @zh-hans
definition: 将一个团体与被指定对一个相关团体的启发或支持之感谢的一种作品关联起来。 @zh-hans
toolkit label: ……的题献者团体 @zh-hans
toolkit definition: 被指定对一个相关团体的启发或支持之感谢的一种作品 @zh-hans
label: ithaf eden tüzel kişisidir @tr
definition: Bir tüzel kişiyi, ilgili bir tüzel kişinin ilham veya desteğinin kabulü olarak atanan bir eserle ilişkilendirir. @tr
toolkit label: adayan tüzel kişi @tr
toolkit definition: İlgili bir tüzel kişinin ilhamının veya desteğinin bir teşekkürü olarak atanan bir eser. @tr
has subproperty: P50868

omistuskirjoituksen tekijä (suku) teoksessa
status: Published
label: is dedicator family of @en
lexical alias: dedicatorFamilyOf.en
definition: Relates a family to a work that is assigned as an acknowledgment of the inspiration or support of a related family. @en
toolkit label: dedicator family of @en
toolkit definition: A work that is assigned as an acknowledgment of the inspiration or support of a related family. @en
type: Property
domain: C10008
has element type: 2
sub property of: sukuun liittyvä teos
sub property of: omistuskirjoituksen tekijä (yhteistoimija) teoksessa
definition: Liittää suvun teokseen, joka on omistettu sitä innoittaneelle tai tukeneelle suvulle.
toolkit label: omistuskirjoituksen tekijä (suku) teoksessa
toolkit definition: Teos, joka on omistettu sitä innoittaneelle tai tukeneelle suvulle.
label: er dediserende familie av @no
definition: Relaterer en familie til et verk som er tilegnet som en anerkjennelse for inspirasjonen eller støtten fra en relatert familie. @no
toolkit label: dediserende familie av @no
toolkit definition: Et verk som er tilegnet som en anerkjennelse for inspirasjonen eller støtten fra en relatert familie. @no
label: is opdrager-familie van @nl
definition: Relateert een familie aan een werk dat toegekend is als erkenning van de inspiratie of hulp van een gerelateerde familie. @nl
toolkit label: opdrager-familie van @nl
toolkit definition: Een werk dat toegekend is als erkenning van de inspiratie of hulp van een gerelateerde familie. @nl
label: هي عائلة مسئولة عن إهداء كتاب لـ @ar
definition: يربط عائلة بعمل تم تعيينه كإقرار بالإلهام أو الدعم لعائلة مرتبطة . @ar
toolkit label: عائلة مسئولة عن إهداء كتاب @ar
toolkit definition: عمل تم تخصيصه كإقرار بالإلهام أو الدعم لعائلة مرتبطة . @ar
label: és família dedicant de @ca
definition: Relaciona una família amb una obra que s’assigna com a reconeixement per la inspiració o suport d’una família relacionada. @ca
toolkit label: família dedicant de @ca
toolkit definition: Obra que s’assigna com a reconeixement per la inspiració o suport d’una família relacionada. @ca
label: er familie, som er dedikationsskriver af @da
definition: Relaterer en familie til et værk, som er tilegnet en relateret familie, som en anerkendelse af inspiration eller støtte. @da
toolkit label: familie, som er dedikationsskriver af @da
toolkit definition: Værk, som er tilegnet en relateret familie, som en anerkendelse af inspiration eller støtte. @da
label: pühendaja (perekond) teoses @et
definition: Seostab perekonna teosega, mille seotud perekond on pühendanud kellelegi tänuavaldusena innustuse või toetuse eest. @et
toolkit label: pühendaja (perekond) teoses @et
toolkit definition: Teos, mille seotud perekond on pühendanud kellelegi tänuavaldusena innustuse või toetuse eest. @et
label: ist Familie als Widmende/Widmender von @de
definition: Setzt eine Familie in Beziehung zu einem Werk, das als Zeichen der Anerkennung oder Unterstützung einer in Beziehung stehenden Familie gewidmet ist. @de
toolkit label: Familie als Widmende/Widmender von @de
toolkit definition: Ein Werk, das als Zeichen der Anerkennung oder Unterstützung einer in Beziehung stehenden Familie gewidmet ist. @de
label: dedikáló családja a következőnek: @hu
definition: Hozzákapcsol egy családot egy műhöz, amelyet egy műhöz kapcsolódó család ösztönzésének vagy támogatásának köszöneteként jelölnek meg. @hu
toolkit label: dedikáló családja: @hu
toolkit definition: Egy mű, amelyet egy műhöz kapcsolódó család ösztönzésének vagy támogatásának köszöneteként jelölnek meg. @hu
label: è dedicante famiglia di @it
definition: Correla una famiglia a un'opera assegnata come riconoscimento dell'ispirazione o supporto di una famiglia correlata. @it
toolkit label: dedicante famiglia di @it
toolkit definition: Opera assegnata come riconoscimento dell'ispirazione o supporto di una famiglia correlata. @it
label: είναι αφιερωτής οικογένεια του @el
toolkit label: αφιερωτής οικογένεια του @el
label: est une famille dédicatrice d’une œuvre de @fr
definition: Met une famille en relation avec une œuvre qui est dédiée en reconnaissance de l’inspiration ou du soutien d’une famille en relation. @fr
toolkit label: famille dédicatrice d’une œuvre de @fr
toolkit definition: Œuvre qui est dédiée en reconnaissance de l’inspiration ou du soutien d’une famille en relation. @fr
label: ir darba veltītājs (dzimta/ģimene) @lv
definition: Sasaista dzimtu/ģimeni ar darbu, kas ir veltīts pateicībā par saistītās dzimtas/ģimenes iedvesmojumu vai atbalstu. @lv
toolkit label: ir darba veltītājs (dzimta/ģimene) @lv
toolkit definition: Darbs, kas ir veltīts pateicībā par saistītās dzimtas/ģimenes iedvesmojumu vai atbalstu. @lv
label: 是……的题献者家族 @zh-hans
definition: 将一个家族与被指定对一个相关家族的启发或支持之感谢的一种作品关联起来。 @zh-hans
toolkit label: ……的题献者家族 @zh-hans
toolkit definition: 被指定对一个相关家族的启发或支持之感谢的一种作品 @zh-hans
label: ithaf eden ailesidir @tr
definition: Bir aileyi, ilgili bir ailenin ilhamı veya desteğini tanıma olarak atanan bir eserle ilişkilendirir. @tr
toolkit label: adayan aile @tr
toolkit definition: İlgili bir ailenin ilhamının veya desteğinin bir teşekkürü olarak atanan bir eser. @tr
has subproperty: P51019

omistuskirjoituksen tekijä (henkilö) teoksessa
status: Published
label: is dedicator person of @en
lexical alias: dedicatorPersonOf.en
definition: Relates a person to a work that is assigned as an acknowledgment of the inspiration or support of a related person. @en
toolkit label: dedicator person of @en
toolkit definition: A work that is assigned as an acknowledgment of the inspiration or support of a related person. @en
type: Property
domain: C10004
has element type: 2
sub property of: henkilöön liittyvä teos
sub property of: omistuskirjoituksen tekijä (toimija) teoksessa
definition: Liittää henkilön teokseen, joka on omistettu sitä innoittaneelle tai tukeneelle henkilölle.
toolkit label: omistuskirjoituksen tekijä (henkilö) teoksessa
toolkit definition: Teos, joka on omistettu sitä innoittaneelle tai tukeneelle henkilölle.
label: er dediserende person av @no
definition: Relaterer en person til et verk som er tilegnet som en anerkjennelse for inspirasjonen eller støtten fra en relatert person. @no
toolkit label: dediserende person av @no
toolkit definition: Et verk som er tilegnet som en anerkjennelse for inspirasjonen eller støtten fra en relatert person. @no
label: is opdrager-persoon van @nl
definition: Relateert een persoon aan een werk dat toegekend is als erkenning van de inspiratie of hulp van een gerelateerde persoon. @nl
toolkit label: opdrager-persoon van @nl
toolkit definition: Een werk dat toegekend is als erkenning van de inspiratie of hulp van een gerelateerde persoon. @nl
label: هو شخص مُهدي كتاب لـ @ar
definition: يربط شخصا بعمل تم تخصيصه كإقرار بالإلهام أو الدعم لشخص ذي الصلة. @ar
toolkit label: شخص مُهدي كتاب @ar
toolkit definition: عمل تم تخصيصه كإقرار بالإلهام أو الدعم لشخص ذي الصلة. @ar
label: és persona dedicant de @ca
definition: Relaciona una persona amb una obra que s’assigna com a reconeixement per la inspiració o suport d’una persona relacionada. @ca
toolkit label: persona dedicant de @ca
toolkit definition: Obra que s’assigna com a reconeixement per la inspiració o suport d’una persona relacionada. @ca
label: er person, som er dedikationsskriver af @da
definition: Relaterer en person til et værk, som er tilegnet en relateret person, som en anerkendelse af inspiration eller støtte. @da
toolkit label: person, som er dedikationsskriver af @da
toolkit definition: Værk, som er tilegnet en relateret person, som en anerkendelse af inspiration eller støtte. @da
label: pühendaja (isik) teoses @et
definition: Seostab isiku teosega, mille seotud isik on pühendanud kellelegi tänuavaldusena innustuse või toetuse eest. @et
toolkit label: pühendaja (isik) teoses @et
toolkit definition: Teos, mille seotud isik on pühendanud kellelegi tänuavaldusena innustuse või toetuse eest. @et
label: ist Person als Widmende/Widmender von @de
definition: Setzt eine Person in Beziehung zu einem Werk, das als Zeichen der Anerkennung oder Unterstützung einer in Beziehung stehenden Person gewidmet ist. @de
toolkit label: Person als Widmende/Widmender von @de
toolkit definition: Ein Werk, das als Zeichen der Anerkennung oder Unterstützung einer in Beziehung stehenden Person gewidmet ist. @de
label: dedikáló személye a következőnek: @hu
definition: Hozzákapcsol egy személyt egy műhöz, amelyet egy műhöz kapcsolódó személy ösztönzésének vagy támogatásának köszöneteként jelölnek meg. @hu
toolkit label: dedikáló személye: @hu
toolkit definition: Egy mű, amelyet egy műhöz kapcsolódó személy ösztönzésének vagy támogatásának köszöneteként jelölnek meg. @hu
label: è dedicante persona di @it
definition: Correla una persona a un'opera assegnata come riconoscimento dell'ispirazione o supporto di una persona correlata. @it
toolkit label: dedicante persona di @it
toolkit definition: Opera assegnata come riconoscimento dell'ispirazione o supporto di una persona correlata. @it
label: είναι αφιερωτής φυσικό πρόσωπο του @el
toolkit label: αφιερωτής φυσικό πρόσωπο του @el
label: est une personne dédicatrice d’une œuvre de @fr
definition: Met une personne en relation avec une œuvre qui est dédiée en reconnaissance de l’inspiration ou du soutien d’une personne en relation. @fr
toolkit label: personne dédicatrice d’une œuvre de @fr
toolkit definition: Œuvre qui est dédiée en reconnaissance de l’inspiration ou du soutien d’une personne en relation. @fr
label: ir darba veltītājs (persona) @lv
definition: Sasaista personu ar darbu, kas ir veltīts pateicībā par saistītās personas iedvesmojumu vai atbalstu. @lv
toolkit label: ir darba veltītājs (persona) @lv
toolkit definition: Darbs, kas ir veltīts pateicībā par saistītās personas iedvesmojumu vai atbalstu. @lv
label: 是……的题献者个人 @zh-hans
definition: 将一个个人与被指定对一个相关个人的启发或支持之感谢的一种作品关联起来。 @zh-hans
toolkit label: ……的题献者个人 @zh-hans
toolkit definition: 被指定对一个相关个人的启发或支持之感谢的一种作品 @zh-hans
label: ithaf eden kişidir @tr
definition: Bir kişiyi, ilgili bir kişinin ilhamı veya desteğinin bir göstergesi olarak atanan bir eserle ilişkilendirir. @tr
toolkit label: adayan kişi @tr
toolkit definition: İlgili bir kişinin ilhamının veya desteğinin bir teşekkürü olarak atanan bir eser. @tr
has subproperty: P50566

saatu haaste
status: Deprecated
type: Property
sub property of: muuna toimijana teoksessa
lexical alias: defendantOf.en
label: est un défendeur de @fr
definition: Met une personne ou collectivité qui est accusée dans une poursuite criminelle ou contre laquelle une poursuite civile est intentée en relation avec une œuvre. @fr
toolkit label: défendeur de @fr
toolkit definition: Œuvre qui comporte une responsabilité consistant à être une personne ou une collectivité accusée dans une poursuite criminelle ou contre laquelle une poursuite civile est intentée. @fr
instruction number: 18.5
label: είναι εναγόμενος του @el
definition: Συνδέει ένα φυσικό πρόσωπο ή συλλογικό όργανο, το οποίο έχει κατηγορηθεί σε μία ποινική διαδικασία ή έχει ασκηθεί αγωγή εναντίον του στο πλαίσιο αστικής διαδικασίας, με ένα έργο. @el
toolkit label: εναγόμενος του @el
toolkit definition: Ένα έργο που περιλαμβάνει την ευθύνη ενός φυσικού προσώπου ή συλλογικού οργάνου, το οποίο έχει κατηγορηθεί σε μία ποινική διαδικασία ή έχει ασκηθεί αγωγή εναντίον του στο πλαίσιο αστικής διαδικασίας. @el
definition: Setzt eine Person oder eine Körperschaft, die in einem Strafverfahren angeklagt oder in einem Zivilprozess verklagt ist, mit einem Werk in Beziehung. @de
toolkit label: Angeklagter/Beklagter von @de
toolkit definition: Ein Werk, bei dem eine Person oder eine Körperschaft in einem Strafverfahren angeklagt oder in einem Zivilprozess verklagt ist. @de
label: er sagsøgt af @da
definition: Relaterer en person eller korporation der er anklaget i en straffesag eller sagsøgt i en civil sag til et værk. @da
toolkit label: sagsøgt af @da
toolkit definition: Værk der involverer et ansvar for at være en person eller korporation anklaget i en straffesag eller sagsøgt i en civil sag. @da
label: és acusat de @ca
definition: Relaciona una persona o entitat corporativa, que és acusada en un procés penal o demandada en un procés civil, amb una obra. @ca
toolkit label: acusat de @ca
toolkit definition: Obra que involucra una responsabilitat de ser una persona o entitat corporativa acusada en un procés penal o demandada en un procés civil. @ca
definition: Liittää henkilön tai yhteisön teokseen, joka sisältää henkilöön tai yhteisöön kohdistuvan syytteen rikosoikeudenkäynnissä tai haasteen siviilioikeudenkäynnissä.
toolkit label: kohteena kanteessa
toolkit definition: Teos, joka sisältää henkilöön tai yhteisöön kohdistuvan syytteen rikosoikeudenkäynnissä tai haasteen siviilioikeudenkäynnissä.
toolkit label: saksøkte for @no
toolkit definition: Et verk som involverer et ansvar for å være en person eller korporasjon som er tiltalt i en straffesak eller saksøkt i en sivilrettslig sak. @no
label: ist Angeklagter/Beklagter von @de

tallettaja (toimija) kappaleessa
status: Published
label: is depositor agent of @en
definition: Relates an agent to an item that is deposited by an agent into the custody of another agent without transferring ownership. @en
type: Property
domain: C10002
sub property of: nykyinen omistaja (toimija) kappaleessa
lexical alias: depositorAgentOf.en
label: est un agent déposant de @fr
definition: Met un agent en relation avec un item qui est déposé par un agent sous la garde d’un autre agent sans que sa propriété ne soit transférée. @fr
toolkit label: agent déposant de @fr
toolkit definition: Item qui est déposé par un agent sous la garde d’un autre agent sans que sa propriété ne soit transférée. @fr
toolkit label: depositor agent of @en
toolkit definition: An item that is deposited by an agent into the custody of another agent without transferring ownership. @en
instruction number: 18.5
label: είναι καταθέτης φορέας του @el
definition: Συνδέει έναν τρέχοντα κάτοχο ενός αντιτύπου ο οποίος κατέθεσε το τεκμήριο υπό την επιμέλεια φύλαξης κάποιου άλλου φορέα, ενόσω διατηρεί ακόμη την ιδιοκτησία του αντιτύπου. @el
toolkit label: καταθέτης φορέας του @el
toolkit definition: Ένα αντίτυπο το οποίο κατατίθεται υπό την επιμέλεια φύλαξης άλλου φορέα, ενόσω ο καταθέτης διατηρεί την ιδιοκτησία. @el
definition: Setzt einen Akteur in Beziehung zu einem Exemplar, das von einem Akteur in die Obhut eines anderen Akteurs gegeben wird, ohne das Eigentumsrecht zu übertragen. @de
toolkit label: Akteur als Leihgeberin/Leihgeber von @de
toolkit definition: Ein Exemplar, das von einem Akteur in die Obhut eines anderen Akteurs gegeben wird, ohne das Eigentumsrecht zu übertragen. @de
label: er agent, som er udlåner af @da
definition: Relaterer en agent til et eksemplar, som er deponeret i forvaring af en agent hos en anden agent, men uden at overgive ejerskab. @da
toolkit label: agent, som er udlåner af @da
toolkit definition: eksemplar, som er deponeret i forvaring af en agent hos en anden agent, men uden at overgive ejerskab. @da
label: és agent dipositador de @ca
definition: Relaciona un agent amb un ítem que és dipositat per un agent sota la custòdia d’un altre agent sense transferir-li la propietat. @ca
toolkit label: agent dipositador de @ca
toolkit definition: Ítem que és dipositat per un agent sota la custòdia d’un altre agent sense transferir-li la propietat. @ca
definition: Liittää toimijan kappaleeseen, jonka toimija on luovuttanut toisen toimijan haltuun siirtämättä omistajuutta.
toolkit label: tallettaja (toimija) kappaleessa
toolkit definition: Kappale, jonka toimija on luovuttanut toisen toimijan haltuun siirtämättä omistajuutta.
toolkit label: deponent av (agent) @no
toolkit definition: Et eksemplar som av en agent er deponert til forvaring av en annen agent uten at eierskapet overføres. @no
label: ist Akteur als Leihgeberin/Leihgeber von @de
has element type: 2
label: letétbe helyező ágense a következőnek: @hu
definition: Hozzákapcsol egy ágenst egy példányhoz, amelyet egy másik ágens felügyelete alá helyez anélkül, hogy tulajdonjogot ruházna át. @hu
toolkit label: letétbe helyező ágense: @hu
toolkit definition: Egy példány, amelyet egy ágens egy másik ágens felügyelete alá helyez anélkül, hogy tulajdonjogot ruházna át. @hu
alternative label: depositor of @en
alternative label: deponointi
label: er deponent av (agent) @no
definition: Relaterer en agent til et eksemplar som av en agent er deponert til forvaring av en annen agent uten at eierskapet overføres. @no
alternative label: deponent av @no
label: is bruikleen-actor van @nl
definition: Relateert een actor aan een item dat door een actor in bewaring is gegeven bij een andere actor zonder overdracht van eigenaarschap. @nl
toolkit label: bruikleen-actor van @nl
toolkit definition: Een item dat door een actor in bewaring is gegeven bij een andere actor zonder overdracht van eigenaarschap. @nl
label: هو وكيل مودع لـ @ar
definition: يربط وكيلا بمفردة أودعها وكيل في عهدة وكيل آخر دون نقل الملكية. @ar
alternative label: مودع @ar
toolkit label: وكيل مودع لـ @ar
toolkit definition: مفردة أودعها وكيل في عهدة وكيل آخر دون نقل الملكية. @ar
alternative label: dipositador de @ca
alternative label: udlåner af @da
label: deponeerija (tegija) eksemplarile @et
definition: Seostab tegija eksemplariga, mille tegija on deponeerinud teise tegija vastutavale hoiule ilma omandiõiguse üleminekuta. @et
alternative label: deponeerija eksemplarile @et
toolkit label: deponeerija (tegija) eksemplarile @et
toolkit definition: Eksemplar, mille tegija on deponeerinud teise tegija vastutavale hoiule ilma omandiõiguse üleminekuta. @et
alternative label: letétbe helyezője: @hu
label: è depositante agente di @it
definition: Correla un agente a un item che è depositato da agente nella custodia di altro agente senza trasferimento della proprietà. @it
alternative label: depositante di @it
toolkit label: agente depositante di @it
toolkit definition: Item che èdepositato da agentedella custodia di altro agente senza trasferirne la proprietà. @it
alternative label: καταθέτης του @el
alternative label: déposant de @fr
label: ir deponētājs (aģents) @lv
definition: Sasaista aģentu ar vienību, ko aģents deponējis cita aģenta uzglabāšanā, vienlaikus saglabājot deponenta īpašumtiesības. @lv
toolkit label: ir deponētājs (aģents) @lv
toolkit definition: Vienība, ko aģents deponējis cita aģenta uzglabāšanā, vienlaikus saglabājot deponenta īpašumtiesības. @lv
alternative label: Leihgeber von @de
alternative label: ……的托存者 @zh-hans
toolkit label: ……的托存者行为者 @zh-hans
toolkit definition: 被一个行为者储存归另一个行为者保管而不转移所有权的一个单件 @zh-hans
toolkit label: mevduatçı temsilci @tr
toolkit definition: Bir temsilci tarafından mülkiyeti devretmeden başka bir temsilci gözetimine bırakılan bir kopya. @tr
has subproperty: tallettaja (yhteistoimija) kappaleessa

tallettaja (yhteistoimija) kappaleessa
status: Published
label: is depositor collective agent of @en
lexical alias: depositorCollectiveAgentOf.en
definition: Relates a collective agent to an item that is deposited by a collective agent into the custody of another agent without transferring ownership. @en
toolkit label: depositor collective agent of @en
toolkit definition: An item that is deposited by a collective agent into the custody of another agent without transferring ownership. @en
type: Property
domain: C10011
has element type: 2
sub property of: nykyinen omistaja (yhteistoimija) kappaleessa
sub property of: tallettaja (toimija) kappaleessa
definition: Liittää yhteistoimijan kappaleeseen, jonka yhteistoimija on luovuttanut toisen toimijan haltuun siirtämättä omistajuutta.
toolkit label: tallettaja (yhteistoimija) kappaleessa
toolkit definition: Kappale, jonka yhteistoimija on luovuttanut toisen toimijan haltuun siirtämättä omistajuutta.
label: er deponent for (kollektiv agent) @no
definition: Relaterer en kollektiv agent til et eksemplar som er deponert av en kollektiv agent til forvaring hos en annen agent uten at eierskapet blir overført. @no
toolkit label: deponent for (kollektiv agent) @no
toolkit definition: Et eksemplar som er deponert av en kollektiv agent til forvaring hos en annen agent uten at eierskapet blir overført. @no
label: is bruikleen-collectieve actor van @nl
definition: Relateert een collectieve actor aan een item dat door een collectieve actor in bewaring is gegeven bij een andere actor zonder overdracht van eigenaarschap. @nl
toolkit label: bruikleen-collectieve actor van @nl
toolkit definition: Een item dat door een collectieve actor in bewaring is gegeven bij een andere actor zonder overdracht van eigenaarschap. @nl
label: هو وكيل جماعي مودع لـ @ar
definition: يربط وكيلا جماعيا بمفردة تم إيداعها بمعرفة وكيل جماعي في عهدة وكيل آخر دون نقل الملكية. @ar
toolkit label: وكيل جماعي مودع @ar
toolkit definition: مفردة تم إيداعها بمعرفة وكيل جماعي في عهدة وكيل آخر دون نقل الملكية. @ar
label: és agent col·lectiu dipositador de @ca
definition: Relaciona un agent col·lectiu amb un ítem que és dipositat per un agent col·lectiu sota la custòdia d’un altre agent col·lectiu sense transferir-li la propietat. @ca
toolkit label: agent col·lectiu dipositador de @ca
toolkit definition: Ítem que és dipositat per un agent col·lectiu sota la custòdia d’un altre agent col·lectiu sense transferir-li la propietat. @ca
label: er kollektiv agent, som er udlåner af @da
definition: Relaterer en kollektiv agent til et eksemplar, som er deponeret i forvaring af en kollektiv agent hos en anden agent, men uden at overgive ejerskab. @da
toolkit label: kollektiv agent, som er udlåner af @da
toolkit definition: Eksemplar, som er deponeret i forvaring af en kollektiv agent hos en anden agent, men uden at overgive ejerskab. @da
label: deponeerija (kollektiiv) eksemplarile @et
definition: Seostab kollektiivi eksemplariga, mille kollektiiv on deponeerinud teise tegija vastutavale hoiule ilma omandiõiguse üleminekuta. @et
toolkit label: deponeerija (kollektiiv) eksemplarile @et
toolkit definition: Eksemplar, mille kollektiiv on deponeerinud teise tegija vastutavale hoiule ilma omandiõiguse üleminekuta. @et
label: ist gemeinschaftlicher Akteur als Leihgeberin/Leihgeber von @de
definition: Setzt einen gemeinschaftlichen Akteur in Beziehung zu einem Exemplar, das von einem gemeinschaftlichen Akteur in die Obhut eines anderen Akteurs gegeben wird, ohne das Eigentumsrecht zu übertragen. @de
toolkit label: Gemeinschaftlicher Akteur als Leihgeberin/Leihgeber von @de
toolkit definition: Ein Exemplar, das von einem gemeinschaftlichen Akteur in die Obhut eines anderen Akteurs gegeben wird, ohne das Eigentumsrecht zu übertragen. @de
label: letétbe helyező kollektív ágense a következőnek: @hu
definition: Hozzákapcsol egy kollektív ágenst egy példányhoz, amelyet egy kollektív ágens egy másik ágens felügyelete alá helyez anélkül, hogy a tulajdonjogot átruházná. @hu
toolkit label: letétbe helyező kollektív ágense: @hu
toolkit definition: Egy példány, amelyet egy kollektív ágens egy másik ágens felügyelete alá helyez anélkül, hogy a tulajdonjogot átruházná. @hu
label: è depositante agente collettivo di @it
definition: Correla un agente collettivo a un item depositato da un agente collettivo in custodia di un altro agente senza trasferire la proprietà. @it
toolkit label: depositante agente collettivo di @it
toolkit definition: Item depositato da un agente collettivo in custodia di un altro agente senza trasferire la proprietà. @it
label: είναι καταθέτης συλλογικός φορέας του @el
toolkit label: καταθέτης συλλογικός φορέας του @el
label: est un agent collectif déposant de @fr
definition: Met un agent collectif en relation avec un item qui est déposé par un agent collectif sous la garde d’un autre agent sans que sa propriété ne soit transférée. @fr
toolkit label: agent collectif déposant de @fr
toolkit definition: Item qui est déposé par un agent collectif sous la garde d’un autre agent sans que sa propriété ne soit transférée. @fr
label: ir deponētājs (grupa) @lv
definition: Sasaista grupu ar vienību, ko grupa deponējusi cita aģenta uzglabāšanā, vienlaikus saglabājot deponenta īpašumtiesības. @lv
toolkit label: ir deponētājs (grupa) @lv
toolkit definition: Vienība, ko grupa deponējusi cita aģenta uzglabāšanā, vienlaikus saglabājot deponenta īpašumtiesības. @lv
label: 是……的托存者集体行为者 @zh-hans
definition: 将一个集体行为者与被一个集体行为者储存归另一个行为者保管而不转移所有权的一个单件关联起来。 @zh-hans
toolkit label: ……的托存者集体行为者 @zh-hans
toolkit definition: 被一个集体行为者储存归另一个行为者保管而不转移所有权的一个单件 @zh-hans
label: mevduatçı kolektif temsilcisidir @tr
definition: Kolektif bir temsilciyi mülkiyeti devretmeksizin başka bir kolektif temsilcinin gözetimine emanet edilen bir kopya ile ilişkilendirir. @tr
toolkit label: mevduatçı kolektif temsilci @tr
toolkit definition: Kolektif bir temsilci tarafından mülkiyeti devretmeden başka bir temsilci gözetimine bırakılan bir kopya. @tr
has subproperty: tallettaja (yhteisö) kappaleessa
has subproperty: tallettaja (suku) kappaleessa
has subproperty: P50789

tallettaja (yhteisö) kappaleessa
status: Published
label: is depositor corporate body of @en
lexical alias: depositorCorporateBodyOf.en
definition: Relates a corporate body to an item that is deposited by a corporate body into the custody of another agent without transferring ownership. @en
toolkit label: depositor corporate body of @en
toolkit definition: An item that is deposited by a corporate body into the custody of another agent without transferring ownership. @en
type: Property
domain: C10005
has element type: 2
sub property of: nykyinen omistaja (yhteisö) kappaleessa
sub property of: tallettaja (yhteistoimija) kappaleessa
definition: Liittää yhteisön kappaleeseen, jonka yhteisö on luovuttanut toisen toimijan haltuun siirtämättä omistajuutta.
toolkit label: tallettaja (yhteisö) kappaleessa
toolkit definition: Kappale, jonka yhteisö on luovuttanut toisen toimijan haltuun siirtämättä omistajuutta.
label: er deponent for (korporasjon) @no
definition: Relaterer en korporasjon til et eksemplar som er deponert av en korporasjon til forvaring hos en annen agent uten at eierskapet blir overført. @no
toolkit label: deponent for (korporasjon) @no
toolkit definition: Et eksemplar som er deponert av en korporasjon til forvaring hos en annen agent uten at eierskapet blir overført. @no
label: is bruikleen-corporatie van @nl
definition: Relateert een corporatie aan een item dat door een corporatie in bewaring is gegeven bij een andere actor zonder overdracht van eigenaarschap. @nl
toolkit label: bruikleen-corporatie van @nl
toolkit definition: Een item dat door een corporatie in bewaring is gegeven bij een andere actor zonder overdracht van eigenaarschap. @nl
label: هي هيئة مسئولة عن الإيداع لـ @ar
definition: يربط هيئة بمفردة يتم إيداعها بمعرفة هيئة في عهدة وكيل آخر دون نقل الملكية. @ar
toolkit label: هيئة مسئولة عن الإيداع @ar
toolkit definition: مفردة تم إيداعها بمعرفة هيئة في عهدة وكيل آخر دون نقل الملكية. @ar
label: és entitat corporativa dipositadora de @ca
definition: Relaciona una entitat corporativa amb un ítem que és dipositat per una entitat corporativa sota la custòdia d’un altre agent sense transferir-li la propietat. @ca
toolkit label: entitat corporativa dipositadora de @ca
toolkit definition: Ítem que és dipositat per una entitat corporativa sota la custòdia d’un altre agent sense transferir-li la propietat. @ca
label: er korporation, som er udlåner af @da
definition: Relaterer en korporation til et eksemplar, som er deponeret i forvaring af en korporation hos en anden agent, men uden at overgive ejerskab. @da
toolkit label: korporation, som er udlåner af @da
toolkit definition: Eksemplar, som er deponeret i forvaring af en korporation hos en anden agent, men uden at overgive ejerskab. @da
label: deponeerija (asutus) eksemplarile @et
definition: Seostab asutuse eksemplariga, mille asutus on deponeerinud teise tegija vastutavale hoiule ilma omandiõiguse üleminekuta. @et
toolkit label: deponeerija (asutus) eksemplarile @et
toolkit definition: Eksemplar, mille asutus on deponeerinud teise tegija vastutavale hoiule ilma omandiõiguse üleminekuta. @et
label: ist Körperschaft als Leihgeberin/Leihgeber von @de
definition: Setzt eine Körperschaft in Beziehung zu einem Exemplar, das von einer Körperschaft in die Obhut einer anderen Körperschaft gegeben wird, ohne das Eigentumsrecht zu übertragen. @de
toolkit label: Körperschaft als Leihgeberin/Leihgeber von @de
toolkit definition: Ein Exemplar, das von einer Körperschaft in die Obhut einer anderen Körperschaft gegeben wird, ohne das Eigentumsrecht zu übertragen. @de
label: letétbe helyező testülete a következőnek: @hu
definition: Hozzákapcsol egy testületet egy példányhoz, amelyet egy testület egy másik ágens felügyelete alá helyez anélkül, hogy a tulajdonjogot átruházná. @hu
toolkit label: letétbe helyező testülete: @hu
toolkit definition: Egy példány, amelyet egy testület egy másik ágens felügyelete alá helyez anélkül, hogy a tulajdonjogot átruházná. @hu
label: è depositante ente di @it
definition: Correla un ente a un item depositato da un ente in custodia di un altro agente senza trasferire la proprietà. @it
toolkit label: depositante ente di @it
toolkit definition: Item depositato da un ente in custodia di un altro agente senza trasferire la proprietà. @it
label: είναι καταθέτης συλλογικό όργανο του @el
toolkit label: καταθέτης συλλογικό όργανο του @el
label: est une collectivité déposante de @fr
definition: Met une collectivité en relation avec un item qui est déposé par une collectivité sous la garde d’un autre agent sans que sa propriété ne soit transférée. @fr
toolkit label: collectivité déposante de @fr
toolkit definition: Item qui est déposé par une collectivité sous la garde d’un autre agent sans que sa propriété ne soit transférée. @fr
label: ir deponētājs (institūcija) @lv
definition: Sasaista institūciju ar vienību, ko institūcija deponējusi cita aģenta uzglabāšanā, vienlaikus saglabājot deponenta īpašumtiesības. @lv
toolkit label: ir deponētājs (institūcija) @lv
toolkit definition: Vienība, ko institūcija deponējusi cita aģenta uzglabāšanā, vienlaikus saglabājot deponenta īpašumtiesības. @lv
label: 是……的托存者团体 @zh-hans
definition: 将一个团体与被一个团体储存归另一个行为者保管而不转移所有权的一个单件关联起来。 @zh-hans
toolkit label: ……的托存者团体 @zh-hans
toolkit definition: 被一个团体储存归另一个行为者保管而不转移所有权的一个单件 @zh-hans
label: mevduatçı tüzel kişisidir @tr
definition: Bir tüzel kişiyi, tüzel kişi tarafından, mülkiyeti devredilmeksizin başka bir temsilcinin gözetimine bırakılan kopyayla ilişkilendirir. @tr
toolkit label: mevduatçı tüzel kişi @tr
toolkit definition: Tüzel bir kişi tarafından mülkiyeti devretmeden başka bir temsilci gözetimine bırakılan bir kopya. @tr
has subproperty: P50940

tallettaja (suku) kappaleessa
status: Published
label: is depositor family of @en
lexical alias: depositorFamilyOf.en
definition: Relates a family to an item that is deposited by a family into the custody of another agent without transferring ownership. @en
toolkit label: depositor family of @en
toolkit definition: An item that is deposited by a family into the custody of another agent without transferring ownership. @en
type: Property
domain: C10008
has element type: 2
sub property of: nykyinen omistaja (suku) kappaleessa
sub property of: tallettaja (yhteistoimija) kappaleessa
definition: Liittää suvun kappaleeseen, jonka suku on luovuttanut toisen toimijan haltuun siirtämättä omistajuutta.
toolkit label: tallettaja (suku) kappaleessa
toolkit definition: Kappale, jonka suku on luovuttanut toisen toimijan haltuun siirtämättä omistajuutta.
label: er deponent for (familie) @no
definition: Relaterer en familie til et eksemplar som er deponert av en familie til forvaring hos en annen agent uten at eierskapet blir overført. @no
toolkit label: deponent for (familie) @no
toolkit definition: Et eksemplar som er deponert av en familie til forvaring hos en annen agent uten at eierskapet blir overført. @no
label: is bruikleen-familie van @nl
definition: Relateert een familie aan een item dat door een familie in bewaring is gegeven bij een andere actor zonder overdracht van eigenaarschap. @nl
toolkit label: bruikleen-familie van @nl
toolkit definition: Een item dat door een familie in bewaring is gegeven bij een andere actor zonder overdracht van eigenaarschap. @nl
label: هي عائلة مسئولة عن الإيداع لـ @ar
definition: يربط عائلة بمفردة تم إيداعها بمعرفة عائلة في عهدة وكيل آخر دون نقل الملكية. @ar
toolkit label: عائلة مسئولة عن الإيداع @ar
toolkit definition: مفردة تم إيداعها بمعرفة عائلة في عهدة وكيل آخر دون نقل الملكية. @ar
label: és família dipositadora de @ca
definition: Relaciona una família amb un ítem que és dipositat per una família sota la custòdia d’un altre agent sense transferir-li la propietat. @ca
toolkit label: família dipositadora de @ca
toolkit definition: Ítem que és dipositat per una família sota la custòdia d’un altre agent sense transferir-li la propietat. @ca
label: er familie, som er udlåner af @da
definition: Relaterer en familie til et eksemplar, som er deponeret i forvaring af en familie hos en anden agent, men uden at overgive ejerskab. @da
toolkit label: familie, som er udlåner af @da
toolkit definition: Eksemplar, som er deponeret i forvaring af en familie hos en anden agent, men uden at overgive ejerskab. @da
label: deponeerija (perekond) eksemplarile @et
definition: Seostab perekonna eksemplariga, mille perekond on deponeerinud teise tegija vastutavale hoiule ilma omandiõiguse üleminekuta. @et
toolkit label: deponeerija (perekond) eksemplarile @et
toolkit definition: Eksemplar, mille perekond on deponeerinud teise tegija vastutavale hoiule ilma omandiõiguse üleminekuta. @et
label: ist Familie als Leihgeberin/Leihgeber von @de
definition: Setzt eine Familie in Beziehung zu einem Exemplar, das von einer Familie in die Obhut eines anderen Akteurs gegeben wird, ohne das Eigentumsrecht zu übertragen. @de
toolkit label: Familie als Leihgeberin/Leihgeber von @de
toolkit definition: Ein Exemplar, das von einer Familie in die Obhut eines anderen Akteurs gegeben wird, ohne das Eigentumsrecht zu übertragen. @de
label: letétbe helyező családja a következőnek: @hu
definition: Hozzákapcsol egy családot egy példányhoz, amelyet egy másik család felügyelete alá helyez anélkül, hogy a tulajdonjogot átruházná. @hu
toolkit label: letétbe helyező családja: @hu
toolkit definition: Egy példány, amelyet egy másik család felügyelete alá helyez anélkül, hogy a tulajdonjogot átruházná. @hu
label: è depositante famiglia di @it
definition: Correla una famiglia a un item depositato da una famiglia in custodia di un altro agente senza trasferire la proprietà. @it
toolkit label: depositante famiglia di @it
toolkit definition: Item depositato da una famiglia in custodia di un altro agente senza trasferire la proprietà. @it
label: είναι καταθέτης οικογένεια του @el
definition: Συνδέει μια οικογένεια με ένα αντίτυπο, το οποίο κατατίθεται από μια οικογένεια για φύλαξη από άλλον φορέα χωρίς τη μεταβίβαση της κυριότητας. @el
toolkit label: καταθέτης οικογένεια του @el
label: est une famille déposante de @fr
definition: Met une famille en relation avec un item qui est déposé par une famille sous la garde d’un autre agent sans que sa propriété ne soit transférée. @fr
toolkit label: famille déposante de @fr
toolkit definition: Item qui est déposé par une famille sous la garde d’un autre agent sans que sa propriété ne soit transférée. @fr
label: ir deponētājs (dzimta/ģimene) @lv
definition: Sasaista dzimtu/ģimeni ar vienību, ko dzimta/ģimene deponējusi cita aģenta uzglabāšanā, vienlaikus saglabājot deponenta īpašumtiesības. @lv
toolkit label: ir deponētājs (dzimta/ģimene) @lv
toolkit definition: Vienība, ko dzimta/ģimene deponējusi cita aģenta uzglabāšanā, vienlaikus saglabājot deponenta īpašumtiesības. @lv
label: 是……的托存者家族 @zh-hans
definition: 将一个家族与被一个家族储存归另一个行为者保管而不转移所有权的一个单件关联起来。 @zh-hans
toolkit label: ……的托存者家族 @zh-hans
toolkit definition: 被一个家族储存归另一个行为者保管而不转移所有权的一个单件 @zh-hans
label: mevduatçı ailesidir @tr
definition: Bir aile tarafından mülkiyeti devredilmeden başka bir temsilcinin gözetimine emanet edilen bir kopyayla ilişkilendirir. @tr
toolkit label: mevduatçı aile @tr
toolkit definition: Bir aile tarafından mülkiyeti devretmeden başka bir temsilci gözetimine bırakılan bir kopya. @tr
has subproperty: P51091

tallettaja (henkilö) kappaleessa
status: Published
label: is depositor person of @en
lexical alias: depositorPersonOf.en
definition: Relates a person to an item that is deposited by a person into the custody of another agent without transferring ownership. @en
toolkit label: depositor person of @en
toolkit definition: An item that is deposited by a person into the custody of another agent without transferring ownership. @en
type: Property
domain: C10004
has element type: 2
sub property of: nykyinen omistaja (henkilö) kappaleessa
sub property of: tallettaja (toimija) kappaleessa
definition: Liittää henkilön kappaleeseen, jonka henkilö on luovuttanut toisen toimijan haltuun siirtämättä omistajuutta.
toolkit label: tallettaja (henkilö) kappaleessa
toolkit definition: Kappale, jonka henkilö on luovuttanut toisen toimijan haltuun siirtämättä omistajuutta.
label: er deponent for (person) @no
definition: Relaterer en person til et eksemplar som er deponert av en person til forvaring hos en annen agent uten at eierskapet blir overført. @no
toolkit label: deponent for (person) @no
toolkit definition: Et eksemplar som er deponert av en person til forvaring hos en annen agent uten at eierskapet blir overført. @no
label: is bruikleen-persoon van @nl
definition: Relateert een persoon aan een item dat door een persoon in bewaring is gegeven bij een andere actor zonder overdracht van eigenaarschap. @nl
toolkit label: bruikleen-persoon van @nl
toolkit definition: Een item dat door een persoon in bewaring is gegeven bij een andere actor zonder overdracht van eigenaarschap. @nl
label: هو شخص مودع لـ @ar
definition: يربط شخصا بمفردة تم إيداعها بمعرفة شخص في عهدة وكيل آخر دون نقل الملكية. @ar
toolkit label: شخص مودع @ar
toolkit definition: مفردة تم إيداعها بمعرفة شخص في عهدة وكيل آخر دون نقل الملكية. @ar
label: és persona dipositadora de @ca
definition: Relaciona una persona amb un ítem que és dipositat per una persona sota la custòdia d’un altre agent sense transferir-li la propietat. @ca
toolkit label: persona dipositadora de @ca
toolkit definition: Ítem que és dipositat per una persona sota la custòdia d’un altre agent sense transferir-li la propietat. @ca
label: er person, som er udlåner af @da
definition: Relaterer en person til et eksemplar, som er deponeret i forvaring af en person hos en anden agent, men uden at overgive ejerskab. @da
toolkit label: person, som er udlåner af @da
toolkit definition: Eksemplar, som er deponeret i forvaring af en person hos en anden agent, men uden at overgive ejerskab. @da
label: deponeerija (isik) eksemplarile @et
definition: Seostab isiku eksemplariga, mille isik on deponeerinud teise tegija vastutavale hoiule ilma omandiõiguse üleminekuta. @et
toolkit label: deponeerija (isik) eksemplarile @et
toolkit definition: Eksemplar, mille isik on deponeerinud teise tegija vastutavale hoiule ilma omandiõiguse üleminekuta. @et
label: ist Person als Leihgeberin/Leihgeber von @de
definition: Setzt eine Person in Beziehung zu einem Exemplar, das von einer Person in die Obhut eines anderen Akteurs gegeben wird, ohne das Eigentumsrecht zu übertragen. @de
toolkit label: Person als Leihgeberin/Leihgeber von @de
toolkit definition: Ein Exemplar, das von einer Person in die Obhut eines anderen Akteurs gegeben wird, ohne das Eigentumsrecht zu übertragen. @de
label: letétbe helyező személye a következőnek: @hu
definition: Hozzákapcsol egy személyt egy példányhoz, amelyet a személy egy másik ágens felügyelete alá helyez anélkül, hogy a tulajdonjogot átruházná. @hu
toolkit label: letétbe helyező személye: @hu
toolkit definition: Egy példány, amelyet egy személy egy másik ágens felügyelete alá helyez anélkül, hogy a tulajdonjogot átruházná. @hu
label: è depositante persona di @it
definition: Correla una persona a un item depositato da una persona in custodia di un altro agente senza trasferire la proprietà. @it
toolkit label: depositante persona di @it
toolkit definition: Item depositato da una persona in custodia di un altro agente senza trasferire la proprietà. @it
label: είναι καταθέτης φυσικό πρόσωπο του @el
toolkit label: καταθέτης φυσικό πρόσωπο του @el
label: est une personne déposante de @fr
definition: Met une personne en relation avec un item qui est déposé par une personne sous la garde d’un autre agent sans que sa propriété ne soit transférée. @fr
toolkit label: personne déposante de @fr
toolkit definition: Item qui est déposé par une personne sous la garde d’un autre agent sans que sa propriété ne soit transférée. @fr
label: ir deponētājs (persona) @lv
definition: Sasaista personu ar vienību, ko persona deponējusi cita aģenta uzglabāšanā, vienlaikus saglabājot deponenta īpašumtiesības. @lv
toolkit label: ir deponētājs (persona) @lv
toolkit definition: Vienība, ko persona deponējusi cita aģenta uzglabāšanā, vienlaikus saglabājot deponenta īpašumtiesības. @lv
label: 是……的托存者行为者 @zh-hans
definition: 将一个个人与被一个个人储存归另一个行为者保管而不转移所有权的一个单件关联起来。 @zh-hans
toolkit label: ……的托存者行为者 @zh-hans
toolkit definition: 被一个个人储存归另一个行为者保管而不转移所有权的一个单件 @zh-hans
label: mevduatçı kişisidir @tr
definition: Bir kişiyi, mülkiyeti devretmeksizin kişi tarafından başka bir temsilcinin gözetimine bırakılan kopyayla ilişkilendirir. @tr
toolkit label: mevduatçı @tr
toolkit definition: Bir kişi tarafından mülkiyeti devretmeden başka bir temsilci gözetimine bırakılan bir kopya. @tr
has subproperty: P50638

designer (toimija) teoksessa
status: Published
label: is designer agent of @en
definition: Relates an agent to a work that involves a responsibility of an agent for designing an object. @en
type: Property
domain: C10002
sub property of: teoksen tekijä (toimija) teoksessa
lexical alias: designerAgentOf.en
label: est un agent designer de @fr
definition: Met un agent en relation avec une œuvre qui comporte une responsabilité de la part d’un agent consistant à concevoir un objet. @fr
toolkit label: agent designer de @fr
toolkit definition: Œuvre qui comporte une responsabilité de la part d’un agent consistant à concevoir un objet. @fr
toolkit label: designer agent of @en
toolkit definition: A work that involves a responsibility of an agent for designing an object. @en
instruction number: 18.5
label: είναι σχεδιαστής φορέας του @el
definition: Συνδέει έναν φορέα υπεύθυνο για τον σχεδιασμό ενός αντικειμένου, με ένα έργο. @el
toolkit label: σχεδιαστής φορέας του @el
toolkit definition: Ένα έργο που περιλαμβάνει την ευθύνη του σχεδιασμού ενός αντικειμένου. @el
definition: Setzt einen Akteur in Beziehung zu einem Werk, bei dem ein Akteur für die Gestaltung eines Objekts verantwortlich ist. @de
toolkit label: Akteur als Designerin/Designer von @de
toolkit definition: Ein Werk, bei dem ein Akteur für die Gestaltung des Designs eines Objekts verantwortlich ist. @de
label: er agent, som er designer af @da
definition: Relaterer en agent til et værk, som involverer en agents ansvar for at designe et objekt. @da
toolkit label: agent, som er designer af @da
toolkit definition: Værk, som involverer en agents ansvar for at designe et objekt. @da
label: és agent dissenyador de @ca
definition: Relaciona un agent amb una obra que implica una responsabilitat d’un agent en el disseny d’un objecte. @ca
toolkit label: agent dissenyador de @ca
toolkit definition: Obra que implica una responsabilitat d’un agent en el disseny d’un objecte. @ca
definition: Liittää toimijan teokseen, jossa toimija on vastuussa kohteen suunnittelusta tai muotoilusta.
toolkit label: designer (toimija) teoksessa
toolkit definition: Teos, jossa toimija on vastuussa kohteen suunnittelusta tai muotoilusta.
toolkit label: designer av (agent) @no
toolkit definition: Et verk som involverer ansvar for en agent i form av utforming av en gjenstand. @no
label: ist Akteur als Designerin/Designer von @de
has element type: 2
label: tervező ágense a következőnek: @hu
definition: Hozzákapcsol egy ágenst egy műhöz, amelyhez hozzátartozik egy ágens felelőssége egy tárgy tervezéséért. @hu
toolkit label: tervező ágense: @hu
toolkit definition: Egy mű, amelyhez hozzátartozik egy ágens felelőssége egy tárgy tervezéséért. @hu
alternative label: designer of @en
alternative label: designerina teoksessa
label: er designer av (agent) @no
definition: Relaterer en agent til et verk som involverer ansvar for en agent i form av utforming av en gjenstand. @no
alternative label: designer av @no
label: is ontwerper-actor van @nl
definition: Relateert een actor aan een werk dat met zich meebrengt een verantwoordelijkheid van een actor voor het ontwerpen van een object. @nl
toolkit label: ontwerper-actor van @nl
toolkit definition: Een werk dat met zich meebrengt een verantwoordelijkheid van een actor voor het ontwerpen van een object. @nl
label: هو وكيل مصمم لـ @ar
definition: يربط وكيلا بعمل يشتمل على مسئولية وكيل عن تصميم كائن. @ar
alternative label: مصمم @ar
toolkit label: وكيل مصمم @ar
toolkit definition: عمل يترتب عليه مسئولية وكيل عن تصميم كائن. @ar
alternative label: dissenyador de @ca
alternative label: designer af @da
label: kujundaja (tegija) teoses @et
definition: Seostab tegija teosega, mis sisaldab tegija vastutust objekti kujunduse eest. @et
alternative label: kujundaja teoses @et
alternative label: disainer teoses @et
toolkit label: kujundaja (tegija) teoses @et
toolkit definition: Teos, mis sisaldab tegija vastutust objekti kujunduse eest. @et
alternative label: tervezője: @hu
label: è designer agente di @it
definition: Correla un agente a un'opera che implica una responsabilità di un agente per la progettazione di un oggetto. @it
alternative label: designer di @it
toolkit label: designer agente di @it
toolkit definition: Opera che implica una responsabilità di un agente per la progettazione di oggetto. @it
alternative label: σχεδιαστής του @el
alternative label: designer de @fr
label: ir dizainers (aģents) @lv
definition: Sasaista aģentu ar darbu, kas ietver aģenta atbildību par objekta dizaina radīšanu. @lv
toolkit label: ir dizainers (aģents) @lv
toolkit definition: Darbs, kas ietver aģenta atbildību par objekta dizaina radīšanu. @lv
alternative label: Designer von @de
toolkit label: ……的设计者行为者 @zh-hans
toolkit definition: 涉及设计一个物体的一个行为者的责任的一种作品 @zh-hans
toolkit label: tasarımcı temsilci @tr
toolkit definition: Bir nesneyi tasarlamak için bir temsilcinin sorumluluğunu içeren bir eser. @tr
has subproperty: designer (yhteistoimija) teoksessa

designer (yhteistoimija) teoksessa
status: Published
label: is designer collective agent of @en
lexical alias: designerCollectiveAgentOf.en
definition: Relates a collective agent to a work that involves a responsibility of a collective agent for designing an object. @en
toolkit label: designer collective agent of @en
toolkit definition: A work that involves a responsibility of a collective agent for designing an object. @en
type: Property
domain: C10011
has element type: 2
sub property of: teoksen tekijä (yhteistoimija) teoksessa
sub property of: designer (toimija) teoksessa
definition: Liittää yhteistoimijan teokseen, jossa yhteistoimija on vastuussa kohteen suunnittelusta tai muotoilusta.
toolkit label: designer (yhteistoimija) teoksessa
toolkit definition: Teos, jossa yhteistoimija on vastuussa kohteen suunnittelusta tai muotoilusta.
label: er designer av (kollektiv agent) @no
definition: Relaterer en kollektiv agent til et verk som involverer et ansvar for en kollektiv agent i form av å designe en gjenstand. @no
toolkit label: designer av (kollektiv agent) @no
toolkit definition: Et verk som involverer et ansvar for en kollektiv agent i form av å designe en gjenstand. @no
label: is ontwerper-collectieve actor van @nl
definition: Relateert een collectieve actor aan een werk dat met zich meebrengt een verantwoordelijkheid van een collectieve actor voor het ontwerpen van een object. @nl
toolkit label: ontwerper-collectieve actor van @nl
toolkit definition: Een werk dat met zich meebrengt een verantwoordelijkheid van een collectieve actor voor het ontwerpen van een object. @nl
label: هو وكيل جماعي مصمم لـ @ar
definition: يربط وكيلا جماعيا بعمل يشتمل على مسئولية وكيل جماعي عن تصميم كائن. @ar
toolkit label: وكيل جماعي مصمم @ar
toolkit definition: عمل يشتمل على مسئولية وكيل جماعي عن تصميم كائن. @ar
label: és agent col·lectiu dissenyador de @ca
definition: Relaciona un agent col·lectiu amb una obra que implica una responsabilitat d’un agent col·lectiu en el disseny d’un objecte. @ca
toolkit label: agent col·lectiu dissenyador de @ca
toolkit definition: Obra que implica una responsabilitat d’un agent col·lectiu en el disseny d’un objecte. @ca
label: er kollektiv agent, som er designer af @da
definition: Relaterer en kollektiv agent til et værk, som involverer en kollektiv agents ansvar for at designe et objekt. @da
toolkit label: kollektiv agent, som er designer af @da
toolkit definition: Værk, som involverer en kollektiv agents ansvar for at designe et objekt. @da
label: kujundaja (kollektiiv) teoses @et
definition: Seostab kollektiivi teosega, mis sisaldab kollektiivi vastutust objekti kujunduse eest. @et
toolkit label: kujundaja (kollektiiv) teoses @et
toolkit definition: Teos, mis sisaldab kollektiivi vastutust objekti kujunduse eest. @et
label: ist gemeinschaftlicher Akteur als Designerin/Designer von @de
definition: Setzt einen gemeinschaftlichen Akteur in Beziehung zu einem Werk, bei dem ein gemeinschaftlicher Akteur für die Gestaltung eines Objekts verantwortlich ist. @de
toolkit label: Gemeinschaftlicher Akteur als Designerin/Designer von @de
toolkit definition: Ein Werk, bei dem ein gemeinschaftlicher Akteur für die Gestaltung eines Objekts verantwortlich ist. @de
label: tervező kollektív ágense a következőnek: @hu
definition: Hozzákapcsol egy kollektív ágenst egy műhöz, amelyhez hozzátartozik egy kollektív ágens felelőssége egy tárgy tervezéséért. @hu
toolkit label: tervező kollektív ágense: @hu
toolkit definition: Egy mű, amelyhez hozzátartozik egy kollektív ágens felelőssége egy tárgy tervezéséért. @hu
label: è designer agente collettivo di @it
definition: Correla un agente collettivo a un'opera che implica una responsabilità di un agente collettivo per la progettazione di oggetto. @it
toolkit label: designer agente collettivo di @it
toolkit definition: Opera che implica una responsabilità di un agente collettivo per la progettazione di oggetto. @it
label: είναι σχεδιαστής συλλογικός φορέας του @el
toolkit label: σχεδιαστής συλλογικός φορέας του @el
label: est un agent collectif designer de @fr
definition: Met un agent collectif en relation avec une œuvre qui comporte une responsabilité de la part d’un agent collectif consistant à concevoir un objet. @fr
toolkit label: agent collectif designer de @fr
toolkit definition: Œuvre qui comporte une responsabilité de la part d’un agent collectif consistant à concevoir un objet. @fr
label: ir dizainers (grupa) @lv
definition: Sasaista grupu ar darbu, kas ietver grupas atbildību par objekta dizaina radīšanu. @lv
toolkit label: ir dizainers (grupa) @lv
toolkit definition: Darbs, kas ietver grupas atbildību par objekta dizaina radīšanu. @lv
label: 是……的设计者集体行为者 @zh-hans
definition: 将一个集体行为者与涉及设计一个物体的一个集体行为者的责任的一种作品关联起来。 @zh-hans
toolkit label: ……的设计者集体行为者 @zh-hans
toolkit definition: 涉及设计一个物体的一个集体行为者的责任的一种作品 @zh-hans
label: tasarımcı kolektif temsilcisidir @tr
definition: Kollektif bir temsilciyi, bir nesneyi tasarlamak için kolektif bir temsilcinin sorumluluğunu içeren bir eserle ilişkilendirir. @tr
toolkit label: tasarımcı kolektif temsilci @tr
toolkit definition: Bir nesneyi tasarlamak için kollektif bir temsilcinin sorumluluğunu içeren bir eser. @tr
has subproperty: designer (yhteisö) teoksessa
has subproperty: designer (suku) teoksessa
has subproperty: P50694

designer (yhteisö) teoksessa
status: Published
label: is designer corporate body of @en
lexical alias: designerCorporateBodyOf.en
definition: Relates a corporate body to a work that involves a responsibility of a corporate body for designing an object. @en
toolkit label: designer corporate body of @en
toolkit definition: A work that involves a responsibility of a corporate body for designing an object. @en
type: Property
domain: C10005
has element type: 2
sub property of: teoksen tekijä (yhteisö) teoksessa
sub property of: designer (yhteistoimija) teoksessa
definition: Liittää yhteisön teokseen, jossa yhteisö on vastuussa kohteen suunnittelusta tai muotoilusta.
toolkit label: designer (yhteisö) teoksessa
toolkit definition: Teos, jossa yhteisö on vastuussa kohteen suunnittelusta tai muotoilusta.
label: er designer av (korporasjon) @no
definition: Relaterer en korporasjon til et verk som involverer et ansvar for en korporasjon i form av å designe en gjenstand. @no
toolkit label: designer av (korporasjon) @no
toolkit definition: Et verk som involverer et ansvar for en korporasjon i form av å designe en gjenstand. @no
label: is ontwerper-corporatie van @nl
definition: Relateert een corporatie aan een werk dat met zich meebrengt een verantwoordelijkheid van een corporatie voor het ontwerpen van een object. @nl
toolkit label: ontwerper-corporatie van @nl
toolkit definition: Een werk dat met zich meebrengt een verantwoordelijkheid van een corporatie voor het ontwerpen van een object. @nl
label: هي هيئة مسئولة عن تصميم @ar
definition: يربط هيئة بعمل يشتمل على مسئولية هيئة عن تصميم كائن. @ar
toolkit label: هيئة مسئولة عن تصميم @ar
toolkit definition: عمل يترتب عليه مسئولية هيئة عن تصميم كائن. @ar
label: és entitat corporativa dissenyadora de @ca
definition: Relaciona una entitat corporativa amb una obra que implica una responsabilitat d’una entitat corporativa en el disseny d’un objecte. @ca
toolkit label: entitat corporativa dissenyadora de @ca
toolkit definition: Obra que implica una responsabilitat d’una entitat corporativa en el disseny d’un objecte. @ca
label: er korporation, som er designer af @da
definition: Relaterer en korporation til et værk, som involverer en korporations ansvar for at designe et objekt. @da
toolkit label: korporation, som er designer af @da
toolkit definition: Værk, som involverer en korporations ansvar for at designe et objekt. @da
label: kujundaja (asutus) teoses @et
definition: Seostab asutuse teosega, mis sisaldab asutuse vastutust objekti kujunduse eest. @et
toolkit label: kujundaja (asutus) teoses @et
toolkit definition: Teos, mis sisaldab asutuse vastutust objekti kujunduse eest. @et
label: ist Körperschaft als Designerin/Designer von @de
definition: Setzt eine Körperschaft in Beziehung zu einem Werk, bei dem eine Körperschaft für die Gestaltung eines Objekts verantwortlich ist. @de
toolkit label: Körperschaft als Designerin/Designer von @de
toolkit definition: Ein Werk, bei dem eine Körperschaft für die Gestaltung eines Objekts verantwortlich ist. @de
label: tervező testülete a következőnek: @hu
definition: Hozzákapcsol egy testületet egy műhöz, amelyhez hozzátartozik egy testület felelőssége egy tárgy tervezéséért. @hu
toolkit label: tervező testülete: @hu
toolkit definition: Egy mű, amelyhez hozzátartozik egy testület felelőssége egy tárgy tervezéséért. @hu
label: è designer ente di @it
definition: Correla un ente a un'opera che implica una responsabilità di un ente per la progettazione di un oggetto. @it
toolkit label: designer ente di @it
toolkit definition: Opera che implica una responsabilità di un ente per la progettazione di un oggetto. @it
label: είναι σχεδιαστής συλλογικό όργανο του @el
toolkit label: σχεδιαστής συλλογικό όργανο του @el
label: est une collectivité designer de @fr
definition: Met une collectivité en relation avec une œuvre qui comporte une responsabilité de la part d’une collectivité consistant à concevoir un objet. @fr
toolkit label: collectivité designer de @fr
toolkit definition: Œuvre qui comporte une responsabilité de la part d’une collectivité consistant à concevoir un objet. @fr
label: ir dizainers (institūcija) @lv
definition: Sasaista institūciju ar darbu, kas ietver institūcijas atbildību par objekta dizaina radīšanu. @lv
toolkit label: ir dizainers (institūcija) @lv
toolkit definition: Darbs, kas ietver institūcijas atbildību par objekta dizaina radīšanu. @lv
label: 是……的设计者团体 @zh-hans
definition: 将一个团体与涉及设计一个物体的一个团体的责任的一种作品关联起来。 @zh-hans
toolkit label: ……的设计者团体 @zh-hans
toolkit definition: 涉及设计一个物体的一个团体的责任的一种作品 @zh-hans
label: tasarımcı tüzel kişisidir @tr
definition: Bir tüzel kişiyi, bir nesneyi tasarlama sorumluluğunu içeren bir eserle ilişkilendirir. @tr
toolkit label: tasarımcı tüzel kişi @tr
toolkit definition: Bir nesneyi tasarlamak için bir tüzel kişinin sorumluluğunu içeren bir eser. @tr
has subproperty: P50845

designer (suku) teoksessa
status: Published
label: is designer family of @en
lexical alias: designerFamilyOf.en
definition: Relates a family to a work that involves a responsibility of a family for designing an object. @en
toolkit label: designer family of @en
toolkit definition: A work that involves a responsibility of a family for designing an object. @en
type: Property
domain: C10008
has element type: 2
sub property of: teoksen tekijä (suku) teoksessa
sub property of: designer (yhteistoimija) teoksessa
definition: Liittää suvun teokseen, jossa suku on vastuussa kohteen suunnittelusta tai muotoilusta.
toolkit label: designer (suku) teoksessa
toolkit definition: Teos, jossa suku on vastuussa kohteen suunnittelusta tai muotoilusta.
label: er designer av (familie) @no
definition: Relaterer en familie til et verk som involverer et ansvar for en familie i form av å designe en gjenstand. @no
toolkit label: designer av (familie) @no
toolkit definition: Et verk som involverer et ansvar for en familie i form av å designe en gjenstand. @no
label: is ontwerper-familie van @nl
definition: Relateert een familie aan een werk dat met zich meebrengt een verantwoordelijkheid van een familie voor het ontwerpen van een object. @nl
toolkit label: ontwerper-familie van @nl
toolkit definition: Een werk dat met zich meebrengt een verantwoordelijkheid van een familie voor het ontwerpen van een object. @nl
label: هي عائلة مسئولة عن تصميم @ar
definition: يربط عائلة بعمل يترتب عليه مسئولية عائلة عن تصميم كائن. @ar
toolkit label: عائلة مسئولة عن تصميم @ar
toolkit definition: عمل يترتب عليه مسئولية عائلة عن تصميم كائن. @ar
label: és família dissenyadora de @ca
definition: Relaciona una família amb una obra que implica una responsabilitat d’una família en el disseny d’un objecte. @ca
toolkit label: família dissenyadora de @ca
toolkit definition: Obra que implica una responsabilitat d’una família en el disseny d’un objecte. @ca
label: er familie, som er designer af @da
definition: Relaterer en familie til et værk, som involverer en families ansvar for at designe et objekt. @da
toolkit label: familie, som er designer af @da
toolkit definition: Værk, som involverer en families ansvar for at designe et objekt. @da
label: kujundaja (perekond) teoses @et
definition: Seostab perekonna teosega, mis sisaldab perekonna vastutust objekti kujunduse eest. @et
toolkit label: kujundaja (perekond) teoses @et
toolkit definition: Teos, mis sisaldab perekonna vastutust objekti kujunduse eest. @et
label: ist Familie als Designerin/Designer von @de
definition: Setzt eine Familie in Beziehung zu einem Werk, bei dem eine Familie für die Gestaltung des Designs eines Objekts verantwortlich ist. @de
toolkit label: Familie als Designerin/Designer von @de
toolkit definition: Ein Werk, bei dem eine Familie für die Gestaltung des Designs eines Objekts verantwortlich ist. @de
label: tervező családja a következőnek: @hu
definition: Hozzákapcsol egy családot egy műhöz, amelyhez hozzátartozik egy család felelőssége egy tárgy tervezéséért. @hu
toolkit label: tervező családja: @hu
toolkit definition: Egy mű, amelyhez hozzátartozik egy család felelőssége egy tárgy tervezéséért. @hu
label: è designer famiglia di @it
definition: Correla una famiglia a un'opera che implica una responsabilità di una famiglia per la progettazione di un oggetto. @it
toolkit label: designer famiglia di @it
toolkit definition: Opera che implica una responsabilità di una famiglia per la progettazione di un oggetto. @it
label: είναι σχεδιαστής οικογένεια του @el
toolkit label: σχεδιαστής οικογένεια του @el
label: est une famille designer de @fr
definition: Met une famille en relation avec une œuvre qui comporte une responsabilité de la part d’une famille consistant à concevoir un objet. @fr
toolkit label: famille designer de @fr
toolkit definition: Œuvre qui comporte une responsabilité de la part d’une famille consistant à concevoir un objet. @fr
label: ir dizainers (dzimta/ģimene) @lv
definition: Sasaista dzimtu/ģimeni ar darbu, kas ietver dzimtas/ģimenes atbildību par objekta dizaina radīšanu. @lv
toolkit label: ir dizainers (dzimta/ģimene) @lv
toolkit definition: Darbs, kas ietver dzimtas/ģimenes atbildību par objekta dizaina radīšanu. @lv
label: 是……的设计者家族 @zh-hans
definition: 将一个家族与涉及设计一个物体的一个家族的责任的一种作品关联起来。 @zh-hans
toolkit label: ……的设计者家族 @zh-hans
toolkit definition: 涉及设计一个物体的一个家族的责任的一种作品 @zh-hans
label: tasarımcı ailesidir @tr
definition: Bir aileyi, bir nesneyi tasarlama sorumluluğunu içeren bir eserle ilişkilendirir. @tr
toolkit label: tasarımcı aile @tr
toolkit definition: Bir nesneyi tasarlamak için bir ailenin sorumluluğunu içeren bir eser. @tr
has subproperty: P50996

designer (henkilö) teoksessa
status: Published
label: is designer person of @en
lexical alias: designerPersonOf.en
definition: Relates a person to a work that involves a responsibility of a person for designing an object. @en
toolkit label: designer person of @en
toolkit definition: A work that involves a responsibility of a person for designing an object. @en
type: Property
domain: C10004
has element type: 2
sub property of: teoksen tekijä (henkilö) teoksessa
sub property of: designer (toimija) teoksessa
definition: Liittää henkilön teokseen, jossa henkilö on vastuussa kohteen suunnittelusta tai muotoilusta.
toolkit label: designer (henkilö) teoksessa
toolkit definition: Teos, jossa henkilö on vastuussa kohteen suunnittelusta tai muotoilusta.
label: er designer av (person) @no
definition: Relaterer en person til et verk som involverer et ansvar for en person i form av å designe en gjenstand. @no
toolkit label: designer av (person) @no
toolkit definition: Et verk som involverer et ansvar for en person i form av å designe en gjenstand. @no
label: is ontwerper-persoon van @nl
definition: Relateert een persoon aan een werk dat met zich meebrengt een verantwoordelijkheid van een persoon voor het ontwerpen van een object. @nl
toolkit label: ontwerper-persoon van @nl
toolkit definition: Een werk dat met zich meebrengt een verantwoordelijkheid van een persoon voor het ontwerpen van een object. @nl
label: هو شخص مصمم لـ @ar
definition: يربط شخصا بعمل يشتمل على مسئولية شخص عن تصميم كائن. @ar
toolkit label: شخص مصمم @ar
toolkit definition: عمل يترتب عليه مسئولية شخص عن تصميم كائن. @ar
label: és persona dissenyadora de @ca
definition: Relaciona una persona amb una obra que implica una responsabilitat d’una persona en el disseny d’un objecte. @ca
toolkit label: persona dissenyadora de @ca
toolkit definition: Obra que implica una responsabilitat d’una persona en el disseny d’un objecte. @ca
label: er person, som er designer af @da
definition: Relaterer en person til et værk, som involverer en persons ansvar for at designe et objekt. @da
toolkit label: person, som er designer af @da
toolkit definition: Værk, som involverer en persons ansvar for at designe et objekt. @da
label: kujundaja (isik) teoses @et
definition: Seostab isiku teosega, mis sisaldab isiku vastutust objekti kujunduse eest. @et
toolkit label: kujundaja (isik) teoses @et
toolkit definition: Teos, mis sisaldab isiku vastutust objekti kujunduse eest. @et
label: ist Person als Designerin/Designer von @de
definition: Setzt eine Person in Beziehung zu einem Werk, bei dem eine Person für die Gestaltung des Designs eines Objekts verantwortlich ist. @de
toolkit label: Person als Designerin/Designer von @de
toolkit definition: Ein Werk, bei dem eine Person für die Gestaltung des Designs eines Objekts verantwortlich ist. @de
label: tervező személye a következőnek: @hu
definition: Hozzákapcsol egy személyt egy műhöz, amelyhez hozzátartozik egy személy felelőssége egy tárgy tervezéséért. @hu
toolkit label: tervező személye: @hu
toolkit definition: Egy mű, amelyhez hozzátartozik egy személy felelőssége egy tárgy tervezéséért. @hu
label: è designer persona di @it
definition: Correla una persona a un'opera che implica una responsabilità di una persona per la progettazione di oggetto. @it
toolkit label: designer persona di @it
toolkit definition: Opera che implica una responsabilità di una persona per la progettazione di oggetto. @it
label: είναι σχεδιαστής φυσικό πρόσωπο του @el
toolkit label: σχεδιαστής φυσικό πρόσωπο του @el
label: est une personne designer de @fr
definition: Met une personne en relation avec une œuvre qui comporte une responsabilité de la part d’une personne consistant à concevoir un objet. @fr
toolkit label: personne designer de @fr
toolkit definition: Œuvre qui comporte une responsabilité de la part d’une personne consistant à concevoir un objet. @fr
label: ir dizainers (persona) @lv
definition: Sasaista personu ar darbu, kas ietver personas atbildību par objekta dizaina radīšanu. @lv
toolkit label: ir dizainers (persona) @lv
toolkit definition: Darbs, kas ietver personas atbildību par objekta dizaina radīšanu. @lv
label: 是……的设计者个人 @zh-hans
definition: 将一个个人与涉及设计一个物体的一个个人的责任的一种作品关联起来。 @zh-hans
toolkit label: ……的设计者个人 @zh-hans
toolkit definition: 涉及设计一个物体的一个个人的责任的一种作品 @zh-hans
label: tasarımcı kişisidir @tr
definition: Bir kişiyi, bir nesneyi tasarlama sorumluluğunu içeren bir eserle ilişkilendirir. @tr
toolkit label: tasarımcı kişi @tr
toolkit definition: Bir nesneyi tasarlamak için bir kişinin sorumluluğunu içeren bir eser. @tr
has subproperty: P50543

oppilas
status: Published
type: Property
label: has student @en
lexical alias: student.en
definition: Relates a person to a person who receives instruction from another person. @en
domain: C10004
toolkit label: student @en
toolkit definition: A person who receives instruction from another person. @en
instruction number: 29.5
sub property of: henkilöön liittyvä henkilö
label: έχει φοιτητή @el
definition: Συνδέει ένα φυσικό πρόσωπο με ένα φυσικό πρόσωπο που λαμβάνει οδηγίες από ένα άλλο φυσικό πρόσωπο. @el
toolkit label: φοιτητής @el
toolkit definition: Ένα φυσικό πρόσωπο που λαμβάνει οδηγίες από ένα άλλο φυσικό πρόσωπο. @el
definition: Setzt eine Person in Beziehung zu einer Person, die von einer anderen Person unterrichtet wird. @de
toolkit label: Studentin/Student @de
toolkit definition: Eine Person, die von einer anderen Person unterrichtet wird. @de
label: har student @da
definition: Relaterer en person til en person, som modtager undervisning fra en anden person. @da
toolkit definition: Person, som modtager undervisning fra en anden person. @da
label: té com a estudiant @ca
definition: Relaciona una persona amb una persona que rep instrucció d’una altra persona. @ca
toolkit label: estudiant @ca
toolkit definition: Persona que rep instrucció d’una altra persona. @ca
definition: Liittää henkilön henkilöön, joka saa opetusta toiselta henkilöltä.
toolkit label: oppilas
toolkit definition: Henkilö, joka saa opetusta toiselta henkilöltä.
toolkit definition: En person som mottar opplæring fra en annen person. @no
label: hat Studentin/Student @de
label: a pour élève @fr
definition: Met une personne en relation avec une personne qui reçoit l’enseignement d’une autre personne. @fr
toolkit label: élève @fr
toolkit definition: Personne qui reçoit l’enseignement d’une autre personne. @fr
has element type: 2
label: tanulója a következő: @hu
definition: Hozzákapcsol egy személyt egy személyhez, aki egy másik személytől oktatásban részesül. @hu
toolkit label: tanuló: @hu
toolkit definition: Egy személy, aki egy másik személytől oktatásban részesül. @hu
alternative label: opiskelija
definition: Relaterer en person til en person som mottar opplæring fra en annen person. @no
label: heeft student @nl
definition: Relateert een persoon aan een persoon die instructie ontvangt van een andere persoon. @nl
toolkit definition: Een persoon die instructie ontvangt van een andere persoon. @nl
label: له طالب @ar
definition: يربط شخصا بشخص يتلقى تعليمات من شخص آخر. @ar
toolkit label: طالب @ar
toolkit definition: شخص يتلقى تعليما من شخص آخر. @ar
label: õppur @et
definition: Seostab isiku isikuga, kes saab teiselt isikult õpetust. @et
toolkit label: õppur @et
toolkit definition: Isik, kes saab teiselt isikult õpetust. @et
label: ha come studente @it
definition: Correla una persona a una persona che riceve istruzione da un'altra persona. @it
toolkit label: studente @it
toolkit definition: Persona che riceve istruzione da un'altra persona. @it
label: audzēknis @lv
definition: Sasaista personu ar personu, kura saņem izglītojošus norādījumus no citas personas. @lv
toolkit label: audzēknis @lv
toolkit definition: Persona, kura saņem izglītojošus norādījumus no citas personas. @lv
label: 有学生 @zh-hans
definition: 将一个个人与从另一个个人接受教学的一个个人关联起来。 @zh-hans
toolkit label: 学生 @zh-hans
toolkit definition: 从另一个个人接受教学的一个个人 @zh-hans
label: öğrenci ile ilişkilidir @tr
definition: Bir kişiyi başka bir kişiden talimat alan bir kişi ile ilişkilendirir. @tr
toolkit label: öğreci @tr
toolkit definition: Başka bir kişiden eğitim alan bir kişi @tr
has subproperty: P50281

oppilaitos
status: Published
type: Property
label: is student at @en
lexical alias: studentAt.en
definition: Relates a person to a corporate body who is an educational institution that provides instruction to a person. @en
domain: C10004
toolkit label: student at @en
toolkit definition: A corporate body who is an educational institution that provides instruction to a person. @en
instruction number: 29.5
label: είναι φοιτητής σε @el
definition: Συνδέει ένα φυσικό πρόσωπο με ένα εκπαιδευτικό ίδρυμα, το οποίο παρέχει οδηγίες σε ένα φυσικό πρόσωπο. @el
toolkit label: φοιτητής σε @el
toolkit definition: Ένα εκπαιδευτικό ίδρυμα που παρέχει οδηγίες σε ένα φυσικό πρόσωπο. @el
definition: Setzt eine Person in Beziehung zu einer Bildungseinrichtung (Körperschaft), die einer Person Unterricht erteilt. @de
toolkit label: Studentin/Student an @de
toolkit definition: Eine Bildungseinrichtung (Körperschaft), die einer Person Unterricht erteilt. @de
label: er studerende på @da
definition: Relaterer en person til en korporation, som er en uddannelsesinstitution, som giver undervisning til en person. @da
toolkit label: studerende på @da
toolkit definition: Korporation, som er en uddannelsesinstitution, som giver undervisning til en person. @da
label: és estudiant a @ca
definition: Relaciona una persona amb una entitat corporativa que és una institució educativa que proporciona instrucció a una persona. @ca
toolkit label: estudiant a @ca
toolkit definition: Entitat corporativa que és una institució educativa que proporciona instrucció a una persona. @ca
definition: Liittää henkilön oppilaitokseen, joka antaa opetusta henkilölle.
toolkit label: oppilaitos
toolkit definition: Oppilaitos, joka antaa opetusta henkilölle.
toolkit label: student ved @no
toolkit definition: En korporasjon som er en utdanningsinstitusjon som gir en person opplæring. @no
label: ist Studentin/Student an @de
label: est un élève à @fr
definition: Met une personne en relation avec une collectivité qui consiste en un établissement d’enseignement fournissant un enseignement à une personne. @fr
toolkit label: élève à @fr
toolkit definition: Collectivité qui consiste en un établissement d’enseignement fournissant un enseignement à une personne. @fr
has element type: 2
label: tanulója a következőnek: @hu
definition: Hozzákapcsol egy személyt egy oktatási intézmény testülethez, amely oktatást nyújt egy személy számára. @hu
toolkit label: tanulója: @hu
toolkit definition: Egy oktatási intézmény testület, amely oktatást nyújt egy személy számára. @hu
label: er student ved @no
definition: Relaterer en person til en korporasjon som er en utdanningsinstitusjon som gir en person opplæring. @no
sub property of: henkilöön liittyvä yhteisö
label: is student aan @nl
definition: Relateert een persoon aan een corporatie die een onderwijsinstelling is die onderricht geeft aan een persoon. @nl
toolkit label: student aan @nl
toolkit definition: Een corporatie die een onderwijsinstelling is die onderricht geeft aan een persoon. @nl
label: هو طالب لـ @ar
definition: يربط شخصا بهيئة هي مؤسسة تعليمية تقدم التعليم لشخص. @ar
toolkit label: طالب في @ar
toolkit definition: هيئة هي مؤسسة تعليمية توفر التعليم لشخص. @ar
label: õppur asutuses @et
definition: Seostab isiku haridusasutusega, kes pakub isikule õpetust. @et
toolkit label: õppur asutuses @et
toolkit definition: Haridusasutus, kes pakub isikule õpetust. @et
label: è studente presso @it
definition: Correla una persona a un ente che è un'istituzione scolastica che fornisce istruzione a una persona. @it
toolkit label: studente presso @it
toolkit definition: Ente che è un'istituzione scolastica che fornisce istruzione a una persona. @it
label: ir izglītojies @lv
definition: Sasaista personu ar institūciju, kur persona studē. @lv
toolkit label: ir izglītojies @lv
toolkit definition: Institūcija, kur persona studē. @lv
label: 是……处的学生 @zh-hans
definition: 将一个个人与作为教育机构为一个个人提供教学的一个团体关联起来。 @zh-hans
toolkit label: ……处的学生 @zh-hans
toolkit definition: 作为教育机构为一个个人提供教学的一个团体 @zh-hans
label: … de/da öğrencidir @tr
definition: Bir kişiyi, bir kişiye eğitim veren bir eğitim kurumu olan bir tüzel kişi ile ilişkilendirir. @tr
toolkit label: … de/da öğrenci @tr
toolkit definition: Bir kişiye eğitim veren bir eğitim kurumu olan bir tüzel kişi. @tr
has subproperty: P50288

opiskelutoveri
status: Published
type: Property
label: has fellow student @en
lexical alias: fellowStudent.en
definition: Relates a person to a person who is an associate of another student who is also formally engaged in learning. @en
domain: C10004
toolkit label: fellow student @en
toolkit definition: A person who is an associate of another student who is also formally engaged in learning. @en
instruction number: 29.5
sub property of: henkilöön liittyvä henkilö
label: έχει συμφοιτητή @el
definition: Συνδέει ένα φυσικό πρόσωπο με έναν συμφοιτητή κάποιου άλλου φοιτητή που επίσης εμπλέκεται τυπικά στη μάθηση @el
toolkit label: συμφοιτητής @el
toolkit definition: Ένας συμφοιτητής κάποιου άλλου φοιτητή που επίσης εμπλέκεται τυπικά στη μάθηση. @el
definition: Setzt eine Person in Beziehung zu einer Studienkollegin/einem Studienkollegen (Person) einer anderen Studentin/eines anderen Studenten, die/der sich ebenfalls offiziell mit Studieren befasst. @de
toolkit label: Kommilitonin/Kommilitone @de
toolkit definition: Eine Studienkollegin/Ein Studienkollege (Person) einer anderen Studentin/eines anderen Studenten, die/der sich ebenfalls offiziell mit Studieren befasst. @de
label: har medstuderende @da
definition: Relaterer en person til en person, der er en anden students arbejdskammerat, som også er formelt beskæftigt med at studere. @da
toolkit label: medstuderende @da
toolkit definition: Person, der er en anden students arbejdskammerat, som også er formelt beskæftigt med at studere. @da
label: té com a company d’estudis @ca
definition: Relaciona una persona amb una persona que és un associat d’un altre estudiant que també es dedica formalment a l’aprenentatge. @ca
toolkit label: company d’estudis @ca
toolkit definition: Persona que és un associat d’un altre estudiant que també es dedica formalment a l’aprenentatge. @ca
definition: Liittää henkilön henkilöön, joka on toisen opiskelijan kollega, joka myös virallisesti opiskelee.
toolkit label: opiskelutoveri
toolkit definition: Henkilö, joka on toisen opiskelijan kollega, joka myös virallisesti opiskelee.
toolkit label: medstudent @no
toolkit definition: En bekjent av en annen student som også er under formell utdanning. @no
label: hat Kommilitonin/Kommilitonen @de
label: a pour compagnon d’études @fr
definition: Met une personne en relation avec une personne qui est un associé d’un autre élève qui est aussi engagé dans un processus formel d’apprentissage. @fr
toolkit label: compagnon d’études @fr
toolkit definition: Personne qui est un associé d’un autre élève qui est aussi engagé dans un processus formel d’apprentissage. @fr
has element type: 2
label: tanulótársa a következő: @hu
definition: Hozzákapcsol egy személyt egy személyhez, aki egy másik, a tanulásban szintén formálisan részt vevő tanulónak a társa. @hu
toolkit label: tanulótárs: @hu
toolkit definition: Egy személy, aki egy másik, a tanulásban szintén formálisan részt vevő tanulónak a társa. @hu
label: har medstudent @no
definition: Relaterer en person til en bekjent av en annen student som også er under formell utdanning. @no
label: heeft medestudent @nl
definition: Relateert een persoon aan een persoon die is een geassocieerde van een andere student die ook formeel betrokken is bij leren. @nl
toolkit label: medestudent @nl
toolkit definition: Een persoon die is een geassocieerde van een andere student die ook formeel betrokken is bij leren. @nl
label: له زميل دراسة @ar
definition: يربط شخصا بزميل طالب آخر ينخرط أيضًا في التعلم بصورة رسمية. @ar
toolkit label: زميل دراسة @ar
toolkit definition: زمالة طالب آخر يشارك أيضًا بشكل رسمي في التعلم. @ar
label: õpingukaaslane @et
definition: Seostab isiku teise õppuriga, kes samuti vormiliselt õpib. @et
toolkit label: õpingukaaslane @et
toolkit definition: Teine õppur, kes samuti vormiliselt õpib. @et
label: ha come studente compagno @it
definition: Correla una persona a un collega di un altro studente che è anche formalmente impegnato nell'apprendere. @it
toolkit label: compagno di studi @it
toolkit definition: Collega di un altro studente che è anche formalmente impegnato nell'apprendere. @it
label: studiju biedrs @lv
definition: Sasaista personu ar personu, kura vienlaicīgi ar citu studentu studēja mācību iestādē. @lv
toolkit label: studiju biedrs @lv
toolkit definition: Persona, kura vienlaicīgi ar citu studentu studēja mācību iestādē. @lv
label: 有同学 @zh-hans
definition: 将一个个人与作为另一个也是正式参加学习的学生的伙伴的一个个人关联起来。 @zh-hans
toolkit label: 同学 @zh-hans
toolkit definition: 作为另一个也是正式参加学习的学生的伙伴的一个个人 @zh-hans
label: okul arkadaşı ile ilişkilidir @tr
definition: Bir kişiyi, aynı zamanda resmi olarak öğrenmeyle meşgul olan başka bir öğrencinin arkadaşı olan bir kişi ile ilişkilendirir. @tr
toolkit label: okul arkadaşı @tr
toolkit definition: Resmi olarak öğrenmeye katılan başka bir öğrencinin arkadaşı olan bir kişi @tr
has subproperty: P50279

oppiarvon myöntävä yhteisö teoksessa
status: Published
label: is degree granting institution of @en
definition: Relates a corporate body to a work that is a thesis or dissertation associated with an academic degree that is approved by a corporate body. @en
type: Property
domain: C10005
sub property of: teoksen tekijä (yhteisö) teoksessa
lexical alias: degreeGrantingInstitutionOf.en
label: est une institution conférant un grade universitaire de @fr
definition: Met une collectivité en relation avec une œuvre qui consiste en une thèse ou un mémoire associé à un grade universitaire qui est approuvé par une collectivité. @fr
toolkit label: institution conférant un grade universitaire de @fr
toolkit definition: Œuvre qui consiste en une thèse ou un mémoire associé à un grade universitaire qui est approuvé par une collectivité. @fr
toolkit label: degree granting institution of @en
toolkit definition: A work that is a thesis or dissertation associated with an academic degree that is approved by a corporate body. @en
instruction number: 18.5
label: είναι ίδρυμα χορήγησης πτυχίου του @el
definition: Συνδέει ένα συλλογικό όργανο που χορηγεί ένα ανώτερου ακαδημαϊκού επιπέδου πτυχίο, με ένα έργο. @el
toolkit label: ίδρυμα χορήγησης πτυχίου του @el
toolkit definition: Ένα ανώτερου εκπαιδευτικού επιπέδου πτυχίο το οποίο χορηγείται από ένα συλλογικό όργανο. @el
definition: Setzt eine Körperschaft in Beziehung zu einer Hochschulschrift (Werk), die von einer Körperschaft genehmigt wird und mit einem akademischen Grad in Verbindung steht. @de
toolkit label: Grad-verleihende Institution von @de
toolkit definition: Eine Hochschulschrift (Werk), die von einer Körperschaft genehmigt wird und mit einem akademischen Grad in Verbindung steht. @de
label: er gradtildelende institution af @da
definition: Relaterer en korporation til et værk, som er en afhandling for en akademisk grad, som er godkendt af en korporation. @da
toolkit label: gradtildelende institution af @da
toolkit definition: Værk, som er en afhandling for en akademisk grad, som er godkendt af en korporation. @da
label: és institució que concedeix un títol acadèmic de @ca
definition: Relaciona una entitat corporativa amb una obra que és una tesi o una dissertació associada amb un grau acadèmic i que és aprovada per una entitat corporativa. @ca
toolkit label: institució que concedeix un títol acadèmic de @ca
toolkit definition: Obra que és una tesi o una dissertació associada amb un grau acadèmic i que és aprovada per una entitat corporativa. @ca
definition: Liittää yhteisön teokseen, joka on yhteisön hyväksymä akateemisen oppiarvon opinnäyte tai väitöskirja.
toolkit label: oppiarvon myöntävä yhteisö teoksessa
toolkit definition: Teos, joka on yhteisön hyväksymä akateemisen oppiarvon opinnäyte tai väitöskirja.
toolkit label: tildelende institusjon for @no
toolkit definition: Et verk som er en avhandling for en akademisk grad som tildeles en korporasjon. @no
label: ist grad-verleihende Institution von @de
has element type: 2
label: tudományos fokozatot adó intézménye a következőnek: @hu
definition: Hozzákapcsol egy testületet egy műhöz, amely egy tudományos fokozat elnyeréséért benyújtott szakdolgozat vagy disszertáció, amelyet a testület jóváhagyott. @hu
toolkit label: tudományos fokozatot adó intézménye a következőnek: @hu
toolkit definition: Egy mű, amely egy tudományos fokozat elnyeréséért benyújtott szakdolgozat vagy disszertáció, amelyet a testület jóváhagyott. @hu
label: er tildelende institusjon for @no
definition: Relaterer en korporasjon til et verk som er en avhandling for en akademisk grad som tildeles en korporasjon. @no
label: is graadverstrekkende instantie van @nl
definition: Relateert een corporatie aan een werk dat een scriptie of proefschrift is voor een academische graad dat is goedgekeurd door een corporatie. @nl
toolkit label: graadverstrekkende instantie van @nl
toolkit definition: Een werk dat een scriptie of proefschrift is voor een academische graad dat is goedgekeurd door een corporatie. @nl
label: هي مؤسسة مانحة درجة لـ @ar
definition: يربط هيئة بعمل عبارة عن أطروحة أو رسالة جامعية ذات صلة بدرجة أكاديمية معتمدة من هيئة. @ar
toolkit label: مؤسسة مانحة درجة لـ @ar
toolkit definition: عمل عبارة عن أطروحة أو رسالة جامعية ذات صلة بدرجة أكاديمية معتمدة من هيئة. @ar
label: kraadi andev asutus teoses @et
definition: Seostab asutuse akadeemilise kraadi taotlemiseks esitatud teosega, mille asutus on heaks kiitnud. @et
toolkit label: kraadi andev asutus teoses @et
toolkit definition: Akadeemilise kraadi taotlemiseks esitatud teos, mille asutus on heaks kiitnud. @et
label: è istituzione che rilascia un titolo accademico di @it
definition: Correla un ente a un'opera che è una tesi per una laura universitaria approvata da un ente. @it
toolkit label: istituzione che rilascia un titolo accademico di @it
toolkit definition: Opera che è una tesi per una laurea universitaria approvata da un ente. @it
label: ir grāda piešķīrējinstitūcija @lv
definition: Sasaista institūciju ar darbu, par ko ir saņemts akadēmiskais grāds, ko piešķīrusi institūcija. @lv
toolkit label: ir grāda piešķīrējinstitūcija @lv
toolkit definition: Akadēmiskais grāds, ko piešķīrusi institūcija. @lv
label: 是……的学位授予机构 @zh-hans
definition: 将一个团体与一种作为被一个机构批准的学位论文的作品关联起来。 @zh-hans
toolkit label: ……的学位授予机构 @zh-hans
toolkit definition: 一种作为被一个机构批准的学位论文的作品 @zh-hans
label: tez onaylayan kurumudur @tr
definition: Bir tüzel kişiyi, tarafından onaylanan ve akademik bir unvanla ilişkili olan yüksek lisans ya da doktora tezi eseri ile ilişkilendirir. @tr
toolkit label: diploma veren kurum @tr
toolkit definition: Bir tüzel kişi tarafından onaylanan ve akademik derece ile bağlantılı olan yüksek lisans ya da doktora tezi çalışması. @tr
has subproperty: P50003

opinnäytteen tarkastaja teoksessa
status: Published
type: Property
label: is degree committee member of @en
lexical alias: degreeCommitteeMemberOf.en
definition: Relates a person to a work that involves a responsibility for serving on a committee that supervises a thesis or dissertation of a student. @en
domain: C10004
toolkit label: degree committee member of @en
toolkit definition: A work that involves a responsibility for serving on a committee that supervises a thesis or dissertation of a student. @en
instruction number: 18.5
label: είναι μέλος συμβουλευτικής επιτροπής του @el
definition: Συνδέει ένα φυσικό πρόσωπο, το οποίο συνιστά μέλος επιτροπής εποπτείας διατριβής ή διδακτορικής έρευνας, με ένα έργο. @el
toolkit label: μέλος συμβουλευτικής επιτροπής του @el
toolkit definition: Ένα έργο που περιλαμβάνει την ευθύνη ενός μέλους επιτροπής που επιβλέπει μια διατριβή ή διδακτορική έρευνα ενός έργου. @el
definition: Setzt eine Person in Beziehung zu einem Werk, das mit einer Verantwortung verbunden ist, Mitglied eines Ausschusses zu sein, der eine Hochschulschrift von einer Studentin/einem Studenten beaufsichtigt. @de
toolkit label: Mitglied eines Graduierungsausschusses von @de
toolkit definition: Ein Werk, das mit einer Verantwortung verbunden ist, Mitglied eines Ausschusses zu sein, der eine Hochschulschrift von einer Studentin/einem Studenten beaufsichtigt. @de
label: er medlem af kandidatudvalg @da
definition: Relaterer en person til et værk, som involverer et ansvar for at være medlem af et udvalg, som fører tilsyn med en students speciale eller afhandling. @da
toolkit label: medlem af kandidatudvalg i @da
toolkit definition: Værk, som involverer et ansvar for at være medlem af et udvalg, som fører tilsyn med en students speciale eller afhandling. @da
label: és membre d’un comitè acadèmic de @ca
definition: Relaciona una persona amb una obra que implica una responsabilitat de formar part d’un comitè que supervisa una tesi o una dissertació d’un estudiant. @ca
toolkit label: membre d’un comitè acadèmic de @ca
toolkit definition: Obra que implica una responsabilitat de formar part d’un comitè que supervisa una tesi o una dissertació d’un estudiant. @ca
definition: Liittää henkilön teokseen, jossa henkilö on vastuussa akateemisen opinnäytteen tai väitöskirjan tarkastaneessa komiteassa toimimisesta.
toolkit label: opinnäytteen tarkastaja teoksessa
toolkit definition: Teos, jossa henkilö on vastuussa akateemisen opinnäytteen tai väitöskirjan tarkastaneessa komiteassa toimimisesta.
toolkit label: medlem av bedømmelseskomité for @no
toolkit definition: Et verk som involverer ansvar for å delta i en komité som veileder en students avhandling eller masteroppgave. @no
label: ist Mitglied eines Graduierungsausschusses von @de
label: est un membre de comité de thèse de @fr
definition: Met une personne en relation avec une œuvre qui comporte une responsabilité consistant à siéger à un comité qui supervise une thèse ou un mémoire d’un étudiant. @fr
toolkit label: membre de comité de thèse de @fr
toolkit definition: Œuvre qui comporte une responsabilité consistant à siéger à un comité qui supervise une thèse ou un mémoire d’un étudiant. @fr
sub property of: teoksen tekijä (henkilö) teoksessa
has element type: 2
label: diplomabizottsági tagja a következőnek: @hu
definition: Hozzákapcsol egy személyt egy műhöz, amelyhez hozzátartozik egy olyan bizottságban való szolgálat felelőssége, amely felügyeli egy hallgató szakdolgozatát vagy disszertációját. @hu
toolkit label: diplomabizottsági tagja: @hu
toolkit definition: Egy mű, amelyhez hozzátartozik egy olyan bizottságban való szolgálat felelőssége, amely felügyeli egy hallgató szakdolgozatát vagy disszertációját. @hu
alternative label: tarkastajana opinnäytteessä
label: er medlem av bedømmelseskomité for @no
definition: Relaterer en person til et verk som involverer ansvar for å delta i en komité som veileder en students avhandling eller masteroppgave. @no
label: is graad commissie-lid van @nl
definition: Relateert een persoon aan een werk dat met zich meebrengt een verantwoordelijkheid voor zitting hebben in een commissie die een scriptie of proefschrift van een student begeleidt. @nl
toolkit label: graad commissie-lid van @nl
toolkit definition: Een werk dat met zich meebrengt een verantwoordelijkheid voor zitting hebben in een commissie die een scriptie of proefschrift van een student begeleidt. @nl
label: هو عضو لجنة تمنح درجة أكاديمية لـ @ar
definition: يربط شخصا بعمل يترتب عليه مسئولية العمل في لجنة تشرف على أطروحة أو رسالة جامعية لطالب. @ar
toolkit label: عضو لجنة درجة أكاديمية @ar
toolkit definition: عمل يترتب عليه مسئولية العمل في لجنة تشرف على رسالة جامعية أو أطروحة لطالب. @ar
label: kraadinõukogu liige teoses @et
definition: Seostab isiku teosega, mis sisaldab vastutust osalemise eest üliõpilase väitekirja ülevaatavas nõukogus. @et
toolkit label: kraadinõukogu liige teoses @et
toolkit definition: Teos, mis sisaldab vastutust osalemise eest üliõpilase väitekirja ülevaatavas nõukogus. @et
label: è membro della commissione di laurea di @it
definition: Correla una persona a un'opera che implica la responsabilità per la partecipazione a una commissione che supervisiona una tesi o dissertazione di uno studente. @it
toolkit label: membro della commissione di laurea di @it
toolkit definition: Opera che implica la responsabilità per la partecipazione a una commissione che supervisiona una tesi o dissertazione di uno studente. @it
label: ir grāda piešķīrējkomisijas dalībnieks @lv
definition: Sasaista personu ar darbu, kas ietver personas ieguldījumu, darbojoties komisijā, kas piešķir akadēmisko grādu. @lv
toolkit label: ir grāda piešķīrējkomisijas dalībnieks @lv
toolkit definition: Darbs, kas ietver personas ieguldījumu, darbojoties komisijā, kas piešķir akadēmisko grādu. @lv
label: 是……的学位委员会成员 @zh-hans
definition: 将一个个人与涉及指导学生论文的一个委员会中的责任的一种作品关联起来。 @zh-hans
toolkit label: ……的学位委员会成员 @zh-hans
toolkit definition: 涉及指导学生论文的一个委员会中的责任的一种作品 @zh-hans
label: tez komitesi üyesidir @tr
definition: Bir kişiyi, bir öğrencinin tezini veya bitirme tezini denetleyen bir komitede görev yapma sorumluluğunu içeren bir eserle ilişkilendirir. @tr
toolkit label: bölüm komitesi üyesi @tr
toolkit definition: Bir öğrencinin tezini veya doktora çalışmasını denetleyen bir komitede görev alma sorumluluğunu içeren bir çalışma. @tr
has subproperty: P50257

loppututkinnon suorittanut
status: Published
type: Property
label: has graduate @en
lexical alias: graduate.en
definition: Relates a corporate body to a person who receives an academic degree from a granting institution or faculty. @en
domain: C10005
toolkit label: graduate @en
toolkit definition: A person who receives an academic degree from a granting institution or faculty. @en
toolkit label: graduado @es
toolkit definition: Una persona que recibe un grado académico de una institución o facultad otorgante. @es
instruction number: 29.5
label: έχει πτυχιούχο @el
definition: Συνδέει ένα συλλογικό όργανο με ένα φυσικό πρόσωπο που λαμβάνει ένα ανώτερου εκπαιδευτικού επιπέδου πτυχίο από ένα ίδρυμα ή σχολή. @el
toolkit label: πτυχιούχος @el
toolkit definition: Ένα φυσικό πρόσωπο που λαμβάνει ένα ανώτερου εκπαιδευτικού επιπέδου πτυχίο από ένα ίδρυμα ή σχολή. @el
definition: Setzt eine Körperschaft in Beziehung zu einer Person, die einen akademischen Grad von einer verleihenden Institution oder Fakultät erhält. @de
toolkit label: Graduierte/Graduierter @de
toolkit definition: Eine Person, die einen akademischen Grad von einer verleihenden Institution oder Fakultät erhält. @de
label: har dimittend @da
definition: Relaterer en korporation til en person, som modtager en akademsk grad fra en tildelende institution eller fakultet. @da
toolkit label: dimittend @da
toolkit definition: Person, som modtager en akademisk grad fra en tildelende institution eller fakultet. @da
label: té com a titulat @ca
definition: Relaciona una entitat corporativa amb una persona que rep una titulació acadèmica d’una institució que concedeix un títol acadèmic. @ca
toolkit label: titulat @ca
toolkit definition: Persona que rep una titulació acadèmica d’una institució que concedeix un títol acadèmic. @ca
definition: Liittää yhteisön henkilöön, jolle laitos tai tiedekunta on myöntänyt akateemisen loppututkinnon.
toolkit label: loppututkinnon suorittanut
toolkit definition: Henkilö, jolle laitos tai tiedekunta on myöntänyt akateemisen loppututkinnon.
toolkit label: akademiker @no
toolkit definition: En person som mottar en akademisk grad ved en utdanningsinstitusjon. @no
label: hat Graduierte/Graduierten @de
label: a pour diplômé @fr
definition: Met une collectivité en relation avec une personne qui reçoit un grade universitaire d’une institution ou d’une faculté conférant un grade universitaire. @fr
toolkit label: diplômé @fr
toolkit definition: Personne qui reçoit un grade universitaire d’une institution ou d’une faculté conférant un grade universitaire. @fr
has element type: 2
sub property of: yhteisöön liittyvä henkilö
label: diplomása a következő: @hu
definition: Hozzákapcsol egy testületet egy személyhez, aki tudományos fokozatot kap egy annak odaítélésére jogosult intézménytől vagy egyetemi kartól. @hu
toolkit label: diplomás: @hu
toolkit definition: Egy személy, aki tudományos fokozatot kap egy annak odaítélésére jogosult intézménytől vagy egyetemi kartól. @hu
label: har akademiker @no
definition: Relaterer en korporasjon til en person som mottar en akademisk grad ved en utdanningsinstitusjon. @no
label: heeft afgestudeerde @nl
definition: Relateert een corporatie aan een persoon die een academische graad ontvangt van een verstrekkende instelling of faculteit. @nl
toolkit label: afgestudeerde @nl
toolkit definition: Een persoon die een academische graad ontvangt van een verstrekkende instelling of faculteit. @nl
label: لها خريج @ar
definition: يربط هيئة بشخص يحصل على درجة أكاديمية من مؤسسة أو كلية مانحة. @ar
toolkit label: خريج @ar
toolkit definition: شخص يحصل على درجة أكاديمية من مؤسسة أو كلية مانحة. @ar
label: kraadi saanud isik @et
definition: Seostab asutuse isikuga, kes on saanud akadeemilise kraadi kraadi andvalt asutuselt või teaduskonnalt. @et
toolkit label: kraadi saanud isik @et
toolkit definition: Isik, kes on saanud akadeemilise kraadi kraadi andvalt asutuselt või teaduskonnalt. @et
label: ha come laureato @it
definition: Collega un ente a una persona che riceve un grado accademico da un'istituzione o facoltà che lo conferisce. @it
toolkit label: laureato @it
toolkit definition: Persona che riceve un grado accademico da un'istituzione o facoltà che lo conferisce. @it
alternative label: απόφοιτος @el
label: absolvents @lv
definition: Sasaista institūciju ar personu, kura ieguvusi akadēmisko grādu augstskolā. @lv
toolkit label: absolvents @lv
toolkit definition: Persona, kura ieguvusi akadēmisko grādu augstskolā. @lv
label: 有毕业生 @zh-hans
definition: 将一个团体与从一个授予机构或院系获得学位的一个个人关联起来。 @zh-hans
toolkit label: 毕业生 @zh-hans
toolkit definition: 从一个授予机构或院系获得学位的一个个人 @zh-hans
label: mezun ile ilişkilidir @tr
definition: Bir tüzel kişiyi, bir enstitü veya fakülteden akademik derece alan bir kişiyle ilişkilendirir. @tr
toolkit label: mezun @tr
toolkit definition: Bir enstitü veya fakülteden akademik derece alan bir kişi. @tr
has subproperty: P50252

ohjaaja (toimija) teoksessa
status: Published
label: is director agent of @en
definition: Relates an agent to a work that involves a responsibility of an agent for the general management and supervision of a filmed performance, a radio or television program, etc. @en
type: Property
domain: C10002
sub property of: toimijaan liittyvä teos
lexical alias: directorAgentOf.en
label: est un agent réalisateur de @fr
definition: Met un agent en relation avec une œuvre qui comporte une responsabilité de la part d’un agent consistant à assurer la gestion et la supervision générales d’une prestation filmée, d’une émission de radio ou de télévision, etc. @fr
toolkit label: agent réalisateur de @fr
toolkit definition: Œuvre qui comporte une responsabilité de la part d’un agent consistant à assurer la gestion et la supervision générales d’une prestation filmée, d’une émission de radio ou de télévision, etc. @fr
toolkit label: director agent of @en
toolkit definition: A work that involves a responsibility of an agent for the general management and supervision of a filmed performance, a radio or television program, etc. @en
instruction number: 18.5
label: είναι σκηνοθέτης φορέας του @el
definition: Συνδέει έναν φορέα υπεύθυνο για τη γενική διαχείριση και εποπτεία μιας κινηματογραφικής παράστασης, ενός ραδιοφωνικού ή τηλεοπτικού προγράμματος κ.λπ., με ένα έργο. @el
toolkit label: σκηνοθέτης φορέας του @el
toolkit definition: Ένα έργο που περιλαμβάνει την ευθύνη για τη γενική διαχείριση και εποπτεία μιας κινηματογραφικής παράστασης, ενός ραδιοφωνικού ή τηλεοπτικού προγράμματος κ.λπ. @el
definition: Setzt einen Akteur in Beziehung zu einem Werk, bei dem ein Akteur für das allgemeine Management und die Leitung einer verfilmten Darbietung, einer Hörfunk- oder Fernsehsendung und so weiter verantwortlich ist. @de
toolkit label: Akteur als Regisseurin/Regisseur von @de
toolkit definition: Ein Werk, bei dem ein Akteur für das allgemeine Management und die Leitung einer verfilmten Darbietung, einer Hörfunk- oder Fernsehsendung und so weiter verantwortlich ist. @de
label: er agent, som er instruktør af @da
definition: Relaterer en agent til et værk, som involverer en agents ansvar for den generelle ledelse af- og tilsyn med en filmoptagelse, et radio- eller tv-program etc. @da
toolkit label: agent, som er instruktør af @da
toolkit definition: Værk, som involverer en agents ansvar for den generelle ledelse af- og tilsyn med en filmoptagelse, et radio- eller tv-program etc. @da
label: és agent realitzador de @ca
definition: Relaciona un agent amb una obra que implica una responsabilitat d’un agent en la gestió general i la supervisió d’una actuació filmada, d’un programa radiofònic o de televisió, etc. @ca
toolkit label: agent realitzador de @ca
toolkit definition: Obra que implica una responsabilitat d’un agent en la gestió general i la supervisió d’una actuació filmada, d’un programa radiofònic o de televisió, etc. @ca
definition: Liittää toimijan teokseen, jossa toimija on vastuussa elokuvatun esityksen, radio- tai televisio-ohjelman tms. yleisestä johtamisesta.
toolkit label: ohjaaja (toimija) teoksessa
toolkit definition: Teos, jossa toimija on vastuussa elokuvatun esityksen, radio- tai televisio-ohjelman tms. yleisestä johtamisesta.
toolkit label: regissør av (agent) @no
toolkit definition: Et verk som involverer ansvar for en agent i form av generell ledelse av en filmet forestilling, et radio- eller fjernsynsprogram, etc. @no
label: ist Akteur als Regisseurin/Regisseur von @de
has element type: 2
label: rendező ágense a következőnek: @hu
definition: Hozzákapcsol egy ágenst egy műhöz, amelyhez hozzátartozik egy ágens felelőssége egy filmforgatás, egy rádió- vagy televízióműsor, stb. általános menedzseléséért és felügyeletéért. @hu
toolkit label: rendező ágense: @hu
toolkit definition: Egy mű, amelyhez hozzátartozik egy ágens felelőssége egy filmforgatás, egy rádió- vagy televízióműsor, stb. általános menedzseléséért és felügyeletéért. @hu
alternative label: director of @en
alternative label: ohjaajana taltioinnissa
label: er regissør av (agent) @no
definition: Relaterer en agent til et verk som involverer ansvar for en agent i form av generell ledelse av en filmet forestilling, et radio- eller fjernsynsprogram, etc. @no
alternative label: regissør av @no
label: is regisseur-actor van @nl
definition: Relateert een actor aan een werk dat met zich meebrengt een verantwoordelijkheid van een actor voor het algemene beheer en toezicht van een gefilmde uitvoering, een radio- of televisieprogramma etc. @nl
toolkit label: regisseur-actor van @nl
toolkit definition: Een werk dat met zich meebrengt een verantwoordelijkheid van een actor voor het algemene beheer en toezicht van een gefilmde uitvoering, een radio- of televisieprogramma etc. @nl
label: هو وكيل مخرج لـ @ar
definition: يربط وكيلا بعمل يترتب عليه مسئولية وكيل عن الإدارة العامة، والإشراف على أداء مصور، أو برنامج إذاعي أو تليفزيوني، إلخ. @ar
alternative label: مخرج @ar
toolkit label: وكيل مخرج @ar
toolkit definition: عمل يترتب عليه مسئولية وكيل عن الإدارة العامة، والإشراف على أداء مصور، أو برنامج إذاعي أو تليفزيوني، إلخ. @ar
alternative label: realitzador de @ca
alternative label: instruktør af @da
label: režissöör (tegija) teoses @et
definition: Seostab tegija teosega, mis sisaldab tegija vastutust filmitava etenduse, raadio- või telesaate vms üldise juhtimise ja juhendamise eest. @et
alternative label: režissöör teoses @et
toolkit label: režissöör (tegija) teoses @et
toolkit definition: Teos, mis sisaldab tegija vastutust filmitava etenduse, raadio- või telesaate vms üldise juhtimise ja juhendamise eest. @et
alternative label: rendezője: @hu
label: è direttore agente di @it
definition: Correla un agente a una manifestazione che implica la responsabilità di un agente per la gestione e supervisione generale di un'interpretazione filmata, programma radio o televisivo, etc. @it
alternative label: direttore di @it
toolkit label: direttore agente di @it
toolkit definition: Manifestazione che implica la responsabilità di un agente per la gestione e supervisione generale di un'interpretazione filmata, programma radio o televisivo, etc. @it
alternative label: σκηνοθέτης του @el
alternative label: réalisateur de @fr
label: ir režisors (aģents) @lv
definition: Sasaista aģentu ar darbu, kas ietver aģenta atbildību par vispārējo vadību un par filmētā materiāla, radio vai televīzijas raidījuma, u.tml. uzraudzību. @lv
toolkit label: ir režisors (aģents) @lv
toolkit definition: Darbs, kas ietver aģenta atbildību par vispārējo vadību un par filmētā materiāla, radio vai televīzijas raidījuma, u.tml. uzraudzību. @lv
alternative label: Regisseur von @de
alternative label: ……的导演 @zh-hans
toolkit label: ……的导演行为者 @zh-hans
toolkit definition: 涉及电影表演、广播或电视节目等的全面管理和监督的一个行为者的责任的一种作品 @zh-hans
toolkit label: yönetmen temsilcisi @tr
toolkit definition: Filme alınmış bir performansın, bir radyo veya televizyon programı vb. genel yönetimi ve denetimi için bir temsilcinin sorumluluğunda olan bir eser. @tr
has subproperty: ohjaaja (yhteistoimija) teoksessa

kuvaaja (toimija) teoksessa
status: Published
label: is director agent of photography of @en
definition: Relates an agent to a work that involves a responsibility of an agent for capturing images, either electronically or on film or video stock, and often selecting and arranging the lighting. @en
type: Property
scope note: A director of photography for a movie is also called a chief cinematographer. @en
domain: C10002
sub property of: toimijaan liittyvä teos
lexical alias: directorAgentOfPhotographyOf.en
label: est un agent directeur de la photographie de @fr
definition: Met un agent en relation avec une œuvre qui comporte une responsabilité de la part d’un agent consistant à capter des images, de manière électronique ou bien sur film ou vidéo, et qui, souvent, choisit et dispose l’éclairage. @fr
scope note: Un directeur de la photographie pour un film est également appelé un chef opérateur de prise de vue. @fr
toolkit label: agent directeur de la photographie de @fr
toolkit definition: Œuvre qui comporte une responsabilité de la part d’un agent consistant à capter des images, de manière électronique ou bien sur film ou vidéo, et qui, souvent, choisit et dispose l’éclairage. @fr
toolkit label: director agent of photography of @en
toolkit definition: A work that involves a responsibility of an agent for capturing images, either electronically or on film or video stock, and often selecting and arranging the lighting. @en
instruction number: 18.5
label: είναι διευθυντής φωτογραφίας φορέας του @el
definition: Συνδέει έναν φορέα ο οποίος συλλαμβάνει τις εικόνες είτε ηλεκτρονικά είτε με φιλμ είτε με βίντεο και συχνά επιλέγει και οργανώνει τον φωτισμό, με ένα έργο. @el
scope note: Ένας διευθυντής φωτογραφίας για μια ταινία ονομάζεται επίσης επικεφαλής κινηματογραφιστής. @el
toolkit label: διευθυντής φωτογραφίας φορέας του @el
toolkit definition: Ένα έργο που περιλαμβάνει την ευθύνη της σύλληψης των εικόνων, είτε ηλεκτρονικά είτε με φιλμ είτε με βίντεο και συχνά της επιλογής και οργάνωσης του φωτισμού. @el
definition: Setzt einen Akteur in Beziehung zu einem Werk, bei dem ein Akteur für die Aufzeichnung von Bildern, entweder elektronisch oder auf Film- oder Videomaterial, verantwortlich ist und häufig die Belichtung auswählt und arrangiert. @de
scope note: Eine Kamerafrau/Ein Kameramann für einen Film wird auch als "Bildregisseurin/Bildregisseur" bezeichnet. @de
toolkit label: Akteur als Kamerafrau/Kameramann von @de
toolkit definition: Ein Werk, bei dem ein Akteur für die Aufzeichnung von Bildern, entweder elektronisch oder auf Film- oder Videomaterial, verantwortlich ist und häufig die Belichtung auswählt und arrangiert. @de
label: er agent, som er filmfotograf af @da
definition: Relaterer en agent til et værk, som involverer en agents ansvar for at optage billeder, enten elektronisk eller på film eller video, og ofte også for at udvælge og arrangere lyssætningen. @da
scope note: Filmfotografen på en film kaldes også for en cheffotograf. @da
toolkit label: agent, som er filmfotograf af @da
toolkit definition: Værk, som involverer en agents ansvar for at optage billeder, enten elektronisk eller på film eller video, og ofte også for at udvælge og arrangere lyssætningen. @da
label: és agent director de fotografia de @ca
definition: Relaciona un agent amb una obra que implica una responsabilitat d’un agent en la captura d’imatges, ja sigui electrònicament o sobre pel·lícula o vídeo, i que sovint selecciona i organitza la il·luminació. @ca
toolkit label: agent director de fotografia de @ca
toolkit definition: Obra que implica una responsabilitat d’un agent en la captura d’imatges, ja sigui electrònicament o sobre pel·lícula o vídeo, i que sovint selecciona i organitza la il·luminació. @ca
definition: Liittää toimijan teokseen, jossa toimija on vastuussa kuvien tallentamisesta joko sähköisesti tai filmille tai videolle, usein myös valaistuksen valitsemisesta ja järjestämisestä.
scope note: Elokuvan kuvaajaa kutsutaan myös elokuvaajaksi.
toolkit label: kuvaaja (toimija) teoksessa
toolkit definition: Teos, jossa toimija on vastuussa kuvien tallentamisesta joko sähköisesti tai filmille tai videolle, usein myös valaistuksen valitsemisesta ja järjestämisestä.
toolkit label: filmfotograf for (agent) @no
toolkit definition: Et verk som involverer ansvar for en agent i form av å filme levende bilder, enten elektronisk eller på film, og ofte valg og arrangement av lyssetting. @no
label: ist Akteur als Kamerafrau/Kameramann von @de
has element type: 2
label: operatőr ágense a következőnek: @hu
definition: Hozzákapcsol egy ágenst egy műhöz, amelyhez hozzátartozik egy ágens felelőssége képek elektronikusan, filmen vagy videoállományon történő rögzítéséért, gyakran a világítás kiválasztásáért és elrendezéséért is. @hu
scope note: operatőr ágense: @hu
toolkit label: Egy mű, amelyhez hozzátartozik egy ágens felelőssége képek elektronikusan, filmen vagy videoállományon történő rögzítéséért, gyakran a világítás kiválasztásáért és elrendezéséért is. @hu
toolkit definition: operatőre: @hu
alternative label: director of photography of @en
alternative label: kuvaajana teoksessa
label: er filmfotograf for (agent) @no
definition: Relaterer en agent til et verk som involverer ansvar for en agent i form av å filme levende bilder, enten elektronisk eller på film, og ofte valg og arrangement av lyssetting. @no
scope note: En filmfotograf for en film kalles også sjefsfotograf. @no
alternative label: filmfotograf for @no
label: is cameraregisseur-actor van @nl
definition: Relateert een actor aan een werk dat met zich meebrengt een verantwoordelijkheid van een actor voor het vastleggen van beelden, elektronisch of op film- of videomateriaal, en vaak het selecteren en arrangeren van de belichting. @nl
scope note: Een cameraregisseur bij een film wordt ook director of photography of hoofdcinematograaf genoemd. @nl
toolkit label: cameraregisseur-actor van @nl
toolkit definition: Een werk dat met zich meebrengt een verantwoordelijkheid van een actor voor het vastleggen van beelden, elektronisch of op film- of videomateriaal, en vaak het selecteren en arrangeren van de belichting. @nl
label: هو وكيل مدير التصوير لـ @ar
definition: يربط وكيلا بعمل يترتب عليه مسئولية وكيل عن التقاط الصور، إما إلكترونيًا أو في فيلم أو في مقاطع فيديو، وغالبا ما يكون مسئولا عن اختيار الإضاءة وتوزيعها. @ar
scope note: ويطلق أيضًا على مدير تصوير الفيلم كبير المصورين السينمائيين . @ar
toolkit label: هو وكيل مدير التصوير لـ @ar
toolkit definition: يربط وكيلا بعمل يترتب عليه مسئولية وكيل عن التقاط الصور، إما إلكترونيًا أو في فيلم أو في مقاطع فيديو، وغالبا ما يكون مسئولا عن اختيار الإضاءة وتوزيعها. @ar
scope note: Un director de fotografia d’una pel·lícula també s’anomena primer operador. @ca
alternative label: director de fotografia de @ca
alternative label: filmfotograf af @da
label: operaator-lavastaja (tegija) teoses @et
definition: Seostab tegija teosega, mis sisaldab tegija vastutust pildi jäädvustamise eest kas elektrooniliselt või filmi- või videolindile ning sageli valgustuse valimise ja ülesseadmise eest. @et
scope note: Filmi operaator-lavastajat nimetatakse inglise keeles sageli ka chief cinematographer. @et
alternative label: operaator-lavastaja teoses @et
toolkit label: operaator-lavastaja (tegija) teoses @et
toolkit definition: Teos, mis sisaldab tegija vastutust pildi jäädvustamise eest kas elektrooniliselt või filmi- või videolindile ning sageli valgustuse valimise ja ülesseadmise eest. @et
alternative label: Egy film operatőrét vezető operatőrnek is nevezik. @hu
label: è direttore della fotografia agente di @it
definition: Correla un agente a un'opera che implica la responsabilità di un agente per l'acquisizione di immagini, elettronicamente o su pellicola o video, e spesso nella scelta e organizzazione dell'illuminazione. @it
scope note: Un direttore della fotografia di un film è anche definito capo cameraman. @it
alternative label: direttore di fotografia di @it
toolkit label: agente direttore di fotografia di @it
toolkit definition: Opera che implica la responsabilità di un agente per l'acquisizione di immagini, elettronicamente o su pellicola o video, e spesso nella scelta e organizzazione dell'illuminazione. @it

ohjaaja (yhteistoimija) teoksessa
status: Published
label: is director collective agent of @en
lexical alias: directorCollectiveAgentOf.en
definition: Relates a collective agent to a work that involves a responsibility of a collective agent for the general management and supervision of a filmed performance, a radio or television program, etc. @en
toolkit label: director collective agent of @en
toolkit definition: A work that involves a responsibility of a collective agent for the general management and supervision of a filmed performance, a radio or television program, etc. @en
type: Property
domain: C10011
has element type: 2
sub property of: yhteistoimijaan liittyvä teos
sub property of: ohjaaja (toimija) teoksessa
definition: Liittää yhteistoimijan teokseen, jossa yhteistoimija on vastuussa elokuvatun esityksen, radio- tai televisio-ohjelman tms. yleisestä johtamisesta.
toolkit label: ohjaaja (yhteistoimija) teoksessa
toolkit definition: Teos, jossa yhteistoimija on vastuussa elokuvatun esityksen, radio- tai televisio-ohjelman tms. yleisestä johtamisesta.
label: er regissør av (kollektiv agent) @no
definition: Relaterer en kollektiv agent til et verk som involverer et ansvar for en kollektiv agent for den generelle ledelsen og tilsyn med en filmet forestilling, et radio- eller fjernsynsprogram etc. @no
toolkit label: regissør av (kollektiv agent) @no
toolkit definition: Et verk som involverer et ansvar for en kollektiv agent for den generelle ledelsen og tilsyn med en filmet forestilling, et radio- eller fjernsynsprogram etc. @no
label: is regisseur-collectieve actor van @nl
definition: Relateert een collectieve actor aan een werk dat met zich meebrengt een verantwoordelijkheid van een collectieve actor voor het algemene beheer en toezicht van een gefilmde uitvoering, een radio- of televisieprogramma etc. @nl
toolkit label: regisseur-collectieve actor van @nl
toolkit definition: Een werk dat met zich meebrengt een verantwoordelijkheid van een collectieve actor voor het algemene beheer en toezicht van een gefilmde uitvoering, een radio- of televisieprogramma etc. @nl
label: هو وكيل جماعي مخرج لـ @ar
definition: يربط وكيلا جماعيا بعمل يترتب عليه مسئولية وكيل جماعي عن الإدارة العامة، والإشراف على أداء مصور، أو برنامج إذاعي أو تليفزيوني، إلخ. @ar
toolkit label: وكيل جماعي مخرج @ar
toolkit definition: عمل يترتب عليه مسئولية وكيل جماعي عن الإدارة العامة، والإشراف على أداء مصور، أو برنامج إذاعي أو تليفزيوني، إلخ. @ar
label: és agent col·lectiu realitzador de @ca
definition: Relaciona un agent col·lectiu amb una obra que implica una responsabilitat d’un agent col·lectiu en la gestió general i la supervisió d’una actuació filmada, d’un programa radiofònic o de televisió, etc. @ca
toolkit label: agent col·lectiu realitzador de @ca
toolkit definition: Obra que implica una responsabilitat d’un agent col·lectiu en la gestió general i la supervisió d’una actuació filmada, d’un programa radiofònic o de televisió, etc. @ca
label: er kollektiv agent, som er instruktør af @da
definition: Relaterer en kollektiv agent til et værk, som involverer en kollektiv agents ansvar for den generelle ledelse af- og tilsyn med en filmoptagelse, et radio- eller tv-program etc. @da
toolkit label: kollektiv agent, som er instruktør af @da
toolkit definition: Værk, som involverer en kollektiv agents ansvar for den generelle ledelse af- og tilsyn med en filmoptagelse, et radio- eller tv-program etc. @da
label: režissöör (kollektiiv) teoses @et
definition: Seostab kollektiivi teosega, mis sisaldab kollektiivi vastutust filmitava etenduse, raadio- või telesaate vms üldise juhtimise ja juhendamise eest. @et
toolkit label: režissöör (kollektiiv) teoses @et
toolkit definition: Teos, mis sisaldab kollektiivi vastutust filmitava etenduse, raadio- või telesaate vms üldise juhtimise ja juhendamise eest. @et
label: ist gemeinschaftlicher Akteur als Regisseurin/Regisseur von @de
definition: Setzt einen gemeinschaftlichen Akteur in Beziehung zu einem Werk, bei dem ein gemeinschaftlicher Akteur für das allgemeine Management und die Leitung einer verfilmten Darbietung, einer Hörfunk- oder Fernsehsendung und so weiter verantwortlich ist. @de
toolkit label: Gemeinschaftlicher Akteur als Regisseurin/Regisseur von @de
toolkit definition: Ein Werk, bei dem ein gemeinschaftlicher Akteur für das allgemeine Management und die Leitung einer verfilmten Darbietung, einer Hörfunk- oder Fernsehsendung und so weiter verantwortlich ist. @de
label: rendező kollektív ágense a következőnek: @hu
definition: Hozzákapcsol egy kollektív ágenst egy műhöz, amelyhez hozzátartozik egy kollektív ágens felelőssége egy filmforgatás, egy rádió- vagy televízióműsor, stb. általános menedzseléséért és felügyeletéért. @hu
toolkit label: rendező kollektív ágense: @hu
toolkit definition: Egy mű, amelyhez hozzátartozik egy kollektív ágens felelőssége egy filmforgatás, egy rádió- vagy televízióműsor, stb. általános menedzseléséért és felügyeletéért. @hu
label: è direttore agente collettivo di @it
definition: Correla un agente collettivo a un'opera che implica una responsabilità di un agente collettivo per la gestione e supervisione generale di un'interpretazione filmata, programma radiofonico o televisivo, etc. @it
toolkit label: direttore agente collettivo di @it
toolkit definition: Opera che implica una responsabilità di un agente collettivo per la gestione e supervisione generale di un'interpretazione filmata, programma radiofonico o televisivo, etc. @it
label: είναι διευθυντής συλλογικός φορέας του @el
toolkit label: διευθυντής συλλογικός φορέας του @el
label: est un agent collectif réalisateur de @fr
definition: Met un agent collectif en relation avec une œuvre qui comporte une responsabilité de la part d’un agent collectif consistant à assurer la gestion et la supervision générales d’une prestation filmée, d’une émission de radio ou de télévision, etc. @fr
toolkit label: agent collectif réalisateur de @fr
toolkit definition: Œuvre qui comporte une responsabilité de la part d’un agent collectif consistant à assurer la gestion et la supervision générales d’une prestation filmée, d’une émission de radio ou de télévision, etc. @fr
label: ir režisors (grupa) @lv
definition: Sasaista grupu ar darbu, kas ietver grupas atbildību par vispārējo vadību un par filmētā materiāla, radio vai televīzijas raidījuma, u.tml. uzraudzību. @lv
toolkit label: ir režisors (grupa) @lv
toolkit definition: Darbs, kas ietver grupas atbildību par vispārējo vadību un par filmētā materiāla, radio vai televīzijas raidījuma, u.tml. uzraudzību. @lv
label: 是……的导演集体行为者 @zh-hans
definition: 将一个集体行为者与涉及电影表演、广播或电视节目等的全面管理和监督的一个集体行为者的责任的一种作品关联起来。 @zh-hans
toolkit label: ……的导演集体行为者 @zh-hans
toolkit definition: 涉及电影表演、广播或电视节目等的全面管理和监督的一个集体行为者的责任的一种作品 @zh-hans
label: yönetmen kolektif temsilisidir @tr
definition: Kolektif bir temsilciyi, filme alınmış bir performansın, bir radyo veya televizyon programının vb. genel yönetimi ve denetimi için bir kolektif temsilcinin sorumluluğunu içeren bir eserle ilişkilendirir. @tr
toolkit label: yönetmen kolektif temsilcisi @tr
toolkit definition: Filme alınmış bir performansın, bir radyo veya televizyon programının vb. genel yönetimi ve denetimi için kolektif bir temsilcinin sorumluluğunu içeren bir eser. @tr
has subproperty: ohjaaja (yhteisö) teoksessa
has subproperty: ohjaaja (suku) teoksessa
has subproperty: elokuvaohjaaja (yhteistoimija) teoksessa
has subproperty: radio-ohjaaja (yhteistoimija) teoksessa
has subproperty: televisio-ohjaaja (yhteistoimija) teoksessa
has subproperty: P50712

kuvaaja (yhteistoimija) teoksessa
status: Published
label: is director collective agent of photography of @en
lexical alias: directorCollectiveAgentOfPhotographyOf.en
definition: Relates a collective agent to a work that involves a responsibility of a collective agent for capturing images, either electronically or on film or video stock, and often selecting and arranging the lighting. @en
toolkit label: director collective agent of photography of @en
toolkit definition: A work that involves a responsibility of a collective agent for capturing images, either electronically or on film or video stock, and often selecting and arranging the lighting. @en
type: Property
domain: C10011
has element type: 2
sub property of: yhteistoimijaan liittyvä teos
sub property of: kuvaaja (toimija) teoksessa
scope note: A director of photography for a movie is also called a chief cinematographer. @en
definition: Liittää yhteistoimijan teokseen, jossa yhteistoimija on vastuussa kuvien tallentamisesta joko sähköisesti tai filmille tai videolle, usein myös valaistuksen valitsemisesta ja järjestämisestä.
scope note: Elokuvan kuvaajaa kutsutaan myös elokuvaajaksi.
toolkit label: kuvaaja (yhteistoimija) teoksessa
toolkit definition: Teos, jossa yhteistoimija on vastuussa kuvien tallentamisesta joko sähköisesti tai filmille tai videolle, usein myös valaistuksen valitsemisesta ja järjestämisestä.
label: er filmfotograf for (kollektiv agent) @no
definition: Relaterer en kollektiv agent til et verk som involverer et ansvar for en kollektiv agent i form av å ta bilder, enten elektronisk eller på film eller video, og som ofte velger og arrangerer lyssetting. @no
scope note: Filmfotografen for en film kalles også sjefsfotograf. @no
toolkit label: filmfotograf for (kollektiv agent) @no
toolkit definition: Et verk som involverer et ansvar for en kollektiv agent i form av å ta bilder, enten elektronisk eller på film eller video, og som ofte velger og arrangerer lyssetting. @no
label: is cameraregisseur-collectieve actor van @nl
definition: Relateert een collectieve actor aan een werk dat met zich meebrengt een verantwoordelijkheid van een collectieve actor voor het vastleggen van beelden, elektronisch of op film- of videomateriaal, en vaak het selecteren en arrangeren van de belichting. @nl
scope note: Een cameraregisseur bij een film wordt ook director of photography of hoofdcinematograaf genoemd. @nl
toolkit label: cameraregisseur-collectieve actor van @nl
toolkit definition: Een werk dat met zich meebrengt een verantwoordelijkheid van een collectieve actor voor het vastleggen van beelden, elektronisch of op film- of videomateriaal, en vaak het selecteren en arrangeren van de belichting. @nl
label: هو وكيل جماعي مدير التصوير لـ @ar
definition: يربط وكيلا جماعيا بعمل يترتب عليه مسئولية وكيل جماعي عن التقاط الصور، إما إلكترونيًا أو في فيلم أو في مقاطع فيديو، وغالبا ما يكون مسئولا عن اختيار الإضاءة وتوزيعها. @ar
scope note: ويطلق أيضًا على مدير تصوير الفيلم كبير المصورين السينمائيين . @ar
toolkit label: وكيل جماعي مدير التصوير لـ @ar
toolkit definition: عمل يترتب عليه مسئولية وكيل جماعي عن التقاط الصور، إما إلكترونيًا أو في فيلم أو في مقاطع فيديو، وغالبا ما يكون مسئولا عن اختيار الإضاءة وتوزيعها. @ar
label: és agent col·lectiu director de fotografia de @ca
definition: Relaciona un agent col·lectiu amb una obra que implica una responsabilitat d’un agent col·lectiu en la captura d’imatges, ja sigui electrònicament o sobre pel·lícula o vídeo, i que sovint selecciona i organitza la il·luminació. @ca
scope note: Un director de fotografia d’una pel·lícula també s’anomena primer operador. @ca
toolkit label: agent col·lectiu director de fotografia de @ca
toolkit definition: Obra que implica una responsabilitat d’un agent col·lectiu en la captura d’imatges, ja sigui electrònicament o sobre pel·lícula o vídeo, i que sovint selecciona i organitza la il·luminació. @ca
label: er kollektiv agent, som er filmfotograf af @da
definition: Relaterer en kollektiv agent til et værk, som involverer en kollektiv agents ansvar for at optage billeder, enten elektronisk eller på film eller video, og ofte også for at udvælge og arrangere lyssætningen. @da
scope note: Filmfotografen på en film kaldes også for en cheffotograf. @da
toolkit label: kollektiv agent, som er filmfotograf af @da
toolkit definition: Værk, som involverer en kollektiv agents ansvar for at optage billeder, enten elektronisk eller på film eller video, og ofte også for at udvælge og arrangere lyssætningen. @da
label: operaator-lavastaja (kollektiiv) teoses @et
definition: Seostab kollektiivi teosega, mis sisaldab kollektiivi vastutust pildi jäädvustamise eest kas elektrooniliselt või filmi- või videolindile ning sageli valgustuse valimise ja ülesseadmise eest. @et
scope note: Filmi operaator-lavastajat nimetatakse inglise keeles sageli ka chief cinematographer. @et
toolkit label: operaator-lavastaja (kollektiiv) teoses @et
toolkit definition: Teos, mis sisaldab kollektiivi vastutust pildi jäädvustamise eest kas elektrooniliselt või filmi- või videolindile ning sageli valgustuse valimise ja ülesseadmise eest. @et
label: ist gemeinschaftlicher Akteur als Kamerafrau/Kameramann von @de
definition: Setzt einen gemeinschaftlichen Akteur in Beziehung zu einem Werk, bei dem ein gemeinschaftlicher Akteur für die Aufzeichnung von Bildern, entweder elektronisch oder auf Film- oder Videomaterial, verantwortlich ist und häufig die Belichtung auswählt und arrangiert. @de
scope note: Eine Kamerafrau/Ein Kameramann für einen Film wird auch als "Bildregisseurin/Bildregisseur" bezeichnet. @de
toolkit label: Gemeinschaftlicher Akteur als Kamerafrau/Kameramann von @de
toolkit definition: Ein Werk, bei dem ein gemeinschaftlicher Akteur für die Aufzeichnung von Bildern, entweder elektronisch oder auf Film- oder Videomaterial, verantwortlich ist und häufig die Belichtung auswählt und arrangiert. @de
label: operatőr kollektív ágense a következőnek: @hu
definition: Hozzákapcsol egy kollektív ágenst egy műhöz, amelyhez hozzátartozik egy kollektív ágens felelőssége képek elektronikusan, filmen vagy videoállományon történő rögzítéséért, gyakran a világítás kiválasztásáért és elrendezéséért is. @hu
scope note: Egy film operatőrét vezető operatőrnek is nevezik. @hu
toolkit label: operatőr kollektív ágense: @hu
toolkit definition: Egy mű, amelyhez hozzátartozik egy kollektív ágens felelőssége képek elektronikusan, filmen vagy videoállományon történő rögzítéséért, gyakran a világítás kiválasztásáért és elrendezéséért is. @hu
label: è direttore agente collettivo della fotografia di @it
definition: Correla un agente collettivo a un'opera che implica una responsabilità di un agente collettivo per l'acquisizione di immagini, elettronicamente o su pellicola o video, e spesso nella scelta e organizzazione dell'illuminazione. @it
scope note: Un direttore della fotografia di un film è anche definito capo cameraman. @it
toolkit label: direttore agente collettivo della fotografia di @it
toolkit definition: Opera che implica una responsabilità di un agente collettivo per l'acquisizione di immagini, elettronicamente o su pellicola o video, e spesso nella scelta e organizzazione dell'illuminazione. @it
label: είναι διευθυντής φωτογραφίας συλλογικός φορέας του @el
toolkit label: διευθυντής φωτογραφίας συλλογικός φορέας του @el
label: est un agent collectif directeur de la photographie de @fr
definition: Met un agent collectif en relation avec une œuvre qui comporte une responsabilité de la part d’un agent collectif consistant à capter des images, de manière électronique ou bien sur film ou vidéo, et qui, souvent, choisit et dispose l’éclairage. @fr
scope note: Un directeur de la photographie pour un film est également appelé un chef opérateur de prise de vue. @fr
toolkit label: agent collectif directeur de la photographie de @fr
toolkit definition: Œuvre qui comporte une responsabilité de la part d’un agent collectif consistant à capter des images, de manière électronique ou bien sur film ou vidéo, et qui, souvent, choisit et dispose l’éclairage. @fr
label: ir kinooperators (grupa) @lv
definition: Sasaista grupu ar darbu, kas ietver grupas atbildību par attēlu uzņemšanu elektroniski vai uz filmas, vai video un bieži izvēlas, un izvieto apgaismojumu. @lv
toolkit label: ir kinooperators (grupa) @lv
toolkit definition: Darbs, kas ietver grupas atbildību par attēlu uzņemšanu elektroniski vai uz filmas, vai video un bieži izvēlas, un izvieto apgaismojumu. @lv
scope note: Kinooperatoru mēdz saukt arī par galveno operatoru. @lv
label: 是……的摄影指导集体行为者 @zh-hans
definition: 将一个集体行为者与涉及通过电子、胶片或视频存储方式摄录影像、且经常负责灯光的选择和布置的一个集体行为者的责任的一种作品关联起来。 @zh-hans
toolkit label: ……的摄影指导集体行为者 @zh-hans
toolkit definition: 涉及通过电子、胶片或视频存储方式摄录影像、且经常负责灯光的选择和布置的一个集体行为者的责任的一种作品 @zh-hans
scope note: 电影的摄影指导也称总摄影师 @zh-hans
label: görüntü yönetmeni kolektif temsilcisidir @tr

ohjaaja (yhteisö) teoksessa
status: Published
label: is director corporate body of @en
lexical alias: directorCorporateBodyOf.en
definition: Relates a corporate body to a work that involves a responsibility of a corporate body for the general management and supervision of a filmed performance, a radio or television program, etc. @en
toolkit label: director corporate body of @en
toolkit definition: A work that involves a responsibility of a corporate body for the general management and supervision of a filmed performance, a radio or television program, etc. @en
type: Property
domain: C10005
has element type: 2
sub property of: teoksen tekijä (yhteisö) teoksessa
sub property of: ohjaaja (yhteistoimija) teoksessa
definition: Liittää yhteisön teokseen, jossa yhteisö on vastuussa elokuvatun esityksen, radio- tai televisio-ohjelman tms. yleisestä johtamisesta.
toolkit label: ohjaaja (yhteisö) teoksessa
toolkit definition: Teos, jossa yhteisö on vastuussa elokuvatun esityksen, radio- tai televisio-ohjelman tms. yleisestä johtamisesta.
label: er regissør av (korporasjon) @no
definition: Relaterer en korporasjon til et verk som involverer et ansvar for en korporasjon for den generelle ledelsen og tilsyn med en filmet forestilling, et radio- eller fjernsynsprogram etc. @no
toolkit label: regissør av (korporasjon) @no
toolkit definition: Et verk som involverer et ansvar for en korporasjon for den generelle ledelsen og tilsyn med en filmet forestilling, et radio- eller fjernsynsprogram etc. @no
label: is regisseur-corporatie van @nl
definition: Relateert een corporatie aan een werk dat met zich meebrengt een verantwoordelijkheid van een actor voor het algemene beheer en toezicht van een gefilmde uitvoering, een radio- of televisieprogramma etc. @nl
toolkit label: regisseur-corporatie van @nl
toolkit definition: Een werk dat met zich meebrengt een verantwoordelijkheid van een actor voor het algemene beheer en toezicht van een gefilmde uitvoering, een radio- of televisieprogramma etc. @nl
label: هي هيئة مخرجة لـ @ar
definition: يربط هيئة بعمل يترتب عليه مسئولية هيئة عن الإدارة العامة، والإشراف على أداء مصور، أو برنامج إذاعي أو تليفزيوني، إلخ. @ar
toolkit label: هيئة مخرجة @ar
toolkit definition: عمل يترتب عليه مسئولية هيئة عن الإدارة العامة، والإشراف على أداء مصور، أو برنامج إذاعي أو تليفزيوني، إلخ. @ar
label: és entitat corporativa realitzadora de @ca
definition: Relaciona una entitat corporativa amb una obra que implica una responsabilitat d’una entitat corporativa en la gestió general i la supervisió d’una actuació filmada, d’un programa radiofònic o de televisió, etc. @ca
toolkit label: entitat corporativa realitzadora de @ca
toolkit definition: Obra que implica una responsabilitat d’una entitat corporativa en la gestió general i la supervisió d’una actuació filmada, d’un programa radiofònic o de televisió, etc. @ca
label: er korporation, som er instruktør af @da
definition: Relaterer en korporation til et værk, som involverer en korporations ansvar for den generelle ledelse af- og tilsyn med en filmoptagelse, et radio- eller tv-program etc. @da
toolkit label: korporation, som er instruktør af @da
toolkit definition: Værk, som involverer en korporations ansvar for den generelle ledelse af- og tilsyn med en filmoptagelse, et radio- eller tv-program etc. @da
label: režissöör (asutus) teoses @et
definition: Seostab asutuse teosega, mis sisaldab asutuse vastutust filmitava etenduse, raadio- või telesaate vms üldise juhtimise ja juhendamise eest. @et
toolkit label: režissöör (asutus) teoses @et
toolkit definition: Teos, mis sisaldab asutuse vastutust filmitava etenduse, raadio- või telesaate vms üldise juhtimise ja juhendamise eest. @et
label: ist Körperschaft als Regisseurin/Regisseur von @de
definition: Setzt eine Körperschaft in Beziehung zu einem Werk, bei dem eine Körperschaft für das allgemeine Management und die Leitung einer verfilmten Darbietung, einer Hörfunk- oder Fernsehsendung und so weiter verantwortlich ist. @de
toolkit label: Körperschaft als Regisseurin/Regisseur von @de
toolkit definition: Ein Werk, bei dem eine Körperschaft für das allgemeine Management und die Leitung einer verfilmten Darbietung, einer Hörfunk- oder Fernsehsendung und so weiter verantwortlich ist. @de
label: rendező testülete a következőnek: @hu
definition: Hozzákapcsol egy testületet egy műhöz, amelyhez hozzátartozik egy testület felelőssége egy filmforgatás, egy rádió- vagy televízióműsor, stb. általános menedzseléséért és felügyeletéért. @hu
toolkit label: rendező testülete: @hu
toolkit definition: Egy mű, amelyhez hozzátartozik egy testület felelőssége egy filmforgatás, egy rádió- vagy televízióműsor, stb. általános menedzseléséért és felügyeletéért. @hu
label: è direttore ente di @it
definition: Correla un ente a un'opera che implica una responsabilità di un ente per la gestione e supervisione generale di un'interpretazione filmata, programma radiofonico o televisivo, etc. @it
toolkit label: direttore ente di @it
toolkit definition: Opera che implica una responsabilità di un ente per la gestione e supervisione generale di un'interpretazione filmata, programma radiofonico o televisivo, etc. @it
label: είναι διευθυντής συλλογικό όργανο του @el
toolkit label: διευθυντής συλλογικό όργανο του @el
label: est une collectivité réalisatrice de @fr
definition: Met une collectivité en relation avec une œuvre qui comporte une responsabilité de la part d’une collectivité consistant à assurer la gestion et la supervision générales d’une prestation filmée, d’une émission de radio ou de télévision, etc. @fr
toolkit label: collectivité réalisatrice de @fr
toolkit definition: Œuvre qui comporte une responsabilité de la part d’une collectivité consistant à assurer la gestion et la supervision générales d’une prestation filmée, d’une émission de radio ou de télévision, etc. @fr
label: ir režisors (institūcija) @lv
definition: Sasaista institūciju ar darbu, kas ietver institūcijas atbildību par vispārējo vadību un par filmētā materiāla, radio vai televīzijas raidījuma, u.tml. uzraudzību. @lv
toolkit label: ir režisors (institūcija) @lv
toolkit definition: Darbs, kas ietver institūcijas atbildību par vispārējo vadību un par filmētā materiāla, radio vai televīzijas raidījuma, u.tml. uzraudzību. @lv
label: 是……的导演团体 @zh-hans
definition: 将一个团体与涉及电影表演、广播或电视节目等的全面管理和监督的一个团体的责任的一种作品关联起来。 @zh-hans
toolkit label: ……的导演团体 @zh-hans
toolkit definition: 涉及电影表演、广播或电视节目等的全面管理和监督的一个团体的责任的一种作品 @zh-hans
label: yönetmen tüzel kişisidir @tr
definition: Bir tüzel kişiyi, filme alınmış bir performansın, bir radyo veya televizyon programı vb. genel yönetimi ve denetimi için bir tüzel kişinin sorumluluğunu içeren bir eser ile ilişkilendirir. @tr
toolkit label: yönetmen tüzel kişisi @tr
toolkit definition: Filme alınmış bir performansın, bir radyo veya televizyon programı vb. genel yönetimi ve denetimi için bir tüzel kişinin sorumluluğunda olan bir eser. @tr
has subproperty: elokuvaohjaaja (yhteisö) teoksessa
has subproperty: radio-ohjaaja (yhteisö) teoksessa
has subproperty: televisio-ohjaaja (yhteisö) teoksessa
has subproperty: P50863

kuvaaja (yhteisö) teoksessa
status: Published
label: is director corporate body of photography of @en
lexical alias: directorCorporateBodyOfPhotographyOf.en
definition: Relates a corporate body to a work that involves a responsibility of a corporate body for capturing images, either electronically or on film or video stock, and often selecting and arranging the lighting. @en
toolkit label: director corporate body of photography of @en
toolkit definition: A work that involves a responsibility of a corporate body for capturing images, either electronically or on film or video stock, and often selecting and arranging the lighting. @en
type: Property
domain: C10005
has element type: 2
sub property of: yhteisöön liittyvä teos
sub property of: kuvaaja (yhteistoimija) teoksessa
scope note: A director of photography for a movie is also called a chief cinematographer. @en
definition: Liittää yhteisön teokseen, jossa yhteisö on vastuussa kuvien tallentamisesta joko sähköisesti tai filmille tai videolle, usein myös valaistuksen valitsemisesta ja järjestämisestä.
scope note: Elokuvan kuvaajaa kutsutaan myös elokuvaajaksi.
toolkit label: kuvaaja (yhteisö) teoksessa
toolkit definition: Teos, jossa yhteisö on vastuussa kuvien tallentamisesta joko sähköisesti tai filmille tai videolle, usein myös valaistuksen valitsemisesta ja järjestämisestä.
label: er filmfotograf for (korporasjon) @no
definition: Relaterer en korporasjon til et verk som involverer et ansvar for en korporasjon i form av å ta bilder, enten elektronisk eller på film eller video, og som ofte velger og arrangerer lyssetting. @no
scope note: Filmfotografen for en film kalles også sjefsfotograf. @no
toolkit label: filmfotograf for (korporasjon) @no
toolkit definition: Et verk som involverer et ansvar for en korporasjon i form av å ta bilder, enten elektronisk eller på film eller video, og som ofte velger og arrangerer lyssetting. @no
label: is cameraregisseur-corporatie van @nl
definition: Relateert een corporatie aan een werk dat met zich meebrengt een verantwoordelijkheid van een corporatie voor het vastleggen van beelden, elektronisch of op film- of videomateriaal, en vaak het selecteren en arrangeren van de belichting. @nl
scope note: Een cameraregisseur bij een film wordt ook director of photography of hoofdcinematograaf genoemd. @nl
toolkit label: cameraregisseur-corporatie van @nl
toolkit definition: Een werk dat met zich meebrengt een verantwoordelijkheid van een corporatie voor het vastleggen van beelden, elektronisch of op film- of videomateriaal, en vaak het selecteren en arrangeren van de belichting. @nl
label: هي هيئة مديرة التصوير لـ @ar
definition: يربط هيئة بعمل يترتب عليه مسئولية هيئة عن التقاط الصور، إما إلكترونيًا أو في فيلم أو فيديو، وغالبا ما يكون مسئولا عن اختيار الإضاءة وتوزيعها. @ar
scope note: ويطلق أيضًا على مدير التصوير لفيلم كبير المصورين السينمائيين . @ar
toolkit label: هيئة مديرة التصوير @ar
toolkit definition: عمل يترتب عليه مسئولية هيئة عن التقاط الصور، إما إلكترونيًا أو في فيلم أو فيديو، وغالبا ما يكون مسئولا عن اختيار الإضاءة وتوزيعها. @ar
label: és entitat corporativa directora de fotografia de @ca
definition: Relaciona una entitat corporativa amb una obra que implica una responsabilitat d’una entitat corporativa en la captura d’imatges, ja sigui electrònicament o sobre pel·lícula o vídeo, i que sovint selecciona i organitza la il·luminació. @ca
scope note: Un director de fotografia d’una pel·lícula també s’anomena primer operador. @ca
toolkit label: entitat corporativa directora de fotografia de @ca
toolkit definition: Obra que implica una responsabilitat d’una entitat corporativa en la captura d’imatges, ja sigui electrònicament o sobre pel·lícula o vídeo, i que sovint selecciona i organitza la il·luminació. @ca
label: er korporation, som er filmfotograf af @da
definition: Relaterer en korporation til et værk, som involverer en korporations ansvar for at optage billeder, enten elektronisk eller på film eller video, og ofte også for at udvælge og arrangere lyssætningen. @da
scope note: Filmfotografen på en film kaldes også for en cheffotograf. @da
toolkit label: korporation, som er filmfotograf af @da
toolkit definition: Værk, som involverer en korporations ansvar for at optage billeder, enten elektronisk eller på film eller video, og ofte også for at udvælge og arrangere lyssætningen. @da
label: operaator-lavastaja (asutus) teoses @et
definition: Seostab asutuse teosega, mis sisaldab asutuse vastutust pildi jäädvustamise eest kas elektrooniliselt või filmi- või videolindile ning sageli valgustuse valimise ja ülesseadmise eest. @et
scope note: Filmi operaator-lavastajat nimetatakse inglise keeles sageli ka chief cinematographer. @et
toolkit label: operaator-lavastaja (asutus) teoses @et
toolkit definition: Teos, mis sisaldab asutuse vastutust pildi jäädvustamise eest kas elektrooniliselt või filmi- või videolindile ning sageli valgustuse valimise ja ülesseadmise eest. @et
label: ist Körperschaft als Kamerafrau/Kameramann von @de
definition: Setzt eine Körperschaft in Beziehung zu einem Werk, bei dem eine Körperschaft für die Aufzeichnung von Bildern, entweder elektronisch oder auf Film- oder Videomaterial, verantwortlich ist und häufig die Belichtung auswählt und arrangiert. @de
scope note: Eine Kamerafrau/Ein Kameramann für einen Film wird auch als "Bildregisseurin/Bildregisseur" bezeichnet. @de
toolkit label: Körperschaft als Kamerafrau/Kameramann von @de
toolkit definition: Ein Werk, bei dem eine Körperschaft für die Aufzeichnung von Bildern, entweder elektronisch oder auf Film- oder Videomaterial, verantwortlich ist und häufig die Belichtung auswählt und arrangiert. @de
label: operatőr testülete a következőnek: @hu
definition: Hozzákapcsol egy testületet egy műhöz, amelyhez hozzátartozik egy testület felelőssége képek elektronikusan, filmen vagy videoállományon történő rögzítéséért, gyakran a világítás kiválasztásáért és elrendezéséért is. @hu
scope note: Egy film operatőrét vezető operatőrnek is nevezik. @hu
toolkit label: operatőr testülete: @hu
toolkit definition: Egy mű, amelyhez hozzátartozik egy testület felelőssége képek elektronikusan, filmen vagy videoállományon történő rögzítéséért, gyakran a világítás kiválasztásáért és elrendezéséért is. @hu
label: è direttore ente della fotografia di @it
definition: Correla un ente a un'opera che implica una responsabilità di un ente per l'acquisizione di immagini, elettronicamente o su pellicola o video, e spesso nella scelta e organizzazione dell'illuminazione. @it
scope note: Un direttore della fotografia di un film è anche definito capo cameraman. @it
toolkit label: direttore ente della fotografia di @it
toolkit definition: Opera che implica una responsabilità di un ente per l'acquisizione di immagini, elettronicamente o su pellicola o video, e spesso nella scelta e organizzazione dell'illuminazione. @it
label: είναι διευθυντής φωτογραφίας συλλογικό όργανο του @el
scope note: Ένας διευθυντής φωτογραφίας για μια ταινία ονομάζεται επίσης επικεφαλής κινηματογραφιστής. @el
toolkit label: διευθυντής φωτογραφίας συλλογικό όργανο του @el
label: est une collectivité directrice de la photographie de @fr
definition: Met une collectivité en relation avec une œuvre qui comporte une responsabilité de la part d’une collectivité consistant à capter des images, de manière électronique ou bien sur film ou vidéo, et qui, souvent, choisit et dispose l’éclairage. @fr
scope note: Un directeur de la photographie pour un film est également appelé un chef opérateur de prise de vue. @fr
toolkit label: collectivité directrice de la photographie de @fr
toolkit definition: Œuvre qui comporte une responsabilité de la part d’une collectivité consistant à capter des images, de manière électronique ou bien sur film ou vidéo, et qui, souvent, choisit et dispose l’éclairage. @fr
label: ir kinooperators (institūcija) @lv
definition: Sasaista institūciju ar darbu, kas ietver institūcijas atbildību par attēlu uzņemšanu elektroniski vai uz filmas, vai video un bieži izvēlas, un izvieto apgaismojumu. @lv
toolkit label: ir kinooperators (institūcija) @lv
toolkit definition: Darbs, kas ietver institūcijas atbildību par attēlu uzņemšanu elektroniski vai uz filmas, vai video un bieži izvēlas, un izvieto apgaismojumu. @lv
scope note: Kinooperatoru mēdz saukt arī par galveno operatoru. @lv
label: 是……的摄影指导团体 @zh-hans
definition: 将一个团体与涉及通过电子、胶片或视频存储方式摄录影像、且经常负责灯光的选择和布置的一个团体的责任的一种作品关联起来。 @zh-hans
toolkit label: ……的摄影指导团体 @zh-hans
toolkit definition: 涉及通过电子、胶片或视频存储方式摄录影像、且经常负责灯光的选择和布置的一个团体的责任的一种作品 @zh-hans
scope note: 电影的摄影指导也称总摄影师 @zh-hans

ohjaaja (suku) teoksessa
status: Published
label: is director family of @en
lexical alias: directorFamilyOf.en
definition: Relates a family to a work that involves a responsibility of a family for the general management and supervision of a filmed performance, a radio or television program, etc. @en
toolkit label: director family of @en
toolkit definition: A work that involves a responsibility of a family for the general management and supervision of a filmed performance, a radio or television program, etc. @en
type: Property
domain: C10008
has element type: 2
sub property of: sukuun liittyvä teos
sub property of: ohjaaja (yhteistoimija) teoksessa
definition: Liittää suvun teokseen, jossa suku on vastuussa elokuvatun esityksen, radio- tai televisio-ohjelman tms. yleisestä johtamisesta.
toolkit label: ohjaaja (suku) teoksessa
toolkit definition: Teos, jossa suku on vastuussa elokuvatun esityksen, radio- tai televisio-ohjelman tms. yleisestä johtamisesta.
label: er regissør av (familie) @no
definition: Relaterer en familie til et verk som involverer et ansvar for en familie for den generelle ledelsen og tilsyn med en filmet forestilling, et radio- eller fjernsynsprogram etc. @no
toolkit label: regissør av (familie) @no
toolkit definition: Et verk som involverer et ansvar for en familie for den generelle ledelsen og tilsyn med en filmet forestilling, et radio- eller fjernsynsprogram etc. @no
label: is regisseur-actor van @nl
definition: Relateert een familie aan een werk dat met zich meebrengt een verantwoordelijkheid van een familie voor het algemene beheer en toezicht van een gefilmde uitvoering, een radio- of televisieprogramma etc. @nl
toolkit label: regisseur-actor van @nl
toolkit definition: Een werk dat met zich meebrengt een verantwoordelijkheid van een familie voor het algemene beheer en toezicht van een gefilmde uitvoering, een radio- of televisieprogramma etc. @nl
label: هي عائلة مخرجة لـ @ar
definition: يربط عائلة بعمل يترتب عليه مسئولية عائلة عن الإدارة العامة، والإشراف على أداء مصور، أو برنامج إذاعي أو تليفزيوني، إلخ. @ar
toolkit label: عائلة مخرجة @ar
toolkit definition: عمل يترتب عليه مسئولية عائلة عن الإدارة العامة، والإشراف على أداء مصور، أو برنامج إذاعي أو تليفزيوني، إلخ. @ar
label: és família realitzadora de @ca
definition: Relaciona una família amb una obra que implica una responsabilitat d’una família en la gestió general i la supervisió d’una actuació filmada, d’un programa radiofònic o de televisió, etc. @ca
toolkit label: família realitzadora de @ca
toolkit definition: Obra que implica una responsabilitat d’una família en la gestió general i la supervisió d’una actuació filmada, d’un programa radiofònic o de televisió, etc. @ca
label: er familie, som er instruktør af @da
definition: Relaterer en familie til et værk, som involverer en families ansvar for den generelle ledelse af- og tilsyn med en filmoptagelse, et radio- eller tv-program etc. @da
toolkit label: familie, som er instruktør af @da
toolkit definition: Værk, som involverer en families ansvar for den generelle ledelse af- og tilsyn med en filmoptagelse, et radio- eller tv-program etc. @da
label: režissöör (perekond) teoses @et
definition: Seostab perekonna teosega, mis sisaldab perekonna vastutust filmitava etenduse, raadio- või telesaate vms üldise juhtimise ja juhendamise eest. @et
toolkit label: režissöör (perekond) teoses @et
toolkit definition: Teos, mis sisaldab perekonna vastutust filmitava etenduse, raadio- või telesaate vms üldise juhtimise ja juhendamise eest. @et
label: ist Familie als Regisseurin/Regisseur von @de
definition: Setzt eine Familie in Beziehung zu einem Werk, bei dem eine Familie für das allgemeine Management und die Leitung einer verfilmten Darbietung, einer Hörfunk- oder Fernsehsendung und so weiter verantwortlich ist. @de
toolkit label: Familie als Regisseurin/Regisseur von @de
toolkit definition: Ein Werk, bei dem eine Familie für das allgemeine Management und die Leitung einer verfilmten Darbietung, einer Hörfunk- oder Fernsehsendung und so weiter verantwortlich ist. @de
label: rendező családja a következőnek: @hu
definition: Hozzákapcsol egy családot egy műhöz, amelyhez hozzátartozik egy család felelőssége egy filmforgatás, egy rádió- vagy televízióműsor, stb. általános menedzseléséért és felügyeletéért. @hu
toolkit label: rendező családja: @hu
toolkit definition: Egy mű, amelyhez hozzátartozik egy család felelőssége egy filmforgatás, egy rádió- vagy televízióműsor, stb. általános menedzseléséért és felügyeletéért. @hu
label: è direttore famiglia di @it
definition: Correla una famiglia a un'opera che implica una responsabilità di una famiglia per la gestione e supervisione generale di un'interpretazione filmata, programma radiofonico o televisivo, etc. @it
toolkit label: direttore famiglia di @it
toolkit definition: Opera che implica una responsabilità di una famiglia per la gestione e supervisione generale di un'interpretazione filmata, programma radiofonico o televisivo, etc. @it
label: είναι διευθυντής οικογένεια του @el
toolkit label: διευθυντής οικογένεια του @el
label: est une famille réalisatrice de @fr
definition: Met une famille en relation avec une œuvre qui comporte une responsabilité de la part d’une famille consistant à assurer la gestion et la supervision générales d’une prestation filmée, d’une émission de radio ou de télévision, etc. @fr
toolkit label: famille réalisatrice de @fr
toolkit definition: Œuvre qui comporte une responsabilité de la part d’une famille consistant à assurer la gestion et la supervision générales d’une prestation filmée, d’une émission de radio ou de télévision, etc. @fr
label: ir režisors (dzimta/ģimene) @lv
definition: Sasaista dzimtu/ģimeni ar darbu, kas ietver dzimtas/ģimenes atbildību par vispārējo vadību un par filmētā materiāla, radio vai televīzijas raidījuma, u.tml. uzraudzību. @lv
toolkit label: ir režisors (dzimta/ģimene) @lv
toolkit definition: Darbs, kas ietver dzimtas/ģimenes atbildību par vispārējo vadību un par filmētā materiāla, radio vai televīzijas raidījuma, u.tml. uzraudzību. @lv
label: 是……的导演家族 @zh-hans
definition: 将一个家族与涉及电影表演、广播或电视节目等的全面管理和监督的一个家族的责任的一种作品关联起来。 @zh-hans
toolkit label: ……的导演家族 @zh-hans
toolkit definition: 涉及电影表演、广播或电视节目等的全面管理和监督的一个家族的责任的一种作品 @zh-hans
label: yönetmen ailesidir @tr
definition: Bir aileyi, bir film performansının, bir radyo veya televizyon programının genel yönetim ve denetim sorumluluğunu içeren bir eserle ilişkilendirir. @tr
toolkit label: yönetmen ailesi @tr
toolkit definition: Filme alınmış bir performansın, bir radyo veya televizyon programı vb. genel yönetimi ve denetimi için bir ailenin sorumluluğunda olan bir eser. @tr
has subproperty: elokuvaohjaaja (suku) teoksessa
has subproperty: radio-ohjaaja (suku) teoksessa
has subproperty: televisio-ohjaaja (suku) teoksessa
has subproperty: P51014

kuvaaja (suku) teoksessa
status: Published
label: is director family of photography of @en
lexical alias: directorFamilyOfPhotographyOf.en
definition: Relates a family to a work that involves a responsibility of a family for capturing images, either electronically or on film or video stock, and often selecting and arranging the lighting. @en
toolkit label: director family of photography of @en
toolkit definition: A work that involves a responsibility of a family for capturing images, either electronically or on film or video stock, and often selecting and arranging the lighting. @en
type: Property
domain: C10008
has element type: 2
sub property of: sukuun liittyvä teos
sub property of: kuvaaja (yhteistoimija) teoksessa
scope note: A director of photography for a movie is also called a chief cinematographer. @en
definition: Liittää suvun teokseen, jossa suku on vastuussa kuvien tallentamisesta joko sähköisesti tai filmille tai videolle, usein myös valaistuksen valitsemisesta ja järjestämisestä.
scope note: Elokuvan kuvaajaa kutsutaan myös elokuvaajaksi.
toolkit label: kuvaaja (suku) teoksessa
toolkit definition: Teos, jossa suku on vastuussa kuvien tallentamisesta joko sähköisesti tai filmille tai videolle, usein myös valaistuksen valitsemisesta ja järjestämisestä.
label: er filmfotograf for (familie) @no
definition: Relaterer en familie til et verk som involverer et ansvar for en familie i form av å ta bilder, enten elektronisk eller på film eller video, og som ofte velger og arrangerer lyssetting. @no
scope note: Filmfotografen for en film kalles også sjefsfotograf. @no
toolkit label: filmfotograf for (familie) @no
toolkit definition: Et verk som involverer et ansvar for en familie i form av å ta bilder, enten elektronisk eller på film eller video, og som ofte velger og arrangerer lyssetting. @no
label: is cameraregisseur-familie van @nl
definition: Relateert een familie aan een werk dat met zich meebrengt een verantwoordelijkheid van een familie voor het vastleggen van beelden, elektronisch of op film- of videomateriaal, en vaak het selecteren en arrangeren van de belichting. @nl
scope note: Een cameraregisseur bij een film wordt ook director of photography of hoofdcinematograaf genoemd. @nl
toolkit label: cameraregisseur-familie van @nl
toolkit definition: Een werk dat met zich meebrengt een verantwoordelijkheid van een familie voor het vastleggen van beelden, elektronisch of op film- of videomateriaal, en vaak het selecteren en arrangeren van de belichting. @nl
label: هي عائلة مديرة تصوير لـ @ar
definition: يربط عائلة بعمل يترتب عليه مسئولية عائلة عن التقاط الصور، إما إلكترونيًا أو في فيلم أو فيديو، وغالبا ما يكون مسئولا عن اختيار الإضاءة وتوزيعها. @ar
scope note: ويطلق أيضًا على مدير تصوير الفيلم كبير المصورين السينمائيين . @ar
toolkit label: عائلة مديرة للتصوير @ar
toolkit definition: عمل يترتب عليه مسئولية عائلة عن التقاط الصور، إما إلكترونيًا أو في فيلم أو فيديو، وغالبا ما يكون مسئولا عن اختيار الإضاءة وتوزيعها. @ar
label: és família directora de fotografia de @ca
definition: Relaciona una família amb una obra que implica una responsabilitat d’una família en la captura d’imatges, ja sigui electrònicament o sobre pel·lícula o vídeo, i que sovint selecciona i organitza la il·luminació. @ca
scope note: Un director de fotografia d’una pel·lícula també s’anomena primer operador. @ca
toolkit label: família directora de fotografia de @ca
toolkit definition: Obra que implica una responsabilitat d’una família en la captura d’imatges, ja sigui electrònicament o sobre pel·lícula o vídeo, i que sovint selecciona i organitza la il·luminació. @ca
label: er familie, som er filmfotograf af @da
definition: Relaterer en familie til et værk, som involverer en families ansvar for at optage billeder, enten elektronisk eller på film eller video, og ofte også for at udvælge og arrangere lyssætningen. @da
scope note: Filmfotografen på en film kaldes også for en cheffotograf. @da
toolkit label: familie, som er filmfotograf af @da
toolkit definition: Værk, som involverer en families ansvar for at optage billeder, enten elektronisk eller på film eller video, og ofte også for at udvælge og arrangere lyssætningen. @da
label: operaator-lavastaja (perekond) teoses @et
definition: Seostab perekonna teosega, mis sisaldab perekonna vastutust pildi jäädvustamise eest kas elektrooniliselt või filmi- või videolindile ning sageli valgustuse valimise ja ülesseadmise eest. @et
scope note: Filmi operaator-lavastajat nimetatakse inglise keeles sageli ka chief cinematographer. @et
toolkit label: operaator-lavastaja (perekond) teoses @et
toolkit definition: Teos, mis sisaldab perekonna vastutust pildi jäädvustamise eest kas elektrooniliselt või filmi- või videolindile ning sageli valgustuse valimise ja ülesseadmise eest. @et
label: ist Familie als Kamerafrau/Kameramann von @de
definition: Setzt eine Familie in Beziehung zu einem Werk, bei dem eine Familie für die Aufzeichnung von Bildern, entweder elektronisch oder auf Film- oder Videomaterial, verantwortlich ist und häufig die Belichtung auswählt und arrangiert. @de
scope note: Eine Kamerafrau/Ein Kameramann für einen Film wird auch als "Bildregisseurin/Bildregisseur" bezeichnet. @de
toolkit label: Familie als Kamerafrau/Kameramann von @de
toolkit definition: Ein Werk, bei dem eine Familie für die Aufzeichnung von Bildern, entweder elektronisch oder auf Film- oder Videomaterial, verantwortlich ist und häufig die Belichtung auswählt und arrangiert. @de
label: operatőr családja a következőnek: @hu
definition: Hozzákapcsol egy családot egy műhöz, amelyhez hozzátartozik egy család felelőssége képek elektronikusan, filmen vagy videoállományon történő rögzítéséért, gyakran a világítás kiválasztásáért és elrendezéséért is. @hu
scope note: Egy film operatőrét vezető operatőrnek is nevezik. @hu
toolkit label: operatőr családja: @hu
toolkit definition: Egy mű, amelyhez hozzátartozik egy család felelőssége képek elektronikusan, filmen vagy videoállományon történő rögzítéséért, gyakran a világítás kiválasztásáért és elrendezéséért is. @hu
label: è direttore famiglia della fotografia di @it
definition: Correla una famiglia a un'opera che implica la responsabilità di una famiglia per l'acquisizione di immagini, elettronicamente o su pellicola o video, e spesso nella scelta e organizzazione dell'illuminazione. @it
scope note: Un direttore della fotografia di un film è anche definito capo cameraman. @it
toolkit label: direttore famiglia della fotografia di @it
toolkit definition: Opera che implica una responsabilità di una famiglia per l'acquisizione di immagini, elettronicamente o su pellicola o video, e spesso nella scelta e organizzazione dell'illuminazione. @it
label: είναι διευθυντής φωτογραφίας οικογένεια του @el
scope note: Ένας διευθυντής φωτογραφίας για μια ταινία ονομάζεται επίσης επικεφαλής κινηματογραφιστής. @el
toolkit label: διευθυντής φωτογραφίας οικογένεια του @el
label: est une famille directrice de la photographie de @fr
definition: Met une famille en relation avec une œuvre qui comporte une responsabilité de la part d’une famille consistant à capter des images, de manière électronique ou bien sur film ou vidéo, et qui, souvent, choisit et dispose l’éclairage. @fr
scope note: Un directeur de la photographie pour un film est également appelé un chef opérateur de prise de vue. @fr
toolkit label: famille directrice de la photographie de @fr
toolkit definition: Œuvre qui comporte une responsabilité de la part d’une famille consistant à capter des images, de manière électronique ou bien sur film ou vidéo, et qui, souvent, choisit et dispose l’éclairage. @fr
label: ir kinooperators (dzimta/ģimene) @lv
definition: Sasaista dzimtu/ģimeni ar darbu, kas ietver dzimtas/ģimenes atbildību par attēlu uzņemšanu elektroniski vai uz filmas, vai video un bieži izvēlas, un izvieto apgaismojumu. @lv
toolkit label: ir kinooperators (dzimta/ģimene) @lv
toolkit definition: Darbs, kas ietver dzimtas/ģimenes atbildību par attēlu uzņemšanu elektroniski vai uz filmas, vai video un bieži izvēlas, un izvieto apgaismojumu. @lv
scope note: Kinooperatoru mēdz saukt arī par galveno operatoru. @lv
label: 是……的摄影指导家族 @zh-hans
definition: 将一个家族与涉及通过电子、胶片或视频存储方式摄录影像、且经常负责灯光的选择和布置的一个家族的责任的一种作品关联起来。 @zh-hans
toolkit label: ……的摄影指导家族 @zh-hans
toolkit definition: 涉及通过电子、胶片或视频存储方式摄录影像、且经常负责灯光的选择和布置的一个家族的责任的一种作品 @zh-hans
scope note: 电影的摄影指导也称总摄影师 @zh-hans

ohjaaja (henkilö) teoksessa
status: Published
label: is director person of @en
lexical alias: directorPersonOf.en
definition: Relates a person to a work that involves a responsibility of a person for the general management and supervision of a filmed performance, a radio or television program, etc. @en
toolkit label: director person of @en
toolkit definition: A work that involves a responsibility of a person for the general management and supervision of a filmed performance, a radio or television program, etc. @en
type: Property
domain: C10004
has element type: 2
sub property of: henkilöön liittyvä teos
sub property of: ohjaaja (toimija) teoksessa
definition: Liittää henkilön teokseen, jossa henkilö on vastuussa elokuvatun esityksen, radio- tai televisio-ohjelman tms. yleisestä johtamisesta.
toolkit label: ohjaaja (henkilö) teoksessa
toolkit definition: Teos, jossa henkilö on vastuussa elokuvatun esityksen, radio- tai televisio-ohjelman tms. yleisestä johtamisesta.
label: er regissør av (person) @no
definition: Relaterer en person til et verk som involverer et ansvar for en person for den generelle ledelsen og tilsyn med en filmet forestilling, et radio- eller fjernsynsprogram etc. @no
toolkit label: regissør av (person) @no
toolkit definition: Et verk som involverer et ansvar for en person for den generelle ledelsen og tilsyn med en filmet forestilling, et radio- eller fjernsynsprogram etc. @no
label: is regisseur-person van @nl
definition: Relateert een persoon aan een werk dat met zich meebrengt een verantwoordelijkheid van een persoon voor het algemene beheer en toezicht van een gefilmde uitvoering, een radio- of televisieprogramma etc. @nl
toolkit label: regisseur-person van @nl
toolkit definition: Een werk dat met zich meebrengt een verantwoordelijkheid van een persoon voor het algemene beheer en toezicht van een gefilmde uitvoering, een radio- of televisieprogramma etc. @nl
label: هو شخص مخرج لـ @ar
definition: يربط شخصا بعمل يترتب عليه مسئولية شخص عن الإدارة العامة، والإشراف على أداء مصور، أو على برنامج إذاعي أو تليفزيوني، إلخ. @ar
toolkit label: شخص مخرج @ar
toolkit definition: عمل يترتب عليه مسئولية شخص عن الإدارة العامة، والإشراف على أداء مصور، أو برنامج إذاعي أو تليفزيوني، إلخ. @ar
label: és persona realitzadora de @ca
definition: Relaciona una persona amb una obra que implica una responsabilitat d’una persona en la gestió general i la supervisió d’una actuació filmada, d’un programa radiofònic o de televisió, etc. @ca
toolkit label: persona realitzadora de @ca
toolkit definition: Obra que implica una responsabilitat d’una persona en la gestió general i la supervisió d’una actuació filmada, d’un programa radiofònic o de televisió, etc. @ca
label: er person, som er instruktør af @da
definition: Relaterer en person til et værk, som involverer en persons ansvar for den generelle ledelse af- og tilsyn med en filmoptagelse, et radio- eller tv-program etc. @da
toolkit label: person, som er instruktør af @da
toolkit definition: Værk, som involverer en persons ansvar for den generelle ledelse af- og tilsyn med en filmoptagelse, et radio- eller tv-program etc. @da
label: režissöör (isik) teoses @et
definition: Seostab isiku teosega, mis sisaldab isiku vastutust filmitava etenduse, raadio- või telesaate vms üldise juhtimise ja juhendamise eest. @et
toolkit label: režissöör (isik) teoses @et
toolkit definition: Teos, mis sisaldab isiku vastutust filmitava etenduse, raadio- või telesaate vms üldise juhtimise ja juhendamise eest. @et
label: ist Person als Regisseurin/Regisseur von @de
definition: Setzt eine Person in Beziehung zu einem Werk, bei dem eine Person für das allgemeine Management und die Leitung einer verfilmten Darbietung, einer Hörfunk- oder Fernsehsendung und so weiter verantwortlich ist. @de
toolkit label: Person als Regisseurin/Regisseur von @de
toolkit definition: Ein Werk, bei dem eine Person für das allgemeine Management und die Leitung einer verfilmten Darbietung, einer Hörfunk- oder Fernsehsendung und so weiter verantwortlich ist. @de
label: rendező személye a következőnek: @hu
definition: Hozzákapcsol egy személyt egy műhöz, amelyhez hozzátartozik egy személy felelőssége egy filmforgatás, egy rádió- vagy televízióműsor, stb. általános menedzseléséért és felügyeletéért. @hu
toolkit label: rendező személye: @hu
toolkit definition: Egy mű, amelyhez hozzátartozik egy személy felelőssége egy filmforgatás, egy rádió- vagy televízióműsor, stb. általános menedzseléséért és felügyeletéért. @hu
label: è direttore persona di @it
definition: Correla una persona a un'opera che implica una responsabilità di una persona per la gestione e supervisione generale di un'interpretazione filmata, programma radiofonico o televisivo, etc. @it
toolkit label: direttore persona di @it
toolkit definition: Opera che implica una responsabilità di una persona per la gestione generale e supervisione di un'interpretazione filmata, programma radiofonico o televisivo, etc. @it
label: είναι διευθυντής φυσικό πρόσωπο του @el
toolkit label: διευθυντής φυσικό πρόσωπο του @el
label: est une personne réalisatrice de @fr
definition: Met une personne en relation avec une œuvre qui comporte une responsabilité de la part d’une personne consistant à assurer la gestion et la supervision générales d’une prestation filmée, d’une émission de radio ou de télévision, etc. @fr
toolkit label: personne réalisatrice de @fr
toolkit definition: Œuvre qui comporte une responsabilité de la part d’une personne consistant à assurer la gestion et la supervision générales d’une prestation filmée, d’une émission de radio ou de télévision, etc. @fr
label: ir režisors (persona) @lv
definition: Sasaista personu ar darbu, kas ietver personas atbildību par vispārējo vadību un par filmētā materiāla, radio vai televīzijas raidījuma, u.tml. uzraudzību. @lv
toolkit label: ir režisors (persona) @lv
toolkit definition: Darbs, kas ietver personas atbildību par vispārējo vadību un par filmētā materiāla, radio vai televīzijas raidījuma, u.tml. uzraudzību. @lv
label: 是……的导演个人 @zh-hans
definition: 将一个个人与涉及电影表演、广播或电视节目等的全面管理和监督的一个个人的责任的一种作品关联起来。 @zh-hans
toolkit label: ……的导演个人 @zh-hans
toolkit definition: 涉及电影表演、广播或电视节目等的全面管理和监督的一个个人的责任的一种作品 @zh-hans
label: yönetmen kişisidir @tr
definition: Bir kişiyi, filme alınmış bir performansın, bir radyo veya televizyon programının vb. genel yönetimi ve denetimi sorumluluğunu içeren bir eserle ilişkilendirir. @tr
toolkit label: yönetmen @tr
toolkit definition: Filme alınmış bir performansın, bir radyo veya televizyon programı vb. genel yönetimi ve denetimi için bir kişinin sorumluluğunda olan bir eser. @tr
has subproperty: elokuvaohjaaja (henkilö) teoksessa
has subproperty: radio-ohjaaja (henkilö) teoksessa
has subproperty: televisio-ohjaaja (henkilö) teoksessa
has subproperty: P50561

kuvaaja (henkilö) teoksessa
status: Published
label: is director person of photography of @en
lexical alias: directorPersonOfPhotographyOf.en
definition: Relates a person to a work that involves a responsibility of a person for capturing images, either electronically or on film or video stock, and often selecting and arranging the lighting. @en
toolkit label: director person of photography of @en
toolkit definition: A work that involves a responsibility of a person for capturing images, either electronically or on film or video stock, and often selecting and arranging the lighting. @en
type: Property
domain: C10004
has element type: 2
sub property of: henkilöön liittyvä teos
sub property of: kuvaaja (toimija) teoksessa
scope note: A director of photography for a movie is also called a chief cinematographer. @en
definition: Liittää henkilön teokseen, jossa henkilö on vastuussa kuvien tallentamisesta joko sähköisesti tai filmille tai videolle, usein myös valaistuksen valitsemisesta ja järjestämisestä.
scope note: Elokuvan kuvaajaa kutsutaan myös elokuvaajaksi.
toolkit label: kuvaaja (henkilö) teoksessa
toolkit definition: Teos, jossa henkilö on vastuussa kuvien tallentamisesta joko sähköisesti tai filmille tai videolle, usein myös valaistuksen valitsemisesta ja järjestämisestä.
label: er filmfotograf for (person) @no
definition: Relaterer en person til et verk som involverer et ansvar for en person i form av å ta bilder, enten elektronisk eller på film eller video, og som ofte velger og arrangerer lyssetting. @no
scope note: Filmfotografen for en film kalles også sjefsfotograf. @no
toolkit label: filmfotograf for (person) @no
toolkit definition: Et verk som involverer et ansvar for en person i form av å ta bilder, enten elektronisk eller på film eller video, og som ofte velger og arrangerer lyssetting. @no
label: is cameraregisseur-persoon van @nl
definition: Relateert een persoon aan een werk dat met zich meebrengt een verantwoordelijkheid van een persoon voor het vastleggen van beelden, elektronisch of op film- of videomateriaal, en vaak het selecteren en arrangeren van de belichting. @nl
scope note: Een cameraregisseur bij een film wordt ook director of photography of hoofdcinematograaf genoemd. @nl
toolkit label: cameraregisseur-persoon van @nl
toolkit definition: Een werk dat met zich meebrengt een verantwoordelijkheid van een persoon voor het vastleggen van beelden, elektronisch of op film- of videomateriaal, en vaak het selecteren en arrangeren van de belichting. @nl
label: هو شخص مدير تصوير لـ @ar
definition: يربط شخصا بعمل يترتب عليه مسئولية شخص عن التقاط الصور، إما إلكترونيًا أو في فيلم أو في مقاطع فيديو، وغالبا ما يكون مسئولا عن اختيار الإضاءة وتوزيعها. @ar
scope note: ويطلق أيضًا على مدير تصوير الفيلم كبير المصورين السينمائيين . @ar
toolkit label: شخص مدير التصوير @ar
toolkit definition: عمل يترتب عليه مسئولية شخص عن التقاط الصور، إما إلكترونيًا أو في فيلم أو في مقاطع فيديو، وغالبا ما يكون مسئولا عن اختيار الإضاءة وتوزيعها. @ar
label: és persona directora de fotografia de @ca
definition: Relaciona una persona amb una obra que implica una responsabilitat d’una persona en la captura d’imatges, ja sigui electrònicament o sobre pel·lícula o vídeo, i que sovint selecciona i organitza la il·luminació. @ca
scope note: Un director de fotografia d’una pel·lícula també s’anomena primer operador. @ca
toolkit label: persona directora de fotografia de @ca
toolkit definition: Obra que implica una responsabilitat d’una persona en la captura d’imatges, ja sigui electrònicament o sobre pel·lícula o vídeo, i que sovint selecciona i organitza la il·luminació. @ca
label: er person, som er filmfotograf af @da
definition: Relaterer en person til et værk, som involverer en persons ansvar for at optage billeder, enten elektronisk eller på film eller video, og ofte også for at udvælge og arrangere lyssætningen. @da
scope note: Filmfotografen på en film kaldes også for en cheffotograf. @da
toolkit label: person, som er filmfotograf af @da
toolkit definition: Værk, som involverer en persons ansvar for at optage billeder, enten elektronisk eller på film eller video, og ofte også for at udvælge og arrangere lyssætningen. @da
label: operaator-lavastaja (isik) teoses @et
definition: Seostab isiku teosega, mis sisaldab isiku vastutust pildi jäädvustamise eest kas elektrooniliselt või filmi- või videolindile ning sageli valgustuse valimise ja ülesseadmise eest. @et
scope note: Filmi operaator-lavastajat nimetatakse inglise keeles sageli ka chief cinematographer. @et
toolkit label: operaator-lavastaja (isik) teoses @et
toolkit definition: Teos, mis sisaldab isiku vastutust pildi jäädvustamise eest kas elektrooniliselt või filmi- või videolindile ning sageli valgustuse valimise ja ülesseadmise eest. @et
label: ist Person als Kamerafrau/Kameramann von @de
definition: Setzt eine Person in Beziehung zu einem Werk, bei dem eine Person für die Aufzeichnung von Bildern, entweder elektronisch oder auf Film- oder Videomaterial, verantwortlich ist und häufig die Belichtung auswählt und arrangiert. @de
scope note: Eine Kamerafrau/Ein Kameramann für einen Film wird auch als "Bildregisseurin/Bildregisseur" bezeichnet. @de
toolkit label: Person als Kamerafrau/Kameramann von @de
toolkit definition: Ein Werk, bei dem eine Person für die Aufzeichnung von Bildern, entweder elektronisch oder auf Film- oder Videomaterial, verantwortlich ist und häufig die Belichtung auswählt und arrangiert. @de
label: operatőr személye a következőnek: @hu
definition: Hozzákapcsol egy személyt egy műhöz, amelyhez hozzátartozik egy személy felelőssége képek elektronikusan, filmen vagy videoállományon történő rögzítéséért, gyakran a világítás kiválasztásáért és elrendezéséért is. @hu
scope note: Egy film operatőrét vezető operatőrnek is nevezik. @hu
toolkit label: operatőr személye: @hu
toolkit definition: Egy mű, amelyhez hozzátartozik egy személy felelőssége képek elektronikusan, filmen vagy videoállományon történő rögzítéséért, gyakran a világítás kiválasztásáért és elrendezéséért is. @hu
label: è direttore persona della fotografia di @it
definition: Correla una persona a un'opera che implica una responsabilità di una persona per l'acquisizione di immagini, elettronicamente o su pellicola o video, e spesso nella scelta e organizzazione dell'illuminazione. @it
scope note: Un direttore della fotografia di un film è anche definito capo cameraman. @it
toolkit label: direttore della fotografia persona di @it
toolkit definition: Opera che implica una responsabilità di una persona per l'acquisizione di immagini, elettronicamente o su pellicola o video, e spesso nella scelta e organizzazione dell'illuminazione. @it
label: είναι διευθυντής φωτογραφίας φυσικό πρόσωπο του @el
toolkit label: διευθυντής φωτογραφίας φυσικό πρόσωπο του @el
label: est une personne directrice de la photographie de @fr
definition: Met une personne en relation avec une œuvre qui comporte une responsabilité de la part d’une personne consistant à capter des images, de manière électronique ou bien sur film ou vidéo, et qui, souvent, choisit et dispose l’éclairage. @fr
scope note: Un directeur de la photographie pour un film est également appelé un chef opérateur de prise de vue. @fr
toolkit label: personne directrice de la photographie de @fr
toolkit definition: Œuvre qui comporte une responsabilité de la part d’une personne consistant à capter des images, de manière électronique ou bien sur film ou vidéo, et qui, souvent, choisit et dispose l’éclairage. @fr
label: ir kinooperators (persona) @lv
definition: Sasaista personu ar darbu, kas ietver personas atbildību par attēlu uzņemšanu elektroniski vai uz filmas, vai video un bieži izvēlas, un izvieto apgaismojumu. @lv
toolkit label: ir kinooperators (persona) @lv
toolkit definition: Darbs, kas ietver personas atbildību par attēlu uzņemšanu elektroniski vai uz filmas, vai video un bieži izvēlas, un izvieto apgaismojumu. @lv
scope note: Kinooperatoru mēdz saukt arī par galveno operatoru. @lv
label: 是……的摄影指导个人 @zh-hans
definition: 将一个个人与涉及通过电子、胶片或视频存储方式摄录影像、且经常负责灯光的选择和布置的一个个人的责任的一种作品关联起来。 @zh-hans
toolkit label: ……的摄影指导个人 @zh-hans
toolkit definition: 涉及通过电子、胶片或视频存储方式摄录影像、且经常负责灯光的选择和布置的一个个人的责任的一种作品 @zh-hans
scope note: 电影的摄影指导也称总摄影师 @zh-hans
label: görüntü yönetmeni kişisidir @tr

jakelija (toimija) manifestaatiossa
status: Published
label: is distributor agent of @en
definition: Relates an agent to a manifestation that involves a responsibility of an agent for distribution. @en
type: Property
domain: C10002
lexical alias: distributorAgentOf.en
label: est un agent diffuseur ou distributeur de @fr
definition: Met un agent en relation avec une manifestation qui comporte une responsabilité de la part d’un agent en ce qui concerne la diffusion ou la distribution. @fr
toolkit label: agent diffuseur ou distributeur de @fr
toolkit definition: Manifestation qui comporte une responsabilité de la part d’un agent en ce qui concerne la diffusion ou la distribution. @fr
toolkit label: distributor agent of @en
toolkit definition: A manifestation that involves a responsibility of an agent for distribution. @en
sub property of: toimijaan liittyvä manifestaatio
label: είναι διανομέας φορέας του @el
definition: Συνδέει έναν φορέα υπεύθυνο για τη διανομή μιας εκδήλωσης, με μια εκδήλωση. @el
toolkit label: διανομέας φορέας του @el
toolkit definition: Μια εκδήλωση η οποία διανέμεται. @el
definition: Setzt einen Akteur in Beziehung zu einer Manifestation, bei der ein Akteur für den Vertrieb verantwortlich ist. @de
toolkit label: Akteur als Vertrieb von @de
toolkit definition: Eine Manifestation, bei der ein Akteur für den Vertrieb verantwortlich ist. @de
label: er agent, som er distributør af @da
definition: Relaterer en agent til en manifestation, som involverer en agents ansvar for distribution. @da
toolkit label: agent, som er distributør af @da
toolkit definition: Manifestation, som involverer en agents ansvar for distribution. @da
label: és agent distribuïdor de @ca
definition: Relaciona un agent amb una manifestació que implica una responsabilitat d’un agent en la distribució. @ca
toolkit label: agent distribuïdor de @ca
toolkit definition: Manifestació que implica una responsabilitat d’un agent en la distribució. @ca
definition: Liittää toimijan manifestaatioon, jonka jakelusta toimija on vastuussa.
toolkit label: jakelija (toimija) manifestaatiossa
toolkit definition: Manifestaatio, jonka jakelusta toimija on vastuussa.
toolkit label: distributør av (agent) @no
toolkit definition: En manifestasjon som involverer ansvar for en agent i form av distribusjon. @no
label: ist Akteur als Vertrieb von @de
has element type: 2
label: terjesztő ágense a következőnek: @hu
definition: Hozzákapcsol egy ágenst egy megjelenési formához, amelyhez hozzátartozik egy ágens felelőssége a terjesztésért. @hu
toolkit label: terjesztő ágense: @hu
toolkit definition: Egy megjelenési forma, amelyhez hozzátartozik egy ágens felelőssége a terjesztésért. @hu
alternative label: distributor of @en
alternative label: jakelija aineistossa
label: er distributør av (agent) @no
definition: Relaterer en agent til en manifestasjon som involverer ansvar for en agent i form av distribusjon. @no
alternative label: distributør av @no
label: is distributeur-actor van @nl
definition: Relateert een actor aan een manifestatie die met zich meebrengt een verantwoordelijkheid van een actor voor distributie. @nl
toolkit label: distributeur-actor van @nl
toolkit definition: Een manifestatie die met zich meebrengt een verantwoordelijkheid van een actor voor distributie. @nl
label: هو وكيل موزع لـ @ar
definition: يربط وكيلا بتجسيدة تنطوي على مسئولية وكيل عن التوزيع. @ar
alternative label: موزع @ar
toolkit label: وكيل موزع @ar
toolkit definition: تجسيدة تنطوي على مسئولية وكيل عن التوزيع. @ar
alternative label: distribuïdor de @ca
alternative label: distributør af @da
label: levitaja (tegija) kehastuses @et
definition: Seostab tegija kehastusega, mis sisaldab tegija vastutust levitamise eest. @et
alternative label: levitaja kehastuses @et
toolkit label: levitaja (tegija) kehastuses @et
toolkit definition: Kehastus, mis sisaldab tegija vastutust levitamise eest. @et
alternative label: terjesztője: @hu
label: è distributore agente di @it
definition: Correla un agente a una manifestazione che implica la responsabilità di un agente nella distribuzione. @it
alternative label: distributore di @it
toolkit label: distributore agente di @it
toolkit definition: Manifestazione che implica la responsabilità di un agente nella distribuzione. @it
alternative label: διαθέτης του @el
alternative label: diffuseur ou distributeur de @fr
label: ir izplatītājs (aģents) @lv
definition: Sasaista aģentu ar manifestāciju, kas ietver aģenta atbildību par izplatīšanu. @lv
toolkit label: ir izplatītājs (aģents) @lv
toolkit definition: Manifestācija, kas ietver aģenta atbildību par izplatīšanu. @lv
alternative label: Vertrieb von @de
alternative label: ……的发行者 @zh-hans
toolkit label: ……的发行者行为者 @zh-hans
toolkit definition: 涉及发行的一个行为者的责任的一种载体表现 @zh-hans
toolkit label: dağıtıcı temsilci @tr
toolkit definition: Dağıtım için bir temsilcinin sorumluluğunu içeren bir gösterim. @tr
has subproperty: jakelija (yhteistoimija) manifestaatiossa
has subproperty: jakelija (henkilö) manifestaatiossa

jakelija (yhteistoimija) manifestaatiossa
status: Published
label: is distributor collective agent of @en
lexical alias: distributorCollectiveAgentOf.en
definition: Relates a collective agent to a manifestation that involves a responsibility of a collective agent for distribution. @en
toolkit label: distributor collective agent of @en
toolkit definition: A manifestation that involves a responsibility of a collective agent for distribution. @en
type: Property
domain: C10011
has element type: 2
sub property of: yhteistoimijaan liittyvä manifestaatio
sub property of: jakelija (toimija) manifestaatiossa
definition: Liittää yhteistoimijan manifestaatioon, jonka jakelusta yhteistoimija on vastuussa.
toolkit label: jakelija (yhteistoimija) manifestaatiossa
toolkit definition: Manifestaatio, jonka jakelusta yhteistoimija on vastuussa.
label: er distributør for (kollektiv agent) @no
definition: Relaterer en kollektiv agent til en manifestasjon som involverer et ansvar for en kollektiv agent i form av distribusjon. @no
toolkit label: distributør for (kollektiv agent) @no
toolkit definition: En manifestasjon som involverer et ansvar for en kollektiv agent i form av distribusjon. @no
label: is distributeur-collectieve actor van @nl
definition: Relateert een collectieve actor aan een manifestatie die met zich meebrengt een verantwoordelijkheid van een collectieve actor voor distributie. @nl
toolkit label: distributeur-collectieve actor van @nl
toolkit definition: Een manifestatie die met zich meebrengt een verantwoordelijkheid van een collectieve actor voor distributie. @nl
label: هو وكيل جماعي موزع لـ @ar
definition: يربط وكيلا جماعيا بتجسيدة تنطوي على مسئولية وكيل جماعي عن التوزيع. @ar
toolkit label: وكيل جماعي موزع @ar
toolkit definition: تجسيدة تنطوي على مسئولية وكيل جماعي عن التوزيع. @ar
label: és agent col·lectiu distribuïdor de @ca
definition: Relaciona un agent col·lectiu amb una manifestació que implica una responsabilitat d’un agent col·lectiu en la distribució. @ca
toolkit label: agent col·lectiu distribuïdor de @ca
toolkit definition: Manifestació que implica una responsabilitat d’un agent col·lectiu en la distribució. @ca
label: er kollektiv agent, som er distributør af @da
definition: Relaterer en kollektiv agent til en manifestation, som involverer en kollektiv agents ansvar for distribution. @da
toolkit label: kollektiv agent, som er distributør af @da
toolkit definition: Manifestation, som involverer en kollektiv agents ansvar for distribution. @da
label: levitaja (kollektiiv) kehastuses @et
definition: Seostab kollektiivi kehastusega, mis sisaldab kollektiivi vastutust levitamise eest. @et
toolkit label: levitaja (kollektiiv) kehastuses @et
toolkit definition: Kehastus, mis sisaldab kollektiivi vastutust levitamise eest. @et
label: ist gemeinschaftlicher Akteur als Vertrieb von @de
definition: Setzt einen gemeinschaftlichen Akteur in Beziehung zu einer Manifestation, bei der ein gemeinschaftlicher Akteur für den Vertrieb verantwortlich ist. @de
toolkit label: Gemeinschaftlicher Akteur als Vertrieb von @de
toolkit definition: Eine Manifestation, bei der ein gemeinschaftlicher Akteur für den Vertrieb verantwortlich ist. @de
label: terjesztő kollektív ágense a következőnek: @hu
definition: Hozzákapcsol egy kollektív ágenst egy megjelenési formához, amelyhez hozzátartozik egy kollektív ágens felelőssége a terjesztésért. @hu
toolkit label: terjesztő kollektív ágense: @hu
toolkit definition: Egy megjelenési forma, amelyhez hozzátartozik egy kollektív ágens felelőssége a terjesztésért. @hu
label: è distributore agente collettivo di @it
definition: Correla un agente collettivo a una manifestazione che implica una responsabilità di un agente collettivo nella distribuzione. @it
toolkit label: distributore agente collettivo di @it
toolkit definition: Manifestazione che implica una responsabilità di un agente collettivo nella distribuzione. @it
label: είναι διανομέας συλλογικός φορέας του @el
toolkit label: διανομέας συλλογικός φορέας του @el
label: est un agent collectif diffuseur ou distributeur de @fr
definition: Met un agent collectif en relation avec une manifestation qui comporte une responsabilité de la part d’un agent collectif en ce qui concerne la diffusion ou la distribution. @fr
toolkit label: agent collectif diffuseur ou distributeur de @fr
toolkit definition: Manifestation qui comporte une responsabilité de la part d’un agent collectif en ce qui concerne la diffusion ou la distribution. @fr
label: ir izplatītājs (grupa) @lv
definition: Sasaista grupu ar manifestāciju, kas ietver grupas atbildību par izplatīšanu. @lv
toolkit label: ir izplatītājs (grupa) @lv
toolkit definition: Manifestācija, kas ietver grupas atbildību par izplatīšanu. @lv
label: 是……的发行者集体行为者 @zh-hans
definition: 将一个集体行为者与涉及发行的一个集体行为者的责任的一种载体表现关联起来。 @zh-hans
toolkit label: ……的发行者集体行为者 @zh-hans
toolkit definition: 涉及发行的一个集体行为者的责任的一种载体表现 @zh-hans
label: dağıtımcı kolektif temsilcisidir @tr
definition: Kolektif bir temsilciyi, dağıtım için kolektif bir temsilcinin sorumluluğunu içeren bir gösterimle ilişkilendirir. @tr
toolkit label: dağıtıcı kolektif temsilci @tr
toolkit definition: Dağıtım için kolektif bir temsilcinin sorumluluğunu içeren bir gösterim. @tr
has subproperty: jakelija (yhteisö) manifestaatiossa
has subproperty: jakelija (suku) manifestaatiossa
has subproperty: elokuvan jakelija (yhteistoimija) manifestaatiossa
has subproperty: P50648

jakelija (yhteisö) manifestaatiossa
status: Published
label: is distributor corporate body of @en
lexical alias: distributorCorporateBodyOf.en
definition: Relates a corporate body to a manifestation that involves a responsibility of a corporate body for distribution. @en
toolkit label: distributor corporate body of @en
toolkit definition: A manifestation that involves a responsibility of a corporate body for distribution. @en
type: Property
domain: C10005
has element type: 2
sub property of: yhteisöön liittyvä manifestaatio
sub property of: jakelija (yhteistoimija) manifestaatiossa
definition: Liittää yhteisön manifestaatioon, jonka jakelusta yhteisö on vastuussa.
toolkit label: jakelija (yhteisö) manifestaatiossa
toolkit definition: Manifestaatio, jonka jakelusta yhteisö on vastuussa.
label: er distributør for (korporasjon) @no
definition: Relaterer en korporasjon til en manifestasjon som involverer et ansvar for en korporasjon i form av distribusjon. @no
toolkit label: distributør for (korporasjon) @no
toolkit definition: En manifestasjon som involverer et ansvar for en korporasjon i form av distribusjon. @no
label: is distributeur-corporatie van @nl
definition: Relateert een corporatie aan een manifestatie die met zich meebrengt een verantwoordelijkheid van een corporatie voor distributie. @nl
toolkit label: distributeur-corporatie van @nl
toolkit definition: Een manifestatie die met zich meebrengt een verantwoordelijkheid van een corporatie voor distributie. @nl
label: هي هيئة موزعة لـ @ar
definition: يربط هيئة بتجسيدة تنطوي على مسئولية هيئة عن التوزيع. @ar
toolkit label: هيئة مسئولة عن التوزيع @ar
toolkit definition: تجسيدة تنطوي على مسئولية هيئة عن التوزيع. @ar
label: és entitat corporativa distribuïdora de @ca
definition: Relaciona una entitat corporativa amb una manifestació que implica una responsabilitat d’una entitat corporativa en la distribució. @ca
toolkit label: entitat corporativa distribuïdora de @ca
toolkit definition: Manifestació que implica una responsabilitat d’una entitat corporativa en la distribució. @ca
label: er korporation, som er distributør af @da
definition: Relaterer en korporation til en manifestation, som involverer en korporations ansvar for distribution. @da
toolkit label: korporation, som er distributør af @da
toolkit definition: Manifestation, som involverer en korporations ansvar for distribution. @da
label: levitaja (asutus) kehastuses @et
definition: Seostab asutuse kehastusega, mis sisaldab asutuse vastutust levitamise eest. @et
toolkit label: levitaja (asutus) kehastuses @et
toolkit definition: Kehastus, mis sisaldab asutuse vastutust levitamise eest. @et
label: ist Körperschaft als Vertrieb von @de
definition: Setzt eine Körperschaft in Beziehung zu einer Manifestation, bei der eine Körperschaft für den Vertrieb verantwortlich ist. @de
toolkit label: Körperschaft als Vertrieb von @de
toolkit definition: Eine Manifestation, bei der eine Körperschaft für den Vertrieb verantwortlich ist. @de
label: terjesztő testülete a következőnek: @hu
definition: Hozzákapcsol egy testületet egy megjelenési formához, amelyhez hozzátartozik egy testület felelőssége a terjesztésért. @hu
toolkit label: terjesztő testülete: @hu
toolkit definition: Egy megjelenési forma, amelyhez hozzátartozik egy testület felelőssége a terjesztésért. @hu
label: è distributore ente di @it
definition: Correla un ente a una manifestazione che implica una responsabilità di un ente per la distribuzione. @it
toolkit label: distributore ente di @it
toolkit definition: Manifestazione che implica una responsabilità di un ente per la distribuzione. @it
label: είναι διανομέας συλλογικό όργανο του @el
toolkit label: διανομέας συλλογικό όργανο του @el
label: est une collectivité diffuseuse ou distributrice de @fr
definition: Met une collectivité en relation avec une manifestation qui comporte une responsabilité de la part d’une collectivité en ce qui concerne la diffusion ou la distribution. @fr
toolkit label: collectivité diffuseuse ou distributrice de @fr
toolkit definition: Manifestation qui comporte une responsabilité de la part d’une collectivité en ce qui concerne la diffusion ou la distribution. @fr
label: ir izplatītājs (institūcija) @lv
definition: Sasaista institūciju ar manifestāciju, kas ietver institūcijas atbildību par izplatīšanu. @lv
toolkit label: ir izplatītājs (institūcija) @lv
toolkit definition: Manifestācija, kas ietver institūcijas atbildību par izplatīšanu. @lv
label: 是……的发行者团体 @zh-hans
definition: 将一个团体与涉及发行的一个团体的责任的一种载体表现关联起来。 @zh-hans
toolkit label: ……的发行者团体 @zh-hans
toolkit definition: 涉及发行的一个团体的责任的一种载体表现 @zh-hans
label: dağıtımcı tüzel kişisidir @tr
definition: Bir tüzel kişiyi, bir tüzel kişiliğin dağıtım sorumluluğunu içeren bir gösterim ile ilişkilendirir. @tr
toolkit label: dağıtıcı tüzel kişi @tr
toolkit definition: Dağıtım için tüzel bir kişinin sorumluluğunu içeren bir gösterim @tr
has subproperty: elokuvan jakelija (yhteisö) manifestaatiossa
has subproperty: P50799

jakelija (suku) manifestaatiossa
status: Published
label: is distributor family of @en
lexical alias: distributorFamilyOf.en
definition: Relates a family to a manifestation that involves a responsibility of a family for distribution. @en
toolkit label: distributor family of @en
toolkit definition: A manifestation that involves a responsibility of a family for distribution. @en
type: Property
domain: C10008
has element type: 2
sub property of: sukuun liittyvä manifestaatio
sub property of: jakelija (yhteistoimija) manifestaatiossa
definition: Liittää suvun manifestaatioon, jonka jakelusta suku on vastuussa.
toolkit label: jakelija (suku) manifestaatiossa
toolkit definition: Manifestaatio, jonka jakelusta suku on vastuussa.
label: er distributør for (familie) @no
definition: Relaterer en famile til en manifestasjon som involverer et ansvar for en familie i form av distribusjon. @no
toolkit label: distributør for (familie) @no
toolkit definition: En manifestasjon som involverer et ansvar for en familie i form av distribusjon. @no
label: is distributeur-familie van @nl
definition: Relateert een familie aan een manifestatie die met zich meebrengt een verantwoordelijkheid van een familie voor distributie. @nl
toolkit label: distributeur-familie van @nl
toolkit definition: Een manifestatie die met zich meebrengt een verantwoordelijkheid van een familie voor distributie. @nl
label: هي عائلة مسئولة عن التوزيع لـ @ar
definition: يربط عائلة بتجسيدة تنطوي على مسئولية عائلة عن التوزيع. @ar
toolkit label: عائلة مسئولة عن التوزيع @ar
toolkit definition: تجسيدة تنطوي على مسئولية عائلة عن التوزيع. @ar
label: és família distribuïdora de @ca
definition: Relaciona una família amb una manifestació que implica una responsabilitat d’una família en la distribució. @ca
toolkit label: família distribuïdora de @ca
toolkit definition: Manifestació que implica una responsabilitat d’una família en la distribució. @ca
label: er familie, som er distributør af @da
definition: Relaterer en familie til en manifestation, som involverer en families ansvar for distribution. @da
toolkit label: familie, som er distributør af @da
toolkit definition: Manifestation, som involverer en families ansvar for distribution. @da
label: levitaja (perekond) kehastuses @et
definition: Seostab perekonna kehastusega, mis sisaldab perekonna vastutust levitamise eest. @et
toolkit label: levitaja (perekond) kehastuses @et
toolkit definition: Kehastus, mis sisaldab perekonna vastutust levitamise eest. @et
label: ist Familie als Vertrieb von @de
definition: Setzt eine Familie in Beziehung zu einer Manifestation, bei der eine Familie für den Vertrieb verantwortlich ist. @de
toolkit label: Familie als Vertrieb von @de
toolkit definition: Eine Manifestation, bei der eine Familie für den Vertrieb verantwortlich ist. @de
label: terjesztő családja a következőnek: @hu
definition: Hozzákapcsol egy családot egy megjelenési formához, amelyhez hozzátartozik egy család felelőssége a terjesztésért. @hu
toolkit label: terjesztő családja: @hu
toolkit definition: Egy megjelenési forma, amelyhez hozzátartozik egy család felelőssége a terjesztésért. @hu
label: è distributore famiglia di @it
definition: Correla una famiglia a una manifestazione che implica una responsabilità di una famiglia per la distribuzione. @it
toolkit label: distributore famiglia di @it
toolkit definition: Manifestazione che implica una responsabilità di una famiglia per la distribuzione. @it
label: είναι διανομέας οικογένεια του @el
toolkit label: διανομέας οικογένεια του @el
label: est une famille diffuseuse ou distributrice de @fr
definition: Met une famille en relation avec une manifestation qui comporte une responsabilité de la part d’une famille en ce qui concerne la diffusion ou la distribution. @fr
toolkit label: famille diffuseuse ou distributrice de @fr
toolkit definition: Manifestation qui comporte une responsabilité de la part d’une famille en ce qui concerne la diffusion ou la distribution. @fr
label: ir izplatītājs (dzimta/ģimene) @lv
definition: Sasaista dzimtu/ģimeni ar manifestāciju, kas ietver dzimtas/ģimenes atbildību par izplatīšanu. @lv
toolkit label: ir izplatītājs (dzimta/ģimene) @lv
toolkit definition: Manifestācija, kas ietver dzimtas/ģimenes atbildību par izplatīšanu. @lv
label: 是……的发行者家族 @zh-hans
definition: 将一个家族与涉及发行的一个家族的责任的一种载体表现关联起来。 @zh-hans
toolkit label: ……的发行者家族 @zh-hans
toolkit definition: 涉及发行的一个家族的责任的一种载体表现 @zh-hans
label: dağıtımcı ailesidir @tr
definition: Bir aileyi, ailenin dağıtımdaki sorumluluğunu içeren gösterimle ilişkilendirir. @tr
toolkit label: dağıtıcı aile @tr
toolkit definition: Ailenin dağıtımdaki sorumluluğunu içeren bir gösterim. @tr
has subproperty: elokuvan jakelijja (suku) manifestaatiossa
has subproperty: P50950

jakelija (henkilö) manifestaatiossa
status: Published
label: is distributor person of @en
lexical alias: distributorPersonOf.en
definition: Relates a person to a manifestation that involves a responsibility of a person for distribution. @en
toolkit label: distributor person of @en
toolkit definition: A manifestation that involves a responsibility of a person for distribution. @en
type: Property
domain: C10004
has element type: 2
sub property of: henkilöön liittyvä manifestaatio
sub property of: jakelija (toimija) manifestaatiossa
definition: Liittää henkilön manifestaatioon, jonka jakelusta henkilö on vastuussa.
toolkit label: jakelija (henkilö) manifestaatiossa
toolkit definition: Manifestaatio, jonka jakelusta henkilö on vastuussa.
label: er distributør for (person) @no
definition: Relaterer en person til en manifestasjon som involverer et ansvar for en person i form av distribusjon. @no
toolkit label: distributør for (person) @no
toolkit definition: En manifestasjon som involverer et ansvar for en person i form av distribusjon. @no
label: is distributeur-persoon van @nl
definition: Relateert een persoon aan een manifestatie die met zich meebrengt een verantwoordelijkheid van een persoon voor distributie. @nl
toolkit label: distributeur-persoon van @nl
toolkit definition: Een manifestatie die met zich meebrengt een verantwoordelijkheid van een persoon voor distributie. @nl
label: هو شخص موزع لـ @ar
definition: يربط شخصا بتجسيدة تنطوي على مسئولية شخص عن التوزيع. @ar
toolkit label: شخص موزع @ar
toolkit definition: تجسيدة تنطوي على مسئولية شخص عن التوزيع. @ar
label: és persona distribuïdora de @ca
definition: Relaciona una persona amb una manifestació que implica una responsabilitat d’una persona en la distribució. @ca
toolkit label: persona distribuïdora de @ca
toolkit definition: Manifestació que implica una responsabilitat d’una persona en la distribució. @ca
label: er person, som er distributør af @da
definition: Relaterer en person til en manifestation, som involverer en persons ansvar for distribution. @da
toolkit label: person, som er distributør af @da
toolkit definition: Manifestation, som involverer en persons ansvar for distribution. @da
label: levitaja (isik) kehastuses @et
definition: Seostab isiku kehastusega, mis sisaldab isiku vastutust levitamise eest. @et
toolkit label: levitaja (isik) kehastuses @et
toolkit definition: Kehastus, mis sisaldab isiku vastutust levitamise eest. @et
label: ist Person als Vertrieb von @de
definition: Setzt eine Person in Beziehung zu einer Manifestation, bei der eine Person für den Vertrieb verantwortlich ist. @de
toolkit label: Person als Vertrieb von @de
toolkit definition: Eine Manifestation, bei der eine Person für den Vertrieb verantwortlich ist. @de
label: terjesztő személye a következőnek: @hu
definition: Hozzákapcsol egy személyt egy megjelenési formához, amelyhez hozzátartozik egy személy felelőssége a terjesztésért. @hu
toolkit label: terjesztő személye: @hu
toolkit definition: Egy megjelenési forma, amelyhez hozzátartozik egy ágens felelőssége a terjesztésért. @hu
label: è distributore persona di @it
definition: Correla una persona a una manifestazione che implica una responsabilità di una persona nella distribuzione. @it
toolkit label: distributore persona di @it
toolkit definition: Manifestazione che implica una responsabilità di una persona nella distribuzione. @it
label: είναι διανομέας φυσικό πρόσωπο του @el
toolkit label: διανομέας φυσικό πρόσωπο του @el
label: est une personne diffuseuse ou distributrice de @fr
definition: Met une personne en relation avec une manifestation qui comporte une responsabilité de la part d’une personne en ce qui concerne la diffusion ou la distribution. @fr
toolkit label: personne diffuseuse ou distributrice de @fr
toolkit definition: Manifestation qui comporte une responsabilité de la part d’une personne en ce qui concerne la diffusion ou la distribution. @fr
label: ir izplatītājs (persona) @lv
definition: Sasaista personu ar manifestāciju, kas ietver personas atbildību par izplatīšanu. @lv
toolkit label: ir izplatītājs (persona) @lv
toolkit definition: Manifestācija, kas ietver personas atbildību par izplatīšanu. @lv
label: 是……的发行者个人 @zh-hans
definition: 将一个个人与涉及一个发行个人的责任的一种载体表现关联起来。 @zh-hans
toolkit label: ……的发行者个人 @zh-hans
toolkit definition: 涉及一个发行个人的责任的一种载体表现 @zh-hans
label: dağıtımcı kişisidir @tr
definition: Bir kişiyi, kişinin dağıtımdaki sorumluğunun gösterimle ilişkilendirir. @tr
toolkit label: dağıtıcı @tr
toolkit definition: Bir kişinin dağıtımdaki sorumluluğunu içeren bir gösterim. @tr
has subproperty: elokuvan jakelija (henkilö) manifestaatiossa
has subproperty: P50497

DJ (toimija) ekspressiossa
status: Published
type: Property
label: is DJ agent of @en
lexical alias: djAgentOf.en
definition: Relates an agent to an expression that includes a contribution by an agent of mixing recorded tracks together during a live performance or in a recording studio to appear as one continuous track. @en
domain: C10002
toolkit label: DJ agent of @en
toolkit definition: An expression that includes a contribution by an agent of mixing recorded tracks together during a live performance or in a recording studio to appear as one continuous track. @en
see also: miksaaja (toimija) ekspressiossa
instruction number: 18.5
sub property of: esitykseen osallinen toimija ekspressiossa
label: είναι DJ φορέας του @el
definition: Συνδέει έναν φορέα με μια έκφραση ενός έργου που ενσωματώνει τη συνεισφορά της μίξης κατά τη διάρκεια μιας ζωντανής παράστασης ή σε ένα studio ηχογράφησης ηχογραφημένων κομματιών [με τέτοιον τρόπο], ώστε να εμφανίζονται ως ένα ενιαίο κομμάτι. @el
toolkit label: DJ φορέας του @el
toolkit definition: Μια έκφραση ενός έργου που ενσωματώνει τη συνεισφορά της μίξης ηχογραφημένων κομματιών κατά τη διάρκεια μιας ζωντανής παράστασης ή σε ένα studio ηχογράφησης [με τέτοιον τρόπο], ώστε να εμφανίζονται ως ένα ενιαίο κομμάτι. @el
definition: Setzt einen Akteur in Beziehung zu einer Expression, zu der ein Akteur beiträgt, indem er während eines Live-Auftritts oder in einem Aufnahme-Studio aufgenommene Einzelspuren (Kanäle) zu einem scheinbar ununterbrochen durchgehenden Klangerlebnis zusammen mischt. @de
toolkit label: Akteur als DJane/DJ von @de
toolkit definition: Eine Expression, zu der ein Akteur beiträgt, indem er während eines Live-Auftritts oder in einem Aufnahme-Studio aufgenommene Einzelspuren (Kanäle) zu einem scheinbar ununterbrochen durchgehenden Klangerlebnis zusammen mischt. @de
label: er agent, som er dj af @da
definition: Relaterer en agent til et udtryk, som omfatter en agents bidrag ved at mixe indspillede spor sammen under en live-optræden eller i et indspilningsstudie, så de fremstår som et uafbrudt spor. @da
toolkit label: agent, som er dj af @da
toolkit definition: Udtryk, som omfatter en agents bidrag ved at mixe indspillede spor sammen under en live-optræden eller i et indspilningsstudie, så de fremstår som et uafbrudt spor. @da
label: és agent discjòquei de @ca
definition: Relaciona un agent amb una expressió que inclou una contribució d’un agent mesclant pistes enregistrades conjuntament durant una actuació en directe o en un estudi de gravació perquè sembli una pista continua. @ca
toolkit label: agent discjòquei de @ca
toolkit definition: Expressió que inclou una contribució d’un agent mesclant pistes enregistrades conjuntament durant una actuació en directe o en un estudi de gravació perquè sembli una pista continua. @ca
definition: Liittää toimijan ekspressioon, jonka tekemiseen toimija osallistuu miksaamalla ääniraitoja yhteen yhtäjaksoiseksi raidaksi live-esityksessä tai äänitysstudiossa.
toolkit label: DJ (toimija) ekspressiossa
toolkit definition: Ekspressio, jonka tekemiseen toimija osallistuu miksaamalla ääniraitoja yhteen yhtäjaksoiseksi raidaksi live-esityksessä tai äänitysstudiossa.
scope note: Remixing activities that substantially change the nature and content of an original work, resulting in a new work, and mixing and assembling the multiple tracks of a recording, are excluded. @en
toolkit label: DJ for (agent) @no
toolkit definition: Et uttrykk som inkluderer et bidrag fra en agent i form av å mikse sammen innspilte spor under en liveopptreden eller i et lydstudio slik at de framstår som ett sammenhengende spor. @no
label: ist Akteur als DJane/DJ von @de
scope note: Μια έκφραση ενός έργου που ενσωματώνει τη συνεισφορά της μείξης κατά τη διάρκεια μιας ζωντανής παράστασης ή σε ένα studio ηχογράφησης ηχογραφημένων κομματιών [με τέτοιον τρόπο], ώστε να εμφανίζονται ως ένα ενιαίο κομμάτι. @el
label: est un agent disque-jockey de @fr
definition: Met un agent en relation avec une expression qui intègre une contribution de la part d’un agent consistant à mixer ensemble des pistes enregistrées, durant une prestation en direct ou dans un studio d’enregistrement, pour donner l’impression d’une seule piste continue. @fr
toolkit label: agent disque-jockey de @fr
toolkit definition: Expression qui intègre une contribution de la part d’un agent consistant à mixer ensemble des pistes enregistrées, durant une prestation en direct ou dans un studio d’enregistrement, pour donner l’impression d’une seule piste continue. @fr
has element type: 2
label: DJ ágense a következőnek: @hu
definition: Hozzákapcsol egy ágenst egy kifejezési formához, amely magában foglalja egy ágens közreműködését felvett hangsávok élő előadás közben vagy egy hangstúdióban történő keverésében, hogy azok egy folyamatos műsorszámként jelenjenek meg. @hu
scope note: DJ-je: @hu
toolkit label: DJ ágense: @hu
toolkit definition: Egy kifejezési forma, amely magában foglalja egy ágens közreműködését felvett hangsávok élő előadás közben vagy egy hangstúdióban történő keverésében, hogy azok egy folyamatos műsorszámként jelenjenek meg. @hu
alternative label: DJ of @en
alternative label: DJ:nä tuotannossa
label: er DJ for (agent) @no
definition: Relaterer en agent til et uttrykk som inkluderer et bidrag fra en agent i form av å mikse sammen innspilte spor under en liveopptreden eller i et lydstudio slik at de framstår som ett sammenhengende spor. @no
scope note: Et uttrykk som inkluderer et bidrag form av å mikse sammen innspilte spor under en liveopptreden eller i et lydstudio slik at de framstår som ett sammenhengende spor. @no
alternative label: DJ for @no
label: is deejay-actor van @nl
definition: Relateert een actor aan een expressie die omvat een bijdrage door een actor door het samenmixen van geluidssporen gedurende een live optreden of in een opnamestudio om als één doorlopend spoor te lijken. @nl
scope note: Remixhandelingen die de aard en content van een oorspronkelijk werk substantieel wijzigen, resulterend in een nieuw werk, en het mixen en samenstellen van meerdere sporen van een opname, zijn uitgesloten. @nl
toolkit label: deejay-actor van @nl
toolkit definition: Een expressie die omvat een bijdrage door een actor door het samenmixen van geluidssporen gedurende een live optreden of in een opnamestudio om als één doorlopend spoor te lijken. @nl
label: هو وكيل منسق دي جي @ar
definition: يربط وكيلا بتعبيرة لعمل تتضمن إسهام وكيل بمزج ألحان مسجلة أثناء أدائها مباشرة أو أثناء تسجيلها في استوديو بحيث تبدو كمقطوعة واحدة مستمرة. @ar
scope note: تعبيرة لعمل تتضمن إسهاما بمزج ألحان مسجلة أثناء أدائها مباشرة أو أثناء تسجيلها في استوديو بحيث تبدو كمسار واحد مستمر. @ar
alternative label: منسق دي جي @ar
toolkit label: وكيل منسق دي جي @ar
toolkit definition: تعبيرة تتضمن إسهام وكيل في مزج ألحان مسجلة أثناء أدائها مباشرة أو أثناء تسجيلها في استوديو لتبدو كمقطوعة واحدة مستمرة. @ar
scope note: S’exclouen les activitats de remescla que canvien substancialment la natura i el contingut d’una obra original, que dona com a resultat una obra nova i la mescla i el muntatge de les diverses pistes d’un enregistrament. @ca
alternative label: discjòquei de @ca
scope note: Remix-aktiviteter, der væsentligt ændrer karakteren og indholdet af et originalværk, hvilket resulterer i et nyt værk, og mixing og sammensætning af flere spor på en optagelse, er udelukket. @da
alternative label: dj af @da
label: DJ (tegija) väljenduses @et
definition: Seostab tegija väljendusega, millesse tegija on andnud panuse, miksides salvestatud lugusid kokku üheks jätkuvaks looks, tehes seda elavas esituses või salvestusstuudios. @et
alternative label: DJ väljenduses @et
toolkit label: DJ (tegija) väljenduses @et
toolkit definition: Väljendus, millesse tegija on andnud panuse, miksides salvestatud lugusid kokku üheks jätkuvaks looks, tehes seda elavas esituses või salvestusstuudios. @et
scope note: Darunter fallen keine Nachbearbeitungen, die die Art und den Inhalt des Originalwerks substantiell verändert, so dass ein neues Werk entsteht, sowie das Mischen und Zusammenlegen von mehreren Einzelspuren einer Aufnahme. @de
alternative label: Nem tartoznak ide azok az új művet eredményező újrakeverési tevékenységek, amelyek jelentősen megváltoztatják az eredeti mű jellegét és tartalmát, sem a felvétel több sávjának keverése és összeállítása. @hu
label: è DJ agente di @it
definition: Correla un agente a un'espressione che coinvolge un contributo da parte di un agente nel missare le tracceregistrate insieme durante uno spettacolo dal vivo o in uno studio di registrazione in modo da farle apparire come una traccia continua. @it
scope note: Un'espressione di un'opera che incorpora un contributo del missaggio di tracce registrate insieme durante uno spettacolo dal vivo o in uno studio di registrazione per risultare come una traccia continua. @it
alternative label: DJ di @it
toolkit label: DJ agente di @it
toolkit definition: Espressione che coinvolge un contributo da parte di un agente nel missare le tracceregistrate insieme durante uno spettacolo dal vivo o in uno studio di registrazione in modo da farle apparire come una traccia continua. @it
alternative label: DJ του @el

DJ (yhteistoimija) ekspressiossa
status: Published
label: is DJ collective agent of @en
lexical alias: djCollectiveAgentOf.en
definition: Relates a collective agent to an expression that includes a contribution by a collective agent of mixing recorded tracks together during a live performance or in a recording studio to appear as one continuous track. @en
toolkit label: DJ collective agent of @en
toolkit definition: An expression that includes a contribution by a collective agent of mixing recorded tracks together during a live performance or in a recording studio to appear as one continuous track. @en
type: Property
domain: C10011
has element type: 2
sub property of: esitykseen osallinen yhteistoimija ekspressiossa
sub property of: DJ (toimija) ekspressiossa
scope note: Remixing activities that substantially change the nature and content of an original work, resulting in a new work, and mixing and assembling the multiple tracks of a recording, are excluded. @en
definition: Liittää yhteistoimijan ekspressioon, jossa yhteistoimija on osallisena ekspression tekemisessä miksaamalla ääniraitoja yhteen yhtäjaksoiseksi raidaksi live-esityksessä tai äänitysstudiossa.
toolkit label: DJ (yhteistoimija) ekspressiossa
toolkit definition: Ekspressio, jossa yhteistoimija on osallisena ekspression tekemisessä miksaamalla ääniraitoja yhteen yhtäjaksoiseksi raidaksi live-esityksessä tai äänitysstudiossa.
label: er DJ for (kollektiv agent) @no
definition: Relaterer en kollektiv agent til et uttrykk av et verk som innlemmer et bidrag av miksing av innspilte spor i løpet av en liveopptreden eller i et studio for å framstilles som ett kontinuerlig spor. @no
scope note: Et uttrykk av et verk som innlemmer et bidrag av miksing av innspilte spor i løpet av en liveopptreden eller i et studio for å framstilles som ett kontinuerlig spor. @no
toolkit label: DJ for (kollektiv agent) @no
toolkit definition: Et uttrykk av et verk som innlemmer et bidrag av miksing av innspilte spor i løpet av en liveopptreden eller i et studio for å framstilles som ett kontinuerlig spor. @no
label: is deejay-collectieve actor van @nl
definition: Relateert een collectieve actor aan een expressie die omvat een bijdrage door een collectieve actor door het samenmixen van geluidssporen gedurende een live optreden of in een opnamestudio om als één doorlopend spoor te lijken. @nl
scope note: Remixhandelingen die de aard en content van de oorspronkelijk werk substantieel wijzigen, resulterend in een nieuw werk, en mixen en samenstellen van meerdere sporen van een opname zijn uitgesloten. @nl
toolkit label: deejay-collectieve actor van @nl
toolkit definition: Een expressie die omvat een bijdrage door een collectieve actor door het samenmixen van geluidssporen gedurende een live optreden of in een opnamestudio om als één doorlopend spoor te lijken. @nl
label: هو وكيل جماعي لدي جي لـ @ar
definition: يربط وكيلا جماعيا بتعبيرة تتضمن إسهام وكيل جماعي في مزج ألحان مسجلة أثناء أدائها مباشرة أو أثناء تسجيلها في استوديو لتبدو كمسار واحد مستمر. @ar
scope note: تعبيرة لعمل يتضمن إسهاما بمزج ألحان مسجلة أثناء أدائها مباشرة أو أثناء تسجيلها في استوديو لتبدو كمسار واحد مستمر. @ar
toolkit label: وكيل جماعي منسق دي جي @ar
toolkit definition: تعبيرة تتضمن إسهام وكيل جماعي في مزج ألحان مسجلة أثناء أدائها مباشرة أو أثناء تسجيلها في استوديو لتبدو كمسار واحد مستمر. @ar
label: és agent col·lectiu discjòquei de @ca
definition: Relaciona un agent col·lectiu amb una expressió que inclou una contribució d’un agent col·lectiu mesclant pistes enregistrades conjuntament durant una actuació en directe o en un estudi de gravació perquè sembli una pista continua. @ca
scope note: S’exclouen les activitats de remescla que canvien substancialment la natura i el contingut d’una obra original, que dona com a resultat una obra nova i la mescla i el muntatge de les diverses pistes d’un enregistrament. @ca
toolkit label: agent col·lectiu discjòquei de @ca
toolkit definition: Expressió que inclou una contribució d’un agent col·lectiu mesclant pistes enregistrades conjuntament durant una actuació en directe o en un estudi de gravació perquè sembli una pista continua. @ca
label: er kollektiv agent, som er dj af @da
definition: Relaterer en kollektiv agent til et udtryk, som omfatter en kollektiv agents bidrag ved at mixe indspillede spor sammen under en live-optræden eller i et indspilningsstudie, så de fremstår som et uafbrudt spor. @da
scope note: Remixing-aktiviteter, som væsentligt forandrer originalressourcens karakter og indhold og derved resulterer i en nyt ressource, samt mixing og sammensætning af de forskellige spor på en optagelse, er ikke omfattet. @da
toolkit label: kollektiv agent, som er dj af @da
toolkit definition: Udtryk, som omfatter en kollektiv agents bidrag ved at mixe indspillede spor sammen under en live-optræden eller i et indspilningsstudie, så de fremstår som et uafbrudt spor. @da
label: DJ (kollektiiv) väljenduses @et
definition: Seostab kollektiivi väljendusega, millesse kollektiiv on andnud panuse, miksides salvestatud lugusid kokku üheks jätkuvaks looks, tehes seda elavas esituses või salvestusstuudios. @et
toolkit label: DJ (kollektiiv) väljenduses @et
toolkit definition: Väljendus, millesse kollektiiv on andnud panuse, miksides salvestatud lugusid kokku üheks jätkuvaks looks, tehes seda elavas esituses või salvestusstuudios. @et
label: ist gemeinschaftlicher Akteur als DJane/DJ von @de
definition: Setzt einen gemeinschaftlichen Akteur in Beziehung zu einer Expression, zu der ein gemeinschaftlicher Akteur beiträgt, indem er während eines Live-Auftritts oder in einem Aufnahme-Studio aufgenommene Einzelspuren (Kanäle) zu einem scheinbar ununterbrochen durchgehenden Klangerlebnis zusammen mischt. @de
scope note: Darunter fallen keine Nachbearbeitungen, die die Art und den Inhalt des Originalwerks substantiell verändert, so dass ein neues Werk entsteht, sowie das Mischen und Zusammenlegen von mehreren Einzelspuren einer Aufnahme. @de
toolkit label: Gemeinschaftlicher Akteur als DJane/DJ von @de
toolkit definition: Eine Expression, zu der ein gemeinschaftlicher Akteur beiträgt, indem er während eines Live-Auftritts oder in einem Aufnahme-Studio aufgenommene Einzelspuren (Kanäle) zu einem scheinbar ununterbrochen durchgehenden Klangerlebnis zusammen mischt. @de
label: DJ kollektív ágense a következőnek: @hu
definition: Hozzákapcsol egy kollektív ágenst egy kifejezési formához, amely magában foglalja egy kollektív ágens közreműködését felvett hangsávok élő előadás közben vagy egy hangstúdióban történő keverésében, hogy azok egy folyamatos műsorszámként jelenjenek meg. @hu
scope note: Nem tartoznak ide azok az új művet eredményező újrakeverési tevékenységek, amelyek jelentősen megváltoztatják az eredeti mű jellegét és tartalmát, sem a felvétel több sávjának keverése és összeállítása. @hu
toolkit label: DJ kollektív ágense: @hu
toolkit definition: Egy kifejezési forma, amely magában foglalja egy kollektív ágens közreműködését felvett hangsávok élő előadás közben vagy egy hangstúdióban történő keverésében, hogy azok egy folyamatos műsorszámként jelenjenek meg. @hu
label: è DJ agente collettivo di @it
definition: Correla un agente collettivo a un'espressione che comprende un contributo di un agente collettivo nel missaggio di tracce registrate durante un'esibizione dal vivo o in uno studio di registrazione in modo che appaiano come una traccia continua. @it
scope note: Espressione di un'opera che incorpora un contributo nel missaggio di tracce registrate durante un'esibizione dal vivo o in uno studio di registrazione in modo che appaiano come una traccia continua. @it
toolkit label: DJ agente collettivo di @it
toolkit definition: Espressione che comprende un contributo di un agente collettivo nel missaggio di tracce registrate durante un'esibizione dal vivo o in uno studio di registrazione in modo che appaiano come una traccia continua. @it
label: είναι DJ συλλογικός φορέας του @el
toolkit label: DJ συλλογικός φορέας του @el
label: est un agent collectif disque-jockey de @fr
definition: Met un agent collectif en relation avec une expression qui intègre une contribution de la part d’un agent collectif consistant à mixer ensemble des pistes enregistrées, durant une prestation en direct ou dans un studio d’enregistrement, pour donner l’impression d’une seule piste continue. @fr
scope note: Sont exclus les activités de remixage qui changent considérablement la nature et le contenu d’une œuvre originale et entraînent la création d’une nouvelle œuvre et le fait de mixer et d’assembler les différentes pistes d’un enregistrement. @fr
alternative label: agent collectif disc-jockey de @fr
alternative label: agent collectif DJ de @fr
toolkit label: agent collectif disque-jockey de @fr
toolkit definition: Expression qui intègre une contribution de la part d’un agent collectif consistant à mixer ensemble des pistes enregistrées, durant une prestation en direct ou dans un studio d’enregistrement, pour donner l’impression d’une seule piste continue. @fr
label: ir dīdžejs (grupa) @lv
definition: Sasaista grupu ar izteiksmi, kas ietver grupas ieguldījumu, miksējot ierakstītus mūzikas celiņus dzīvās uzstāšanās laikā vai ierakstu studijā, lai radītu vienu nepārtrauktu ierakstu. @lv
toolkit label: ir dīdžejs (grupa) @lv
toolkit definition: Izteiksme, kas ietver grupas ieguldījumu, miksējot ierakstītus mūzikas celiņus dzīvās uzstāšanās laikā vai ierakstu studijā, lai radītu vienu nepārtrauktu ierakstu. @lv
scope note: Neietver miksēšanas darbības, kas būtiski maina oriģināldarba būtību un saturu, radot jaunu darbu, kā arī ieraksta vairāku celiņu miksēšanu un montāžu. @lv
scope note: Ei koske uudelleenmiksauksia, jotka olennaisesti muuttavat alkuperäisen teoksen luonnetta ja sisältöä, mikä johtaa uuteen teokseen, eikä äänitteen useampien raitojen miksaamista ja yhdistelyä.
label: 是……的打碟者集体行为者 @zh-hans
definition: 将一个集体行为者与包括在现场表演中或在录音工作室中混合已录制音轨使其出现为一个连续的音轨的一个集体行为者的贡献的一种内容表达关联起来。 @zh-hans
toolkit label: ……的打碟者集体行为者 @zh-hans
toolkit definition: 包括在现场表演中或在录音工作室中混合已录制音轨使其出现为一个连续的音轨的一个集体行为者的贡献的一种内容表达 @zh-hans
scope note: 不包括实质性改变原作品的性质和内容导致一种新的作品以及混合和聚集一个录音的多个音轨的合成活动。 @zh-hans

DJ (yhteisö) ekspressiossa
status: Published
label: is DJ corporate body of @en
lexical alias: djCorporateBodyOf.en
definition: Relates a corporate body to an expression that includes a contribution by a corporate body of mixing recorded tracks together during a live performance or in a recording studio to appear as one continuous track. @en
toolkit label: DJ corporate body of @en
toolkit definition: An expression that includes a contribution by a corporate body of mixing recorded tracks together during a live performance or in a recording studio to appear as one continuous track. @en
type: Property
domain: C10005
has element type: 2
sub property of: esitykseen osallinen yhteisö ekspressiossa
sub property of: DJ (yhteistoimija) ekspressiossa
scope note: Remixing activities that substantially change the nature and content of an original work, resulting in a new work, and mixing and assembling the multiple tracks of a recording, are excluded. @en
definition: Liittää yhteisön ekspressioon, jossa yhteisö on osallisena ekspression tekemisessä miksaamalla ääniraitoja yhteen yhtäjaksoiseksi raidaksi live-esityksessä tai äänitysstudiossa.
toolkit label: DJ (yhteisö) ekspressiossa
toolkit definition: Ekspressio, jossa yhteisö on osallisena ekspression tekemisessä miksaamalla ääniraitoja yhteen yhtäjaksoiseksi raidaksi live-esityksessä tai äänitysstudiossa.
label: er DJ for (korporasjon) @no
definition: Relaterer en korporasjon til et uttrykk av et verk som innlemmer et bidrag av miksing av innspilte spor i løpet av en liveopptreden eller i et studio for å framstilles som ett kontinuerlig spor. @no
scope note: Et uttrykk av et verk som innlemmer et bidrag av miksing av innspilte spor i løpet av en liveopptreden eller i et studio for å framstilles som ett kontinuerlig spor. @no
toolkit label: DJ for (korporasjon) @no
toolkit definition: Et uttrykk av et verk som innlemmer et bidrag av miksing av innspilte spor i løpet av en liveopptreden eller i et studio for å framstilles som ett kontinuerlig spor. @no
label: is deejay-corporatie van @nl
definition: Relateert een corporatie aan een expressie die omvat een bijdrage door een corporatie door het samenmixen van geluidssporen gedurende een live optreden of in een opnamestudio om als één doorlopend spoor te lijken. @nl
scope note: Remixhandelingen die de aard en content van de oorspronkelijk werk substantieel wijzigen, resulterend in een nieuw werk, en mixen en samenstellen van meerdere sporen van een opname zijn uitgesloten. @nl
toolkit label: deejay-corporatie van @nl
toolkit definition: Een expressie die omvat een bijdrage door een corporatie door het samenmixen van geluidssporen gedurende een live optreden of in een opnamestudio om als één doorlopend spoor te lijken. @nl
label: هي هيئة منسقة دي جي لـ @ar
definition: يربط هيئة بتعبيرة تتضمن إسهام هيئة في مزج ألحان مسجلة أثناء أدائها مباشرة أو أثناء تسجيلها في استوديو لتبدو كمسار واحد مستمر. @ar
scope note: تعبيرة لعمل يتضمن إسهاما بمزج ألحان مسجلة أثناء أدائها مباشرة أو أثناء تسجيلها في استوديو لتبدو كمسار واحد مستمر. @ar
toolkit label: هيئة منسقة دي جي @ar
toolkit definition: تعبيرة تتضمن إسهام هيئة في مزج ألحان مسجلة أثناء أدائها مباشرة أو أثناء تسجيلها في استوديو لتبدو كمسار واحد مستمر. @ar
label: és entitat corporativa discjòquei de @ca
definition: Relaciona una entitat corporativa amb una expressió que inclou una contribució d’una entitat corporativa mesclant pistes enregistrades conjuntament durant una actuació en directe o en un estudi de gravació perquè sembli una pista continua. @ca
scope note: S’exclouen les activitats de remescla que canvien substancialment la natura i el contingut d’una obra original, que dona com a resultat una obra nova i la mescla i el muntatge de les diverses pistes d’un enregistrament. @ca
toolkit label: entitat corporativa discjòquei de @ca
toolkit definition: Expressió que inclou una contribució d’una entitat corporativa mesclant pistes enregistrades conjuntament durant una actuació en directe o en un estudi de gravació perquè sembli una pista continua. @ca
label: er korporation, som er dj af @da
definition: Relaterer en korporation til et udtryk, som omfatter en korporations bidrag ved at mixe indspillede spor sammen under en live-optræden eller i et indspilningsstudie, så de fremstår som et uafbrudt spor. @da
scope note: Remixing-aktiviteter, som ikke væsentligt forandrer originalværkets karakter og indhold, samt mixe indspillede lydspor sammen for at fremstå som ét uafbrudt spor, er ikke omfattet. @da
toolkit label: korporation, som er dj af @da
toolkit definition: Udtryk, som omfatter en korporations bidrag ved at mixe indspillede spor sammen under en live-optræden eller i et indspilningsstudie, så de fremstår som et uafbrudt spor. @da
label: DJ (asutus) väljenduses @et
definition: Seostab asutuse väljendusega, millesse asutus on andnud panuse, miksides salvestatud lugusid kokku üheks jätkuvaks looks, tehes seda elavas esituses või salvestusstuudios. @et
toolkit label: DJ (asutus) väljenduses @et
toolkit definition: Väljendus, millesse asutus on andnud panuse, miksides salvestatud lugusid kokku üheks jätkuvaks looks, tehes seda elavas esituses või salvestusstuudios. @et
label: Körperschaft als DJane/DJ von @de
definition: Setzt eine Körperschaft in Beziehung zu einer Expression, zu der eine Körperschaft beiträgt, indem sie während eines Live-Auftritts oder in einem Aufnahme-Studio aufgenommene Einzelspuren (Kanäle) zu einem scheinbar ununterbrochen durchgehenden Klangerlebnis zusammen mischt. @de
scope note: Darunter fallen keine Nachbearbeitungen, die die Art und den Inhalt des Originalwerks substantiell verändert, so dass ein neues Werk entsteht, sowie das Mischen und Zusammenlegen von mehreren Einzelspuren einer Aufnahme. @de
toolkit label: Körperschaft als DJane/DJ von @de
toolkit definition: Eine Expression, zu der eine Körperschaft beiträgt, indem sie während eines Live-Auftritts oder in einem Aufnahme-Studio aufgenommene Einzelspuren (Kanäle) zu einem scheinbar ununterbrochen durchgehenden Klangerlebnis zusammen mischt. @de
label: DJ testülete a következőnek: @hu
definition: Hozzákapcsol egy testületet egy kifejezési formához, amely magában foglalja egy testület közreműködését felvett hangsávok élő előadás közben vagy egy hangstúdióban történő keverésében, hogy azok egy folyamatos műsorszámként jelenjenek meg. @hu
scope note: Nem tartoznak ide azok az új művet eredményező újrakeverési tevékenységek, amelyek jelentősen megváltoztatják az eredeti mű jellegét és tartalmát, sem a felvétel több sávjának keverése és összeállítása. @hu
toolkit label: DJ testülete: @hu
toolkit definition: Egy kifejezési forma, amely magában foglalja egy testület közreműködését felvett hangsávok élő előadás közben vagy egy hangstúdióban történő keverésében, hogy azok egy folyamatos műsorszámként jelenjenek meg. @hu
label: è DJ ente di @it
definition: Correla un ente a un'espressione che include un contributo di un ente nel missaggio di tracce registrate durante un'esibizione dal vivo o in uno studio di registrazione in modo che appaiano come una traccia continua. @it
scope note: Espressione di un'opera che incorpora un contributo nel missaggio di tracce registrate durante un'esibizione dal vivo o in uno studio di registrazione in modo che appaiano come una traccia continua. @it
toolkit label: DJ ente di @it
toolkit definition: Espressione che include un contributo di un ente nel missaggio di tracce registrate durante un'esibizione dal vivo o in uno studio di registrazione in modo che appaiano come una traccia continua. @it
label: είναι DJ συλλογικό όργανο του @el
scope note: Μια έκφραση ενός έργου που ενσωματώνει τη συνεισφορά της μείξης κατά τη διάρκεια μιας ζωντανής παράστασης ή σε ένα studio ηχογράφησης ηχογραφημένων κομματιών [με τέτοιον τρόπο], ώστε να εμφανίζονται ως ένα ενιαίο κομμάτι. @el
toolkit label: DJ συλλογικό όργανο του @el
label: est une collectivité disque-jockey de @fr
definition: Met une collectivité en relation avec une expression qui intègre une contribution de la part d’une collectivité consistant à mixer ensemble des pistes enregistrées, durant une prestation en direct ou dans un studio d’enregistrement, pour donner l’impression d’une seule piste continue. @fr
scope note: Sont exclus les activités de remixage qui changent considérablement la nature et le contenu d’une œuvre originale et entraînent la création d’une nouvelle œuvre et le fait de mixer et d’assembler les différentes pistes d’un enregistrement. @fr
alternative label: collectivité disc-jockey de @fr
alternative label: collectivité DJ de @fr
toolkit label: collectivité disque-jockey de @fr
toolkit definition: Expression qui intègre une contribution de la part d’une collectivité consistant à mixer ensemble des pistes enregistrées, durant une prestation en direct ou dans un studio d’enregistrement, pour donner l’impression d’une seule piste continue. @fr
label: ir dīdžejs (institūcija) @lv
definition: Sasaista institūciju ar izteiksmi, kas ietver institūcijas ieguldījumu, miksējot ierakstītus mūzikas celiņus dzīvās uzstāšanās laikā vai ierakstu studijā, lai radītu vienu nepārtrauktu ierakstu. @lv
toolkit label: ir dīdžejs (institūcija) @lv
toolkit definition: Izteiksme, kas ietver institūcijas ieguldījumu, miksējot ierakstītus mūzikas celiņus dzīvās uzstāšanās laikā vai ierakstu studijā, lai radītu vienu nepārtrauktu ierakstu. @lv
scope note: Neietver miksēšanas darbības, kas būtiski maina oriģināldarba būtību un saturu, radot jaunu darbu, kā arī ieraksta vairāku celiņu miksēšanu un montāžu. @lv
scope note: Ei koske uudelleenmiksauksia, jotka olennaisesti muuttavat alkuperäisen teoksen luonnetta ja sisältöä, mikä johtaa uuteen teokseen, eikä äänitteen useampien raitojen miksaamista ja yhdistelyä.
label: 是……的打碟者团体 @zh-hans
definition: 将一个团体与包括在现场表演中或在录音工作室中混合已录制音轨使其出现为一个连续的音轨的一个团体的贡献的一种内容表达关联起来。 @zh-hans
toolkit label: ……的打碟者团体 @zh-hans
toolkit definition: 包括在现场表演中或在录音工作室中混合已录制音轨使其出现为一个连续的音轨的一个团体的贡献的一种内容表达 @zh-hans

DJ (suku) ekspressiossa
status: Published
label: is DJ family of @en
lexical alias: djFamilyOf.en
definition: Relates a family to an expression that includes a contribution by a family of mixing recorded tracks together during a live performance or in a recording studio to appear as one continuous track. @en
toolkit label: DJ family of @en
toolkit definition: An expression that includes a contribution by a family of mixing recorded tracks together during a live performance or in a recording studio to appear as one continuous track. @en
type: Property
domain: C10008
has element type: 2
sub property of: esitykseen osallinen suku ekspressiossa
sub property of: DJ (yhteistoimija) ekspressiossa
scope note: Remixing activities that substantially change the nature and content of an original work, resulting in a new work, and mixing and assembling the multiple tracks of a recording, are excluded. @en
definition: Liittää suvun ekspressioon, jossa suku on osallisena ekspression tekemisessä miksaamalla ääniraitoja yhteen yhtäjaksoiseksi raidaksi live-esityksessä tai äänitysstudiossa.
toolkit label: DJ (suku) ekspressiossa
toolkit definition: Ekspressio, jossa suku on osallisena ekspression tekemisessä miksaamalla ääniraitoja yhteen yhtäjaksoiseksi raidaksi live-esityksessä tai äänitysstudiossa.
label: er DJ for (familie) @no
definition: Relaterer en familie til et uttrykk av et verk som innlemmer et bidrag av miksing av innspilte spor i løpet av en liveopptreden eller i et studio for å framstilles som ett kontinuerlig spor. @no
scope note: Et uttrykk av et verk som innlemmer et bidrag av miksing av innspilte spor i løpet av en liveopptreden eller i et studio for å framstilles som ett kontinuerlig spor. @no
toolkit label: DJ for (familie) @no
toolkit definition: Et uttrykk av et verk som innlemmer et bidrag av miksing av innspilte spor i løpet av en liveopptreden eller i et studio for å framstilles som ett kontinuerlig spor. @no
label: is deejay-familie van @nl
definition: Relateert een familie aan een expressie die omvat een bijdrage door een familie door het samenmixen van geluidssporen gedurende een live optreden of in een opnamestudio om als één doorlopend spoor te lijken. @nl
scope note: Remixhandelingen die de aard en content van het oorspronkelijk werk substantieel wijzigen, resulterend in een nieuw werk, en mixen en samenstellen van meerdere sporen van een opname zijn uitgesloten. @nl
toolkit label: deejay-familie van @nl
toolkit definition: Een expressie die omvat een bijdrage door een familie door het samenmixen van geluidssporen gedurende een live optreden of in een opnamestudio om als één doorlopend spoor te lijken. @nl
label: هي عائلة مسئولة عن تنسيق الدي جي لـ @ar
definition: يربط عائلة بتعبيرة تتضمن إسهام عائلة في مزج ألحان مسجلة أثناء أدائها مباشرة أو أثناء تسجيلها في استوديو لتبدو كمسار واحد مستمر. @ar
scope note: تعبيرة لعمل يتضمن إسهام في مزج ألحان مسجلة أثناء أدائها مباشرة أو أثناء تسجيلها في استوديو لتبدو كمسار واحد مستمر. @ar
toolkit label: عائلة مسئولة عن تنسيق الدي جي @ar
toolkit definition: تعبيرة تتضمن إسهام عائلة في مزج ألحان مسجلة أثناء أدائها مباشرة أو أثناء تسجيلها في استوديو لتبدو كمقطوعة واحدة مستمرة. @ar
label: és família discjòquei de @ca
definition: Relaciona una família amb una expressió que inclou una contribució d’una família mesclant pistes enregistrades conjuntament durant una actuació en directe o en un estudi de gravació perquè sembli una pista continua. @ca
scope note: S’exclouen les activitats de remescla que canvien substancialment la natura i el contingut d’una obra original, que dona com a resultat una obra nova i la mescla i el muntatge de les diverses pistes d’un enregistrament. @ca
toolkit label: família discjòquei de @ca
toolkit definition: Expressió que inclou una contribució d’una família mesclant pistes enregistrades conjuntament durant una actuació en directe o en un estudi de gravació perquè sembli una pista continua. @ca
label: er familie, som er dj af @da
definition: Relaterer en familie til et udtryk, som omfatter en families bidrag ved at mixe indspillede spor sammen under en live-optræden eller i et indspilningsstudie, så de fremstår som et uafbrudt spor. @da
scope note: Remixing-aktiviteter, som ikke væsentligt forandrer originalværkets karakter og indhold, samt mixe indspillede lydspor sammen for at fremstå som ét uafbrudt spor, er ikke omfattet. @da
toolkit label: familie, som er dj af @da
toolkit definition: Udtryk, som omfatter en families bidrag ved at mixe indspillede spor sammen under en live-optræden eller i et indspilningsstudie, så de fremstår som et uafbrudt spor. @da
label: DJ (perekond) väljenduses @et
definition: Seostab perekonna väljendusega, millesse perekond on andnud panuse, miksides salvestatud lugusid kokku üheks jätkuvaks looks, tehes seda elavas esituses või salvestusstuudios. @et
toolkit label: DJ (perekond) väljenduses @et
toolkit definition: Väljendus, millesse perekond on andnud panuse, miksides salvestatud lugusid kokku üheks jätkuvaks looks, tehes seda elavas esituses või salvestusstuudios. @et
label: ist Familie als DJane/DJ von @de
definition: Setzt eine Familie in Beziehung zu einer Expression, zu der eine Familie beiträgt, indem sie während eines Live-Auftritts oder in einem Aufnahme-Studio aufgenommene Einzelspuren (Kanäle) zu einem scheinbar ununterbrochen durchgehenden Klangerlebnis zusammen mischt. @de
scope note: Darunter fallen keine Nachbearbeitungen, die die Art und den Inhalt des Originalwerks substantiell verändert, so dass ein neues Werk entsteht, sowie das Mischen und Zusammenlegen von mehreren Einzelspuren einer Aufnahme. @de
toolkit label: Familie als DJane/DJ von @de
toolkit definition: Eine Expression, zu der eine Familie beiträgt, indem sie während eines Live-Auftritts oder in einem Aufnahme-Studio aufgenommene Einzelspuren (Kanäle) zu einem scheinbar ununterbrochen durchgehenden Klangerlebnis zusammen mischt. @de
label: DJ családja a következőnek: @hu
definition: Hozzákapcsol egy családot egy kifejezési formához, amely magában foglalja egy család közreműködését felvett hangsávok élő előadás közben vagy egy hangstúdióban történő keverésében, hogy azok egy folyamatos műsorszámként jelenjenek meg. @hu
scope note: Nem tartoznak ide azok az új művet eredményező újrakeverési tevékenységek, amelyek jelentősen megváltoztatják az eredeti mű jellegét és tartalmát, sem a felvétel több sávjának keverése és összeállítása. @hu
toolkit label: DJ családja: @hu
toolkit definition: Egy kifejezési forma, amely magában foglalja egy család közreműködését felvett hangsávok élő előadás közben vagy egy hangstúdióban történő keverésében, hogy azok egy folyamatos műsorszámként jelenjenek meg. @hu
label: è DJ famiglia di @it
definition: Correla una famiglia a un'espressione che comprende un contributo di una famiglia nel missaggio di tracce registrate durante un'esibizione dal vivo o in uno studio di registrazione in modo che appaiano come una traccia continua. @it
scope note: Espressione di un'opera che incorpora un contributo nel missaggio di tracce registrate durante un'esibizione dal vivo o in uno studio di registrazione in modo che appaiano come una traccia continua. @it
toolkit label: DJ famiglia di @it
toolkit definition: Espressione che comprende un contributo di una famiglia nel missaggio di tracce registrate durante un'esibizione dal vivo o in uno studio di registrazione in modo che appaiano come una traccia continua. @it
label: είναι DJ οικογένεια του @el
scope note: Μια έκφραση ενός έργου που ενσωματώνει τη συνεισφορά της μείξης κατά τη διάρκεια μιας ζωντανής παράστασης ή σε ένα studio ηχογράφησης ηχογραφημένων κομματιών [με τέτοιον τρόπο], ώστε να εμφανίζονται ως ένα ενιαίο κομμάτι. @el
toolkit label: DJ οικογένεια του @el
label: est une famille disque-jockey de @fr
definition: Met une famille en relation avec une expression qui intègre une contribution de la part d’une famille consistant à mixer ensemble des pistes enregistrées, durant une prestation en direct ou dans un studio d’enregistrement, pour donner l’impression d’une seule piste continue. @fr
scope note: Sont exclus les activités de remixage qui changent considérablement la nature et le contenu d’une œuvre originale et entraînent la création d’une nouvelle œuvre et le fait de mixer et d’assembler les différentes pistes d’un enregistrement. @fr
alternative label: famille disc-jockey de @fr
alternative label: famille DJ de @fr
toolkit label: famille disque-jockey de @fr
toolkit definition: Expression qui intègre une contribution de la part d’une famille consistant à mixer ensemble des pistes enregistrées, durant une prestation en direct ou dans un studio d’enregistrement, pour donner l’impression d’une seule piste continue. @fr
label: ir dīdžejs (dzimta/ģimene) @lv
definition: Sasaista dzimtu/ģimeni ar izteiksmi, kas ietver dzimtas/ģimenes ieguldījumu, miksējot ierakstītus mūzikas celiņus dzīvās uzstāšanās laikā vai ierakstu studijā, lai radītu vienu nepārtrauktu ierakstu. @lv
toolkit label: ir dīdžejs (dzimta/ģimene) @lv
toolkit definition: Izteiksme, kas ietver dzimtas/ģimenes ieguldījumu, miksējot ierakstītus mūzikas celiņus dzīvās uzstāšanās laikā vai ierakstu studijā, lai radītu vienu nepārtrauktu ierakstu. @lv
scope note: Neietver miksēšanas darbības, kas būtiski maina oriģināldarba būtību un saturu, radot jaunu darbu, kā arī ieraksta vairāku celiņu miksēšanu un montāžu. @lv
scope note: Ei koske uudelleenmiksauksia, jotka olennaisesti muuttavat alkuperäisen teoksen luonnetta ja sisältöä, mikä johtaa uuteen teokseen, eikä äänitteen useampien raitojen miksaamista ja yhdistelyä.
label: 是……的打碟者家族 @zh-hans
definition: 将一个家族与包括在现场表演中或在录音工作室中混合已录制音轨使其出现为一个连续的音轨的一个家族的贡献的一种内容表达关联起来。 @zh-hans
toolkit label: ……的打碟者家族 @zh-hans
toolkit definition: 包括在现场表演中或在录音工作室中混合已录制音轨使其出现为一个连续的音轨的一个家族的贡献的一种内容表达 @zh-hans

DJ (henkilö) ekspressiossa
status: Published
label: is DJ person of @en
lexical alias: djPersonOf.en
definition: Relates a person to an expression that includes a contribution by a person of mixing recorded tracks together during a live performance or in a recording studio to appear as one continuous track. @en
toolkit label: DJ person of @en
toolkit definition: An expression that includes a contribution by a person of mixing recorded tracks together during a live performance or in a recording studio to appear as one continuous track. @en
type: Property
domain: C10004
has element type: 2
sub property of: esitykseen osallinen henkilö ekspressiossa
sub property of: DJ (toimija) ekspressiossa
scope note: Remixing activities that substantially change the nature and content of an original work, resulting in a new work, and mixing and assembling the multiple tracks of a recording, are excluded. @en
definition: Liittää henkilön ekspressioon, jossa henkilö on osallisena ekspression tekemisessä miksaamalla ääniraitoja yhteen yhtäjaksoiseksi raidaksi live-esityksessä tai äänitysstudiossa.
toolkit label: DJ (henkilö) ekspressiossa
toolkit definition: Ekspressio, jossa henkilö on osallisena ekspression tekemisessä miksaamalla ääniraitoja yhteen yhtäjaksoiseksi raidaksi live-esityksessä tai äänitysstudiossa.
label: er DJ for (person) @no
definition: Relaterer en person til et uttrykk av et verk som innlemmer et bidrag av miksing av innspilte spor i løpet av en liveopptreden eller i et studio for å framstilles som ett kontinuerlig spor. @no
scope note: Et uttrykk av et verk som innlemmer et bidrag av miksing av innspilte spor i løpet av en liveopptreden eller i et studio for å framstilles som ett kontinuerlig spor. @no
toolkit label: DJ for (person) @no
toolkit definition: Et uttrykk av et verk som innlemmer et bidrag av miksing av innspilte spor i løpet av en liveopptreden eller i et studio for å framstilles som ett kontinuerlig spor. @no
label: is deejay-persoon van @nl
definition: Relateert een persoon aan een expressie die omvat een bijdrage door een persoon door het samenmixen van geluidssporen gedurende een live optreden of in een opnamestudio om als één doorlopend spoor te lijken. @nl
scope note: Remixhandelingen die de aard en content van een oorspronkelijk werk substantieel wijzigen, resulterend in een nieuw werk, en mixen en samenstellen van meerdere sporen van een geluidsopname, zijn uitgesloten. @nl
toolkit label: deejay-persoon van @nl
toolkit definition: Een expressie die omvat een bijdrage door een persoon door het samenmixen van geluidssporen gedurende een live optreden of in een opnamestudio om als één doorlopend spoor te lijken. @nl
label: هو شخص منسق دي جي لـ @ar
definition: يربط شخصا بتعبيرة تتضمن إسهام شخص في مزج ألحان مسجلة أثناء أدائها مباشرة أو أثناء تسجيلها في استوديو لتبدو كمقطوعة واحدة مستمرة. @ar
scope note: تعبيرة لعمل يتضمن إسهاما بمزج ألحان مسجلة أثناء أدائها مباشرة أو أثناء تسجيلها في استوديو لتبدو كمقطوعة واحدة مستمرة. @ar
toolkit label: شخص منسق دي جي @ar
toolkit definition: تعبيرة تتضمن إسهام شخص في مزج ألحان مسجلة أثناء أدائها مباشرة أو أثناء تسجيلها في استوديو لتبدو كمقطوعة واحدة مستمرة. @ar
label: és persona discjòquei de @ca
definition: Relaciona una persona amb una expressió que inclou una contribució d’una persona mesclant pistes enregistrades conjuntament durant una actuació en directe o en un estudi de gravació perquè sembli una pista continua. @ca
scope note: S’exclouen les activitats de remescla que canvien substancialment la natura i el contingut d’una obra original, que dona com a resultat una obra nova i la mescla i el muntatge de les diverses pistes d’un enregistrament. @ca
toolkit label: persona discjòquei de @ca
toolkit definition: Expressió que inclou una contribució d’una persona mesclant pistes enregistrades conjuntament durant una actuació en directe o en un estudi de gravació perquè sembli una pista continua. @ca
label: er person, som er dj af @da
definition: Relaterer en person til et udtryk, som omfatter en persons bidrag ved at mixe indspillede spor sammen under en live-optræden eller i et indspilningsstudie, så de fremstår som et uafbrudt spor. @da
scope note: Remixing-aktiviteter, som væsentligt forandrer originalressourcens karakter og indhold og derved resulterer i en nyt ressource, samt mixing og sammensætning af de forskellige spor på en optagelse, er ikke omfattet. @da
toolkit label: person, som er dj af @da
toolkit definition: Udtryk, som omfatter en persons bidrag ved at mixe indspillede spor sammen under en live-optræden eller i et indspilningsstudie, så de fremstår som et uafbrudt spor. @da
label: DJ (isik) väljenduses @et
definition: Seostab isiku väljendusega, millesse isik on andnud panuse, miksides salvestatud lugusid kokku üheks jätkuvaks looks, tehes seda elavas esituses või salvestusstuudios. @et
toolkit label: DJ (isik) väljenduses @et
toolkit definition: Väljendus, millesse isik on andnud panuse, miksides salvestatud lugusid kokku üheks jätkuvaks looks, tehes seda elavas esituses või salvestusstuudios. @et
label: ist Person als DJane/DJ von @de
definition: Setzt eine Person in Beziehung zu einer Expression, zu der eine Person beiträgt, indem sie während eines Live-Auftritts oder in einem Aufnahme-Studio aufgenommene Einzelspuren (Kanäle) zu einem scheinbar ununterbrochen durchgehenden Klangerlebnis zusammen mischt. @de
scope note: Darunter fallen keine Nachbearbeitungen, die die Art und den Inhalt des Originalwerks substantiell verändert, so dass ein neues Werk entsteht, sowie das Mischen und Zusammenlegen von mehreren Einzelspuren einer Aufnahme. @de
toolkit label: Person als DJane/DJ von @de
toolkit definition: Eine Expression, zu der eine Person beiträgt, indem sie während eines Live-Auftritts oder in einem Aufnahme-Studio aufgenommene Einzelspuren (Kanäle) zu einem scheinbar ununterbrochen durchgehenden Klangerlebnis zusammen mischt @de
label: DJ személye a következőnek: @hu
definition: Hozzákapcsol egy személyt egy kifejezési formához, amely magában foglalja egy személy közreműködését felvett hangsávok élő előadás közben vagy egy hangstúdióban történő keverésében, hogy azok egy folyamatos műsorszámként jelenjenek meg. @hu
scope note: Nem tartoznak ide azok az új művet eredményező újrakeverési tevékenységek, amelyek jelentősen megváltoztatják az eredeti mű jellegét és tartalmát, sem a felvétel több sávjának keverése és összeállítása. @hu
toolkit label: DJ személye: @hu
toolkit definition: Egy kIfejezési forma, amely magában foglalja egy személy közreműködését felvett hangsávok élő előadás közben vagy egy hangstúdióban történő keverésében, hogy azok egy folyamatos műsorszámként jelenjenek meg. @hu
label: è DJ persona di @it
definition: Correla una persona a un'espressione che comprende un contributo di una persona nel missaggio di tracce registrate durante un'esibizione dal vivo o in uno studio di registrazione in modo che appaiano come una traccia continua. @it
scope note: Espressione di un'opera che incorpora un contributo nel missaggio di tracce registrate durante un'esibizione dal vivo o in uno studio di registrazione in modo che appaiano come una traccia continua. @it
toolkit label: DJ persona di @it
toolkit definition: Espressione che comprende un contributo di una persona nel missaggio di tracce registrate durante un'esibizione dal vivo o in uno studio di registrazione in modo che appaiano come una traccia continua. @it
label: είναι DJ φυσικό πρόσωπο του @el
toolkit label: DJ φυσικό πρόσωπο του @el
label: est une personne disque-jockey de @fr
definition: Met une personne en relation avec une expression qui intègre une contribution de la part d’une personne consistant à mixer ensemble des pistes enregistrées, durant une prestation en direct ou dans un studio d’enregistrement, pour donner l’impression d’une seule piste continue. @fr
scope note: Sont exclus les activités de remixage qui changent considérablement la nature et le contenu d’une œuvre originale et entraînent la création d’une nouvelle œuvre et le fait de mixer et d’assembler les différentes pistes d’un enregistrement. @fr
alternative label: personne disc-jockey de @fr
alternative label: personne DJ de @fr
toolkit label: personne disque-jockey de @fr
toolkit definition: Expression qui intègre une contribution de la part d’une personne consistant à mixer ensemble des pistes enregistrées, durant une prestation en direct ou dans un studio d’enregistrement, pour donner l’impression d’une seule piste continue. @fr
label: ir dīdžejs (persona) @lv
definition: Sasaista personu ar izteiksmi, kas ietver personas ieguldījumu, miksējot ierakstītus mūzikas celiņus dzīvās uzstāšanās laikā vai ierakstu studijā, lai radītu vienu nepārtrauktu ierakstu. @lv
toolkit label: ir dīdžejs (persona) @lv
toolkit definition: Izteiksme, kas ietver personas ieguldījumu, miksējot ierakstītus mūzikas celiņus dzīvās uzstāšanās laikā vai ierakstu studijā, lai radītu vienu nepārtrauktu ierakstu. @lv
scope note: Neietver miksēšanas darbības, kas būtiski maina oriģināldarba būtību un saturu, radot jaunu darbu, kā arī ieraksta vairāku celiņu miksēšanu un montāžu. @lv
scope note: Ei koske uudelleenmiksauksia, jotka olennaisesti muuttavat alkuperäisen teoksen luonnetta ja sisältöä, mikä johtaa uuteen teokseen, eikä äänitteen useampien raitojen miksaamista ja yhdistelyä.
label: 是……的打碟者个人 @zh-hans
definition: 将一个个人与包括在现场表演中或在录音工作室中混合已录制音轨使其出现为一个连续的音轨的一个个人的贡献的一种内容表达关联起来。 @zh-hans
toolkit label: ……的打碟者个人 @zh-hans
toolkit definition: 包括在现场表演中或在录音工作室中混合已录制音轨使其出现为一个连续的音轨的一个个人的贡献的一种内容表达 @zh-hans
scope note: 不包括实质性改变原作品的性质和内容导致一种新的作品以及混合和聚集一个录音的多个音轨的合成活动。 @zh-hans

lahjoittaja (toimija) kappaleelle
status: Published
label: is donor agent of @en
definition: Relates an agent to an item that is donated to another owner who is an agent. @en
type: Property
domain: C10002
sub property of: entinen omistaja (toimija) kappaleessa
lexical alias: donorAgentOf.en
label: est un agent donateur de @fr
definition: Met un agent en relation avec un item qui est offert en don à un autre propriétaire qui est un agent. @fr
toolkit label: agent donateur de @fr
toolkit definition: Item qui est offert en don à un autre propriétaire qui est un agent. @fr
toolkit label: donor agent of @en
toolkit definition: An item that is donated to another owner who is an agent. @en
instruction number: 18.5
label: είναι δωρητής φορέας του @el
definition: Συνδέει τον προηγούμενο ιδιοκτήτη ενός αντιτύπου, ο οποίος δώρισε αυτό το αντίτυπο σε κάποιον άλλον ιδιοκτήτη, με ένα αντίτυπο. @el
toolkit label: δωρητής φορέας του @el
toolkit definition: Ένα αντίτυπο που έχει δωρηθεί σε κάποιον άλλον ιδιοκτήτη. @el
definition: Setzt einen Akteur in Beziehung zu einem Exemplar, das einer anderen Eigentümerin/einem anderen Eigentümer (Akteur) überlassen wird. @de
toolkit label: Akteur als Stifterin/Stifter von @de
toolkit definition: Ein Exemplar, das einer anderen Eigentümerin/einem anderen Eigentümer (Akteur) überlassen wird. @de
label: er agent, som er donor af @da
definition: Relaterer en agent til et eksemplar, som er doneret til en anden ejer, som er en agent. @da
toolkit label: agent, som er donor af @da
toolkit definition: Eksemplar, som er doneret til en anden ejer, som er en agent. @da
label: és agent donant de @ca
definition: Relaciona un agent amb un ítem que es dona a un altre propietari que és un agent. @ca
toolkit label: agent donant de @ca
toolkit definition: Ítem que es dona a un altre propietari que és un agent. @ca
definition: Liittää toimijan kappaleeseen, jonka toimija on lahjoittanut toiselle omistajalle.
toolkit label: lahjoittaja (toimija) kappaleelle
toolkit definition: Kappale, joka on lahjoitettu toiselle omistajalle, joka on toimija.
toolkit label: giver av (agent) @no
toolkit definition: Et eksemplar som er gitt til en annen eier som er en agent. @no
label: ist Akteur als Stifterin/Stifter von @de
has element type: 2
label: adományozó ágense a következőnek: @hu
definition: Hozzákapcsol egy ágenst egy példányhoz, amelyet egy másik tulajdonos ágensnek adományoznak. @hu
toolkit label: adományozó ágense: @hu
toolkit definition: Egy példány, amelyet egy másik tulajdonos ágensnek adományoznak. @hu
alternative label: donor of @en
alternative label: lahjoitus
label: er giver av (agent) @no
definition: Relaterer en agent til et eksemplar som er gitt til en annen eier som er en agent. @no
alternative label: giver av @no
label: is schenker-actor van @nl
definition: Relateert een actor aan een item dat is geschonken aan een andere eigenaar die een actor is. @nl
toolkit label: schenker-actor van @nl
toolkit definition: Een item dat is geschonken aan een andere eigenaar die een actor is. @nl
label: هو وكيل متبرع لـ @ar
definition: يربط وكيلا بمفردة تم التبرع بها إلى مالك آخر هو وكيل . @ar
alternative label: مانح لـ @ar
toolkit label: وكيل مانح لـ @ar
toolkit definition: مفردة تم التبرع بها إلى مالك آخر هو وكيل. @ar
alternative label: donant de @ca
alternative label: donor af @da
label: annetaja (tegija) eksemplarile @et
definition: Seostab tegija eksemplariga, mille tegija on kinkinud teisele omanikule. @et
alternative label: annetaja eksemplarile @et
toolkit label: annetaja (tegija) eksemplarile @et
toolkit definition: Eksemplar, mille tegija on kinkinud teisele omanikule. @et
alternative label: adományozója: @hu
label: è donatore agente di @it
definition: Correla un agente a un item donato a un altro proprietario che è un agente. @it
alternative label: donatore di @it
toolkit label: agente donatore di @it
toolkit definition: Item donato a un altro proprietario che è agente. @it
alternative label: δωρητής του @el
alternative label: donateur de @fr
label: ir ziedotājs (aģents) @lv
definition: Sasaista aģentu ar vienību, ko aģents ziedojis citam īpašniekam. @lv
toolkit label: ir ziedotājs (aģents) @lv
toolkit definition: Vienība, ko aģents ziedojis citam īpašniekam. @lv
alternative label: Stifter von @de
alternative label: ……的捐赠者 @zh-hans
toolkit label: 捐赠者行为者 @zh-hans
toolkit definition: 被捐赠给作为一个行为者的另一个拥有者的一个单件 @zh-hans
toolkit label: bağışcı temsilci @tr
toolkit definition: Bir temsilci olan başka bir mülk sahibine bağışlanan bir kopya. @tr
has subproperty: lahjoittaja (yhteistoimija) kappaleelle

lahjoittaja (yhteistoimija) kappaleelle
status: Published
label: is donor collective agent of @en
lexical alias: donorCollectiveAgentOf.en
definition: Relates a collective agent to an item that is donated to another owner who is a collective agent. @en
toolkit label: donor collective agent of @en
toolkit definition: An item that is donated to another owner who is a collective agent. @en
type: Property
domain: C10011
has element type: 2
sub property of: aiempi omistaja (yhteistoimija) kappaleessa
sub property of: lahjoittaja (toimija) kappaleelle
definition: Liittää yhteistoimijan kappaleeseen, jonka yhteistoimija on lahjoittanut toiselle omistajalle.
toolkit label: lahjoittaja (yhteistoimija) kappaleelle
toolkit definition: Kappale, jonka yhteistoimija on lahjoittanut toiselle omistajalle.
label: er giver av (kollektiv agent) @no
definition: Relaterer en kollektiv agent til et eksemplar som er gitt til en annen eier som er en kollektiv agent. @no
toolkit label: giver av (kollektiv agent) @no
toolkit definition: Et eksemplar som er gitt til en annen eier som er en kollektiv agent. @no
label: is schenker-collectieve actor van @nl
definition: Relateert een collectieve actor aan een item dat is geschonken aan een andere eigenaar die een collectieve actor is. @nl
toolkit label: schenker-collectieve actor van @nl
toolkit definition: Een item dat is gedoneerd aan een andere eigenaar die een collectieve actor is. @nl
label: هو وكيل جماعي متبرع لـ @ar
definition: يربط وكيلا جماعيا بمفردة يتم التبرع بها إلى وكيل جماعي مالك آخر. @ar
toolkit label: وكيل جماعي متبرع @ar
toolkit definition: مفردة يتم التبرع بها إلى وكيل جماعي مالك آخر. @ar
label: és agent col·lectiu donant de @ca
definition: Relaciona un agent col·lectiu amb un ítem que es dona a un altre propietari que és un agent col·lectiu . @ca
toolkit label: agent col·lectiu donant de @ca
toolkit definition: Ítem que es dona a un altre propietari que és un agent col·lectiu. @ca
label: er kollektiv agent, som er donor af @da
definition: Relaterer en kollektiv agent til et eksemplar, som er doneret til en anden ejer, som er en kollektiv agent. @da
toolkit label: kollektiv agent, som er donor af @da
toolkit definition: Eksemplar, som er doneret til en anden ejer, som er en kollektiv agent. @da
label: annetaja (kollektiiv) eksemplarile @et
definition: Seostab kollektiivi eksemplariga, mille kollektiiv on kinkinud teisele omanikule. @et
toolkit label: annetaja (kollektiiv) eksemplarile @et
toolkit definition: Eksemplar, mille kollektiiv on kinkinud teisele omanikule. @et
label: ist gemeinschaftlicher Akteur als Stifterin/Stifter von @de
definition: Setzt einen gemeinschaftlichen Akteur in Beziehung zu einem Exemplar, das einer anderen Eigentümerin/einem anderen Eigentümer (Gemeinschaftlicher Akteur) überlassen wird. @de
toolkit label: Gemeinschaftlicher Akteur als Stifterin/Stifter von @de
toolkit definition: Ein Exemplar, das einer anderen Eigentümerin/einem anderen Eigentümer (Gemeinschaftlicher Akteur) überlassen wird. @de
label: adományozó kollektív ágense a következőnek: @hu
definition: Hozzákapcsol egy kollektív ágenst egy példányhoz, amelyet egy másik tulajdonos kollektív ágensnek adományoznak. @hu
toolkit label: adományozó kollektív ágense: @hu
toolkit definition: Egy példány, amelyet egy másik tulajdonos kollektív ágensnek adományoznak. @hu
label: è donatore agente collettivo di @it
definition: Correla un agente collettivo a un item donato a un altro proprietario che è un agente collettivo. @it
toolkit label: donatore agente collettivo di @it
toolkit definition: Item donato a un altro proprietario che è un agente collettivo. @it
label: είναι δωρητής συλλογικός φορέας του @el
toolkit label: δωρητής συλλογικός φορέας του @el
label: est un agent collectif donateur de @fr
definition: Met un agent collectif en relation avec un item qui est offert en don à un autre propriétaire qui est un agent collectif. @fr
toolkit label: agent collectif donateur de @fr
toolkit definition: Item qui est offert en don à un autre propriétaire qui est un agent collectif. @fr
label: ir ziedotājs (grupa) @lv
definition: Sasaista grupu ar vienību, ko grupa ziedojusi citam īpašniekam. @lv
toolkit label: ir ziedotājs (grupa) @lv
toolkit definition: Vienība, ko grupa ziedojusi citam īpašniekam. @lv
label: 是……的捐赠者集体行为者 @zh-hans
definition: 将一个集体行为者与被捐赠给作为一个集体行为者的另一个拥有者的一个单件关联起来。 @zh-hans
toolkit label: ……的捐赠者集体行为者 @zh-hans
toolkit definition: 被捐赠给作为一个集体行为者的另一个拥有者的一个单件 @zh-hans
label: bağışçı kolektif temsilcisidir @tr
definition: Kollektif bir temsilciyi, kollektif bir temsilci olan başka bir sahibine bağışlanan bir kopya ile ilişkilendirir. @tr
toolkit label: bağışçı kolektif temsilci @tr
toolkit definition: Kolektif temsilci olan başka bir sahibine bağışlanan bir kopya. @tr
has subproperty: lahjoittaja (yhteisö) kappaleelle
has subproperty: lahjoittaja (suku) kappaleelle
has subproperty: P50790

lahjoittaja (yhteisö) kappaleelle
status: Published
label: is donor corporate body of @en
lexical alias: donorCorporateBodyOf.en
definition: Relates a corporate body to an item that is donated to another owner who is a corporate body. @en
toolkit label: donor corporate body of @en
toolkit definition: An item that is donated to another owner who is a corporate body. @en
type: Property
domain: C10005
has element type: 2
sub property of: aiempi omistaja (yhteisö) kappaleessa
sub property of: lahjoittaja (yhteistoimija) kappaleelle
definition: Liittää yhteisön kappaleeseen, jonka yhteisö on lahjoittanut toiselle omistajalle.
toolkit label: lahjoittaja (yhteisö) kappaleelle
toolkit definition: Kappale, jonka yhteisö on lahjoittanut toiselle omistajalle.
label: er giver av (korporasjon) @no
definition: Relaterer en korporasjon til et eksemplar som er gitt til en annen eier som er en korporasjon. @no
toolkit label: giver av (korporasjon) @no
toolkit definition: Et eksemplar som er gitt til en annen eier som er en korporasjon. @no
label: is schenker-corporatie van @nl
definition: Relateert een corporatie aan een item dat is geschonken aan een andere eigenaar die een corporatie is. @nl
toolkit label: schenker-corporatie van @nl
toolkit definition: Een item dat is gedoneerd aan een andere eigenaar die een corporatie is. @nl
label: هي هيئة متبرعة لـ @ar
definition: يربط هيئة بمفردة يتم التبرع بها إلى هيئة مالك آخر. @ar
toolkit label: هيئة متبرعة @ar
toolkit definition: مفردة يتم التبرع بها إلى هيئة مالك آخر. @ar
label: és entitat corporativa donant de @ca
definition: Relaciona una entitat corporativa amb un ítem que es dona a un altre propietari que és una entitat corporativa. @ca
toolkit label: entitat corporativa donant de @ca
toolkit definition: Ítem que es dona a un altre propietari que és una entitat corporativa. @ca
label: er korporation, som er donor af @da
definition: Relaterer en korporation til et eksemplar, som er doneret til en anden ejer, som er en korporation. @da
toolkit label: korporation, som er donor af @da
toolkit definition: Eksemplar, som er doneret til en anden ejer, som er en korporation. @da
label: annetaja (asutus) eksemplarile @et
definition: Seostab asutuse eksemplariga, mille asutus on kinkinud teisele omanikule. @et
toolkit label: annetaja (asutus) eksemplarile @et
toolkit definition: Eksemplar, mille asutus on kinkinud teisele omanikule. @et
label: ist Körperschaft als Stifterin/Stifter von @de
definition: Setzt eine Körperschaft in Beziehung zu einem Exemplar, das einer anderen Eigentümerin/einem anderen Eigentümer (Körperschaft) überlassen wird. @de
toolkit label: Körperschaft als Stifterin/Stifter von @de
toolkit definition: Ein Exemplar, das einer anderen Eigentümerin/einem anderen Eigentümer (Körperschaft) überlassen wird. @de
label: adományozó testülete a következőnek: @hu
definition: Hozzákapcsol egy testületet egy példányhoz, amelyet egy másik tulajdonos testületnek adományoznak. @hu
toolkit label: adományozó testülete: @hu
toolkit definition: Egy példány, amelyet egy másik tulajdonos testületnek adományoznak. @hu
label: è donatore ente di @it
definition: Correla un ente a un item donato a un altro proprietario che è un ente. @it
toolkit label: donatore ente di @it
toolkit definition: Item donato a un altro proprietario che è un ente. @it
label: είναι δωρητής συλλογικό όργανο του @el
toolkit label: δωρητής συλλογικό όργανο του @el
label: est une collectivité donatrice de @fr
definition: Met une collectivité en relation avec un item qui est offert en don à un autre propriétaire qui est une collectivité. @fr
toolkit label: collectivité donatrice de @fr
toolkit definition: Item qui est offert en don à un autre propriétaire qui est une collectivité. @fr
label: ir ziedotājs (institūcija) @lv
definition: Sasaista institūciju ar vienību, ko institūcija ziedojusi citam īpašniekam. @lv
toolkit label: ir ziedotājs (institūcija) @lv
toolkit definition: Vienība, ko institūcija ziedojusi citam īpašniekam. @lv
label: 是……的捐赠者团体 @zh-hans
definition: 将一个团体与被捐赠给作为一个团体的另一个拥有者的一个单件关联起来。 @zh-hans
toolkit label: ……的捐赠者团体 @zh-hans
toolkit definition: 被捐赠给作为一个团体的另一个拥有者的一个单件 @zh-hans
label: bağışçı tüzel kişisidir @tr
definition: Bir tüzel kişiyi, tüzel bir kişilik olan başka bir mal sahibine bağışlanan kopyayla ilişkilendirir. @tr
toolkit label: bağışçı tüzel kişi @tr
toolkit definition: Tüzel bir kişi olan başka bir mülk sahibine bağışlanan bir kopya. @tr
has subproperty: P50941

lahjoittaja (suku) kappaleelle
status: Published
label: is donor family of @en
lexical alias: donorFamilyOf.en
definition: Relates a family to an item that is donated to another owner who is a family. @en
toolkit label: donor family of @en
toolkit definition: An item that is donated to another owner who is a family. @en
type: Property
domain: C10008
has element type: 2
sub property of: aiempi omistaja (suku) kappaleessa
sub property of: lahjoittaja (yhteistoimija) kappaleelle
definition: Liittää suvun kappaleeseen, jonka suku on lahjoittanut toiselle suvulle.
toolkit label: lahjoittaja (suku) kappaleelle
toolkit definition: Kappale, joka on lahjoitettu toiselle suvulle.
label: er giver av (familie) @no
definition: Relaterer en familie til et eksemplar som er gitt til en annen eier som er en familie. @no
toolkit label: giver av (familie) @no
toolkit definition: Et eksemplar som er gitt til en annen eier som er en familie. @no
label: is schenker-familie van @nl
definition: Relateert een familie aan een item dat is geschonken aan een andere eigenaar die een familie is. @nl
toolkit label: schenker-familie van @nl
toolkit definition: Een item dat is gedoneerd aan een andere eigenaar die een familie is. @nl
label: هي عائلة متبرعة لـ @ar
definition: يربط عائلة بمفردة يتم التبرع بها إلى عائلة مالك آخر. @ar
toolkit label: عائلة متبرعة @ar
toolkit definition: مفردة يتم التبرع بها إلى عائلة مالك آخر. @ar
label: és família donant de @ca
definition: Relaciona una família amb un ítem que es dona a un altre propietari que és una família. @ca
toolkit label: família donant de @ca
toolkit definition: Ítem que es dona a un altre propietari que és una família. @ca
label: er familie, som er donor af @da
definition: Relaterer en familie til et eksemplar, som er doneret til en anden ejer, som er en familie. @da
toolkit label: familie, som er donor af @da
toolkit definition: Eksemplar, som er doneret til en anden ejer, som er en familie. @da
label: annetaja (perekond) eksemplarile @et
definition: Seostab perekonna eksemplariga, mille perekond on kinkinud teisele omanikule. @et
toolkit label: annetaja (perekond) eksemplarile @et
toolkit definition: Eksemplar, mille perekond on kinkinud teisele omanikule. @et
label: ist Familie als Stifterin/Stifter von @de
definition: Setzt eine Familie in Beziehung zu einem Exemplar, das einer anderen Eigentümerin/einem anderen Eigentümer (Familie) überlassen wird. @de
toolkit label: Familie als Stifterin/Stifter von @de
toolkit definition: Ein Exemplar, das einer anderen Eigentümerin/einem anderen Eigentümer (Familie) überlassen wird. @de
label: adományozó családja a következőnek: @hu
definition: Hozzákapcsol egy családot egy példányhoz, amelyet egy másik tulajdonos családnak adományoznak. @hu
toolkit label: adományozó családja @hu
toolkit definition: Egy példány, amelyet egy másik tulajdonos családnak adományoznak. @hu
label: è donatore famiglia di @it
definition: Correla una famiglia a un item donato a un altro proprietario che è una famiglia. @it
toolkit label: donatore famiglia di @it
toolkit definition: Item donato a un altro proprietario che è una famiglia. @it
label: είναι δωρητής οικογένεια του @el
definition: Συνδέει μια οικογένεια με ένα αντίτυπο το οποίο δωρίζεται σε άλλον κάτοχο, ο οποίος είναι μια οικογένεια. @el
toolkit label: δωρητής οικογένεια του @el
label: est une famille donatrice de @fr
definition: Met une famille en relation avec un item qui est offert en don à un autre propriétaire qui est une famille. @fr
toolkit label: famille donatrice de @fr
toolkit definition: Item qui est offert en don à un autre propriétaire qui est une famille. @fr
label: ir ziedotājs (dzimta/ģimene) @lv
definition: Sasaista dzimtu/ģimeni ar vienību, ko dzimta/ģimene ziedojusi citam īpašniekam. @lv
toolkit label: ir ziedotājs (dzimta/ģimene) @lv
toolkit definition: Vienība, ko dzimta/ģimene ziedojusi citam īpašniekam. @lv
label: 是……的捐赠者家族 @zh-hans
definition: 将一个家族与被捐赠给作为一个家族的另一个拥有者的一个单件关联起来。 @zh-hans
toolkit label: ……的捐赠者家族 @zh-hans
toolkit definition: 被捐赠给作为一个家族的另一个拥有者的一个单件 @zh-hans
label: bağışçı ailesidir @tr
definition: Bir aileyi, aile olan başka bir sahibine bağışlanan bir kopyayla ilişkilendirir. @tr
toolkit label: bağışçı aile @tr
toolkit definition: Bir aile olan başka bir mülk sahibine bağışlanan bir kopya. @tr
has subproperty: P51092

lahjoittaja (henkilö) kappaleelle
status: Published
label: is donor person of @en
lexical alias: donorPersonOf.en
definition: Relates a person to an item that is donated to another owner who is a person. @en
toolkit label: donor person of @en
toolkit definition: An item that is donated to another owner who is a person. @en
type: Property
domain: C10004
has element type: 2
sub property of: aiempi omistaja (henkilö) kappaleessa
sub property of: lahjoittaja (toimija) kappaleelle
definition: Liittää henkilön kappaleeseen, jonka henkilö on lahjoittanut toiselle omistajalle.
toolkit label: lahjoittaja (henkilö) kappaleelle
toolkit definition: Kappale, jonka henkilö on lahjoittanut toiselle omistajalle.
label: er giver av (person) @no
definition: Relaterer en person til et eksemplar som er gitt til en annen eier som er en person. @no
toolkit label: giver av (person) @no
toolkit definition: Et eksemplar som er gitt til en annen eier som er en person. @no
label: is schenker-persoon van @nl
definition: Relateert een persoon aan een item dat is geschonken aan een andere eigenaar die een persoon is. @nl
toolkit label: schenker-persoon van @nl
toolkit definition: Een item dat is gedoneerd aan een andere eigenaar die een persoon is. @nl
label: هو شخص متبرع بـ @ar
definition: يربط شخصا بمفردة يتم التبرع بها إلى مالك آخر شخص. @ar
toolkit label: شخص متبرع @ar
toolkit definition: مفردة يتم التبرع بها إلى مالك آخر شخص. @ar
label: és persona donant de @ca
definition: Relaciona una persona amb un ítem que es dona a un altre propietari que és una persona. @ca
toolkit label: persona donant de @ca
toolkit definition: Ítem que es dona a un altre propietari que és una persona. @ca
label: er person, som er donor af @da
definition: Relaterer en person til et eksemplar, som er doneret til en anden ejer, som er en person. @da
toolkit label: person, som er donor af @da
toolkit definition: Eksemplar, som er doneret til en anden ejer, som er en person. @da
label: annetaja (isik) eksemplarile @et
definition: Seostab isiku eksemplariga, mille isik on kinkinud teisele omanikule. @et
toolkit label: annetaja (isik) eksemplarile @et
toolkit definition: Eksemplar, mille isik on kinkinud teisele omanikule. @et
label: ist Person als Stifterin/Stifter von @de
definition: Setzt eine Person in Beziehung zu einem Exemplar, das einer anderen Eigentümerin/einem anderen Eigentümer (Person) überlassen wird. @de
toolkit label: Person als Stifterin/Stifter von @de
toolkit definition: Ein Exemplar, das einer anderen Eigentümerin/einem anderen Eigentümer (Person) überlassen wird. @de
label: adományozó személye a következőnek: @hu
definition: Hozzákapcsol egy személyt egy példányhoz, amelyet egy másik tulajdonos személynek adományoznak. @hu
toolkit label: adományozó személye: @hu
toolkit definition: Egy példány, amelyet egy másik tulajdonos személynek adományoznak. @hu
label: è donatore persona di @it
definition: Correla una persona a un item donato a un altro proprietario che è una persona. @it
toolkit label: donatore persona di @it
toolkit definition: Item donato a un altro proprietario che è una persona. @it
label: είναι δωρητής φυσικό πρόσωπο του @el
toolkit label: δωρητής φυσικό πρόσωπο του @el
label: est une personne donatrice de @fr
definition: Met une personne en relation avec un item qui est offert en don à un autre propriétaire qui est une personne. @fr
toolkit label: personne donatrice de @fr
toolkit definition: Item qui est offert en don à un autre propriétaire qui est une personne. @fr
label: ir ziedotājs (persona) @lv
definition: Sasaista personu ar vienību, ko persona ziedojusi citam īpašniekam. @lv
toolkit label: ir ziedotājs (persona) @lv
toolkit definition: Vienība, ko persona ziedojusi citam īpašniekam. @lv
label: 是……的捐赠者个人 @zh-hans
definition: 将一个个人与被捐赠给作为个人的另一个拥有者的一个单件关联起来。 @zh-hans
toolkit label: ……的捐赠者个人 @zh-hans
toolkit definition: 被捐赠给作为个人的另一个拥有者的一个单件 @zh-hans
label: bağışçı kişisidir @tr
definition: Bir kişiyi, başka bir şahıs olan sahibine bağışlanmış bir kopyayla ilişkilendirir. @tr
toolkit label: bağışçı @tr
toolkit definition: Bir kişi olan başka bir mülk sahibine bağışlanan bir kopya. @tr
has subproperty: P50639

piirtäjä (toimija) ekspressiossa
status: Published
label: is draftsman agent of @en
definition: Relates an agent to an expression that includes a contribution by an agent of making detailed plans or drawings for buildings, ships, aircraft, machines, objects, etc. @en
type: Property
domain: C10002
sub property of: yhdistymään osallinen toimija ekspressiossa
lexical alias: draftsmanAgentOf.en
label: est un agent dessinateur industriel de @fr
definition: Met un agent en relation avec une expression qui intègre une contribution de la part d’un agent consistant à effectuer des plans ou des dessins détaillés pour des bâtiments, des navires, des avions, des machines, des objets, etc. @fr
toolkit label: agent dessinateur industriel de @fr
toolkit definition: Expression qui intègre une contribution de la part d’un agent consistant à effectuer des plans ou des dessins détaillés pour des bâtiments, des navires, des avions, des machines, des objets, etc. @fr
toolkit label: draftsman agent of @en
toolkit definition: An expression that includes a contribution by an agent of making detailed plans or drawings for buildings, ships, aircraft, machines, objects, etc. @en
instruction number: 18.5
label: είναι σχεδιαστής φορέας του @el
definition: Συνδέει έναν φορέα, ο οποίος συνεισφέρει σε μια έκφραση ενός έργου ενός αρχιτέκτονα, εφευρέτη κ.λπ. δημιουργώντας λεπτομερή σχέδια ή σκίτσα κτηρίων, πλοίων, αεροσκαφών, μηχανών, αντικειμένων κ.λπ., με μια έκφραση. @el
toolkit label: σχεδιαστής φορέας του @el
toolkit definition: Mια έκφραση ενός έργου που ενσωματώνει τη συνεισφορά ενός αρχιτέκτονα, εφευρέτη κ.λπ. μέσω της δημιουργίας λεπτομερών σχεδίων ή σκίτσων κτηρίων, πλοίων, αεροσκαφών, μηχανών, αντικειμένων κ.λπ. @el
definition: Setzt einen Akteur in Beziehung zu einer Expression, zu der ein Akteur beiträgt, indem er detaillierte Pläne oder Zeichnungen für Gebäude, Schiffe, Flugzeuge, Maschinen, Objekte oder ähnliches erstellt. @de
toolkit label: Akteur als Technische Zeichnerin/Technischer Zeichner von @de
toolkit definition: Eine Expression, zu der ein Akteur beiträgt, indem er detaillierte Pläne oder Zeichnungen für Gebäude, Schiffe, Flugzeuge, Maschinen, Objekte oder ähnliches erstellt. @de
label: er agent, som er teknisk tegner af @da
definition: Relaterer en agent til et udtryk, som omfatter en agents bidrag ved at lave detaljerede planer eller tegninger til bygninger, skibe, luftfartøj, maskiner, objekter etc. @da
toolkit label: agent, som er teknisk tegner af @da
toolkit definition: Udtryk, som omfatter en agents bidrag ved at lave detaljerede planer eller tegninger til bygninger, skibe, luftfartøj, maskiner, objekter etc. @da
label: és agent delineant de @ca
definition: Relaciona un agent amb una expressió que inclou una contribució d’un agent elaborant plànols o dibuixos detallats d’edificis, de vaixells, d’avions, de màquines, d’objectes, etc. @ca
toolkit label: agent delineant de @ca
toolkit definition: Expressió que inclou una contribució d’un agent elaborant plànols o dibuixos detallats d’edificis, de vaixells, d’avions, de màquines, d’objectes, etc. @ca
definition: Liittää toimijan ekspressioon, jonka tekemiseen toimija osallistuu tuottamalla tarkkoja suunnitelmia tai piirroksia rakennuksista, laivoista, lentokoneista, laitteista, esineistä tms.
toolkit label: piirtäjä (toimija) ekspressiossa
toolkit definition: Ekspressio, jonka tekemiseen toimija osallistuu tuottamalla tarkkoja suunnitelmia tai piirroksia rakennuksista, laivoista, lentokoneista, laitteista, esineistä tms.
toolkit label: teknisk tegner av (agent) @no
toolkit definition: Et uttrykk som inkluderer et bidrag fra en agent i form av å lage detaljerte plantegninger for bygninger, skip, fly, maskiner, gjenstander, etc. @no
label: ist Akteur als Technische Zeichnerin/Technischer Zeichner von @de
has element type: 2
label: műszaki rajzoló ágense a következőnek: @hu
definition: Hozzákapcsol egy ágenst egy kifejezési formához, amely magában foglalja egy ágens közreműködését épületek, hajók, repülőgépek, gépek, objektumok, stb. részletes terveinek vagy rajzainak elkészítésében. @hu
toolkit label: műszaki rajzoló ágense: @hu
toolkit definition: Egy kifejezési forma, amely magában foglalja egy ágens közreműködését épületek, hajók, repülőgépek, gépek, objektumok, stb. részletes terveinek vagy rajzainak elkészítésében. @hu
alternative label: draftsman of @en
alternative label: tekninen piirros
label: er teknisk tegner av (agent) @no
definition: Relaterer en agent til et uttrykk som inkluderer et bidrag fra en agent i form av å lage detaljerte plantegninger for bygninger, skip, fly, maskiner, gjenstander, etc. @no
alternative label: teknisk tegner av @no
label: is technisch tekenaar-actor van @nl
definition: Relateert een actor aan een expressie die omvat een bijdrage door een actor door het maken van gedetailleerde plattegronden of tekeningen voor gebouwen, schepen, luchtvaartuigen, machines, voorwerpen etc. @nl
toolkit label: technisch tekenaar-actor van @nl
toolkit definition: Een expressie die omvat een bijdrage door een actor door het maken van gedetailleerde plattegronden of tekeningen voor gebouwen, schepen, luchtvaartuigen, machines, voorwerpen etc. @nl
label: هو وكيل رسام هندسي لـ @ar
definition: يربط وكيلا بتعبيرة تتضمن إسهام وكيل في وضع خطط أو رسومات مفصلة للمباني والسفن والطائرات والآلات والأشياء، إلخ. @ar
alternative label: رسام هندسي لـ @ar
toolkit label: وكيل رسام هندسي @ar
toolkit definition: تعبيرة تتضمن إسهام وكيل في وضع خطط أو رسومات مفصلة للمباني والسفن والطائرات والآلات والأشياء، إلخ. @ar
alternative label: delineant de @ca
alternative label: teknisk tegner af @da
label: joonestaja (tegija) väljenduses @et
definition: Seostab tegija väljendusega, millesse tegija on andnud panuse, tehes täpseid plaane või jooniseid ehitistele, laevadele, lennukitele, masinatele vm objektidele. @et
alternative label: joonestaja väljenduses @et
toolkit label: joonestaja (tegija) väljenduses @et
toolkit definition: Väljendus, millesse tegija on andnud panuse, tehes täpseid plaane või jooniseid ehitistele, laevadele, lennukitele, masinatele vm objektidele. @et
alternative label: műszaki rajzolója a következő: @hu
label: è disegnatore industriale agente di @it
definition: Correla un agente a un'espressione che include un contributo da parte di un agente nel fare progetti o disegni dettagliati per edifici, navi, aerei, macchine, oggetti, etc. @it
alternative label: disegnatore industriale di @it
toolkit label: disegnatore industriale agente di @it
toolkit definition: Espressione che include un contributo da parte di un agente nel fare progetti o disegni dettagliati per edifici, navi, aerei, macchine, oggetti, etc. @it
alternative label: σχεδιαστής του @el
alternative label: dessinateur industriel de @fr
label: ir rasētājs (aģents) @lv
definition: Sasaista aģentu ar izteiksmi, kas ietver aģenta ieguldījumu, izstrādājot ēku, kuģu, lidmašīnu, mašīnu, objektu utt. detalizētus plānus vai rasējumus. @lv
toolkit label: ir rasētājs (aģents) @lv
toolkit definition: Izteiksme, kas ietver aģenta ieguldījumu, izstrādājot ēku, kuģu, lidmašīnu, mašīnu, objektu utt. detalizētus plānus vai rasējumus. @lv
alternative label: Technischer Zeichner von @de
alternative label: ……的绘图者 @zh-hans
toolkit label: ……的绘图者行为者 @zh-hans
toolkit definition: 包括为建筑物、船舶、飞行器、机械装置、物体等制作详细平面图或绘制草图的一个行为者的贡献的一种内容表达 @zh-hans
toolkit label: tasarımcı temsilci @tr
toolkit definition: Binalar, gemiler, uçaklar, makineler, nesneler vb. için ayrıntılı planlar veya çizimler yapan bir temsilcinin katkısını içeren bir anlatım. @tr
has subproperty: piirtäjä (yhteistoimija) ekspressiossa

piirtäjä (yhteistoimija) ekspressiossa
status: Published
label: is draftsman collective agent of @en
lexical alias: draftsmanCollectiveAgentOf.en
definition: Relates a collective agent to an expression that includes a contribution by a collective agent of making detailed plans or drawings for buildings, ships, aircraft, machines, objects, etc. @en
toolkit label: draftsman collective agent of @en
toolkit definition: An expression that includes a contribution by a collective agent of making detailed plans or drawings for buildings, ships, aircraft, machines, objects, etc. @en
type: Property
domain: C10011
has element type: 2
sub property of: yhdistymään osallinen yhteistoimija ekspressiossa
sub property of: piirtäjä (toimija) ekspressiossa
definition: Liittää yhteistoimijan ekspressioon, jonka tekemisessä yhteistoimija on osallisena tuottamalla tarkkoja suunnitelmia tai piirroksia rakennuksista, laivoista, lentokoneista, laitteista, esineistä tms.
toolkit label: piirtäjä (yhteistoimija) ekspressiossa
toolkit definition: Ekspressio, jonka tekemisessä yhteistoimija on osallisena tuottamalla tarkkoja suunnitelmia tai piirroksia rakennuksista, laivoista, lentokoneista, laitteista, esineistä tms.
label: er teknisk tegner for (kollektiv agent) @no
definition: Relaterer en kollektiv agent til et uttrykk som inkluderer et bidrag fra en kollektiv agent i form av å lage detaljerte plantegninger for bygninger, skip, fly, maskiner, gjenstander, etc. @no
toolkit label: teknisk tegner for (kollektiv agent) @no
toolkit definition: Et uttrykk som inkluderer et bidrag fra en kollektiv agent i form av å lage detaljerte plantegninger for bygninger, skip, fly, maskiner, gjenstander, etc. @no
label: is technisch tekenaar-collectieve actor van @nl
definition: Relateert een collectieve actor aan een expressie die omvat een bijdrage door een collectieve actor door het maken van gedetailleerde plattegronden of tekeningen voor gebouwen, schepen, luchtvaartuigen, machines, voorwerpen etc. @nl
toolkit label: technisch tekenaar-collectieve actor van @nl
toolkit definition: Een expressie die omvat een bijdrage door een collectieve actor door het maken van gedetailleerde plattegronden of tekeningen voor gebouwen, schepen, luchtvaartuigen, machines, voorwerpen etc. @nl
label: هو وكيل جماعي رسام هندسي لـ @ar
definition: يربط وكيلا جماعيا بتعبيرة تتضمن إسهام وكيل جماعي في وضع خطط أو رسومات مفصلة للمباني والسفن والطائرات والآلات والأشياء، إلخ. @ar
toolkit label: وكيل جماعي رسام هندسي @ar
toolkit definition: تعبيرة تتضمن إسهام وكيل جماعي في وضع خطط أو رسومات مفصلة للمباني والسفن والطائرات والآلات والأشياء، إلخ. @ar
label: és agent col·lectiu delineant de @ca
definition: Relaciona un agent col·lectiu amb una expressió que inclou una contribució d’un agent col·lectiu elaborant plànols o dibuixos detallats d’edificis, de vaixells, d’avions, de màquines, d’objectes, etc. @ca
toolkit label: agent col·lectiu delineant de @ca
toolkit definition: Expressió que inclou una contribució d’un agent col·lectiu elaborant plànols o dibuixos detallats d’edificis, de vaixells, d’avions, de màquines, d’objectes, etc. @ca
label: er kollektiv agent, som er teknisk tegner af @da
definition: Relaterer en kollektiv agent til et udtryk, som omfatter en kollektiv agents bidrag ved at lave detaljerede planer eller tegninger til bygninger, skibe, luftfartøj, maskiner, objekter etc. @da
toolkit label: kollektiv agent, som er teknisk tegner af @da
toolkit definition: Udtryk, som omfatter en kollektiv agents bidrag ved at lave detaljerede planer eller tegninger til bygninger, skibe, luftfartøj, maskiner, objekter etc. @da
label: joonestaja (kollektiiv) väljenduses @et
definition: Seostab kollektiivi väljendusega, millesse kollektiiv on andnud panuse, tehes täpseid plaane või jooniseid ehitistele, laevadele, lennukitele, masinatele vm objektidele. @et
toolkit label: joonestaja (kollektiiv) väljenduses @et
toolkit definition: Väljendus, millesse kollektiiv on andnud panuse, tehes täpseid plaane või jooniseid ehitistele, laevadele, lennukitele, masinatele vm objektidele. @et
label: ist gemeinschaftlicher Akteur als Technische Zeichnerin/Technischer Zeichner von @de
definition: Setzt einen gemeinschaftlichen Akteur in Beziehung zu einer Expression, zu der ein gemeinschaftlicher Akteur beiträgt, indem er detaillierte Pläne oder Zeichnungen für Gebäude, Schiffe, Flugzeuge, Maschinen, Objekte oder ähnliches erstellt. @de
toolkit label: Gemeinschaftlicher Akteur als Technische Zeichnerin/Technischer Zeichner von @de
toolkit definition: Eine Expression, zu der ein gemeinschaftlicher Akteur beiträgt, indem er detaillierte Pläne oder Zeichnungen für Gebäude, Schiffe, Flugzeuge, Maschinen, Objekte oder ähnliches erstellt. @de
label: műszaki rajzoló kollektív ágense a következőnek: @hu
definition: Hozzákapcsol egy kollektív ágenst egy kifejezési formához, amely magában foglalja egy kollektív ágens közreműködését épületek, hajók, repülőgépek, gépek, objektumok, stb. részletes terveinek vagy rajzainak elkészítésében. @hu
toolkit label: műszaki rajzoló kollektív ágense: @hu
toolkit definition: Egy kifejezési forma, amely magában foglalja egy kollektív ágens közreműködését épületek, hajók, repülőgépek, gépek, objektumok, stb. részletes terveinek vagy rajzainak elkészítésében. @hu
label: è disegnatore industriale agente collettivo di @it
definition: Correla un agente collettivo a un'espressione che comprende un contributo di un agente collettivo nel fare progetti o disegni dettagliati per edifici, navi, aerei, macchine, oggetti, etc. @it
toolkit label: disegnatore industriale agente collettivo di @it
toolkit definition: Espressione che comprende un contributo di un agente collettivo nel fare progetti o disegni dettagliati per edifici, navi, aerei, macchine, oggetti, etc. @it
label: είναι σχεδιαστής συλλογικός φορέας του @el
toolkit label: σχεδιαστής συλλογικός φορέας του @el
label: est un agent collectif dessinateur industriel de @fr
definition: Met un agent collectif en relation avec une expression qui intègre une contribution de la part d’un agent collectif consistant à effectuer des plans ou des dessins détaillés pour des bâtiments, des navires, des avions, des machines, des objets, etc. @fr
toolkit label: agent collectif dessinateur industriel de @fr
toolkit definition: Expression qui intègre une contribution de la part d’un agent collectif consistant à effectuer des plans ou des dessins détaillés pour des bâtiments, des navires, des avions, des machines, des objets, etc. @fr
label: ir rasētājs (grupa) @lv
definition: Sasaista grupu ar izteiksmi, kas ietver grupas ieguldījumu, izstrādājot ēku, kuģu, lidmašīnu, mašīnu, objektu utt. detalizētus plānus vai rasējumus. @lv
toolkit label: ir rasētājs (grupa) @lv
toolkit definition: Izteiksme, kas ietver grupas ieguldījumu, izstrādājot ēku, kuģu, lidmašīnu, mašīnu, objektu utt. detalizētus plānus vai rasējumus. @lv
label: 是……的绘图者集体行为者 @zh-hans
definition: 将一个集体行为者与包括为建筑物、船舶、飞行器、机械装置、物体等制作详细平面图或绘制草图的一个集体行为者的贡献的一种内容表达关联起来。 @zh-hans
toolkit label: ……的绘图者集体行为者 @zh-hans
toolkit definition: 包括为建筑物、船舶、飞行器、机械装置、物体等制作详细平面图或绘制草图的一个集体行为者的贡献的一种内容表达 @zh-hans
label: teknik ressam kolektif temsilcisidir @tr
definition: Kolektif bir temsilciyi, binalar, gemiler, uçaklar, makineler, nesneler vb. için ayrıntılı planlar veya çizimler yapmaya kolektif bir temsilcinin katkısını içeren bir anlatım ile ilişkilendirir. @tr
toolkit label: tasarımcı kolektif temsilci @tr
toolkit definition: Binalar, gemiler, uçaklar, makineler, nesneler vb. için ayrıntılı plan veya çizimler yapan kolektif bir temsilcinin katkısını içeren bir anlatım. @tr
has subproperty: piirtäjä (yhteisö) ekspressiossa
has subproperty: piirtäjä (suku) ekspressiossa
has subproperty: P50745

piirtäjä (yhteisö) ekspressiossa
status: Published
label: is draftsman corporate body of @en
lexical alias: draftsmanCorporateBodyOf.en
definition: Relates a corporate body to an expression that includes a contribution by a corporate body of making detailed plans or drawings for buildings, ships, aircraft, machines, objects, etc. @en
toolkit label: draftsman corporate body of @en
toolkit definition: An expression that includes a contribution by a corporate body of making detailed plans or drawings for buildings, ships, aircraft, machines, objects, etc. @en
type: Property
domain: C10005
has element type: 2
sub property of: yhdistymään osallinen yhteisö ekspressiossa
sub property of: piirtäjä (yhteistoimija) ekspressiossa
definition: Liittää yhteisön ekspressioon, jonka tekemisessä yhteisö on osallisena tuottamalla tarkkoja suunnitelmia tai piirroksia rakennuksista, laivoista, lentokoneista, laitteista, esineistä tms.
toolkit label: piirtäjä (yhteisö) ekspressiossa
toolkit definition: Ekspressio, jonka tekemisessä yhteisö on osallisena tuottamalla tarkkoja suunnitelmia tai piirroksia rakennuksista, laivoista, lentokoneista, laitteista, esineistä tms.
label: er teknisk tegner for (korporasjon) @no
definition: Relaterer en korporasjon til et uttrykk som inkluderer et bidrag fra en korporasjon i form av å lage detaljerte plantegninger for bygninger, skip, fly, maskiner, gjenstander, etc. @no
toolkit label: teknisk tegner for (korporasjon) @no
toolkit definition: Et uttrykk som inkluderer et bidrag fra en korporasjon i form av å lage detaljerte plantegninger for bygninger, skip, fly, maskiner, gjenstander, etc. @no
label: is technisch tekenaar-corporatie van @nl
definition: Relateert een corporatie aan een expressie die omvat een bijdrage door een corporatie door het maken van gedetailleerde plattegronden of tekeningen voor gebouwen, schepen, luchtvaartuigen, machines, voorwerpen etc. @nl
toolkit label: technisch tekenaar-corporatie van @nl
toolkit definition: Een expressie die omvat een bijdrage door een corporatie door het maken van gedetailleerde plattegronden of tekeningen voor gebouwen, schepen, luchtvaartuigen, machines, voorwerpen etc. @nl
label: هي هيئة مسئولة عن الرسم الهندسي لـ @ar
definition: يربط هيئة بتعبيرة تتضمن إسهام هيئة في وضع خطط أو رسومات مفصلة للمباني والسفن والطائرات والآلات والأشياء، إلخ. @ar
toolkit label: هيئة مسئولة عن الرسم الهندسي @ar
toolkit definition: تعبيرة تتضمن إسهام هيئة في وضع خطط أو رسومات مفصلة للمباني والسفن والطائرات والآلات والأشياء، إلخ. @ar
label: és entitat corporativa delineant de @ca
definition: Relaciona una entitat corporativa amb una expressió que inclou una contribució d’una entitat corporativa elaborant plànols o dibuixos detallats d’edificis, de vaixells, d’avions, de màquines, d’objectes, etc. @ca
toolkit label: entitat corporativa delineant de @ca
toolkit definition: Expressió que inclou una contribució d’una entitat corporativa elaborant plànols o dibuixos detallats d’edificis, de vaixells, d’avions, de màquines, d’objectes, etc. @ca
label: er korporation, som er teknisk tegner af @da
definition: Relaterer en korporation til et udtryk, som omfatter en korporations bidrag ved at lave detaljerede planer eller tegninger til bygninger, skibe, luftfartøj, maskiner, objekter etc. @da
toolkit label: korporation, som er teknisk tegner af @da
toolkit definition: Udtryk, som omfatter en korporations bidrag ved at lave detaljerede planer eller tegninger til bygninger, skibe, luftfartøj, maskiner, objekter etc. @da
label: joonestaja (asutus) väljenduses @et
definition: Seostab asutuse väljendusega, millesse asutus on andnud panuse, tehes täpseid plaane või jooniseid ehitistele, laevadele, lennukitele, masinatele vm objektidele. @et
toolkit label: joonestaja (asutus) väljenduses @et
toolkit definition: Väljendus, millesse asutus on andnud panuse, tehes täpseid plaane või jooniseid ehitistele, laevadele, lennukitele, masinatele vm objektidele. @et
label: ist Körperschaft als Technische Zeichnerin/Technischer Zeichner von @de
definition: Setzt eine Körperschaft in Beziehung zu einer Expression, zu der eine Körperschaft beiträgt, indem sie detaillierte Pläne oder Zeichnungen für Gebäude, Schiffe, Flugzeuge, Maschinen, Objekte oder ähnliches erstellt. @de
toolkit label: Körperschaft als Technische Zeichnerin/Technischer Zeichner von @de
toolkit definition: Eine Expression, zu der eine Körperschaft beiträgt, indem sie detaillierte Pläne oder Zeichnungen für Gebäude, Schiffe, Flugzeuge, Maschinen, Objekte oder ähnliches erstellt. @de
label: műszaki rajzoló testülete a következőnek: @hu
definition: Hozzákapcsol egy testület egy kifejezési formához, amely magában foglalja egy testület közreműködését épületek, hajók, repülőgépek, gépek, objektumok, stb. részletes terveinek vagy rajzainak elkészítésében. @hu
toolkit label: műszaki rajzoló testülete: @hu
toolkit definition: Egy kifejezési forma, amely magában foglalja egy testület közreműködését épületek, hajók, repülőgépek, gépek, objektumok, stb. részletes terveinek vagy rajzainak elkészítésében. @hu
label: è disegnatore industriale ente di @it
definition: Correla un ente a un'espressione che include un contributo di un ente nel fare progetti o disegni dettagliati per edifici, navi, aerei, macchine, oggetti, etc. @it
toolkit label: disegnatore industriale ente di @it
toolkit definition: Espressione che include un contributo di un ente nel fare progetti o disegni dettagliati per edifici, navi, aerei, macchine, oggetti, etc. @it
label: είναι σχεδιαστής συλλογικό όργανο του @el
toolkit label: σχεδιαστής συλλογικό όργανο του @el
label: est une collectivité dessinatrice industrielle de @fr
definition: Met une collectivité en relation avec une expression qui intègre une contribution de la part d’une collectivité consistant à effectuer des plans ou des dessins détaillés pour des bâtiments, des navires, des avions, des machines, des objets, etc. @fr
toolkit label: collectivité dessinatrice industrielle de @fr
toolkit definition: Expression qui intègre une contribution de la part d’une collectivité consistant à effectuer des plans ou des dessins détaillés pour des bâtiments, des navires, des avions, des machines, des objets, etc. @fr
label: ir rasētājs (institūcija) @lv
definition: Sasaista institūciju ar izteiksmi, kas ietver institūcijas ieguldījumu, izstrādājot ēku, kuģu, lidmašīnu, mašīnu, objektu utt. detalizētus plānus vai rasējumus. @lv
toolkit label: ir rasētājs (institūcija) @lv
toolkit definition: Izteiksme, kas ietver institūcijas ieguldījumu, izstrādājot ēku, kuģu, lidmašīnu, mašīnu, objektu utt. detalizētus plānus vai rasējumus. @lv
label: 是……的绘图者团体 @zh-hans
definition: 将一个团体与包括为建筑物、船舶、飞行器、机械装置、物体等制作详细平面图或绘制草图的一个团体的贡献的一种内容表达关联起来。 @zh-hans
toolkit label: ……的绘图者团体 @zh-hans
toolkit definition: 包括为建筑物、船舶、飞行器、机械装置、物体等制作详细平面图或绘制草图的一个团体的贡献的一种内容表达 @zh-hans
label: teknik ressam tüzel kişisidir @tr
definition: Bir tüzel kişiyi, binalar, gemiler, uçaklar, makineler, nesneler vb. için ayrıntılı planlar veya çizimler yapmaya bir tüzel kişinin katkısını içeren bir anlatımla ilişkilendirir. @tr
toolkit label: tasarımcı tüzel kişi @tr
toolkit definition: Binalar, gemiler, uçaklar, makineler, nesneler vb. için ayrıntılı planlar veya çizimler yapan tüzel bir kişinin katkısını içeren bir anlatım. @tr
has subproperty: P50896

piirtäjä (suku) ekspressiossa
status: Published
label: is draftsman family of @en
lexical alias: draftsmanFamilyOf.en
definition: Relates a family to an expression that includes a contribution by a family of making detailed plans or drawings for buildings, ships, aircraft, machines, objects, etc. @en
toolkit label: draftsman family of @en
toolkit definition: An expression that includes a contribution by a family of making detailed plans or drawings for buildings, ships, aircraft, machines, objects, etc. @en
type: Property
domain: C10008
has element type: 2
sub property of: yhdistymään osallinen suku ekspressiossa
sub property of: piirtäjä (yhteistoimija) ekspressiossa
definition: Liittää suvun ekspressioon, jonka tekemisessä suku on osallisena tuottamalla tarkkoja suunnitelmia tai piirroksia rakennuksista, laivoista, lentokoneista, laitteista, esineistä tms.
toolkit label: piirtäjä (suku) ekspressiossa
toolkit definition: Ekspressio, jonka tekemisessä suku on osallisena tuottamalla tarkkoja suunnitelmia tai piirroksia rakennuksista, laivoista, lentokoneista, laitteista, esineistä tms.
label: er teknisk tegner for (familie) @no
definition: Relaterer en familie til et uttrykk som inkluderer et bidrag fra en familie i form av å lage detaljerte plantegninger for bygninger, skip, fly, maskiner, gjenstander, etc. @no
toolkit label: teknisk tegner for (familie) @no
toolkit definition: Et uttrykk som inkluderer et bidrag fra en familie i form av å lage detaljerte plantegninger for bygninger, skip, fly, maskiner, gjenstander, etc. @no
label: is technisch tekenaar-familie van @nl
definition: Relateert een familie aan een expressie die omvat een bijdrage door een familie door het maken van gedetailleerde plattegronden of tekeningen voor gebouwen, schepen, luchtvaartuigen, machines, voorwerpen etc. @nl
toolkit label: technisch tekenaar-familie van @nl
toolkit definition: Een expressie die omvat een bijdrage door een familie door het maken van gedetailleerde plattegronden of tekeningen voor gebouwen, schepen, luchtvaartuigen, machines, voorwerpen etc. @nl
label: هي عائلة مسئولة عن الرسم الهندسي لـ @ar
definition: يربط عائلة بتعبيرة تتضمن إسهام عائلة في وضع خطط أو رسومات مفصلة للمباني والسفن والطائرات والآلات والأشياء، إلخ. @ar
toolkit label: عائلة مسئولة عن الرسم الهندسي @ar
toolkit definition: تعبيرة تتضمن إسهام عائلة في وضع خطط أو رسومات مفصلة للمباني والسفن والطائرات والآلات والأشياء، إلخ. @ar
label: és família delineant de @ca
definition: Relaciona una família amb una expressió que inclou una contribució d’una família elaborant plànols o dibuixos detallats d’edificis, de vaixells, d’avions, de màquines, d’objectes, etc. @ca
toolkit label: família delineant de @ca
toolkit definition: Expressió que inclou una contribució d’una família elaborant plànols o dibuixos detallats d’edificis, de vaixells, d’avions, de màquines, d’objectes, etc. @ca
label: er familie, som er teknisk tegner af @da
definition: Relaterer en familie til et udtryk, som omfatter en families bidrag ved at lave detaljerede planer eller tegninger til bygninger, skibe, luftfartøj, maskiner, objekter etc. @da
toolkit label: familie, som er teknisk tegner af @da
toolkit definition: Udtryk, som omfatter en families bidrag ved at lave detaljerede planer eller tegninger til bygninger, skibe, luftfartøj, maskiner, objekter etc. @da
label: joonestaja (perekond) väljenduses @et
definition: Seostab perekonna väljendusega, millesse perekond on andnud panuse, tehes täpseid plaane või jooniseid ehitistele, laevadele, lennukitele, masinatele vm objektidele. @et
toolkit label: joonestaja (perekond) väljenduses @et
toolkit definition: Väljendus, millesse perekond on andnud panuse, tehes täpseid plaane või jooniseid ehitistele, laevadele, lennukitele, masinatele vm objektidele. @et
label: ist Familie als Technische Zeichnerin/Technischer Zeichner von @de
definition: Setzt eine Familie in Beziehung zu einer Expression, zu der eine Familie beiträgt, indem sie detaillierte Pläne oder Zeichnungen für Gebäude, Schiffe, Flugzeuge, Maschinen, Objekte oder ähnliches erstellt. @de
toolkit label: Familie als Technische Zeichnerin/Technischer Zeichner von @de
toolkit definition: Eine Expression, zu der eine Familie beiträgt, indem sie detaillierte Pläne oder Zeichnungen für Gebäude, Schiffe, Flugzeuge, Maschinen, Objekte oder ähnliches erstellt. @de
label: műszaki rajzoló családja a következőnek: @hu
definition: Hozzákapcsol egy családot egy kifejezési formához, amely magában foglalja egy család közreműködését épületek, hajók, repülőgépek, gépek, objektumok, stb. részletes terveinek vagy rajzainak elkészítésében. @hu
toolkit label: műszaki rajzoló családja: @hu
toolkit definition: Egy kifejezési forma, amely magában foglalja egy család közreműködését épületek, hajók, repülőgépek, gépek, objektumok, stb. részletes terveinek vagy rajzainak elkészítésében. @hu
label: è disegnatore industriale famiglia di @it
definition: Correla una famiglia a un'espressione che comprende un contributo di una famiglia nel fare progetti o disegni dettagliati per edifici, navi, aerei, macchine, oggetti, etc. @it
toolkit label: disegnatore industriale famiglia di @it
toolkit definition: Espressione che comprende un contributo di una famiglia per fare progetti o disegni dettagliati per edifici, navi, aerei, macchine, oggetti, etc. @it
label: είναι σχεδιαστής οικογένεια του @el
toolkit label: σχεδιαστής οικογένεια του @el
label: est une famille dessinatrice industrielle de @fr
definition: Met une famille en relation avec une expression qui intègre une contribution de la part d’une famille consistant à effectuer des plans ou des dessins détaillés pour des bâtiments, des navires, des avions, des machines, des objets, etc. @fr
toolkit label: famille dessinatrice industrielle de @fr
toolkit definition: Expression qui intègre une contribution de la part d’une famille consistant à effectuer des plans ou des dessins détaillés pour des bâtiments, des navires, des avions, des machines, des objets, etc. @fr
label: ir rasētājs (dzimta/ģimene) @lv
definition: Sasaista dzimtu/ģimeni ar izteiksmi, kas ietver dzimtas/ģimenes ieguldījumu, izstrādājot ēku, kuģu, lidmašīnu, mašīnu, objektu utt. detalizētus plānus vai rasējumus. @lv
toolkit label: ir rasētājs (dzimta/ģimene) @lv
toolkit definition: Izteiksme, kas ietver dzimtas/ģimenes ieguldījumu, izstrādājot ēku, kuģu, lidmašīnu, mašīnu, objektu utt. detalizētus plānus vai rasējumus. @lv
label: 是……的绘图者家族 @zh-hans
definition: 将一个家族与包括为建筑物、船舶、飞行器、机械装置、物体等制作详细平面图或绘制草图的一个家族的贡献的一种内容表达关联起来。 @zh-hans
toolkit label: ……的绘图者家族 @zh-hans
toolkit definition: 包括为建筑物、船舶、飞行器、机械装置、物体等制作详细平面图或绘制草图的一个家族的贡献的一种内容表达 @zh-hans
label: teknik ressam ailesidir @tr
definition: Bir aileyi, binalar, gemiler, uçaklar, makineler, nesneler vb. için ayrıntılı planlar veya çizimler yapma katkısını içeren bir anlatımla ilişkilendirir. @tr
toolkit label: tasarımcı aile @tr
toolkit definition: Binalar, gemiler, uçaklar, makineler, nesneler vb. için ayrıntılı planlar veya çizimler yapan bir ailenin katkısını içeren bir anlatım. @tr
has subproperty: P51047

piirtäjä (henkilö) ekspressiossa
status: Published
label: is draftsman person of @en
lexical alias: draftsmanPersonOf.en
definition: Relates a person to an expression that includes a contribution by a person of making detailed plans or drawings for buildings, ships, aircraft, machines, objects, etc. @en
toolkit label: draftsman person of @en
toolkit definition: An expression that includes a contribution by a person of making detailed plans or drawings for buildings, ships, aircraft, machines, objects, etc. @en
type: Property
domain: C10004
has element type: 2
sub property of: yhdistymään osallinen henkilö ekspressiossa
sub property of: piirtäjä (toimija) ekspressiossa
definition: Liittää henkilön ekspressioon, jonka tekemisessä henkilö on osallisena tuottamalla tarkkoja suunnitelmia tai piirroksia rakennuksista, laivoista, lentokoneista, laitteista, esineistä tms.
toolkit label: piirtäjä (henkilö) ekspressiossa
toolkit definition: Ekspressio, jonka tekemisessä henkilö on osallisena tuottamalla tarkkoja suunnitelmia tai piirroksia rakennuksista, laivoista, lentokoneista, laitteista, esineistä tms.
label: er teknisk tegner for (person) @no
definition: Relaterer en person til et uttrykk som inkluderer et bidrag fra en person i form av å lage detaljerte plantegninger for bygninger, skip, fly, maskiner, gjenstander, etc. @no
toolkit label: teknisk tegner for (person) @no
toolkit definition: Et uttrykk som inkluderer et bidrag fra en person i form av å lage detaljerte plantegninger for bygninger, skip, fly, maskiner, gjenstander, etc. @no
label: is technisch tekenaar-persoon van @nl
definition: Relateert een persoon aan een expressie die omvat een bijdrage door een persoon door het maken van gedetailleerde plattegronden of tekeningen voor gebouwen, schepen, luchtvaartuigen, machines, voorwerpen etc. @nl
toolkit label: technisch tekenaar-persoon van @nl
toolkit definition: Een expressie die omvat een bijdrage door een persoon door het maken van gedetailleerde plattegronden of tekeningen voor gebouwen, schepen, luchtvaartuigen, machines, voorwerpen etc. @nl
label: هو شخص رسام هندسي لـ @ar
definition: يربط شخصا بتعبيرة تتضمن إسهام شخص في وضع خطط أو رسومات مفصلة للمباني والسفن والطائرات والآلات والأشياء، إلخ. @ar
toolkit label: شخص رسام هندسي @ar
toolkit definition: تعبيرة تتضمن إسهام شخص في وضع خطط أو رسومات مفصلة للمباني والسفن والطائرات والآلات والأشياء، إلخ. @ar
label: és persona delineant de @ca
definition: Relaciona una persona amb una expressió que inclou una contribució d’una persona elaborant plànols o dibuixos detallats d’edificis, de vaixells, d’avions, de màquines, d’objectes, etc. @ca
toolkit label: persona delineant de @ca
toolkit definition: Expressió que inclou una contribució d’una persona elaborant plànols o dibuixos detallats d’edificis, de vaixells, d’avions, de màquines, d’objectes, etc. @ca
label: er person, som er teknisk tegner af @da
definition: Relaterer en person til et udtryk, som omfatter en persons bidrag ved at lave detaljerede planer eller tegninger til bygninger, skibe, luftfartøj, maskiner, objekter etc. @da
toolkit label: person, som er teknisk tegner af @da
toolkit definition: Udtryk, som omfatter en persons bidrag ved at lave detaljerede planer eller tegninger til bygninger, skibe, luftfartøj, maskiner, objekter etc. @da
label: joonestaja (isik) väljenduses @et
definition: Seostab isiku väljendusega, millesse isik on andnud panuse, tehes täpseid plaane või jooniseid ehitistele, laevadele, lennukitele, masinatele vm objektidele. @et
toolkit label: joonestaja (isik) väljenduses @et
toolkit definition: Väljendus, millesse isik on andnud panuse, tehes täpseid plaane või jooniseid ehitistele, laevadele, lennukitele, masinatele vm objektidele. @et
label: ist Person als Technische Zeichnerin/Technischer Zeichner von @de
definition: Setzt eine Person in Beziehung zu einer Expression, zu der eine Person beiträgt, indem sie detaillierte Pläne oder Zeichnungen für Gebäude, Schiffe, Flugzeuge, Maschinen, Objekte oder ähnliches erstellt. @de
toolkit label: Person als Technische Zeichnerin/Technischer Zeichner von @de
toolkit definition: Eine Expression, zu der eine Person beiträgt, indem sie detaillierte Pläne oder Zeichnungen für Gebäude, Schiffe, Flugzeuge, Maschinen, Objekte oder ähnliches erstellt. @de
label: műszaki rajzoló személye a következőnek: @hu
definition: Hozzákapcsol egy személyt egy kifejezési formához, amely magában foglalja egy személy közreműködését épületek, hajók, repülőgépek, gépek, objektumok, stb. részletes terveinek vagy rajzainak elkészítésében. @hu
toolkit label: műszaki rajzoló személye: @hu
toolkit definition: Egy kifejezési forma, amely magában foglalja egy személy közreműködését épületek, hajók, repülőgépek, gépek, objektumok, stb. részletes terveinek vagy rajzainak elkészítésében. @hu
label: è disegnatore industriale persona di @it
definition: Correla una persona a un'espressione che comprende un contributo di una persona nel fare progetti o disegni dettagliati per edifici, navi, aerei, macchine, oggetti, etc. @it
toolkit label: disegnatore industriale persona di @it
toolkit definition: Espressione che comprende un contributo di una persona nel fare progetti o disegni dettagliati per edifici, navi, aerei, macchine, oggetti, etc. @it
label: είναι σχεδιαστής φυσικό πρόσωπο του @el
toolkit label: σχεδιαστής φυσικό πρόσωπο του @el
label: est une personne dessinatrice industrielle de @fr
definition: Met une personne en relation avec une expression qui intègre une contribution de la part d’une personne consistant à effectuer des plans ou des dessins détaillés pour des bâtiments, des navires, des avions, des machines, des objets, etc. @fr
toolkit label: personne dessinatrice industrielle de @fr
toolkit definition: Expression qui intègre une contribution de la part d’une personne consistant à effectuer des plans ou des dessins détaillés pour des bâtiments, des navires, des avions, des machines, des objets, etc. @fr
label: ir rasētājs (persona) @lv
definition: Sasaista personu ar izteiksmi, kas ietver personas ieguldījumu, izstrādājot ēku, kuģu, lidmašīnu, mašīnu, objektu utt. detalizētus plānus vai rasējumus. @lv
toolkit label: ir rasētājs (persona) @lv
toolkit definition: Izteiksme, kas ietver personas ieguldījumu, izstrādājot ēku, kuģu, lidmašīnu, mašīnu, objektu utt. detalizētus plānus vai rasējumus. @lv
label: 是……的绘图者个人 @zh-hans
definition: 将一个个人与包括为建筑物、船舶、飞行器、机械装置、物体等制作详细平面图或绘制草图的一个个人的贡献的一种内容表达关联起来。 @zh-hans
toolkit label: ……的绘图者个人 @zh-hans
toolkit definition: 包括为建筑物、船舶、飞行器、机械装置、物体等制作详细平面图或绘制草图的一个个人的贡献的一种内容表达 @zh-hans
label: teknik ressam kişisidir @tr
definition: Bir kişiyi, binalar, gemiler, uçaklar, makineler, nesneler vb. için ayrıntılı planlar veya çizimler yapan bir kişinin katkısını içeren bir anlatımla ilişkilendirir. @tr
toolkit label: tasarımcı @tr
toolkit definition: Binalar, gemiler, uçaklar, makineler, nesneler vb. için ayrıntılı planlar veya çizimler yapan bir kişinin katkısını içeren bir anlatım. @tr
has subproperty: P50594

dubbausohjaaja (toimija) ekspressiossa
status: Published
type: Property
label: is dubbing director agent of @en
lexical alias: dubbingDirectorAgentOf.en
definition: Relates an agent to an expression that includes a contribution by an agent of responsibility for the general management and supervision of the process of adding new dialogue or other sounds to complete a soundtrack. @en
domain: C10002
toolkit label: dubbing director agent of @en
toolkit definition: An expression that includes a contribution by an agent of responsibility for the general management and supervision of the process of adding new dialogue or other sounds to complete a soundtrack. @en
instruction number: 18.5
sub property of: esitykseen osallinen toimija ekspressiossa
label: είναι διευθυντής μεταγλώττισης φορέας του @el
definition: Συνδέει έναν φορέα με μια έκφραση ενός έργου που ενσωματώνει την ευθύνη της συνεισφοράς της γενικής διαχείρισης και εποπτείας της διαδικασίας προσθήκης νέου διαλόγου ή άλλων ήχων για τη συμπλήρωση ενός ηχητικού κομματιού. @el
toolkit label: διευθυντής μεταγλώττισης φορέας του @el
toolkit definition: Μια έκφραση ενός έργου που ενσωματώνει την ευθύνη της συνεισφοράς για τη γενική διαχείριση και εποπτεία της διαδικασίας προσθήκης νέου διαλόγου ή άλλων ήχων για τη συμπλήρωση του ηχητικού κομματιού. @el
definition: Setzt einen Akteur in Beziehung zu einer Expression, zu der ein Akteur beiträgt, indem er für das allgemeine Management und die Leitung beim Hinzufügen von neuem Dialog oder anderen Geräuschen verantwortlich ist, um die Tonspur zu vervollständigen. @de
toolkit label: Akteur als Synchronregisseurin/Synchronregisseur von @de
toolkit definition: Eine Expression, zu der ein Akteur beiträgt, indem er für das allgemeine Management und die Leitung beim Hinzufügen von neuem Dialog oder anderen Geräuschen verantwortlich ist, um die Tonspur zu vervollständigen. @de
label: er agent, som er dubbinginstruktør af @da
definition: Relaterer en agent til et udtryk, som omfatter en agents bidrag ved at have ansvar for den generelle ledelse af- og tilsyn med processen at tilføje ny dialog eller andre lyde for at fuldstændiggøre et soundtrack. @da
toolkit label: agent, som er dubbinginstruktør af @da
toolkit definition: Udtryk, som omfatter en agents bidrag ved at have ansvar for den generelle ledelse af- og tilsyn med processen at tilføje ny dialog eller andre lyde for at fuldstændiggøre et soundtrack. @da
label: és agent director de doblatge de @ca
definition: Relaciona un agent amb una expressió que inclou una contribució d’un agent en la responsabilitat de la gestió general i la supervisió del procés d’afegir nou diàleg o altres sons per completar una banda sonora. @ca
toolkit label: agent director de doblatge de @ca
toolkit definition: Expressió que inclou una contribució d’un agent en la responsabilitat de la gestió general i la supervisió del procés d’afegir nou diàleg o altres sons per completar una banda sonora. @ca
definition: Liittää toimijan ekspressioon, jossa toimija on vastuussa uuden dialogin tai muiden äänien lisäämisprosessin yleisestä johtamisesta ja valvonnasta ekspression ääniraidan täydentämiseksi.
toolkit label: dubbausohjaaja (toimija) ekspressiossa
toolkit definition: Ekspressio, jossa toimija on vastuussa uuden dialogin tai muiden äänien lisäämisprosessin yleisestä johtamisesst ja valvonnasta ekspression ääniraidan täydentämiseksi.
toolkit label: stemmeregissør for (agent) @no
toolkit definition: Et uttrykk som inkluderer et bidrag fra en agent i form av ansvar for generell ledelse og kontroll av prosessen med å legge til ny dialog eller andre lyder for å komplettere et lydspor. @no
label: ist Akteur als Synchronregisseurin/Synchronregisseur von @de
label: est un agent directeur de doublage de @fr
definition: Met un agent en relation avec une expression qui intègre une contribution de la part d’un agent consistant à être responsable de la gestion et de la supervision générales du processus visant à ajouter de nouveaux dialogues ou d’autres sons pour compléter une piste sonore. @fr
toolkit label: agent directeur de doublage de @fr
toolkit definition: Expression qui intègre une contribution de la part d’un agent consistant à être responsable de la gestion et de la supervision générales du processus visant à ajouter de nouveaux dialogues ou d’autres sons pour compléter une piste sonore. @fr
has element type: 2
label: szinkronrendező ágense a következőnek: @hu
definition: Hozzákapcsol egy ágenst egy kifejezési formához, amely magában foglalja egy ágens közreműködését új párbeszéd vagy más hangok hozzáadási folyamatának általános irányításában és felügyeletében egy hangsáv befejezése, teljessé tétele céljából. @hu
toolkit label: szinkronrendező ágense: @hu
toolkit definition: Egy kifejezési forma, amely magában foglalja egy ágens közreműködését új párbeszéd vagy más hangok hozzáadási folyamatának általános irányításában és felügyeletében egy hangsáv befejezése, teljessé tétele céljából. @hu
alternative label: dubbing director of @en
alternative label: dubbausohjaajana produktiossa
label: er stemmeregissør for (agent) @no
definition: Relaterer en agent til et uttrykk som inkluderer et bidrag fra en agent i form av ansvar for generell ledelse og kontroll av prosessen med å legge til ny dialog eller andre lyder for å komplettere et lydspor. @no
alternative label: stemmeregissør for @no
label: is stemregisseur-actor van @nl
definition: Relateert een actor aan een expressie die omvat een bijdrage door een actor door algeheel beheer en toezicht van het proces van toevoegen van nieuwe dialoog of andere geluiden om een geluidsspoor te completeren. @nl
toolkit label: stemregisseur-actor van @nl
toolkit definition: Een expressie die omvat een bijdrage door een actor door algeheel beheer en toezicht van het proces van toevoegen van nieuwe dialoog of andere geluiden om een geluidsspoor te completeren. @nl
label: هو وكيل مخرج الدبلجة لـ @ar
definition: يربط وكيلا بتعبيرة تتضمن إسهام وكيل مسئول عن الإدارة العامة والإشراف على عملية إضافة حوار جديد أو أصوات أخرى لإكمال مقطع صوتي. @ar
alternative label: مخرج الدبلجة @ar
toolkit label: وكيل مخرج الدبلجة @ar
toolkit definition: تعبيرة تتضمن إسهام وكيل مسئول عن الإدارة العامة والإشراف على عملية إضافة حوار جديد أو أصوات أخرى لإكمال مقطع صوتي. @ar
alternative label: director de doblatge de @ca
alternative label: dubbinginstruktør af @da
label: dublaaži režissöör (tegija) väljenduses @et
definition: Seostab tegija väljendusega, millesse tegija on andnud panuse, vastutades väljenduse heliriba täiendamisel uue dialoogi või muude helide lisamise üldise juhtimise ja juhendamise eest. @et
alternative label: dublaaži režissöör väljenduses @et
toolkit label: dublaaži režissöör (tegija) väljenduses @et
toolkit definition: Väljendus, millesse tegija on andnud panuse, vastutades väljenduse heliriba täiendamisel uue dialoogi või muude helide lisamise üldise juhtimise ja juhendamise eest. @et
alternative label: szinkronrendezője: @hu
label: è direttore del doppiaggio agente di @it
definition: Correla un agente a un'espressione che coinvolge un contributo da parte di un agente nella responsabilità per la gestione generale e la supervisione del processo di aggiunta di nuovi dialoghi o altri suoni a una colonna sonora completa. @it
alternative label: direttore del doppiaggio di @it
toolkit label: direttore del doppiaggio agente di @it
toolkit definition: Espressione che coinvolge un contributo da parte di un agente nella responsabilità della gestione generale e la supervisione del processo di aggiunta di nuovi dialoghi o altri suoni a una colonna sonora completa. @it
alternative label: διευθυντής μεταγλώττισης του @el
alternative label: directeur de doublage de @fr
label: ir dublāžas režisors (aģents) @lv
definition: Sasaista aģentu ar izteiksmi, kas ietver aģenta ieguldījumu, atbildot par vispārējo vadību un uzraudzību pār jaunu dialogu vai citu skaņu pievienošanu pabeigtam izteiksmes skaņu celiņam. @lv
toolkit label: ir dublāžas režisors (aģents) @lv
toolkit definition: Izteiksme, kas ietver aģenta ieguldījumu, atbildot par vispārējo vadību un uzraudzību pār jaunu dialogu vai citu skaņu pievienošanu pabeigtam izteiksmes skaņu celiņam. @lv
alternative label: Synchronregisseur von @de
alternative label: ……的混声导演 @zh-hans
toolkit label: ……的混声导演行为者 @zh-hans
toolkit definition: 包括总体管理和监督增加对话或其他声音以完成音轨的一个责任的一个行为者的贡献的一种内容表达 @zh-hans
toolkit label: dublaj yönetmeni temsilcisi @tr
toolkit definition: Bir film müziğini tamamlamak için yeni diyalog veya diğer sesleri ekleme sürecinin genel yönetimi ve denetiminden sorumlu bir temsilcinin katkısını içeren bir anlatım. @tr
has subproperty: dubbausohjaaja (yhteistoimija) ekspressiossa

dubbausohjaaja (yhteistoimija) ekspressiossa
status: Published
label: is dubbing director collective agent of @en
lexical alias: dubbingDirectorCollectiveAgentOf.en
definition: Relates a collective agent to an expression that includes a contribution by a collective agent of responsibility for the general management and supervision of the process of adding new dialogue or other sounds to complete a soundtrack. @en
toolkit label: dubbing director collective agent of @en
toolkit definition: An expression that includes a contribution by a collective agent of responsibility for the general management and supervision of the process of adding new dialogue or other sounds to complete a soundtrack. @en
type: Property
domain: C10011
has element type: 2
sub property of: esitykseen osallinen yhteistoimija ekspressiossa
sub property of: dubbausohjaaja (toimija) ekspressiossa
definition: Liittää yhteistoimijan ekspressioon, jossa yhteistoimija on osallisena uuden dialogin tai muiden äänien lisäämisprosessin yleisessä johtamisessa ja valvonnassa ekspression ääniraidan täydentämiseksi.
toolkit label: dubbausohjaaja (yhteistoimija) ekspressiossa
toolkit definition: Ekspressio, jossa yhteistoimija on osallisena uuden dialogin tai muiden äänien lisäämisprosessin yleisessä johtamisessa ja valvonnassa ekspression ääniraidan täydentämiseksi.
label: er stemmeregissør for (kollektiv agent) @no
definition: Relaterer en kollektiv agent til et uttrykk som inkluderer et bidrag fra en kollektiv agent i form av generell ledelse og tilsyn med prosessen med å legge til ny dialog eller andre lyder for å fullføre et lydspor. @no
toolkit label: stemmeregissør for (kollektiv agent) @no
toolkit definition: Et uttrykk som inkluderer et bidrag fra en kollektiv agent i form av generell ledelse og tilsyn med prosessen med å legge til ny dialog eller andre lyder for å fullføre et lydspor. @no
label: is stemregisseur-collectieve actor van @nl
definition: Relateert een collectieve actor aan een expressie die omvat een bijdrage door een collectieve actor door algeheel beheer en toezicht van het proces van toevoegen van nieuwe dialoog of andere geluiden om een geluidsspoor te completeren. @nl
toolkit label: stemregisseur-collectieve actor van @nl
toolkit definition: Een expressie die omvat een bijdrage door een collectieve actor door algeheel beheer en toezicht van het proces van toevoegen van nieuwe dialoog of andere geluiden om een geluidsspoor te completeren. @nl
label: هو وكيل جماعي مخرج الدبلجة لـ @ar
definition: يربط وكيلا جماعيا بتعبيرة تتضمن إسهام وكيل جماعي بتحمل مسئولية الإدارة العامة والإشراف على عملية إضافة حوار جديد أو أصوات أخرى لإكمال مقطع صوتي. @ar
toolkit label: وكيل جماعي مخرج الدبلجة @ar
toolkit definition: تعبيرة تتضمن إسهام وكيل جماعي بتحمل مسئولية الإدارة العامة والإشراف على عملية إضافة حوار جديد أو أصوات أخرى لإكمال مقطع صوتي. @ar
label: és agent col·lectiu director de doblatge de @ca
definition: Relaciona un agent col·lectiu amb una expressió que inclou una contribució d’un agent col·lectiu en la responsabilitat de la gestió general i la supervisió del procés d’afegir nou diàleg o altres sons per completar una banda sonora. @ca
toolkit label: agent col·lectiu director de doblatge de @ca
toolkit definition: Expressió que inclou una contribució d’un agent col·lectiu en la responsabilitat de la gestió general i la supervisió del procés d’afegir nou diàleg o altres sons per completar una banda sonora. @ca
label: er kollektiv agent, som er dubbinginstruktør af @da
definition: Relaterer en kollektiv agent til et udtryk, som omfatter en kollektiv agents bidrag ved at have ansvar for den generelle ledelse af- og tilsyn med processen at tilføje ny dialog eller andre lyde for at fuldstændiggøre et soundtrack. @da
toolkit label: kollektiv agent, som er dubbinginstruktør af @da
toolkit definition: Udtryk, som omfatter en kollektiv agents bidrag ved at have ansvar for den generelle ledelse af- og tilsyn med processen at tilføje ny dialog eller andre lyde for at fuldstændiggøre et soundtrack. @da
label: dublaaži režissöör (kollektiiv) väljenduses @et
definition: Seostab kollektiivi väljendusega, millesse kollektiiv on andnud panuse, vastutades väljenduse heliriba täiendamisel uue dialoogi või muude helide lisamise üldise juhtimise ja juhendamise eest. @et
toolkit label: dublaaži režissöör (kollektiiv) väljenduses @et
toolkit definition: Väljendus, millesse kollektiiv on andnud panuse, vastutades väljenduse heliriba täiendamisel uue dialoogi või muude helide lisamise üldise juhtimise ja juhendamise eest. @et
label: ist gemeinschaftlicher Akteur als Synchronregisseurin/Synchronregisseur von @de
definition: Setzt einen gemeinschaftlichen Akteur in Beziehung zu einer Expression, zu der ein gemeinschaftlicher Akteur beiträgt, indem er für das allgemeine Management und die Leitung beim Hinzufügen von neuem Dialog oder anderen Geräuschen verantwortlich ist, um die Tonspur zu vervollständigen. @de
toolkit label: Gemeinschaftlicher Akteur als Synchronregisseurin/Synchronregisseur von @de
toolkit definition: Eine Expression, zu der ein gemeinschaftlicher Akteur beiträgt, indem er für das allgemeine Management und die Leitung beim Hinzufügen von neuem Dialog oder anderen Geräuschen verantwortlich ist, um die Tonspur zu vervollständigen. @de
label: szinkronrendező kollektív ágense a következőnek: @hu
definition: Hozzákapcsol egy kollektív ágenst egy kifejezési formához, amely magában foglalja egy kollektív ágens közreműködését új párbeszéd vagy más hangok hozzáadási folyamatának általános irányításában és felügyeletében egy hangsáv befejezése, teljessé tétele céljából. @hu
toolkit label: szinkronrendező kollektív ágense: @hu
toolkit definition: Egy kifejezési forma, amely magában foglalja egy kollektív ágens közreműködését új párbeszéd vagy más hangok hozzáadási folyamatának általános irányításában és felügyeletében egy hangsáv befejezése, teljessé tétele céljából. @hu
label: è agente collettivo direttore di doppiaggio di @it
definition: Correla un agente collettivo a un'espressione che comprende un contributo di un agente collettivo di responsabilità per la gestione e supervisione generale del processo di aggiunta di nuovi dialoghi o altri suoni per completare una colonna sonora. @it
toolkit label: direttore di doppiaggio agente collettivo di @it
toolkit definition: Espressione che comprende un contributo di un agente collettivo di responsabilità per la gestione e supervisione generale del processo di aggiunta di nuovi dialoghi o altri suoni per completare una colonna sonora. @it
label: είναι διευθυντής μεταγλώττισης συλλογικός φορέας του @el
toolkit label: διευθυντής μεταγλώττισης συλλογικός φορέας του @el
label: est un agent collectif directeur de doublage de @fr
definition: Met un agent collectif en relation avec une expression qui intègre une contribution de la part d’un agent collectif consistant à être responsable de la gestion et de la supervision générales du processus visant à ajouter de nouveaux dialogues ou d’autres sons pour compléter une piste sonore. @fr
toolkit label: agent collectif directeur de doublage de @fr
toolkit definition: Expression qui intègre une contribution de la part d’un agent collectif consistant à être responsable de la gestion et de la supervision générales du processus visant à ajouter de nouveaux dialogues ou d’autres sons pour compléter une piste sonore. @fr
label: ir dublāžas režisors (grupa) @lv
definition: Sasaista grupu ar izteiksmi, kas ietver grupas ieguldījumu, atbildot par vispārējo vadību un uzraudzību pār jaunu dialogu vai citu skaņu pievienošanu pabeigtam izteiksmes skaņu celiņam. @lv
toolkit label: ir dublāžas režisors (grupa) @lv
toolkit definition: Izteiksme, kas ietver grupas ieguldījumu, atbildot par vispārējo vadību un uzraudzību pār jaunu dialogu vai citu skaņu pievienošanu pabeigtam izteiksmes skaņu celiņam. @lv
label: 是……的混声导演集体行为者 @zh-hans
definition: 将一个集体行为者与包括总体管理和监督增加对话或其他声音以完成音轨的一个责任的一个集体行为者的贡献的一种内容表达关联起来。 @zh-hans
toolkit label: ……的混声导演集体行为者 @zh-hans
toolkit definition: 包括总体管理和监督增加对话或其他声音以完成音轨的一个责任的一个集体行为者的贡献的一种内容表达 @zh-hans
label: dublaj yönetmeni kolektif temsilcisidir @tr
definition: Kolektif bir temsilciyi bir film müziğini tamamlamak için yeni diyalog veya diğer sesleri ekleme sürecinin genel yönetimi ve denetiminden sorumlu bir kolektif temsilcinin katkısını içeren bir anlatım ile ilişkilendirir. @tr
toolkit label: dublaj yönetmeni kolektif temsilcisi @tr
toolkit definition: Bir film müziğini tamamlamak için yeni diyalog veya diğer sesleri ekleme sürecinin genel yönetimi ve denetiminden sorumlu kolektif bir temsilcinin katkısını içeren bir anlatım. @tr
has subproperty: dubbausohjaaja (yhteisö) ekspressiossa
has subproperty: dubbausohjaaja (suku) ekspressiossa
has subproperty: P50762

dubbausohjaaja (yhteisö) ekspressiossa
status: Published
label: is dubbing director corporate body of @en
lexical alias: dubbingDirectorCorporateBodyOf.en
definition: Relates a corporate body to an expression that includes a contribution by a corporate body of responsibility for the general management and supervision of the process of adding new dialogue or other sounds to complete a soundtrack. @en
toolkit label: dubbing director corporate body of @en
toolkit definition: An expression that includes a contribution by a corporate body of responsibility for the general management and supervision of the process of adding new dialogue or other sounds to complete a soundtrack. @en
type: Property
domain: C10005
has element type: 2
sub property of: esitykseen osallinen yhteisö ekspressiossa
sub property of: dubbausohjaaja (yhteistoimija) ekspressiossa
definition: Liittää yhteisön ekspressioon, jossa yhteisö on osallisena uuden dialogin tai muiden äänien lisäämisprosessin yleisessä johtamisessa ja valvonnassa ekspression ääniraidan täydentämiseksi.
toolkit label: dubbausohjaaja (yhteisö) ekspressiossa
toolkit definition: Ekspressio, jossa yhteisö on osallisena uuden dialogin tai muiden äänien lisäämisprosessin yleisessä johtamisessa ja valvonnassa ekspression ääniraidan täydentämiseksi.
label: er stemmeregissør for (korporasjon) @no
definition: Relaterer en korporasjon til et uttrykk som inkluderer et bidrag fra en korporasjon i form av generell ledelse og tilsyn med prosessen med å legge til ny dialog eller andre lyder for å fullføre et lydspor. @no
toolkit label: stemmeregissør for (korporasjon) @no
toolkit definition: Et uttrykk som inkluderer et bidrag fra en korporasjon i form av generell ledelse og tilsyn med prosessen med å legge til ny dialog eller andre lyder for å fullføre et lydspor. @no
label: is stemregisseur-corporatie van @nl
definition: Relateert een corporatie aan een expressie die omvat een bijdrage door een corporatie door algeheel beheer en toezicht van het proces van toevoegen van nieuwe dialoog of andere geluiden om een geluidsspoor te completeren. @nl
toolkit label: stemregisseur-corporatie van @nl
toolkit definition: Een expressie die omvat een bijdrage door een corporatie door algeheel beheer en toezicht van het proces van toevoegen van nieuwe dialoog of andere geluiden om een geluidsspoor te completeren. @nl
label: هي هيئة مخرجة للدبلجة لـ @ar
definition: يربط هيئة بتعبيرة تتضمن إسهام هيئة مسئولة عن الإدارة العامة والإشراف على عملية إضافة حوار جديد أو أصوات أخرى لإكمال مقطع صوتي. @ar
toolkit label: هيئة مخرجة للدبلجة @ar
toolkit definition: تعبيرة تتضمن إسهام هيئة مسئولة عن الإدارة العامة والإشراف على عملية إضافة حوار جديد أو أصوات أخرى لإكمال مقطع صوتي. @ar
label: és entitat corporativa directora de doblatge de @ca
definition: Relaciona una entitat corporativa amb una expressió que inclou una contribució d’una entitat corporativa en la responsabilitat de la gestió general i la supervisió del procés d’afegir nou diàleg o altres sons per completar una banda sonora. @ca
toolkit label: entitat corporativa directora de doblatge de @ca
toolkit definition: Expressió que inclou una contribució d’una entitat corporativa en la responsabilitat de la gestió general i la supervisió del procés d’afegir nou diàleg o altres sons per completar una banda sonora. @ca
label: er korporation, som er dubbinginstruktør af @da
definition: Relaterer en korporation til et udtryk, som omfatter en korporations bidrag ved at have ansvar for den generelle ledelse af- og tilsyn med processen at tilføje ny dialog eller andre lyde for at fuldstændiggøre et soundtrack. @da
toolkit label: korporation, som er dubbinginstruktør af @da
toolkit definition: Udtryk, som omfatter en korporations bidrag ved at have ansvar for den generelle ledelse af- og tilsyn med processen at tilføje ny dialog eller andre lyde for at fuldstændiggøre et soundtrack. @da
label: dublaaži režissöör (asutus) väljenduses @et
definition: Seostab asutuse väljendusega, millesse asutus on andnud panuse, vastutades väljenduse heliriba täiendamisel uue dialoogi või muude helide lisamise üldise juhtimise ja juhendamise eest. @et
toolkit label: dublaaži režissöör (asutus) väljenduses @et
toolkit definition: Väljendus, millesse asutus on andnud panuse, vastutades väljenduse heliriba täiendamisel uue dialoogi või muude helide lisamise üldise juhtimise ja juhendamise eest. @et
label: ist Körperschaft als Synchronregisseurin/Synchronregisseur von @de
definition: Setzt eine Körperschaft in Beziehung zu einer Expression, zu der eine Körperschaft beiträgt, indem sie für das allgemeine Management und die Leitung beim Hinzufügen von neuem Dialog oder anderen Geräuschen verantwortlich ist, um die Tonspur zu vervollständigen. @de
toolkit label: Körperschaft als Synchronregisseurin/Synchronregisseur von @de
toolkit definition: Eine Expression, zu der eine Körperschaft beiträgt, indem sie für das allgemeine Management und die Leitung beim Hinzufügen von neuem Dialog oder anderen Geräuschen verantwortlich ist, um die Tonspur zu vervollständigen. @de
label: szinkronrendező testülete a következőnek: @hu
definition: Hozzákapcsol egy testületet egy kifejezési formához, amely magában foglalja egy testület közreműködését új párbeszéd vagy más hangok hozzáadási folyamatának általános irányításában és felügyeletében egy hangsáv befejezése, teljessé tétele céljából. @hu
toolkit label: szinkronrendező testülete: @hu
toolkit definition: Egy kifejezési forma, amely magában foglalja egy testület közreműködését új párbeszéd vagy más hangok hozzáadási folyamatának általános irányításában és felügyeletében egy hangsáv befejezése, teljessé tétele céljából. @hu
label: è direttore del doppiaggio ente di @it
definition: Correla un ente a un'espressione che comprende un contributo di un ente di responsabilità per la gestione e supervisione generale del processo di aggiunta di nuovi dialoghi o altri suoni per completare una colonna sonora. @it
toolkit label: direttore del doppiaggio ente di @it
toolkit definition: Espressione che comprende un contributo di un ente di responsabilità per la gestione e supervisione generale del processo di aggiunta di nuovi dialoghi o altri suoni per completare una colonna sonora. @it
label: είναι διευθυντής μεταγλώττισης συλλογικό όργανο του @el
toolkit label: διευθυντής μεταγλώττισης συλλογικό όργανο του @el
label: est une collectivité directrice de doublage de @fr
definition: Met une collectivité en relation avec une expression qui intègre une contribution de la part d’une collectivité consistant à être responsable de la gestion et de la supervision générales du processus visant à ajouter de nouveaux dialogues ou d’autres sons pour compléter une piste sonore. @fr
toolkit label: collectivité directrice de doublage de @fr
toolkit definition: Expression qui intègre une contribution de la part d’une collectivité consistant à être responsable de la gestion et de la supervision générales du processus visant à ajouter de nouveaux dialogues ou d’autres sons pour compléter une piste sonore. @fr
label: ir dublāžas režisors (institūcija) @lv
definition: Sasaista institūciju ar izteiksmi, kas ietver institūcijas ieguldījumu, atbildot par vispārējo vadību un uzraudzību pār jaunu dialogu vai citu skaņu pievienošanu pabeigtam izteiksmes skaņu celiņam. @lv
toolkit label: ir dublāžas režisors (institūcija) @lv
toolkit definition: Izteiksme, kas ietver institūcijas ieguldījumu, atbildot par vispārējo vadību un uzraudzību pār jaunu dialogu vai citu skaņu pievienošanu pabeigtam izteiksmes skaņu celiņam. @lv
label: 是……的混声导演团体 @zh-hans
definition: 将一个团体与包括总体管理和监督增加对话或其他声音以完成音轨的一个责任的一个团体的贡献的一种内容表达关联起来。 @zh-hans
toolkit label: ……的混声导演团体 @zh-hans
toolkit definition: 包括总体管理和监督增加对话或其他声音以完成音轨的一个责任的一个团体的贡献的一种内容表达 @zh-hans
label: dublaj yönetmeni tüzel kişisidir @tr
definition: Bir tüzel kişiyi, bir film müziğini tamamlamak için yeni diyalog veya diğer seslerin eklenmesi sürecinin genel yönetimi ve denetiminden sorumlu bir tüzel kişinin katkısını içeren bir anlatımla ilişkilendirir. @tr
toolkit label: doblaj yönetmeni tüzel kişisi @tr
toolkit definition: Bir film müziğini tamamlamak için yeni diyalog veya başka seslerin eklenmesi sürecinin genel yönetimi ve denetiminden sorumlu tüzel bir kişinin katkısını içeren bir anlatım. @tr
has subproperty: P50913

dubbausohjaaja (suku) ekspressiossa
status: Published
label: is dubbing director family of @en
lexical alias: dubbingDirectorFamilyOf.en
definition: Relates a family to an expression that includes a contribution by a family of responsibility for the general management and supervision of the process of adding new dialogue or other sounds to complete a soundtrack. @en
toolkit label: dubbing director family of @en
toolkit definition: An expression that includes a contribution by a family of responsibility for the general management and supervision of the process of adding new dialogue or other sounds to complete a soundtrack. @en
type: Property
domain: C10008
has element type: 2
sub property of: esitykseen osallinen suku ekspressiossa
sub property of: dubbausohjaaja (yhteistoimija) ekspressiossa
definition: Liittää suvun ekspressioon, jossa suku on osallisena uuden dialogin tai muiden äänien lisäämisprosessin yleisessä johtamisessa ja valvonnassa ekspression ääniraidan täydentämiseksi.
toolkit label: dubbausohjaaja (suku) ekspressiossa
toolkit definition: Ekspressio, jossa suku on osallisena uuden dialogin tai muiden äänien lisäämisprosessin yleisessä johtamisessa ja valvonnassa ekspression ääniraidan täydentämiseksi.
label: er stemmeregissør for (familie) @no
definition: Relaterer en familie til et uttrykk som inkluderer et bidrag fra en familie i form av generell ledelse og tilsyn med prosessen med å legge til ny dialog eller andre lyder for å fullføre et lydspor. @no
toolkit label: stemmeregissør for (familie) @no
toolkit definition: Et uttrykk som inkluderer et bidrag fra en familie i form av generell ledelse og tilsyn med prosessen med å legge til ny dialog eller andre lyder for å fullføre et lydspor. @no
label: is stemregisseur-familie van @nl
definition: Relateert een familie aan een expressie die omvat een bijdrage door een familie door algeheel beheer en toezicht van het proces van toevoegen van nieuwe dialoog of andere geluiden om een geluidsspoor te completeren. @nl
toolkit label: stemregisseur-familie van @nl
toolkit definition: Een expressie die omvat een bijdrage door een familie door algeheel beheer en toezicht van het proces van toevoegen van nieuwe dialoog of andere geluiden om een geluidsspoor te completeren. @nl
label: هي عائلة مخرجة الدبلجة لـ @ar
definition: يربط عائلة بتعبيرة تتضمن إسهام عائلة مسئولة عن الإدارة العامة والإشراف على عملية إضافة حوار جديد أو أصوات أخرى لإكمال مقطع صوتي. @ar
toolkit label: عائلة مخرجة الدبلجة @ar
toolkit definition: تعبيرة تتضمن إسهام عائلة مسئولة عن الإدارة العامة والإشراف على عملية إضافة حوار جديد أو أصوات أخرى لإكمال مقطع صوتي. @ar
label: és família directora de doblatge de @ca
definition: Relaciona una família amb una expressió que inclou una contribució d’una família en la responsabilitat de la gestió general i la supervisió del procés d’afegir nou diàleg o altres sons per completar una banda sonora. @ca
toolkit label: família directora de doblatge de @ca
toolkit definition: Expressió que inclou una contribució d’una família en la responsabilitat de la gestió general i la supervisió del procés d’afegir nou diàleg o altres sons per completar una banda sonora. @ca
label: er familie, som er dubbinginstruktør af @da
definition: Relaterer en familie til et udtryk, som omfatter en families bidrag ved at have ansvar for den generelle ledelse af- og tilsyn med processen at tilføje ny dialog eller andre lyde for at fuldstændiggøre et soundtrack. @da
toolkit label: familie, som er dubbinginstruktør af @da
toolkit definition: Udtryk, som omfatter en families bidrag ved at have ansvar for den generelle ledelse af- og tilsyn med processen at tilføje ny dialog eller andre lyde for at fuldstændiggøre et soundtrack. @da
label: dublaaži režissöör (perekond) väljenduses @et
definition: Seostab perekonna väljendusega, millesse perekond on andnud panuse, vastutades väljenduse heliriba täiendamisel uue dialoogi või muude helide lisamise üldise juhtimise ja juhendamise eest. @et
toolkit label: dublaaži režissöör (perekond) väljenduses @et
toolkit definition: Väljendus, millesse perekond on andnud panuse, vastutades väljenduse heliriba täiendamisel uue dialoogi või muude helide lisamise üldise juhtimise ja juhendamise eest. @et
label: ist Familie als Synchronregisseurin/Synchronregisseur von @de
definition: Setzt eine Familie in Beziehung zu einer Expression, zu der eine Familie beiträgt, indem sie für das allgemeine Management und die Leitung beim Hinzufügen von neuem Dialog oder anderen Geräuschen verantwortlich ist, um die Tonspur zu vervollständigen. @de
toolkit label: Familie als Synchronregisseurin/Synchronregisseur von @de
toolkit definition: Eine Expression, zu der eine Familie beiträgt, indem sie für das allgemeine Management und die Leitung beim Hinzufügen von neuem Dialog oder anderen Geräuschen verantwortlich ist, um die Tonspur zu vervollständigen. @de
label: szinkronrendező rendezője a következőnek: @hu
definition: Hozzákapcsol egy családot egy kifejezési formához, amely magában foglalja egy család közreműködését új párbeszéd vagy más hangok hozzáadási folyamatának általános irányításában és felügyeletében egy hangsáv befejezése, teljessé tétele céljából. @hu
toolkit label: szinkronrendező rendezője: @hu
toolkit definition: Egy kifejezési forma, amely magában foglalja egy család közreműködését új párbeszéd vagy más hangok hozzáadási folyamatának általános irányításában és felügyeletében egy hangsáv befejezése, teljessé tétele céljából. @hu
label: è direttore del doppiaggio famiglia di @it
definition: Correla una famiglia a un'espressione che comprende un contributo di una famiglia di responsabilità per la gestione e supervisione generale del processo di aggiunta di nuovi dialoghi o altri suoni per completare una colonna sonora. @it
toolkit label: direttore del doppiaggio famiglia di @it
toolkit definition: Espressione che comprende un contributo di una famiglia di responsabilità per la gestione e supervisione generale del processo di aggiunta di nuovi dialoghi o altri suoni per completare una colonna sonora. @it
label: είναι διευθυντής μεταγλώττισης οικογένεια του @el
toolkit label: διευθυντής μεταγλώττισης οικογένεια του @el
label: est une famille directrice de doublage de @fr
definition: Met une famille en relation avec une expression qui intègre une contribution de la part d’une famille consistant à être responsable de la gestion et de la supervision générales du processus visant à ajouter de nouveaux dialogues ou d’autres sons pour compléter une piste sonore. @fr
toolkit label: famille directrice de doublage de @fr
toolkit definition: Expression qui intègre une contribution de la part d’une famille consistant à être responsable de la gestion et de la supervision générales du processus visant à ajouter de nouveaux dialogues ou d’autres sons pour compléter une piste sonore. @fr
label: ir dublāžas režisors (dzimta/ģimene) @lv
definition: Sasaista dzimtu/ģimeni ar izteiksmi, kas ietver dzimtas/ģimenes ieguldījumu, atbildot par vispārējo vadību un uzraudzību pār jaunu dialogu vai citu skaņu pievienošanu pabeigtam izteiksmes skaņu celiņam. @lv
toolkit label: ir dublāžas režisors (dzimta/ģimene) @lv
toolkit definition: Izteiksme, kas ietver dzimtas/ģimenes ieguldījumu, atbildot par vispārējo vadību un uzraudzību pār jaunu dialogu vai citu skaņu pievienošanu pabeigtam izteiksmes skaņu celiņam. @lv
label: 是……的混声导演家族 @zh-hans
definition: 将一个家族与包括总体管理和监督增加对话或其他声音以完成音轨的一个责任的一个家族的贡献的一种内容表达关联起来。 @zh-hans
toolkit label: ……的混声导演家族 @zh-hans
toolkit definition: 包括总体管理和监督增加对话或其他声音以完成音轨的一个责任的一个家族的贡献的一种内容表达 @zh-hans
label: dublaj yönetmeni ailesidir @tr
definition: Bir aileyi, bir film müziğini tamamlamak için yeni diyalog veya başka seslerin eklenmesi sürecinin genel yönetimi ve denetiminden sorumlu bir ailenin katkısını içeren bir anlatımla ilişkilendirir. @tr
toolkit label: dublaj yönetmeni ailesi @tr
toolkit definition: Bir film müziğini tamamlamak için yeni diyalog veya diğer sesleri ekleme sürecinin genel yönetimi ve denetiminden sorumlu bir ailenin katkısını içeren bir anlatım. @tr
has subproperty: P51064

dubbausohjaaja (henkilö) ekspressiossa
status: Published
label: is dubbing director person of @en
lexical alias: dubbingDirectorPersonOf.en
definition: Relates a person to an expression that includes a contribution by a person of responsibility for the general management and supervision of the process of adding new dialogue or other sounds to complete a soundtrack. @en
toolkit label: dubbing director person of @en
toolkit definition: An expression that includes a contribution by a person of responsibility for the general management and supervision of the process of adding new dialogue or other sounds to complete a soundtrack. @en
type: Property
domain: C10004
has element type: 2
sub property of: esitykseen osallinen henkilö ekspressiossa
sub property of: dubbausohjaaja (toimija) ekspressiossa
definition: Liittää henkilön ekspressioon, jossa henkilö on osallisena uuden dialogin tai muiden äänien lisäämisprosessin yleisessä johtamisessa ja valvonnassa ekspression ääniraidan täydentämiseksi.
toolkit label: dubbausohjaaja (henkilö) ekspressiossa
toolkit definition: Ekspressio, jossa henkilö on osallisena uuden dialogin tai muiden äänien lisäämisprosessin yleisessä johtamisessa ja valvonnassa ekspression ääniraidan täydentämiseksi.
label: er stemmeregissør for (person) @no
definition: Relaterer en person til et uttrykk som inkluderer et bidrag fra en person i form av generell ledelse og tilsyn med prosessen med å legge til ny dialog eller andre lyder for å fullføre et lydspor. @no
toolkit label: stemmeregissør for (person) @no
toolkit definition: Et uttrykk som inkluderer et bidrag fra en person i form av generell ledelse og tilsyn med prosessen med å legge til ny dialog eller andre lyder for å fullføre et lydspor. @no
label: is stemregisseur-persoon van @nl
definition: Relateert een persoon aan een expressie die omvat een bijdrage door een persoon door algeheel beheer en toezicht van het proces van toevoegen van nieuwe dialoog of andere geluiden om een geluidsspoor te completeren. @nl
toolkit label: stemregisseur-persoon van @nl
toolkit definition: Een expressie die omvat een bijdrage door een persoon door algeheel beheer en toezicht van het proces van toevoegen van nieuwe dialoog of andere geluiden om een geluidsspoor te completeren. @nl
label: هو شخص مخرج الدبلجة لـ @ar
definition: يربط شخصا بتعبيرة تتضمن إسهام شخص بتحمل مسئولية الإدارة العامة والإشراف على عملية إضافة حوار جديد أو أصوات أخرى لإكمال مقطع صوتي. @ar
toolkit label: شخص مخرج دبلجة @ar
toolkit definition: تعبيرة تتضمن إسهام شخص بتحمله مسئولية الإدارة العامة والإشراف على عملية إضافة حوار جديد أو أصوات أخرى لإكمال مقطع صوتي. @ar
label: és persona directora de doblatge de @ca
definition: Relaciona una persona amb una expressió que inclou una contribució d’una persona en la responsabilitat de la gestió general i la supervisió del procés d’afegir nou diàleg o altres sons per completar una banda sonora. @ca
toolkit label: persona directora de doblatge de @ca
toolkit definition: Expressió que inclou una contribució d’una persona en la responsabilitat de la gestió general i la supervisió del procés d’afegir nou diàleg o altres sons per completar una banda sonora. @ca
label: er person, som er dubbinginstruktør af @da
definition: Relaterer en person til et udtryk, som omfatter en persons bidrag ved at have ansvar for den generelle ledelse af- og tilsyn med processen at tilføje ny dialog eller andre lyde for at fuldstændiggøre et soundtrack. @da
toolkit label: person, som er dubbinginstruktør af @da
toolkit definition: Udtryk, som omfatter en persons bidrag ved at have ansvar for den generelle ledelse af- og tilsyn med processen at tilføje ny dialog eller andre lyde for at fuldstændiggøre et soundtrack. @da
label: dublaaži režissöör (isik) väljenduses @et
definition: Seostab isiku väljendusega, millesse isik on andnud panuse, vastutades väljenduse heliriba täiendamisel uue dialoogi või muude helide lisamise üldise juhtimise ja juhendamise eest. @et
toolkit label: dublaaži režissöör (isik) väljenduses @et
toolkit definition: Väljendus, millesse isik on andnud panuse, vastutades väljenduse heliriba täiendamisel uue dialoogi või muude helide lisamise üldise juhtimise ja juhendamise eest. @et
label: ist Person als Synchronregisseurin/Synchronregisseur von @de
definition: Setzt eine Person in Beziehung zu einer Expression, zu der eine Person beiträgt, indem sie für das allgemeine Management und die Leitung beim Hinzufügen von neuem Dialog oder anderen Geräuschen verantwortlich ist, um die Tonspur zu vervollständigen. @de
toolkit label: Person als Synchronregisseurin/Synchronregisseur von @de
toolkit definition: Eine Expression, zu der eine Person beiträgt, indem sie für das allgemeine Management und die Leitung beim Hinzufügen von neuem Dialog oder anderen Geräuschen verantwortlich ist, um die Tonspur zu vervollständigen. @de
label: szinkronrendező személye a következőnek: @hu
definition: Hozzákapcsol egy személyt egy kifejezési formához, amely magában foglalja egy személy közreműködését új párbeszéd vagy más hangok hozzáadási folyamatának általános irányításában és felügyeletében egy hangsáv befejezése, teljessé tétele céljából. @hu
toolkit label: szinkronrendező személye: @hu
toolkit definition: Egy kifejezési forma, amely magában foglalja egy személy közreműködését új párbeszéd vagy más hangok hozzáadási folyamatának általános irányításában és felügyeletében egy hangsáv befejezése, teljessé tétele céljából. @hu
label: è direttore del doppiaggio persona di @it
definition: Correla una persona a un'espressione che comprende un contributo di una persona di responsabilità per la gestione e supervisione generale del processo di aggiunta di nuovi dialoghi o altri suoni per completare una colonna sonora. @it
toolkit label: direttore del doppiaggio persona di @it
toolkit definition: Espressione che comprende un contributo di una persona di responsabilità per la gestione e supervisione generale del processo di aggiunta di nuovi dialoghi o altri suoni per completare una colonna sonora. @it
label: είναι διευθυντής μεταγλώττισης φυσικό πρόσωπο του @el
toolkit label: διευθυντής μεταγλώττισης φυσικό πρόσωπο του @el
label: est une personne directrice de doublage de @fr
definition: Met une personne en relation avec une expression qui intègre une contribution de la part d’une personne consistant à être responsable de la gestion et de la supervision générales du processus visant à ajouter de nouveaux dialogues ou d’autres sons pour compléter une piste sonore. @fr
toolkit label: personne directrice de doublage de @fr
toolkit definition: Expression qui intègre une contribution de la part d’une personne consistant à être responsable de la gestion et de la supervision générales du processus visant à ajouter de nouveaux dialogues ou d’autres sons pour compléter une piste sonore. @fr
label: ir dublāžas režisors (persona) @lv
definition: Sasaista personu ar izteiksmi, kas ietver personas ieguldījumu, atbildot par vispārējo vadību un uzraudzību pār jaunu dialogu vai citu skaņu pievienošanu pabeigtam izteiksmes skaņu celiņam. @lv
toolkit label: ir dublāžas režisors (persona) @lv
toolkit definition: Izteiksme, kas ietver personas ieguldījumu, atbildot par vispārējo vadību un uzraudzību pār jaunu dialogu vai citu skaņu pievienošanu pabeigtam izteiksmes skaņu celiņam. @lv
label: 是……的混声导演个人 @zh-hans
definition: 将一个个人与包括总体管理和监督增加对话或其他声音以完成音轨的一个责任的一个个人的贡献的一种内容表达关联起来。 @zh-hans
toolkit label: ……的混声导演个人 @zh-hans
toolkit definition: 包括总体管理和监督增加对话或其他声音以完成音轨的一个责任的一个个人的贡献的一种内容表达 @zh-hans
label: dublaj yönetmeni kişisidir @tr
definition: Bir kişiyi, bir film müziğini tamamlamak için yeni diyalog veya diğer seslerin eklenmesi sürecinin genel yönetimi ve denetiminden sorumlu bir kişinin katkısını içeren bir anlatımla ilişkilendirir. @tr
toolkit label: dublaj yönetmeni @tr
toolkit definition: Bir film müziğini tamamlamak için yeni diyalog veya diğer sesleri ekleme sürecinin genel yönetimi ve denetiminden sorumlu bir kişinin katkısını içeren bir anlatım. @tr
has subproperty: P50611

toimittaja (toimija) ekspressiossa
status: Published
label: is editor agent of @en
lexical alias: editorAgentOf.en
definition: Relates an agent to an expression that includes a contribution by an agent of amending content created by other agents in order to meet standards for publication or other use. @en
toolkit label: editor agent of @en
toolkit definition: An expression that includes a contribution by an agent of amending content created by other agents in order to meet standards for publication or other use. @en
type: Property
domain: C10002
sub property of: yhdistymään osallinen toimija ekspressiossa
has element type: 2
alternative label: editor of @en
scope note: Content includes notated movement, notated music, tactile notated movement, tactile notated music, tactile text, and text. @en
alternative label: editor agent of text of @en
definition: Liittää toimijan ekspressioon, jonka tekemiseen toimija osallistuu tarkistamalla muiden toimijoiden luomaa sisältöä julkaisu- tai muiden käyttöstandardien saavuttamiseksi.
toolkit label: toimittaja (toimija) ekspressiossa
toolkit definition: Ekspressio, jonka tekemiseen toimija osallistuu tarkistamalla muiden toimijoiden luomaa sisältöä julkaisu- tai muiden käyttöstandardien saavuttamiseksi.
label: er redaktør av tekst for (agent) @no
definition: Relaterer en agent til et uttrykk som inkluderer et bidrag fra en agent ved å gjøre endringer i tekst skrevet av andre agenter for å imøtekomme utgivelsesstandarder for sammenheng, tydelighet og stil. @no
alternative label: redaktør av @no
toolkit label: redaktør av tekst for (agent) @no
toolkit definition: Et uttrykk som inkluderer et bidrag fra en agent ved å gjøre endringer i tekst skrevet av andre agenter for å imøtekomme utgivelsesstandarder for sammenheng, tydelighet og stil. @no
label: is redacteur-actor van @nl
definition: Relateert een actor aan een expressie die omvat een bijdrage door een actor door het aanpassen van content gecreëerd door andere actoren met de bedoeling te voldoen aan standaarden voor publicatie of ander gebruik. @nl
toolkit label: redacteur-actor van tekst van @nl
toolkit definition: Een expressie die omvat een bijdrage door een actor door het aanpassen van content gecreëerd door andere actoren met de bedoeling te voldoen aan standaarden voor publicatie of ander gebruik. @nl
label: هو وكيل محرر نص لـ @ar
definition: يربط وكيلا بتعبيرة تتضمن إسهام وكيل في تعديل نص من تأليف وكلاء آخرين من أجل استيفاء معايير النشر مثل الاتساق والوضوح والأسلوب. @ar
alternative label: وكيل محرر لنص @ar
toolkit label: وكيل محرر نص @ar
toolkit definition: تعبيرة تتضمن إسهام وكيل في تعديل نص من تأليف وكلاء آخرين من أجل استيفاء معايير النشر مثل الاتساق والوضوح والأسلوب. @ar
label: és agent editor de text de @ca
definition: Relaciona un agent amb una expressió que inclou una contribució d’un agent esmenant contingut creat per altres agents per tal de complir els estàndards de publicació o un altre ús. @ca
toolkit label: agent editor de text de @ca
toolkit definition: Expressió que inclou una contribució d’un agent esmenant contingut creat per altres agents per tal de complir els estàndards de publicació o un altre ús. @ca
label: er agent, som er redaktør af @da
definition: Relaterer en agent til et udtryk, som omfatter en agents bidrag ved at ændre tekst skabt af andre agenter, for at opfylde publikationsstandarder eller for andet brug. @da
alternative label: er agent, som er redaktør af tekst af @da
toolkit label: agent, som er redaktør af @da
toolkit definition: Udtryk, som omfatter en agents bidrag ved at ændre tekst skabt af andre agenter, for at opfylde publikationsstandarder eller for andet brug. @da
label: tekstitoimetaja (tegija) väljenduses @et
definition: Seostab tegija väljendusega, millesse tegija on andnud panuse, parandades teiste tegijate loodud teksti, et see vastaks loogilisuse, selguse ja stiili poolest avaldamisnõuetele. @et
alternative label: toimetaja väljenduses @et
alternative label: keeletoimetaja väljenduses @et
toolkit label: tekstitoimetaja (tegija) väljenduses @et
toolkit definition: Väljendus, millesse tegija on andnud panuse, parandades teiste tegijate loodud teksti, et see vastaks loogilisuse, selguse ja stiili poolest avaldamisnõuetele. @et
label: ist Akteur als Herausgeberin/Herausgeber von @de
definition: Setzt einen Akteur in Beziehung zu einer Expression, zu der ein Akteur beiträgt, indem er von anderen Akteuren erstellte Inhalte so verändert, dass sie den Standards für die Veröffentlichung oder einer anderweitigen Verwendung entsprechen. @de
toolkit label: Akteur als Herausgeberin/Herausgeber von @de
toolkit definition: Eine Expression, zu der ein Akteur beiträgt, indem er von anderen Akteuren erstellte Inhalte so verändert, dass sie den Standards für die Veröffentlichung oder einer anderweitigen Verwendung entsprechen. @de
label: szerkesztő ágense a következőnek: @hu
definition: Hozzákapcsol egy ágenst egy kifejezési formához, amely magában foglalja egy ágens más ágensek által létrehozott tartalmat módosító közreműködését, hogy az megfeleljen a publikáció és az egyéb felhasználás szabályainak. @hu
toolkit label: szerkesztő ágense: @hu
toolkit definition: Egy kifejezési forma, amely magában foglalja egy ágens más ágensek által létrehozott tartalmat módosító közreműködését, hogy az megfeleljen a publikáció és az egyéb felhasználás szabályainak. @hu
label: è curatore agente di testo di @it
definition: Correla un agente con un'espressione che comprende un contributo di un agente nella correzione di testo creato da altri agenti per raggiungere standard di pubblicazione come uniformità, chiarezza e stile. @it
alternative label: curatore di @it
toolkit label: curatore agente di testo di @it
toolkit definition: Espressione che comprende un contributo di un agente nella correzione di testo creato da altri agenti per soddisfare standard di pubblicazione come uniformità, chiarezza e stile. @it
label: είναι επιμελητής φορέας του κειμένου του @el
alternative label: επιμελητής του @el
toolkit label: επιμελητής φορέας του κειμένου του @el
label: est un agent éditeur intellectuel de @fr
definition: Met un agent en relation avec une expression qui intègre une contribution de la part d’un agent consistant à modifier du contenu créé par d’autres agents afin de répondre à des normes pour la publication ou une autre utilisation. @fr
toolkit label: agent éditeur intellectuel de @fr
toolkit definition: Expression qui intègre une contribution de la part d’un agent consistant à modifier du contenu créé par d’autres agents afin de répondre à des normes pour la publication ou une autre utilisation. @fr
scope note: Content omvat bewegingsnotatie, muzieknotatie, tactiele bewegingsnotatie, tactiele muzieknotatie, tactiele tekst en tekst. @nl
label: ir redaktors (aģents) @lv
definition: Sasaista aģentu ar izteiksmi, kas ietver aģenta ieguldījumu, pielāgojot citu aģentu radīto saturu, lai tas atbilstu publicēšanas vai citādas izmantošanas standartiem. @lv
toolkit label: ir redaktors (aģents) @lv
toolkit definition: Izteiksme, kas ietver aģenta ieguldījumu, pielāgojot citu aģentu radīto saturu, lai tas atbilstu publicēšanas vai citādas izmantošanas standartiem. @lv
scope note: Saturs ir: teksts, kustību pieraksts, notācija, taktils kustības pieraksts, taktila notācija, taktils teksts. @lv
scope note: Sisältöön kuuluvat liikenotaatio, nuottikirjoitus, taktiili liikenotaatio, taktiili nuottikirjoitus, taktiili teksti ja teksti.
scope note: Le contenu comprend le mouvement noté, le mouvement noté tactile, la musique notée, la musique notée tactile, le texte et le texte tactile. @fr
scope note: محتوى يتضمن حركات مدونة، وموسيقى مدونة، حركة مدونة بصورة ملموسة، موسيقى مدونة بصورة ملموسة، ونص ملموس، ونص. @ar
scope note: Indhold inkluderer noteret bevægelse, noteret musik, taktil noteret bevægelse, taktil noteret musik, taktil tekst og tekst. @da
alternative label: Akteur als Herausgeberin/Herausgeber eines Texts von @de
scope note: Darunter fallen Bewegungsnotationen, Noten, Text, taktile Bewegungsnotationen, taktile Noten und taktiler Text. @de
scope note: El contingut inclou moviment notat, música notada, moviment notat tàctil, música notada tàctil, text tàctil i text. @ca
label: 是……的编者行为者 @zh-hans

leikkaaja (toimija) ekspressiossa
status: Published
label: is editor agent of moving image work of @en
definition: Relates an agent to an expression that includes a contribution by an agent of assembling, arranging, and trimming film, video, or other moving image formats, including both visual and audio aspects. @en
type: Property
domain: C10002
sub property of: esitykseen osallinen toimija ekspressiossa
lexical alias: editorAgentOfMovingImageWorkOf.en
label: est un agent monteur d’une œuvre d’images animées de @fr
definition: Met un agent en relation avec une expression qui intègre une contribution de la part d’un agent consistant à assembler, à agencer et à découper du film, de la vidéo ou d’autres formats d’images animées, y compris les aspects visuels et sonores. @fr
toolkit label: agent monteur d’une œuvre d’images animées de @fr
toolkit definition: Expression qui intègre une contribution de la part d’un agent consistant à assembler, à agencer et à découper du film, de la vidéo ou d’autres formats d’images animées, y compris les aspects visuels et sonores. @fr
toolkit label: editor agent of moving image work of @en
toolkit definition: An expression that includes a contribution by an agent of assembling, arranging, and trimming film, video, or other moving image formats, including both visual and audio aspects. @en
instruction number: 18.5
label: είναι επιμελητής φορέας του έργου κινητής εικόνας του @el
definition: Συνδέει έναν φορέα υπεύθυνο για τη συλλογή, επιλογή, οργάνωση και προετοιμασία φιλμ, βίντεο ή άλλων μορφότυπων κινητής εικόνας, περιλαμβανομένων οπτικών και ακουστικών πτυχών, με μια έκφραση. @el
toolkit label: επιμελητής φορέας του έργου κινητής εικόνας του @el
toolkit definition: Μια έκφραση που ενσωματώνει τη συνεισφορά της συλλογής, επιλογής, οργάνωσης και προετοιμασίας φιλμ, βίντεο ή άλλων μορφότυπων κινητής εικόνας, περιλαμβανομένων οπτικών και ακουστικών πτυχών. @el
definition: Setzt einen Akteur in Beziehung zu einer Expression, zu der ein Akteur beiträgt, indem er für das Zusammensetzen, Arrangieren und Nachschneiden von Film-, Video- oder anderen Bewegtbildformaten zuständig ist. Darunter fallen Video- und Audio-Eigenschaften. @de
toolkit label: Akteur als Filmeditorin/Filmeditor von @de
toolkit definition: Eine Expression, zu der ein Akteur beiträgt, indem er für das Zusammensetzen, Arrangieren und Nachschneiden von Film-, Video- oder anderen Bewegtbildformaten zuständig ist. Darunter fallen Video- und Audio-Eigenschaften. @de
label: er agent, som er klipper af levende billedværk af @da
definition: Relaterer en agent til et udtryk, som omfatter en agents bidrag ved at sammensætte, arrangere og klippe film, video eller andre levende billedformater, inkl. både visuelle og lydmæssige aspekter. @da
toolkit label: agent, som er klipper af levende billedværk af @da
toolkit definition: Udtryk, som omfatter en agents bidrag ved at sammensætte, arrangere og klippe film, video eller andre levende billedformater, inkl. både visuelle og lydmæssige aspekter. @da
label: és agent editor d’una obra d’imatge en moviment de @ca
definition: Relaciona un agent amb una expressió que inclou una contribució d’un agent aplegant, arranjant i retallant pel·lícules, vídeos o altres formats d’imatge en moviment, inclosos tant els aspectes visuals com els d’àudio. @ca
toolkit label: agent editor d’una obra d’imatge en moviment de @ca
toolkit definition: Expressió que inclou una contribució d’un agent aplegant, arranjant i retallant pel·lícules, vídeos o altres formats d’imatge en moviment, inclosos tant els aspectes visuals com els d’àudio. @ca
definition: Liittää toimijan ekspressioon, jonka tekemiseen toimija osallistuu elokuvan, videon tai muiden elokuvaformaattien kokoamisessa, järjestämisessä ja leikkauksessa sekä kuvan että äänen osalta.
toolkit label: leikkaaja (toimija) ekspressiossa
toolkit definition: Ekspressio, jonka tekemiseen toimija osallistuu elokuvan, videon tai muiden elokuvaformaattien kokoamisessa, järjestämisessä ja leikkauksessa sekä kuvan että äänen osalta.
toolkit label: redigerer av verk i form av levende bilder (agent) @no
toolkit definition: Et uttrykk som inkluderer et bidrag fra en agent i form av å sette sammen, arrangere og klippe film, video eller andre formater for levende bilder, inkludert både bilde- og lydaspekter. @no
label: ist Akteur als Filmeditorin/Filmeditor von @de
has element type: 2
label: vágó ágense a következő mozgóképműnek: @hu
definition: Hozzákapcsol egy ágenst egy kifejezési formához, amely magában foglal film, videó vagy más mozgóképformátum összeállításával, elrendezésével és vágásával járó közreműködést, beleértve mind a vizuális, mind az audió szempontokat. @hu
toolkit label: vágó ágense a következő mozgóképműnek: @hu
toolkit definition: Egy kifejezési forma, amely magában foglal film, videó vagy más mozgóképformátum összeállításával, elrendezésével és vágásával járó közreműködést, beleértve mind a vizuális, mind az audió szempontokat. @hu
alternative label: editor of moving image work of @en
alternative label: leikkaus
label: er redigerer av verk i form av levende bilder (agent) @no
definition: Relaterer en agent til et uttrykk som inkluderer et bidrag fra en agent i form av å sette sammen, arrangere og klippe film, video eller andre formater for levende bilder, inkludert både bilde- og lydaspekter. @no
alternative label: redigerer av verk i form av levende bilder @no
label: is filmeditor-actor van bewegend beeldwerk van @nl
definition: Relateert een actor aan een expressie die omvat een bijdrage door een actor door samenstellen, arrangeren en couperen van film, video of andere bewegend beeld-vormen, inclusief zowel visuele als geluidaspecten. @nl
toolkit label: filmeditor-actor van bewegend beeldwerk van @nl
toolkit definition: Een expressie die omvat een bijdrage door een actor door samenstellen, arrangeren en couperen van film, video of andere bewegend beeld-vormen, inclusief zowel visuele als geluidaspecten. @nl
label: هو وكيل محرر لعمل صور متحركة لـ @ar
definition: يربط وكيلا بتعبيرة تتضمن إسهام وكيل في تجميع فيلم أو فيديو أو شكل آخر من أشكال الصور المتحركة وترتيبها واقتطاعها، بما في ذلك الجوانب المرئية والمسموعة. @ar
alternative label: محرر لعمل صور متحركة لـ @ar
toolkit label: وكيل محرر لعمل صور متحركة @ar
toolkit definition: تعبيرة تتضمن إسهام وكيل في تجميع فيلم، أو فيديو أو شكل آخر من أشكال الصور المتحركة وترتيبها واقتطاعها، بما في ذلك الجوانب المرئية والمسموعة. @ar
alternative label: editor d’una obra d’imatge en moviment de @ca
alternative label: klipper af levende billedværk af @da
label: filmiteose monteerija (tegija) väljenduses @et
definition: Seostab tegija väljendusega, millesse tegija on andnud panuse, monteerides, järjestades ja lõigates filmist, videost jm liikuvast pildist koosnevaid formaate, hõlmates nii visuaalseid kui ka heli aspekte. @et
alternative label: filmiteose monteerija väljenduses @et
toolkit label: filmiteose monteerija (tegija) väljenduses @et
toolkit definition: Väljendus, millesse tegija on andnud panuse, monteerides, järjestades ja lõigates filmist, videost jm liikuvast pildist koosnevaid formaate, hõlmates nii visuaalseid kui ka heli aspekte. @et
alternative label: vágója a következő mozgóképműnek: @hu
label: è editore agente di opera cinematografica di @it
definition: Correla un agente a un'espressione che comprende contributo da parte di un agente per l'assemblaggio, organizzazione e taglio di film, video o altri formati di immagini in movimento, inclusi gli aspetti sia visivi sia audio. @it
alternative label: editore di film opera di @it
toolkit label: editore agente di opera cinematografica di @it
toolkit definition: Espressione che comprende contributo da parte di un agente per l'assemblaggio, organizzazione e taglio di film, video o altri formati di immagini in movimento, inclusi gli aspetti sia visivi sia audio. @it
alternative label: επιμελητής του έργου κινητής εικόνας του @el
alternative label: monteur d’œuvre d’images animées de @fr
label: ir filmas montāžas redaktors (aģents) @lv
definition: Sasaista aģentu ar izteiksmi, kas ietver aģenta ieguldījumu, montējot, pārkārtojot un saīsinot filmas, video vai citu kustīga attēla formātu, ietverot gan vizuālos, gan audio aspektus. @lv
toolkit label: ir filmas montāžas redaktors (aģents) @lv
toolkit definition: Izteiksme, kas ietver aģenta ieguldījumu, montējot, pārkārtojot un saīsinot filmas, video vai citu kustīga attēla formātu, ietverot gan vizuālos, gan audio aspektus. @lv
alternative label: Filmeditor von @de
alternative label: ……动态图像作品的剪辑师 @zh-hans
toolkit label: ……的动态图像作品的剪辑师行为者 @zh-hans
toolkit definition: 包括对影片、视频或其他动态图像格式（包括视频和音频方面）的汇编、编排和剪辑的一个行为者的贡献的一种内容表达 @zh-hans
toolkit label: hareketli görüntü eserinin editör temsilcisi @tr
toolkit definition: Film, video veya diğer hareketli görüntü formatlarının montajı, düzenlenmesi ve kırpılmasından oluşan, hem görsel hem de işitsel yönleri içeren bir temsilcinin katkısını içeren bir anlatım. @tr
has subproperty: leikkaaja (yhteistoimija) ekspressiossa

toimittaja (yhteistoimija) ekspressiossa
status: Published
label: is editor collective agent of @en
lexical alias: editorCollectiveAgentOf.en
definition: Relates a collective agent to an expression that includes a contribution by a collective agent of amending content created by other agents in order to meet standards for publication or other use. @en
toolkit label: editor collective agent of @en
toolkit definition: An expression that includes a contribution by a collective agent of amending content created by other agents in order to meet standards for publication or other use. @en
type: Property
domain: C10011
has element type: 2
sub property of: yhdistymään osallinen yhteistoimija ekspressiossa
sub property of: toimittaja (toimija) ekspressiossa
scope note: Content includes notated movement, notated music, tactile notated movement, tactile notated music, tactile text, and text. @en
alternative label: editor collective agent of text of @en
definition: Liittää yhteistoimijan ekspressioon, jonka tekemiseen yhteistoimija osallistuu tarkistamalla muiden toimijoiden luomaa sisältöä julkaisu- tai muiden käyttöstandardien saavuttamiseksi.
toolkit label: toimittaja (yhteistoimija) ekspressiossa
toolkit definition: Ekspressio, jonka tekemiseen yhteistoimija osallistuu tarkistamalla muiden toimijoiden luomaa sisältöä julkaisu- tai muiden käyttöstandardien saavuttamiseksi.
label: er redaktør av tekst for (kollektiv agent) @no
definition: Relaterer en kollektiv agent til et uttrykk som inkluderer et bidrag fra en kollektiv agent i form av å å gjøre endringer i tekst skrevet av andre kollektiv agenter for å imøtekomme utgivelsesstandarder for sammenheng, tydelighet og stil. @no
toolkit label: redaktør av tekst for (kollektiv agent) @no
toolkit definition: Et uttrykk som inkluderer et bidrag fra en kollektiv agent i form av å å gjøre endringer i tekst skrevet av andre kollektiv agenter for å imøtekomme utgivelsesstandarder for sammenheng, tydelighet og stil. @no
label: is redacteur-collectieve actor van @nl
definition: Relateert een collectieve actor aan een expressie die omvat een bijdrage door een collectieve actor door aanpassen van tekst gecreëerd door andere actoren met de bedoeling te voldoen aan standaarden voor publiceren of ander gebruik. @nl
toolkit label: redacteur-collectieve actor van tekst van @nl
toolkit definition: Een expressie die omvat een bijdrage door een collectieve actor door aanpassen van tekst gecreëerd door andere actoren met de bedoeling te voldoen aan standaarden voor publiceren of ander gebruik. @nl
label: هو وكيل جماعي محرر نص لـ @ar
definition: يربط وكيلا جماعيا بتعبيرة تتضمن إسهام وكيل جماعي في تعديل نص من تأليف وكلاء آخرين من أجل استيفاء معايير النشر مثل الاتساق والوضوح والأسلوب. @ar
toolkit label: وكيل جماعي محرر نص @ar
toolkit definition: تعبيرة تتضمن إسهام وكيل جماعي في تعديل نص من تأليف وكلاء آخرين من أجل استيفاء معايير النشر مثل الاتساق والوضوح والأسلوب. @ar
label: és agent col·lectiu editor literari de @ca
definition: Relaciona un agent col·lectiu amb una expressió que inclou una contribució d’un agent col·lectiu esmenant contingut creat per altres agents per tal de complir els estàndards de publicació o un altre ús. @ca
toolkit label: agent col·lectiu editor literari de @ca
toolkit definition: Expressió que inclou una contribució d’un agent col·lectiu esmenant contingut creat per altres agents per tal de complir els estàndards de publicació o un altre ús. @ca
label: er kollektiv agent, som er redaktør af tekst af @da
definition: Relaterer en kollektiv agent til et udtryk, som omfatter en kollektiv agents bidrag ved at ændre indhold skabt af andre agenter, for at opfylde publikationsstandarder eller til andet brug. @da
toolkit label: kollektiv agent, som er redaktør @da
toolkit definition: Udtryk, som omfatter en kollektiv agents bidrag ved at ændre indhold skabt af andre agenter, for at opfylde publikationsstandarder eller til andet brug. @da
label: tekstitoimetaja (kollektiiv) väljenduses @et
definition: Seostab kollektiivi väljendusega, millesse kollektiiv on andnud panuse, parandades teiste kollektiivide loodud teksti, et see vastaks loogilisuse, selguse ja stiili poolest avaldamisnõuetele. @et
toolkit label: tekstitoimetaja (kollektiiv) väljenduses @et
toolkit definition: Väljendus, millesse kollektiiv on andnud panuse, parandades teiste kollektiivide loodud teksti, et see vastaks loogilisuse, selguse ja stiili poolest avaldamisnõuetele. @et
label: ist gemeinschaftlicher Akteur als Herausgeberin/Herausgeber von @de
definition: Setzt einen gemeinschaftlicher Akteur in Beziehung zu einer Expression, zu der ein gemeinschaftlicher Akteur beiträgt, indem er von anderen Akteuren erstellte Inhalte so verändert, dass sie den Standards für die Veröffentlichung oder einer anderweitigen Verwendung entsprechen. @de
toolkit label: Gemeinschaftlicher Akteur als Herausgeberin/Herausgeber von @de
toolkit definition: Eine Expression, zu der ein gemeinschaftlicher Akteur beiträgt, indem er von anderen Akteuren erstellte Inhalte so verändert, dass sie den Standards für die Veröffentlichung oder einer anderweitigen Verwendung entsprechen. @de
label: szerkesztő kollektív ágense a következőnek: @hu
definition: Hozzákapcsol egy kollektív ágenst egy kifejezési formához, amely magában foglalja egy kollektív ágens más ágensek által létrehozott tartalmat módosító közreműködését, hogy az megfeleljen a publikáció és az egyéb felhasználás szabályainak. @hu
toolkit label: szerkesztő kollektív ágense: @hu
toolkit definition: Egy kifejezési forma, amely magában foglalja egy kollektív ágens más ágensek által létrehozott tartalmat módosító közreműködését, hogy az megfeleljen a publikáció és az egyéb felhasználás szabályainak. @hu
label: è curatore agente collettivo di testo di @it
definition: Correla un agente collettivo a un'espressione che comprende un contributo di un agente collettivo nella correzione di testo creato da altri agenti collettivi per soddisfare standard di pubblicazione come uniformità, chiarezza e stile. @it
toolkit label: curatore agente collettivo di testo di @it
toolkit definition: Espressione che comprende un contributo di un agente collettivo nella correzione di testo creato da altri agenti collettivi per soddisfare standard di pubblicazione come uniformità, chiarezza e stile. @it
label: είναι επιμελητής συλλογικός φορέας του κειμένου του @el
toolkit label: επιμελητής συλλογικός φορέας του κειμένου του @el
label: est un agent collectif éditeur intellectuel de @fr
definition: Met un agent collectif en relation avec une expression qui intègre une contribution de la part d’un agent collectif consistant à modifier du contenu créé par d’autres agents afin de répondre à des normes pour la publication ou une autre utilisation. @fr
toolkit label: agent collectif éditeur intellectuel de @fr
toolkit definition: Expression qui intègre une contribution de la part d’un agent collectif consistant à modifier du contenu créé par d’autres agents afin de répondre à des normes pour la publication ou une autre utilisation. @fr
scope note: Content omvat bewegingsnotatie, muzieknotatie, tactiele bewegingsnotatie, tactiele muzieknotatie, tactiele tekst en tekst. @nl
label: ir redaktors (grupa) @lv
definition: Sasaista grupu ar izteiksmi, kas ietver grupas ieguldījumu, pielāgojot citu aģentu radīto saturu, lai tas atbilstu publicēšanas vai citādas izmantošanas standartiem. @lv
toolkit label: ir redaktors (grupa) @lv
toolkit definition: Izteiksme, kas ietver grupas ieguldījumu, pielāgojot citu aģentu radīto saturu, lai tas atbilstu publicēšanas vai citādas izmantošanas standartiem. @lv
scope note: Saturs ir: teksts, kustību pieraksts, notācija, taktils kustības pieraksts, taktila notācija, taktils teksts. @lv
scope note: Sisältöön kuuluvat liikenotaatio, nuottikirjoitus, taktiili liikenotaatio, taktiili nuottikirjoitus, taktiili teksti ja teksti.
alternative label: tekstin toimittaja (yhteistoimija) ekspressiossa
scope note: Le contenu comprend le mouvement noté, le mouvement noté tactile, la musique notée, la musique notée tactile, le texte et le texte tactile. @fr
alternative label: agent collectif éditeur intellectuel de texte de @fr
scope note: محتوى يتضمن حركات مدونة، وموسيقى مدونة، حركة مدونة ملموسة، موسيقى مدونة بصورة ملموسة، ونص ملموس، ونص. @ar
alternative label: وكيل جماعي محرر نص @ar
scope note: Indhold omfatter noteret bevægelse, noteret musik, taktil noteret bevægelse, taktil noteret musik og tekst. @da
alternative label: kollektiv agent, som er redaktør af tekst af @da
scope note: Darunter fallen Bewegungsnotationen, Noten, Text, taktile Bewegungsnotationen, taktile Noten und taktiler Text. @de
alternative label: Gemeinschaftlicher Akteur als Herausgeberin/Herausgeber eines Texts von @de
scope note: El contingut inclou moviment notat, música notada, moviment notat tàctil, música notada tàctil, text tàctil i text. @ca
alternative label: agent col·lectiu editor de text de @ca
alternative label: ……的文本的编者集体行为者 @zh-hans
label: 是……的编者集体行为者 @zh-hans
definition: 将一个集体行为者与包括修正其他行为者创作的内容以满足出版标准或其他用途的一个集体行为者的贡献的一种内容表达关联起来。 @zh-hans

leikkaaja (yhteistoimija) ekspressiossa
status: Published
label: is editor collective agent of moving image work of @en
lexical alias: editorCollectiveAgentOfMovingImageWorkOf.en
definition: Relates a collective agent to an expression that includes a contribution by a collective agent of assembling, arranging, and trimming film, video, or other moving image formats, including both visual and audio aspects. @en
toolkit label: editor collective agent of moving image work of @en
toolkit definition: An expression that includes a contribution by a collective agent of assembling, arranging, and trimming film, video, or other moving image formats, including both visual and audio aspects. @en
type: Property
domain: C10011
has element type: 2
sub property of: esitykseen osallinen yhteistoimija ekspressiossa
sub property of: leikkaaja (toimija) ekspressiossa
definition: Liittää yhteistoimijan ekspressioon, jonka tekemisessä yhteistoimija on osallisena elokuvan, videon tai muiden elokuvaformaattien kokoamisessa, järjestämisessä ja leikkauksessa sekä kuvan että äänen osalta.
toolkit label: leikkaaja (yhteistoimija) ekspressiossa
toolkit definition: Ekspressio, jonka tekemisessä yhteistoimija on osallisena elokuvan, videon tai muiden elokuvaformaattien kokoamisessa, järjestämisessä ja leikkauksessa sekä kuvan että äänen osalta.
label: er redaktør av verk i form av levende bilder for (kollektiv agent) @no
definition: Relaterer en kollektiv agent til et uttrykk som inkluderer et bidrag fra en kollektiv agent i form av å sette sammen, arrangere og klippe film, video eller andre formater for levende bilder, inkludert både bilde- og lydaspekter. @no
toolkit label: redaktør av verk i form av levende bilder for (kollektiv agent) @no
toolkit definition: Et uttrykk som inkluderer et bidrag fra en kollektiv agent i form av å sette sammen, arrangere og klippe film, video eller andre formater for levende bilder, inkludert både bilde- og lydaspekter. @no
label: is filmeditor-collectieve actor van bewegend beeldwerk van @nl
definition: Relateert een collectieve actor aan een expressie die omvat een bijdrage door een collectieve actor door samenstellen, arrangeren en couperen van film, video of andere bewegend beeld-vormen, inclusief zowel visuele als geluidaspecten. @nl
toolkit label: filmeditor-collectieve actor van bewegend beeldwerk van @nl
toolkit definition: Een expressie die omvat een bijdrage door een collectieve actor door samenstellen, arrangeren en couperen van film, video of andere bewegend beeld-vormen, inclusief zowel visuele als geluidaspecten. @nl
label: هو وكيل جماعي محرر عمل صور متحركة لـ @ar
definition: يربط وكيلا جماعيا بتعبيرة تتضمن إسهام وكيل جماعي في تجميع فيلم، أو فيديو أو شكل آخر من أشكال الصور المتحركة وترتيبها واقتطاعها، بما في ذلك الجوانب المرئية والمسموعة. @ar
toolkit label: وكيل جماعي محرر لعمل صور متحركة لـ @ar
toolkit definition: يربط وكيلا جماعيا بتعبيرة تتضمن إسهام وكيل جماعي في تجميع فيلم، أو فيديو أو شكل آخر من أشكال الصور المتحركة وترتيبها واقتطاعها، بما في ذلك الجوانب المرئية والمسموعة. @ar
label: és agent col·lectiu editor d’una obra d’imatge en moviment de @ca
definition: Relaciona un agent col·lectiu amb una expressió que inclou una contribució d’un agent col·lectiu d’aplegar, arranjar i retallar pel·lícules, vídeos i altres formats d’imatge en moviment, inclosos tant els aspectes visuals com els d’àudio. @ca
toolkit label: agent col·lectiu editor d’una obra d’imatge en moviment de @ca
toolkit definition: Expressió que inclou una contribució d’un agent col·lectiu d’aplegar, arranjar i retallar pel·lícules, vídeos i altres formats d’imatge en moviment, inclosos tant els aspectes visuals com els d’àudio. @ca
label: er kollektiv agent, som er klipper af levende billedværk af @da
definition: Relaterer en kollektiv agent til et udtryk, som omfatter en kollektiv agents bidrag ved at sammensætte, arrangere og klippe film, video eller andre levende billedformater, inkl. både visuelle og lydmæssige aspekter. @da
toolkit label: kollektiv agent, som er klipper af levende billedværk af @da
toolkit definition: Udtryk, som omfatter en kollektiv agents bidrag ved at sammensætte, arrangere og klippe film, video eller andre levende billedformater, inkl. både visuelle og lydmæssige aspekter. @da
label: filmiteose monteerija (kollektiiv) väljenduses @et
definition: Seostab kollektiivi väljendusega, millesse kollektiiv on andnud panuse, monteerides, järjestades ja lõigates filmist, videost jm liikuvast pildist koosnevaid formaate, hõlmates nii visuaalseid kui ka heli aspekte. @et
toolkit label: filmiteose monteerija (kollektiiv) väljenduses @et
toolkit definition: Väljendus, millesse kollektiiv on andnud panuse, monteerides, järjestades ja lõigates filmist, videost jm liikuvast pildist koosnevaid formaate, hõlmates nii visuaalseid kui ka heli aspekte. @et
label: ist gemeinschaftlicher Akteur als Filmeditorin/Filmeditor von @de
definition: Setzt einen gemeinschaftlichen Akteur in Beziehung zu einer Expression, zu der ein gemeinschaftlicher Akteur beiträgt, indem er für das Zusammensetzen, Arrangieren und Nachschneiden von Film-, Video- oder anderen Bewegtbildformaten zuständig ist. Darunter fallen Video- und Audio-Eigenschaften. @de
toolkit label: Gemeinschaftlicher Akteur als Filmeditorin/Filmeditor von @de
toolkit definition: Eine Expression, zu der ein gemeinschaftlicher Akteur beiträgt, indem er für das Zusammensetzen, Arrangieren und Nachschneiden von Film-, Video- oder anderen Bewegtbildformaten zuständig ist. Darunter fallen Video- und Audio-Eigenschaften. @de
label: vágó kollektív ágense a következő mozgóképműnek: @hu
definition: Hozzákapcsol egy kollektív ágenst egy kifejezési formához, amely magában foglalja egy kollektív ágens film, videó vagy más mozgóképformátum összeállításával, elrendezésével és vágásával járó közreműködését, beleértve mind a vizuális, mind az audió szempontokat. @hu
toolkit label: vágó kollektív ágense a következő mozgóképműnek: @hu
toolkit definition: Egy kifejezési forma, amely magában foglalja egy kollektív ágens film, videó vagy más mozgóképformátum összeállításával, elrendezésével és vágásával járó közreműködését, beleértve mind a vizuális, mind az audió szempontokat. @hu
label: è curatore agente collettivo di opera immagine in movimento di @it
definition: Correla un agente collettivo a un'espressione che comprende un contributo di un agente collettivo per l'assemblaggio, organizzazione e taglio di film, video o altri formati di immagini in movimento, inclusi gli aspetti sia visivi sia audio. @it
toolkit label: curatore agente collettivo di opera immagine in movimento di @it
toolkit definition: Espressione che comprende un contributo di un agente collettivo per l'assemblaggio, organizzazione e taglio di film, video o altri formati di immagini in movimento, inclusi gli aspetti sia visivi sia audio. @it
label: είναι επιμελητής συλλογικός φορέας του έργου κινητής εικόνας του @el
toolkit label: επιμελητής συλλογικός φορέας του έργου κινητής εικόνας του @el
label: est un agent collectif monteur d’une œuvre d’images animées de @fr
definition: Met un agent collectif en relation avec une expression qui intègre une contribution de la part d’un agent collectif consistant à assembler, à agencer et à découper du film, de la vidéo ou d’autres formats d’images animées, y compris les aspects visuels et sonores. @fr
toolkit label: agent collectif monteur d’une œuvre d’images animées de @fr
toolkit definition: Expression qui intègre une contribution de la part d’un agent collectif consistant à assembler, à agencer et à découper du film, de la vidéo ou d’autres formats d’images animées, y compris les aspects visuels et sonores. @fr
label: ir filmas montāžas redaktors (grupa) @lv
definition: Sasaista grupu ar izteiksmi, kas ietver grupas ieguldījumu, montējot, pārkārtojot un saīsinot filmas, video vai citu kustīga attēla formātu, ietverot gan vizuālos, gan audio aspektus. @lv
toolkit label: ir filmas montāžas redaktors (grupa) @lv
toolkit definition: Izteiksme, kas ietver grupas ieguldījumu, montējot, pārkārtojot un saīsinot filmas, video vai citu kustīga attēla formātu, ietverot gan vizuālos, gan audio aspektus. @lv
label: 是……的动态图像作品的剪辑师集体行为者 @zh-hans
definition: 将一个集体行为者与包括对影片、视频或其他动态图像格式（包括视频和音频方面）的汇编、编排和剪辑的一个集体行为者的贡献的一种内容表达关联起来。 @zh-hans
toolkit label: ……的动态图像作品的剪辑师集体行为者 @zh-hans
toolkit definition: 包括对影片、视频或其他动态图像格式（包括视频和音频方面）的汇编、编排和剪辑的一个集体行为者的贡献的一种内容表达 @zh-hans
label: hareketli görüntü eserinin editör kolektif temsilcisidir @tr
definition: Kolektif bir temsilciyi, hem görsel hem de işitsel yönler dahil olmak üzere film, video veya diğer hareketli görüntü formatlarının birleştirilmesi, düzenlenmesi ve kırpılması için kolektif bir temsilcinin katkısını içeren bir anlatımla ilişkilendirir. @tr
toolkit label: hareketli görüntü eserinin editör kolektif temsilcisi @tr
toolkit definition: Hem görsel hem de işitsel yönler dahil olmak üzere, film, video veya diğer hareketli görüntü formatlarını bir araya getiren, düzenleyen ve kırpan kolektif bir temsilcinin katkısını içeren bir anlatım. @tr
has subproperty: leikkaaja (yhteisö) ekspressiossa
has subproperty: leikkaaja (suku) ekspressiossa
has subproperty: P50724

toimittaja (yhteisö) ekspressiossa
status: Published
label: is editor corporate body of @en
lexical alias: editorCorporateBodyOf.en
definition: Relates a corporate body to an expression that includes a contribution by a corporate body of amending content created by other agents in order to meet standards for publication or other use. @en
toolkit label: editor corporate body of @en
toolkit definition: An expression that includes a contribution by a corporate body of amending content created by other agents in order to meet standards for publication or other use. @en
type: Property
domain: C10005
has element type: 2
sub property of: yhdistymään osallinen yhteisö ekspressiossa
sub property of: toimittaja (yhteistoimija) ekspressiossa
scope note: Content includes notated movement, notated music, tactile notated movement, tactile notated music, tactile text, and text. @en
alternative label: editor corporate body of text of @en
definition: Liittää yhteisön ekspressioon, jonka tekemiseen yhteisö osallistuu tarkistamalla muiden toimijoiden luomaa sisältöä julkaisu- tai muiden käyttöstandardien saavuttamiseksi.
toolkit label: toimittaja (yhteisö) ekspressiossa
toolkit definition: Ekspressio, jonka tekemiseen yhteisö osallistuu tarkistamalla muiden toimijoiden luomaa sisältöä julkaisu- tai muiden käyttöstandardien saavuttamiseksi.
label: er redaktør av tekst for (korporasjon) @no
definition: Relaterer en korporasjon til et uttrykk som inkluderer et bidrag fra en korporasjon i form av å å gjøre endringer i tekst skrevet av andre korporasjoner for å imøtekomme utgivelsesstandarder for sammenheng, tydelighet og stil. @no
toolkit label: redaktør av tekst for (korporasjon) @no
toolkit definition: Et uttrykk som inkluderer et bidrag fra en korporasjon i form av å å gjøre endringer i tekst skrevet av andre korporasjoner for å imøtekomme utgivelsesstandarder for sammenheng, tydelighet og stil. @no
label: is redacteur-corporatie van @nl
definition: Relateert een corporatie aan een expressie die omvat een bijdrage door een corporatie door het aanpassen van content gecreëerd door andere actoren met de bedoeling te voldoen aan standaarden voor publicatie of ander gebruik. @nl
toolkit label: redacteur-corporatie van tekst van @nl
toolkit definition: Een expressie die omvat een bijdrage door een corporatie door het aanpassen van content gecreëerd door andere actoren met de bedoeling te voldoen aan standaarden voor publicatie of ander gebruik. @nl
label: هي هيئة مسئولة عن تحرير نص لـ @ar
definition: يربط هيئة بتعبيرة تتضمن إسهام هيئة في تعديل نص من تأليف وكلاء آخرين من أجل استيفاء معايير النشر مثل الاتساق والوضوح والأسلوب. @ar
toolkit label: هيئة مسئولة عن تحرير نص @ar
toolkit definition: تعبيرة تتضمن إسهام هيئة في تعديل نص من تأليف وكلاء آخرين من أجل استيفاء معايير النشر مثل الاتساق والوضوح والأسلوب. @ar
label: és entitat corporativa editora literària de @ca
definition: Relaciona una entitat corporativa amb una expressió que inclou una contribució d’una entitat corporativa esmenant contingut creat per altres agents per tal de complir els estàndards de publicació o d’un un altre ús. @ca
toolkit label: entitat corporativa editora literària de @ca
toolkit definition: Expressió que inclou una contribució d’una entitat corporativa esmenant contingut creat per altres agents per tal de complir els estàndards de publicació o d’un un altre ús. @ca
label: er korporation, som er redaktør af tekst af @da
definition: Relaterer en korporation til et udtryk, som omfatter en korporations bidrag ved at ændre indhold skabt af andre agenter, for at opfylde publikationsstandardereller for andet brug. @da
toolkit label: korporation, som er redaktør af tekst af @da
toolkit definition: Udtryk, som omfatter en korporations bidrag ved at ændre indhold skabt af andre agenter, for at opfylde publikationsstandardereller for andet brug. @da
label: tekstitoimetaja (asutus) väljenduses @et
definition: Seostab asutuse väljendusega, millesse asutus on andnud panuse, parandades teiste asutuste loodud teksti, et see vastaks loogilisuse, selguse ja stiili poolest avaldamisnõuetele. @et
toolkit label: tekstitoimetaja (asutus) väljenduses @et
toolkit definition: Väljendus, millesse asutus on andnud panuse, parandades teiste asutuste loodud teksti, et see vastaks loogilisuse, selguse ja stiili poolest avaldamisnõuetele. @et
label: ist Körperschaft als Herausgeberin/Herausgeber von @de
definition: Setzt eine Körperschaft in Beziehung zu einer Expression, zu der eine Körperschaft beiträgt, indem sie von anderen Akteuren erstellte Inhalte so verändert, dass sie den Standards für die Veröffentlichung oder einer anderweitigen Verwendung entsprechen. @de
toolkit label: Körperschaft als Herausgeberin/Herausgeber von @de
toolkit definition: Eine Expression, zu der eine Körperschaft beiträgt, indem sie von anderen Akteuren erstellte Inhalte so verändert, dass sie den Standards für die Veröffentlichung oder einer anderweitigen Verwendung entsprechen. @de
label: szerkesztő testülete a következő szövegnek: @hu
definition: Hozzákapcsol egy testületet egy kifejezési formához, amely magában foglalja egy testület más ágensek által létrehozott tartalmat módosító közreműködését, hogy az megfeleljen a publikáció és az egyéb felhasználás szabályainak. @hu
toolkit label: szerkesztő testülete a következő szövegnek: @hu
toolkit definition: Egy kifejezési forma, amely magában foglalja egy testület más ágensek által létrehozott tartalmat módosító közreműködését, hogy az megfeleljen a publikáció és az egyéb felhasználás szabályainak. @hu
label: è curatore ente di testo di @it
definition: Correla un ente a un'espressione che comprende un contributo di un ente nella correzione di testo creato da altri enti per soddisfare standard di pubblicazione come uniformità, chiarezza e stile. @it
toolkit label: curatore ente di testo di @it
toolkit definition: Espressione che comprende un contributo di un ente nella correzione di testo creato da altri enti per soddisfare standard di pubblicazione come uniformità, chiarezza e stile. @it
label: είναι επιμελητής συλλογικό όργανο του κειμένου του @el
toolkit label: επιμελητής συλλογικό όργανο του κειμένου του @el
label: est une collectivité éditrice intellectuelle de @fr
definition: Met une collectivité en relation avec une expression qui intègre une contribution de la part d’une collectivité consistant à modifier du contenu créé par d’autres agents afin de répondre à des normes pour la publication ou une autre utilisation. @fr
toolkit label: collectivité éditrice intellectuelle de @fr
toolkit definition: Expression qui intègre une contribution de la part d’une collectivité consistant à modifier du contenu créé par d’autres agents afin de répondre à des normes pour la publication ou une autre utilisation. @fr
scope note: Content omvat bewegingsnotatie, muzieknotatie, tactiele bewegingsnotatie, tactiele muzieknotatie, tactiele tekst en tekst. @nl
label: ir redaktors (institūcija) @lv
definition: Sasaista institūciju ar izteiksmi, kas ietver institūcijas ieguldījumu, pielāgojot citu aģentu radīto saturu, lai tas atbilstu publicēšanas vai citādas izmantošanas standartiem. @lv
toolkit label: ir redaktors (institūcija) @lv
toolkit definition: Izteiksme, kas ietver institūcijas ieguldījumu, pielāgojot citu aģentu radīto saturu, lai tas atbilstu publicēšanas vai citādas izmantošanas standartiem. @lv
scope note: Saturs ir: teksts, kustību pieraksts, notācija, taktils kustības pieraksts, taktila notācija, taktils teksts. @lv
scope note: Sisältöön kuuluvat liikenotaatio, nuottikirjoitus, taktiili liikenotaatio, taktiili nuottikirjoitus, taktiili teksti ja teksti.
alternative label: tekstin toimittaja (yhteisö) ekspressiossa
scope note: Le contenu comprend le mouvement noté, le mouvement noté tactile, la musique notée, la musique notée tactile, le texte et le texte tactile. @fr
alternative label: collectivité éditrice intellectuelle de texte de @fr
scope note: محتوى يتضمن حركات مدونة، وموسيقى مدونة، وحركة مدونة ملموسة، وموسيقى مدونة بصورة ملموسة، ونص ملموس، ونص. @ar
alternative label: هيئة محررة لنص لـ @ar
scope note: Indehold omfatter noteret bevægelse, noteret musik, taktil noteret bevægelse, taktil noteret musik, taktil tekst og tekst. @da
scope note: Darunter fallen Bewegungsnotationen, Noten, Text, taktile Bewegungsnotationen, taktile Noten und taktiler Text. @de
alternative label: Körperschaft als Herausgeberin/Herausgeber eines Texts von @de
scope note: El contingut inclou moviment notat, música notada, moviment notat tàctil, música notada tàctil, text tàctil i text. @ca
alternative label: entitat corporativa editora de text de @ca
alternative label: ……的文本的编者团体 @zh-hans
label: 是……的编者团体 @zh-hans
definition: 将一个团体与包括修正其他行为者创作的内容以满足出版标准或其他用途的一个团体的贡献的一种内容表达关联起来。 @zh-hans
toolkit label: ……的编者团体 @zh-hans

leikkaaja (yhteisö) ekspressiossa
status: Published
label: is editor corporate body of moving image work of @en
lexical alias: editorCorporateBodyOfMovingImageWorkOf.en
definition: Relates a corporate body to an expression that includes a contribution by a corporate body of assembling, arranging, and trimming film, video, or other moving image formats, including both visual and audio aspects. @en
toolkit label: editor corporate body of moving image work of @en
toolkit definition: An expression that includes a contribution by a corporate body of assembling, arranging, and trimming film, video, or other moving image formats, including both visual and audio aspects. @en
type: Property
domain: C10005
has element type: 2
sub property of: esitykseen osallinen yhteisö ekspressiossa
sub property of: leikkaaja (yhteistoimija) ekspressiossa
definition: Liittää yhteisön ekspressioon, jonka tekemisessä yhteisö on osallisena elokuvan, videon tai muiden elokuvaformaattien kokoamisessa, järjestämisessä ja leikkauksessa sekä kuvan että äänen osalta.
toolkit label: leikkaaja (yhteisö) ekspressiossa
toolkit definition: Ekspressio, jonka tekemisessä yhteisö on osallisena elokuvan, videon tai muiden elokuvaformaattien kokoamisessa, järjestämisessä ja leikkauksessa sekä kuvan että äänen osalta.
label: er redaktør av verk i form av levende bilder for (korporasjon) @no
definition: Relaterer en korporasjon til et uttrykk som inkluderer et bidrag fra en korporasjon i form av å sette sammen, arrangere og klippe film, video eller andre formater for levende bilder, inkludert både bilde- og lydaspekter. @no
toolkit label: redaktør av verk i form av levende bilder for (korporasjon) @no
toolkit definition: Et uttrykk som inkluderer et bidrag fra en korporasjon i form av å sette sammen, arrangere og klippe film, video eller andre formater for levende bilder, inkludert både bilde- og lydaspekter. @no
label: is filmeditor-corporatie van bewegend beeldwerk van @nl
definition: Relateert een corporatie aan een expressie die omvat een bijdrage door een corporatie door samenstellen, arrangeren en couperen van film, video of andere bewegend beeld-vormen, inclusief zowel visuele als geluidaspecten. @nl
toolkit label: filmeditor-corporatie van bewegend beeldwerk van @nl
toolkit definition: Een expressie die omvat een bijdrage door een corporatie door samenstellen, arrangeren en couperen van film, video of andere bewegend beeld-vormen, inclusief zowel visuele als geluidaspecten. @nl
label: هي هيئة مسئولة عن تحرير عمل صور متحركة لـ @ar
definition: يربط هيئة بتعبيرة تتضمن إسهام هيئة في تجميع فيلم، أو فيديو أو شكل آخر من أشكال الصور المتحركة وترتيبها واقتطاعها، بما في ذلك الجوانب المرئية والمسموعة. @ar
toolkit label: هيئة مسئولة عن تحرير عمل صور متحركة @ar
toolkit definition: تعبيرة تتضمن إسهام هيئة في تجميع فيلم، أو فيديو أو شكل آخر من أشكال الصور المتحركة وترتيبها واقتطاعها، بما في ذلك الجوانب المرئية والمسموعة. @ar
label: és entitat corporativa editora d’una obra d’imatge en moviment de @ca
definition: Relaciona una entitat corporativa amb una expressió que inclou una contribució d’una entitat corporativa aplegant, arranjant i retallant pel·lícules, vídeos o altres formats d’imatge en moviment, inclosos tant els aspectes visuals com els d’àudio. @ca
toolkit label: entitat corporativa editora d’una obra d’imatge en moviment de @ca
toolkit definition: Expressió que inclou una contribució d’una entitat corporativa aplegant, arranjant i retallant pel·lícules, vídeos o altres formats d’imatge en moviment, inclosos tant els aspectes visuals com els d’àudio. @ca
label: er korporation, som er klipper af levende billedværk af @da
definition: Relaterer en korporation til et udtryk, som omfatter en korporations bidrag ved at sammensætte, arrangere og klippe film, video eller andre levende billedformater, inkl. både visuelle og lydmæssige aspekter. @da
toolkit label: korporation, som er klipper af levende billedværk af @da
toolkit definition: Udtryk, som omfatter en korporations bidrag ved at sammensætte, arrangere og klippe film, video eller andre levende billedformater, inkl. både visuelle og lydmæssige aspekter. @da
label: filmiteose monteerija (asutus) väljenduses @et
definition: Seostab asutuse väljendusega, millesse asutus on andnud panuse, monteerides, järjestades ja lõigates filmist, videost jm liikuvast pildist koosnevaid formaate, hõlmates nii visuaalseid kui ka heli aspekte. @et
toolkit label: filmiteose monteerija (asutus) väljenduses @et
toolkit definition: Väljendus, millesse asutus on andnud panuse, monteerides, järjestades ja lõigates filmist, videost jm liikuvast pildist koosnevaid formaate, hõlmates nii visuaalseid kui ka heli aspekte. @et
label: ist Körperschaft als Filmeditorin/Filmeditor von @de
definition: Setzt eine Körperschaft in Beziehung zu einer Expression, zu der eine Körperschaft beiträgt, indem sie für das Zusammensetzen, Arrangieren und Nachschneiden von Film-, Video- oder anderen Bewegtbildformaten zuständig ist. Darunter fallen Video- und Audio-Eigenschaften. @de
toolkit label: Körperschaft als Filmeditorin/Filmeditor von @de
toolkit definition: Eine Expression, zu der eine Körperschaft beiträgt, indem sie für das Zusammensetzen, Arrangieren und Nachschneiden von Film-, Video- oder anderen Bewegtbildformaten zuständig ist. Darunter fallen Video- und Audio-Eigenschaften. @de
label: vágó testülete a következő mozgóképműnek: @hu
definition: Hozzákapcsol egy testületet egy kifejezési formához, amely magában foglalja egy testület film, videó vagy más mozgóképformátum összeállításával, elrendezésével és vágásával járó közreműködését, beleértve mind a vizuális, mind az audió szempontokat. @hu
toolkit label: vágó testülete a következő mozgóképműnek: @hu
toolkit definition: Egy kifejezési forma, amely magában foglalja egy testület film, videó vagy más mozgóképformátum összeállításával, elrendezésével és vágásával járó közreműködését, beleértve mind a vizuális, mind az audió szempontokat. @hu
label: è curatore ente di opera immagine in movimento di @it
definition: Correla un ente a un'espressione che comprende un contributo di un ente per l'assemblaggio, organizzazione e taglio di film, video o altri formati di immagini in movimento, inclusi gli aspetti sia visivi sia audio. @it
toolkit label: curatore ente di opera immagine in movimento di @it
toolkit definition: Espressione che comprende un contributo di un ente per l'assemblaggio, organizzazione e taglio di film, video o altri formati di immagini in movimento, inclusi gli aspetti sia visivi sia audio. @it
label: είναι επιμελητής συλλογικό όργανο του έργου κινητής εικόνας του @el
toolkit label: επιμελητής συλλογικό όργανο του έργου κινητής εικόνας του @el
label: est une collectivité monteuse d’une œuvre d’images animées de @fr
definition: Met une collectivité en relation avec une expression qui intègre une contribution de la part d’une collectivité consistant à assembler, à agencer et à découper du film, de la vidéo ou d’autres formats d’images animées, y compris les aspects visuels et sonores. @fr
toolkit label: collectivité monteuse d’une œuvre d’images animées de @fr
toolkit definition: Expression qui intègre une contribution de la part d’une collectivité consistant à assembler, à agencer et à découper du film, de la vidéo ou d’autres formats d’images animées, y compris les aspects visuels et sonores. @fr
label: ir filmas montāžas redaktors (institūcija) @lv
definition: Sasaista institūciju ar izteiksmi, kas ietver institūcijas ieguldījumu, montējot, pārkārtojot un saīsinot filmas, video vai citu kustīga attēla formātu, ietverot gan vizuālos, gan audio aspektus. @lv
toolkit label: ir filmas montāžas redaktors (institūcija) @lv
toolkit definition: Izteiksme, kas ietver institūcijas ieguldījumu, montējot, pārkārtojot un saīsinot filmas, video vai citu kustīga attēla formātu, ietverot gan vizuālos, gan audio aspektus. @lv
label: 是……的动态图像作品的剪辑师团体 @zh-hans
definition: 将一个团体与包括对影片、视频或其他动态图像格式（包括视频和音频方面）的汇编、编排和剪辑的一个团体的贡献的一种内容表达关联起来。 @zh-hans
toolkit label: ……的动态图像作品的剪辑师团体 @zh-hans
toolkit definition: 包括对影片、视频或其他动态图像格式（包括视频和音频方面）的汇编、编排和剪辑的一个团体的贡献的一种内容表达 @zh-hans
label: hareketli görüntü eserinin editör tüzel kişisisidir @tr
definition: Bir tüzel kişiyi, hem görsel hem de işitsel yönler dahil olmak üzere film, video veya diğer hareketli görüntü formatlarının birleştirilmesi, düzenlenmesi ve kırpılmasına yönelik bir kurumsal kuruluşun katkısını içeren bir anlatımla ilişkilendirir. @tr
toolkit label: hareketli görüntü eserinin editör tüzel kişisi @tr
toolkit definition: Hem görsel hem de işitsel yönler dahil olmak üzere film, video veya diğer hareketli görüntü formatlarının birleştirilmesi, düzenlenmesi ve kırpılmasına yönelik tüzel bir kişinin katkısını içeren bir anlatım. @tr
has subproperty: P50875

toimittaja (suku) ekspressiossa
status: Published
label: is editor family of @en
lexical alias: editorFamilyOf.en
definition: Relates a family to an expression that includes a contribution by a family of amending content created by other agents in order to meet standards for publication or other use. @en
toolkit label: editor family of @en
toolkit definition: An expression that includes a contribution by a family of amending content created by other agents in order to meet standards for publication or other use. @en
type: Property
domain: C10008
has element type: 2
sub property of: yhdistymään osallinen suku ekspressiossa
sub property of: toimittaja (yhteistoimija) ekspressiossa
scope note: Content includes notated movement, notated music, tactile notated movement, tactile notated music, tactile text, and text. @en
alternative label: editor family of text of @en
definition: Liittää suvun ekspressioon, jonka tekemiseen suku osallistuu tarkistamalla muiden toimijoiden luomaa sisältöä julkaisu- tai muiden käyttöstandardien saavuttamiseksi.
toolkit label: toimittaja (suku) ekspressiossa
toolkit definition: Ekspressio, jonka tekemiseen suku osallistuu tarkistamalla muiden toimijoiden luomaa sisältöä julkaisu- tai muiden käyttöstandardien saavuttamiseksi.
label: er redaktør av tekst for (familie) @no
definition: Relaterer en familie til et uttrykk som inkluderer et bidrag fra en familie i form av å å gjøre endringer i tekst skrevet av andre familieer for å imøtekomme utgivelsesstandarder for sammenheng, tydelighet og stil. @no
toolkit label: redaktør av tekst for (familie) @no
toolkit definition: Et uttrykk som inkluderer et bidrag fra en familie i form av å å gjøre endringer i tekst skrevet av andre familieer for å imøtekomme utgivelsesstandarder for sammenheng, tydelighet og stil. @no
label: is redacteur-familie van @nl
definition: Relateert een familie aan een expressie die omvat een bijdrage door een familie door het aanpassen van content gecreëerd door andere actoren met de bedoeling te voldoen aan standaarden voor publicatie of ander gebruik. @nl
toolkit label: redacteur-familie van tekst van @nl
toolkit definition: Een expressie die omvat een bijdrage door een familie door het aanpassen van content gecreëerd door andere actoren met de bedoeling te voldoen aan standaarden voor publicatie of ander gebruik. @nl
label: هي عائلة مسئولة عن تحرير نص لـ @ar
definition: يربط عائلة بتعبيرة تتضمن إسهام عائلة في تعديل نص من تأليف وكلاء آخرين من أجل استيفاء معايير النشر مثل الاتساق والوضوح والأسلوب. @ar
toolkit label: عائلة مسئولة عن تحرير نص @ar
toolkit definition: تعبيرة تتضمن إسهام عائلة في تعديل نص من تأليف وكلاء آخرين من أجل استيفاء معايير النشر مثل الاتساق والوضوح والأسلوب. @ar
label: és família editora literària de @ca
definition: Relaciona una família amb una expressió que inclou una contribució d’una família esmenant contingut creat per altres agents per tal de complir els estàndards de publicació o un altre ús. @ca
toolkit label: família editora literària de @ca
toolkit definition: Expressió que inclou una contribució d’una família esmenant contingut creat per altres agents per tal de complir els estàndards de publicació o un altre ús. @ca
label: er familie, som er redaktør af tekst af @da
definition: Relaterer en familie til et udtryk, som omfatter en families bidrag ved at ændre indhold skabt af andre familier, for at opfylde publikationsstandarder eller for andet brug. @da
toolkit label: familie, som er redaktør @da
toolkit definition: Udtryk, som omfatter en families bidrag ved at ændre indhold skabt af andre agenter, for at opfylde publikationsstandarder eller for andet brug. @da
label: tekstitoimetaja (perekond) väljenduses @et
definition: Seostab perekonna väljendusega, millesse perekond on andnud panuse, parandades teiste perekondade loodud teksti, et see vastaks loogilisuse, selguse ja stiili poolest avaldamisnõuetele. @et
toolkit label: tekstitoimetaja (perekond) väljenduses @et
toolkit definition: Väljendus, millesse perekond on andnud panuse, parandades teiste perekondade loodud teksti, et see vastaks loogilisuse, selguse ja stiili poolest avaldamisnõuetele. @et
label: ist Familie als Herausgeberin/Herausgeber von @de
definition: Setzt eine Familie in Beziehung zu einer Expression, zu der eine Familie beiträgt, indem sie von anderen Akteuren erstellte Inhalte so verändert, dass sie den Standards für die Veröffentlichung oder einer anderweitigen Verwendung entsprechen. @de
toolkit label: Familie als Herausgeberin/Herausgeber von @de
toolkit definition: Eine Expression, zu der eine Familie beiträgt, indem sie von anderen Akteuren erstellte Inhalte so verändert, dass sie den Standards für die Veröffentlichung oder einer anderweitigen Verwendung entsprechen. @de
label: szerkesztő családja a következőnek: @hu
definition: Hozzákapcsol egy családot egy kifejezési formához, amely magában foglalja egy család más ágensek által létrehozott tartalmat módosító közreműködését, hogy az megfeleljen a publikáció és az egyéb felhasználás szabályainak. @hu
toolkit label: szerkesztő családja: @hu
toolkit definition: Egy kifejezési forma, amely magában foglalja egy család más ágensek által létrehozott tartalmat módosító közreműködését, hogy az megfeleljen a publikáció és az egyéb felhasználás szabályainak. @hu
label: è curatore famiglia di testo di @it
definition: Correla una famiglia a un'espressione che comprende un contributo di una famiglia nella correzione di testo creato da altre famiglie per soddisfare standard di pubblicazione come uniformità, chiarezza e stile. @it
toolkit label: curatore famiglia di testo di @it
toolkit definition: Espressione che comprende un contributo di una famiglia nella correzione di testo creato da altre famiglie per soddisfare standard di pubblicazione come uniformità, chiarezza e stile. @it
label: είναι επιμελήτρια οικογένεια του κειμένου του @el
toolkit label: επιμελήτρια οικογένεια του κειμένου του @el
label: est une famille éditrice intellectuelle de @fr
definition: Met une famille en relation avec une expression qui intègre une contribution de la part d’une famille consistant à modifier du contenu créé par d’autres agents afin de répondre à des normes pour la publication ou une autre utilisation. @fr
toolkit label: famille éditrice intellectuelle de @fr
toolkit definition: Expression qui intègre une contribution de la part d’une famille consistant à modifier du contenu créé par d’autres agents afin de répondre à des normes pour la publication ou une autre utilisation. @fr
scope note: Content omvat bewegingsnotatie, muzieknotatie, tactiele bewegingsnotatie, tactiele muzieknotatie, tactiele tekst en tekst. @nl
label: ir redaktors (dzimta/ģimene) @lv
definition: Sasaista dzimtu/ģimeni ar izteiksmi, kas ietver dzimtas/ģimenes ieguldījumu, pielāgojot citu aģentu radīto saturu, lai tas atbilstu publicēšanas vai citādas izmantošanas standartiem. @lv
toolkit label: ir redaktors (dzimta/ģimene) @lv
toolkit definition: Izteiksme, kas ietver dzimtas/ģimenes ieguldījumu, pielāgojot citu aģentu radīto saturu, lai tas atbilstu publicēšanas vai citādas izmantošanas standartiem. @lv
scope note: Saturs ir: teksts, kustību pieraksts, notācija, taktils kustības pieraksts, taktila notācija, taktils teksts. @lv
scope note: Sisältöön kuuluvat liikenotaatio, nuottikirjoitus, taktiili liikenotaatio, taktiili nuottikirjoitus, taktiili teksti ja teksti.
alternative label: tekstin toimittaja (suku) ekspressiossa
scope note: Le contenu comprend le mouvement noté, le mouvement noté tactile, la musique notée, la musique notée tactile, le texte et le texte tactile. @fr
alternative label: famille éditrice intellectuelle de texte de @fr
scope note: محتوى يتضمن حركات مدونة، وموسيقى مدونة، حركة مدونة بصورة ملموسة، موسيقى مدونة بصورة ملموسة، ونص ملموس، ونص. @ar
alternative label: عائلة محررة لنص لـ @ar
scope note: Indhold omfatter noteret bevægelse, noteret musik, taktil noteret bevægelse, taktil noteret musik og tekst. @da
alternative label: familie, som er redaktør af tekst af @da
scope note: Darunter fallen Bewegungsnotationen, Noten, Text, taktile Bewegungsnotationen, taktile Noten und taktiler Text. @de
alternative label: Familie als Herausgeberin/Herausgeber eines Texts von @de
scope note: El contingut inclou moviment notat, música notada, moviment notat tàctil, música notada tàctil, text tàctil i text. @ca
alternative label: família editora de text de @ca
alternative label: ……的文本的编者家族 @zh-hans
label: 是……的编者家族 @zh-hans
definition: 将一个家族与包括修正其他行为者创作的内容以满足出版标准或其他用途的一个家族的贡献的一种内容表达关联起来。 @zh-hans

leikkaaja (suku) ekspressiossa
status: Published
label: is editor family of moving image work of @en
lexical alias: editorFamilyOfMovingImageWorkOf.en
definition: Relates a family to an expression that includes a contribution by a family of assembling, arranging, and trimming film, video, or other moving image formats, including both visual and audio aspects. @en
toolkit label: editor family of moving image work of @en
toolkit definition: An expression that includes a contribution by a family of assembling, arranging, and trimming film, video, or other moving image formats, including both visual and audio aspects. @en
type: Property
domain: C10008
has element type: 2
sub property of: esitykseen osallinen suku ekspressiossa
sub property of: leikkaaja (yhteistoimija) ekspressiossa
definition: Liittää suvun ekspressioon, jonka tekemisessä suku on osallisena elokuvan, videon tai muiden elokuvaformaattien kokoamisessa, järjestämisessä ja leikkauksessa sekä kuvan että äänen osalta.
toolkit label: leikkaaja (suku) ekspressiossa
toolkit definition: Ekspressio, jonka tekemisessä suku on osallisena elokuvan, videon tai muiden elokuvaformaattien kokoamisessa, järjestämisessä ja leikkauksessa sekä kuvan että äänen osalta.
label: er redaktør av verk i form av levende bilder for (familie) @no
definition: Relaterer en familie til et uttrykk som inkluderer et bidrag fra en familie i form av å sette sammen, arrangere og klippe film, video eller andre formater for levende bilder, inkludert både bilde- og lydaspekter. @no
toolkit label: redaktør av verk i form av levende bilder for (familie) @no
toolkit definition: Et uttrykk som inkluderer et bidrag fra en familie i form av å sette sammen, arrangere og klippe film, video eller andre formater for levende bilder, inkludert både bilde- og lydaspekter. @no
label: is filmeditor-familie van bewegend beeldwerk van @nl
definition: Relateert een familie aan een expressie die omvat een bijdrage door een familie door samenstellen, arrangeren en couperen van film, video of andere bewegend beeld-vormen, inclusief zowel visuele als geluidaspecten. @nl
toolkit label: filmeditor-familie van bewegend beeldwerk van @nl
toolkit definition: Een expressie die omvat een bijdrage door een familie door samenstellen, arrangeren en couperen van film, video of andere bewegend beeld-vormen, inclusief zowel visuele als geluidaspecten. @nl
label: هي عائلة مسئولة عن تحرير عمل صور متحركة لـ @ar
definition: يربط عائلة بتعبيرة تتضمن إسهام عائلة في تجميع فيلم، أو فيديو أو شكل آخر من أشكال الصور المتحركة وترتيبها واقتطاعها، بما في ذلك الجوانب المرئية والمسموعة. @ar
toolkit label: عائلة مسئولة عن تحرير عمل صور متحركة @ar
toolkit definition: تعبيرة تتضمن إسهام عائلة في تجميع فيلم، أو فيديو أو شكل آخر من أشكال الصور المتحركة وترتيبها واقتطاعها، بما في ذلك الجوانب المرئية والمسموعة. @ar
label: és família editora d’una obra d’imatge en moviment de @ca
definition: Relaciona una família amb una expressió que inclou una contribució d’una família aplegant, arranjant i retallant pel·lícules, vídeos o altres formats d’imatge en moviment, inclosos tant els aspectes visuals com els d’àudio. @ca
toolkit label: família editora d’una obra d’imatge en moviment de @ca
toolkit definition: Expressió que inclou una contribució d’una família aplegant, arranjant i retallant pel·lícules, vídeos o altres formats d’imatge en moviment, inclosos tant els aspectes visuals com els d’àudio. @ca
label: er familie, som er klipper af levende billedværk af @da
definition: Relaterer en familie til et udtryk, som omfatter en families bidrag ved at sammensætte, arrangere og klippe film, video eller andre levende billedformater, inkl. både visuelle og lydmæssige aspekter. @da
toolkit label: familie, som er klipper af levende billedværk af @da
toolkit definition: Udtryk, som omfatter en families bidrag ved at sammensætte, arrangere og klippe film, video eller andre levende billedformater, inkl. både visuelle og lydmæssige aspekter. @da
label: filmiteose monteerija (perekond) väljenduses @et
definition: Seostab perekonna väljendusega, millesse perekond on andnud panuse, monteerides, järjestades ja lõigates filmist, videost jm liikuvast pildist koosnevaid formaate, hõlmates nii visuaalseid kui ka heli aspekte. @et
toolkit label: filmiteose monteerija (perekond) väljenduses @et
toolkit definition: Väljendus, millesse perekond on andnud panuse, monteerides, järjestades ja lõigates filmist, videost jm liikuvast pildist koosnevaid formaate, hõlmates nii visuaalseid kui ka heli aspekte. @et
label: ist Familie als Filmeditorin/Filmeditor von @de
definition: Setzt eine Familie in Beziehung zu einer Expression, zu der eine Familie beiträgt, indem sie für das Zusammensetzen, Arrangieren und Nachschneiden von Film-, Video- oder anderen Bewegtbildformaten zuständig ist. Darunter fallen Video- und Audio-Eigenschaften. @de
toolkit label: Familie als Filmeditorin/Filmeditor von @de
toolkit definition: Eine Expression, zu der eine Familie beiträgt, indem sie für das Zusammensetzen, Arrangieren und Nachschneiden von Film-, Video- oder anderen Bewegtbildformaten zuständig ist. Darunter fallen Video- und Audio-Eigenschaften. @de
label: vágó családja a következő mozgóképműnek: @hu
definition: Hozzákapcsol egy családot egy kifejezési formához, amely magában foglalja egy család film, videó vagy más mozgóképformátum összeállításával, elrendezésével és vágásával járó közreműködését, beleértve mind a vizuális, mind az audió szempontokat. @hu
toolkit label: mozgóképforrás vágó családja: @hu
toolkit definition: Egy kifejezési forma, amely magában foglalja egy család film, videó vagy más mozgóképformátum összeállításával, elrendezésével és vágásával járó közreműködését, beleértve mind a vizuális, mind az audió szempontokat. @hu
label: è curatore famiglia di opera immagine in movimento di @it
definition: Correla una famiglia a un'espressione che comprende un contributo di una famiglia per l'assemblaggio, organizzazione e taglio di film, video o altri formati di immagini in movimento, inclusi gli aspetti sia visivi sia audio. @it
toolkit label: curatore famiglia di opera immagine in movimento di @it
toolkit definition: Espressione che comprende un contributo di una famiglia per l'assemblaggio, organizzazione e taglio di film, video o altri formati di immagini in movimento, inclusi gli aspetti sia visivi sia audio. @it
label: είναι επιμελητής οικογένεια του έργου κινητής εικόνας του @el
toolkit label: επιμελητής οικογένεια του έργου κινητής εικόνας του @el
label: est une famille monteuse d’une œuvre d’images animées de @fr
definition: Met une famille en relation avec une expression qui intègre une contribution de la part d’une famille consistant à assembler, à agencer et à découper du film, de la vidéo ou d’autres formats d’images animées, y compris les aspects visuels et sonores. @fr
toolkit label: famille monteuse d’une œuvre d’images animées de @fr
toolkit definition: Expression qui intègre une contribution de la part d’une famille consistant à assembler, à agencer et à découper du film, de la vidéo ou d’autres formats d’images animées, y compris les aspects visuels et sonores. @fr
label: ir filmas montāžas redaktors (dzimta/ģimene) @lv
definition: Sasaista dzimtu/ģimeni ar izteiksmi, kas ietver dzimtas/ģimenes ieguldījumu, montējot, pārkārtojot un saīsinot filmas, video vai citu kustīga attēla formātu, ietverot gan vizuālos, gan audio aspektus. @lv
toolkit label: ir filmas montāžas redaktors (dzimta/ģimene) @lv
toolkit definition: Izteiksme, kas ietver dzimtas/ģimenes ieguldījumu, montējot, pārkārtojot un saīsinot filmas, video vai citu kustīga attēla formātu, ietverot gan vizuālos, gan audio aspektus. @lv
label: 是……的动态图像作品的剪辑师家族 @zh-hans
definition: 将一个家族与包括对影片、视频或其他动态图像格式（包括视频和音频方面）的汇编、编排和剪辑的一个价值的贡献的一种内容表达关联起来。 @zh-hans
toolkit label: ……的动态图像作品的剪辑师家族 @zh-hans
toolkit definition: 包括对影片、视频或其他动态图像格式（包括视频和音频方面）的汇编、编排和剪辑的一个价值的贡献的一种内容表达 @zh-hans
label: hareketli görüntü eserinin editor ailesidir @tr
definition: Bir aileyi, film, video veya diğer hareketli görüntü formatlarının hem görsel hem de işitsel yönleri de dahil olmak üzere bir araya getirilmesi, düzenlenmesi ve kırpılmasından oluşan bir ailenin katkısını içeren anlatımla ilişkilendirir. @tr
toolkit label: hareketli görüntü eserinin editör ailesi @tr
toolkit definition: Film, video veya diğer hareketli görüntü formatlarının montajı, düzenlenmesi ve kırpılmasından oluşan, hem görsel hem de işitsel yönleri içeren bir ailenin katkısını içeren bir anlatım. @tr
has subproperty: P51026

toimituspäällikkö (toimija) teoksessa
status: Published
type: Property
label: is editorial director agent of @en
lexical alias: editorialDirectorAgentOf.en
domain: C10002
toolkit label: editorial director agent of @en
toolkit definition: A work that involves a legal or intellectual responsibility, but not creative responsibility, of an agent for the editorial policy and content of a diachronic work. @en
see also: toimittajana aineistossa
instruction number: 18.5
definition: Relates an agent to a work that involves a legal or intellectual responsibility, but not creative responsibility, of an agent for the editorial policy and content of a diachronic work. @en
sub property of: toimijaan liittyvä teos
label: είναι διευθυντής σύνταξης φορέας του @el
definition: Συνδέει έναν φορέα με ένα έργο που περιλαμβάνει μια νομική ή πνευματική ευθύνη, αλλά όχι μια δημιουργική ευθύνη, ενός φορέα για την πολιτική της σύνταξης και το περιεχόμενο ενός διαχρονικού έργου. @el
toolkit label: διευθυντής σύνταξης φορέας του @el
toolkit definition: Ένα έργο που περιλαμβάνει τη νομική ή/και πνευματική ευθύνη, άλλη από τη δημιουργία, για το περιεχόμενο ενός περιοδικού, ενσωματωμένου πόρου ή πολυμερούς μονογραφίας. @el
definition: Setzt einen Akteur in Beziehung zu einem Werk, bei dem ein Akteur die rechtliche oder intellektuelle, aber keine kreative, Verantwortung für die redaktionelle Vorgehensweise und den Inhalt eines diachronen Werks trägt. @de
scope note: Überarbeitungen, Erläuterungen usw. in einer Expression eines Werks sind hiervon ausgenommen. @de
toolkit label: Akteur als Chefredakteurin/Chefredakteur von @de
toolkit definition: Ein Werk, bei dem ein Akteur die rechtliche oder intellektuelle, aber keine kreative, Verantwortung für die redaktionelle Vorgehensweise und den Inhalt eines diachronen Werks trägt. @de
label: er agent, som er ansvarshavende redaktør af @da
definition: Relaterer en agent til et værk, som involverer en agents juridiske eller intellektuelle ansvar, men ikke skabelsesansvar, for et diakronisk værks redaktionelle linje og indhold. @da
toolkit label: agent, som er ansvarshavende redaktør af @da
toolkit definition: Værk, som involverer en agents juridiske eller intellektuelle ansvar, men ikke skabelsesansvar, for et diakronisk værks redaktionelle linje og indhold. @da
label: és agent director editorial de @ca
definition: Relaciona un agent amb una obra que implica una responsabilitat legal o intel·lectual, però no una responsabilitat creativa, d’un agent en la política editorial i el contingut d’una obra diacrònica. @ca
toolkit label: agent director editorial de @ca
toolkit definition: Obra que implica una responsabilitat legal o intel·lectual, però no una responsabilitat creativa, d’un agent en la política editorial i el contingut d’una obra diacrònica. @ca
definition: Liittää toimijan teokseen, jossa toimija on juridisesti tai tiedollisesti muttei luovasti vastuussa diakronisen teoksen toimituslinjasta ja sisällöstä.
toolkit label: toimituspäällikkö (toimija) teoksessa
toolkit definition: Teos, jossa toimija on juridisesti tai tiedollisesti muttei luovasti vastuussa diakronisen teoksen toimituslinjasta ja sisällöstä.
toolkit label: redaksjonssjef for (agent) @no
toolkit definition: Et verk som involverer juridisk eller intellektuelt ansvar, bortsett fra kreativt ansvar, for en agent i form av de redaksjonelle retningslinjene og innholdet i et diakronisk verk. @no
label: ist Akteur als Chefredakteurin/Chefredakteur von @de
label: est un agent directeur de publication de @fr
definition: Met un agent en relation avec une œuvre qui comporte une responsabilité légale ou intellectuelle, mais non une responsabilité créative, de la part d’un agent en ce qui concerne la politique éditoriale et le contenu d’une œuvre diachronique. @fr
toolkit label: agent directeur de publication de @fr
toolkit definition: Œuvre qui comporte une responsabilité légale ou intellectuelle, mais non une responsabilité créative, de la part d’un agent en ce qui concerne la politique éditoriale et le contenu d’une œuvre diachronique. @fr
has element type: 2
label: főszerkesztő ágense a következőnek: @hu
definition: Egy mű, amely magában foglalja egy ágens jogi vagy szellemi, de nem alkotói felelősségét egy diakronikus mű szerkesztési politikájáért és tartalmáért. @hu
toolkit label: Hozzákapcsol egy ágenst egy műhöz, amely magában foglalja egy ágens jogi vagy szellemi, de nem alkotói felelősségét egy diakronikus mű szerkesztési politikájáért és tartalmáért. @hu
toolkit definition: főszerkesztő ágense: @hu
alternative label: editorial director of @en
alternative label: toimituspäällikkönä teoksessa
label: er redaksjonssjef for (agent) @no
definition: Relaterer en agent til et verk som involverer juridisk eller intellektuelt ansvar, bortsett fra kreativt ansvar, for en agent i form av de redaksjonelle retningslinjene og innholdet i et diakronisk verk. @no
alternative label: redaksjonssjef for @no
label: is hoofdredacteur-actor van @nl
definition: Relateert een actor aan een werk dat met zich meebrengt een wettelijke of intellectuele verantwoordelijkheid, maar niet creatieve verantwoordelijkheid, van een actor voor redactioneel beleid en content van een diachronisch werk. @nl
toolkit label: hoofdredacteur-actor van @nl
toolkit definition: Een werk dat met zich meebrengt een wettelijke of intellectuele verantwoordelijkheid, maar niet creatieve verantwoordelijkheid, van een actor voor redactioneel beleid en content van een diachronisch werk. @nl
label: هو وكيل مدير تحرير لـ @ar
definition: يربط وكيلا بعمل يترتب عليه تحمل وكيل المسئولية القانونية أو الفكرية، وليس إبداعية عن السياسة التحريرية وعن محتوى عمل ممتد زمنيا. @ar
alternative label: مدير تحرير @ar
toolkit label: وكيل مدير تحرير @ar
toolkit definition: عمل يترتب عليه تحمل وكيل المسئولية القانونية أو الفكرية، وليس إبداعية مسئول عن السياسة التحريرية ومحتوى عمل ممتد زمنيا. @ar
alternative label: director editorial de @ca
alternative label: ansvarshavende redaktør af @da
label: peatoimetaja (tegija) teoses @et
definition: Seostab tegija teosega, mis sisaldab tegija juriidilist või intellektuaalset, kuid mitte loomingulist vastutust diakroonilise teose toimetamispõhimõtete ja sisu eest. @et
alternative label: peatoimetaja teoses @et
toolkit label: peatoimetaja (tegija) teoses @et
toolkit definition: Teos, mis sisaldab tegija juriidilist või intellektuaalset, kuid mitte loomingulist vastutust diakroonilise teose toimetamispõhimõtete ja sisu eest. @et
label: è agente direttore eagente ditoriale agente di @it
definition: Correla un agente a un'opera che implica una responsabilità legale o intellettuale, ma non una responsabilità creativa, di un agente relativamente alla politica editoriale e al contenuto di un'opera diacronica. @it
alternative label: direttore editoriale di @it
toolkit label: direttore editoriale agente di @it
toolkit definition: Opera che implica una responsabilità legale o intellettuale, ma non una responsabilità creativa, di un agente relativamente alla politica editoriale e al contenuto di un'opera diacronica. @it
alternative label: διευθυντής σύνταξης του @el
alternative label: directeur de publication de @fr
label: ir galvenais redaktors (aģents) @lv
toolkit label: ir galvenais redaktors (aģents) @lv
toolkit definition: Darbs, kas ietver aģenta juridisku vai intelektuālu, bet ne radošu, atbildību par diahroniskā darba izdošanas politiku un saturu. @lv
definition: Sasaista aģentu ar darbu, kas ietver aģenta juridisku vai intelektuālu, bet ne radošu, atbildību par diahroniskā darba izdošanas politiku un saturu. @lv
alternative label: Chefredakteur von @de
alternative label: ……的主编 @zh-hans
label: 是……的主编行为者 @zh-hans
toolkit label: ……的主编行为者 @zh-hans
toolkit definition: 涉及一个行为者对一种历时作品的编辑政策和内容的法律或知识责任（但非创作责任）的一种作品 @zh-hans
toolkit label: yayın yönetmeni temsilcisi @tr

toimituspäällikkö (yhteistoimija) teoksessa
status: Published
label: is editorial director collective agent of @en
lexical alias: editorialDirectorCollectiveAgentOf.en
definition: Relates a collective agent to a work that involves a legal or intellectual responsibility, but not creative responsibility, of a collective agent for the editorial policy and content of a diachronic work. @en
toolkit label: editorial director collective agent of @en
toolkit definition: A work that involves a legal or intellectual responsibility, but not creative responsibility, of a collective agent for the editorial policy and content of a diachronic work. @en
type: Property
domain: C10011
has element type: 2
sub property of: yhteistoimijaan liittyvä teos
sub property of: toimituspäällikkö (toimija) teoksessa
definition: Liittää yhteistoimijan teokseen, jossa yhteistoimija on juridisesti tai tiedollisesti muttei luovasti vastuussa diakronisen teoksen toimituslinjasta ja sisällöstä.
toolkit label: toimituspäällikkö (yhteistoimija) teoksessa
toolkit definition: Teos, jossa yhteistoimija on juridisesti tai tiedollisesti muttei luovasti vastuussa diakronisen teoksen toimituslinjasta ja sisällöstä.
label: er redaksjonssjef for (kollektiv agent) @no
definition: Relaterer en kollektiv agent til et verk som involverer juridisk eller intellektuelt ansvar, bortsett fra kreativt ansvar, for det redaksjonelle innholdet i et diakronisk verk. @no
toolkit label: redaksjonssjef for (kollektiv agent) @no
toolkit definition: Et verk som involverer juridisk eller intellektuelt ansvar, bortsett fra kreativt ansvar, for det redaksjonelle innholdet i et diakronisk verk. @no
label: is hoofdredacteur-collectieve actor van @nl
definition: Relateert een collectieve actor aan een werk dat met zich meebrengt een wettelijke of intellectuele verantwoordelijkheid, maar niet creatieve verantwoordelijkheid, van een collectieve actor voor redactioneel beleid en content van een diachronisch werk. @nl
toolkit label: hoofdredacteur-collectieve actor van @nl
toolkit definition: Een werk dat met zich meebrengt een wettelijke of intellectuele verantwoordelijkheid, maar niet creatieve verantwoordelijkheid, van een collectieve actor voor redactioneel beleid en content van een diachronisch werk. @nl
label: هو وكيل جماعي مدير تحرير لـ @ar
definition: يربط وكيلا جماعيا بعمل يترتب عليه تحمل وكيل جماعي المسئولية القانونية أو الفكرية، وليس الإبداعية عن السياسة التحريرية وعن محتوى عمل ممتد زمنيا. @ar
toolkit label: وكيل جماعي مدير تحرير @ar
toolkit definition: عمل يترتب عليه تحمل وكيل جماعي المسئولية القانونية أو الفكرية، وليس الإبداعية عن السياسة التحريرية وعن محتوى عمل ممتد زمنيا. @ar
label: és agent col·lectiu director editorial de @ca
definition: Relaciona un agent col·lectiu amb una obra que implica una responsabilitat legal o intel·lectual, però no una responsabilitat creativa, d’un agent col·lectiu en la política i el contingut editorial d’una obra diacrònica. @ca
toolkit label: agent col·lectiu director editorial de @ca
toolkit definition: Obra que implica una responsabilitat legal o intel·lectual, però no una responsabilitat creativa, d’un agent col·lectiu en la política i el contingut editorial d’una obra diacrònica. @ca
label: er kollektiv agent, som er ansvarshavende redaktør af @da
definition: Relaterer en kollektiv agent til et værk, som involverer en kollektiv agents juridiske eller intellektuelle ansvar, men ikke skabelsesansvar, for et diakronisk værks redaktionelle linje og indhold. @da
toolkit label: kollektiv agent, som er ansvarshavende redaktør af @da
toolkit definition: Værk, som involverer en kollektiv agents juridiske eller intellektuelle ansvar, men ikke skabelsesansvar, for et diakronisk værks redaktionelle linje og indhold. @da
label: peatoimetaja (kollektiiv) teoses @et
definition: Seostab kollektiivi teosega, mis sisaldab kollektiivi juriidilist või intellektuaalset, kuid mitte loomingulist vastutust diakroonilise teose toimetamispõhimõtete ja sisu eest. @et
toolkit label: peatoimetaja (kollektiiv) teoses @et
toolkit definition: Teos, mis sisaldab kollektiivi juriidilist või intellektuaalset, kuid mitte loomingulist vastutust diakroonilise teose toimetamispõhimõtete ja sisu eest. @et
label: ist gemeinschaftlicher Akteur als Chefredakteurin/Chefredakteur von @de
definition: Setzt einen gemeinschaftlichen Akteur in Beziehung zu einem Werk, bei dem ein gemeinschaftlicher Akteur die rechtliche oder intellektuelle, aber keine kreative, Verantwortung für die redaktionelle Vorgehensweise und den Inhalt eines diachronen Werks trägt. @de
toolkit label: Gemeinschaftlicher Akteur als Chefredakteurin/Chefredakteur von @de
toolkit definition: Ein Werk, bei dem ein gemeinschaftlicher Akteur die rechtliche oder intellektuelle, aber keine kreative, Verantwortung für die redaktionelle Vorgehensweise und den Inhalt eines diachronen Werks trägt. @de
label: főszerkesztő kollektív ágense a következőnek: @hu
definition: Hozzákapcsol egy kollektív ágenst egy műhöz, amely magában foglalja egy kollektív ágens jogi vagy szellemi, de nem alkotói felelősségét egy diakronikus mű szerkesztési politikájáért és tartalmáért. @hu
toolkit label: főszerkesztő kollektív ágense: @hu
toolkit definition: Egy mű, amely magában foglalja egy kollektív ágens jogi vagy szellemi, de nem alkotói felelősségét egy diakronikus mű szerkesztési politikájáért és tartalmáért. @hu
label: è direttore editoriale agente collettivo di @it
definition: Correla un agente collettivo a un'opera che implica una responsabilità legale o intellettuale, ma non una responsabilità creativa, di un agente collettivo nella politica editoriale e contenuto di un'opera diacronica. @it
toolkit label: direttore editoriale agente collettivo di @it
toolkit definition: Opera che implica una responsabilità legale o intellettuale, ma non una responsabilità creativa, di un agente collettivo nella politica editoriale e contenuto di un'opera diacronica. @it
label: είναι διευθυντής σύνταξης συλλογικός φορέας του @el
toolkit label: διευθυντής σύνταξης συλλογικός φορέας του @el
label: est un agent collectif directeur de publication de @fr
definition: Met un agent collectif en relation avec une œuvre qui comporte une responsabilité légale ou intellectuelle, mais non une responsabilité créative, de la part d’un agent collectif en ce qui concerne la politique éditoriale et le contenu d’une œuvre diachronique. @fr
toolkit label: agent collectif directeur de publication de @fr
toolkit definition: Œuvre qui comporte une responsabilité légale ou intellectuelle, mais non une responsabilité créative, de la part d’un agent collectif en ce qui concerne la politique éditoriale et le contenu d’une œuvre diachronique. @fr
label: ir galvenais redaktors (grupa) @lv
definition: Sasaista grupu ar darbu, kas ietver grupas juridisku vai intelektuālu, bet ne radošu, atbildību par diahroniskā darba izdošanas politiku un saturu. @lv
toolkit label: ir galvenais redaktors (grupa) @lv
toolkit definition: Darbs, kas ietver grupas juridisku vai intelektuālu, bet ne radošu, atbildību par diahroniskā darba izdošanas politiku un saturu. @lv
label: 是……的主编集体行为者 @zh-hans
definition: 将一个集体行为者与涉及一个集体行为者对一种历时作品的编辑政策和内容的法律或知识责任（但非创作责任）的一种作品关联起来。 @zh-hans
toolkit label: ……的主编集体行为者 @zh-hans
toolkit definition: 涉及一个集体行为者对一种历时作品的编辑政策和内容的法律或知识责任（但非创作责任）的一种作品 @zh-hans
label: yayın yönetmeni kolektif temsilcisidir @tr
definition: Kolektif bir temsilciyi, artzamanlı bir eserin yayın politikası ve içeriği için kolektif bir temsilcinin yasal veya entelektüel sorumluluğunu içeren, ancak yaratıcı sorumluluğunu içermeyen bir eserle ilişkilendirir. @tr
toolkit label: yayın yönetmeni kolektif temsilcisi @tr
toolkit definition: Artzamanlı bir eserin yayın politikası ve içeriği için kolektif bir temsilcinin yasal veya entelektüel sorumluluğunu içeren, ancak yaratıcı sorumluluğunu içermeyen bir eser. @tr
has subproperty: toimituspäällikkö (yhteisö) teoksessa
has subproperty: toimituspäällikkö (suku) teoksessa
has subproperty: P50675

toimituspäällikkö (yhteisö) teoksessa
status: Published
label: is editorial director corporate body of @en
lexical alias: editorialDirectorCorporateBodyOf.en
definition: Relates a corporate body to a work that involves a legal or intellectual responsibility, but not creative responsibility, of a corporate body for the editorial policy and content of a diachronic work. @en
toolkit label: editorial director corporate body of @en
toolkit definition: A work that involves a legal or intellectual responsibility, but not creative responsibility, of a corporate body for the editorial policy and content of a diachronic work. @en
type: Property
domain: C10005
has element type: 2
sub property of: teoksen tekijä (yhteisö) teoksessa
sub property of: toimituspäällikkö (yhteistoimija) teoksessa
definition: Liittää yhteisön teokseen, jossa yhteisö on juridisesti tai tiedollisesti muttei luovasti vastuussa diakronisen teoksen toimituslinjasta ja sisällöstä.
toolkit label: toimituspäällikkö (yhteisö) teoksessa
toolkit definition: Teos, jossa yhteisö on juridisesti tai tiedollisesti muttei luovasti vastuussa diakronisen teoksen toimituslinjasta ja sisällöstä.
label: er redaksjonssjef for (korporasjon) @no
definition: Relaterer en korporasjon til et verk som involverer juridisk eller intellektuelt ansvar, bortsett fra kreativt ansvar, for det redaksjonelle innholdet i et diakronisk verk. @no
toolkit label: redaksjonssjef for (korporasjon) @no
toolkit definition: Et verk som involverer juridisk eller intellektuelt ansvar, bortsett fra kreativt ansvar, for det redaksjonelle innholdet i et diakronisk verk. @no
label: is hoofdredacteur-corporatie van @nl
definition: Relateert een corporatie aan een werk dat met zich meebrengt een wettelijke of intellectuele verantwoordelijkheid, maar niet creatieve verantwoordelijkheid, van een corporatie voor redactioneel beleid en content van een diachronisch werk. @nl
toolkit label: hoofdredacteur-corporatie van @nl
toolkit definition: Een werk dat met zich meebrengt een wettelijke of intellectuele verantwoordelijkheid, maar niet creatieve verantwoordelijkheid, van een corporatie voor redactioneel beleid en content van een diachronisch werk. @nl
label: هي هيئة مسئولة عن إدارة التحرير لـ @ar
definition: يربط هيئة بعمل يترتب عليه تحمل هيئة المسئولية القانونية أو الفكرية، وليس الإبداعية عن السياسة التحريرية وعن محتوى عمل ممتد زمنيا. @ar
toolkit label: هيئة مسئولة عن إدارة التحرير @ar
toolkit definition: عمل يترتب عليه تحمل هيئة المسئولية القانونية أو الفكرية، وليس الإبداعية عن السياسة التحريرية وعن محتوى عمل ممتد زمنيا. @ar
label: és entitat corporativa directora editorial de @ca
definition: Relaciona una entitat corporativa amb una obra que implica una responsabilitat legal o intel·lectual, però no una responsabilitat creativa, d’una entitat corporativa en la política i del contingut editorial d’una obra diacrònica. @ca
toolkit label: entitat corporativa directora editorial de @ca
toolkit definition: Obra que implica una responsabilitat legal o intel·lectual, però no una responsabilitat creativa, d’una entitat corporativa en la política i del contingut editorial d’una obra diacrònica. @ca
label: er korporation, som er ansvarshavende redaktør af @da
definition: Relaterer en korporation til et værk, som involverer en korporations juridiske eller intellektuelle ansvar, men ikke skabelsesansvar, for et diakronisk værks redaktionelle linje og indhold. @da
toolkit label: korporation, som er ansvarshavende redaktør af @da
toolkit definition: Værk, som involverer en korporations juridiske eller intellektuelle ansvar, men ikke skabelsesansvar, for et diakronisk værks redaktionelle linje og indhold. @da
label: peatoimetaja (asutus) teoses @et
definition: Seostab asutuse teosega, mis sisaldab asutuse juriidilist või intellektuaalset, kuid mitte loomingulist vastutust diakroonilise teose toimetamispõhimõtete ja sisu eest. @et
toolkit label: peatoimetaja (asutus) teoses @et
toolkit definition: Teos, mis sisaldab asutuse juriidilist või intellektuaalset, kuid mitte loomingulist vastutust diakroonilise teose toimetamispõhimõtete ja sisu eest. @et
label: ist Körperschaft als Chefredakteurin/Chefredakteur von @de
definition: Setzt eine Körperschaft in Beziehung zu einem Werk, bei dem eine Körperschaft die rechtliche oder intellektuelle, aber keine kreative, Verantwortung für die redaktionelle Vorgehensweise und den Inhalt eines diachronen Werks trägt. @de
toolkit label: Körperschaft als Chefredakteurin/Chefredakteur von @de
toolkit definition: Ein Werk, bei dem eine Körperschaft die rechtliche oder intellektuelle, aber keine kreative, Verantwortung für die redaktionelle Vorgehensweise und den Inhalt eines diachronen Werks trägt. @de
label: főszerkesztő testülete a következőnek: @hu
definition: Hozzákapcsol egy testületet egy műhöz, amely magában foglalja egy testület jogi vagy szellemi, de nem alkotói felelősségét egy diakronikus mű szerkesztési politikájáért és tartalmáért. @hu
toolkit label: főszerkesztő testülete: @hu
toolkit definition: Egy mű, amely magában foglalja egy testület jogi vagy szellemi, de nem alkotói felelősségét egy diakronikus mű szerkesztési politikájáért és tartalmáért. @hu
label: è direttore editoriale ente di @it
definition: Correla un ente a un'opera che implica una responsabilità legale o intellettuale, ma non una responsabilità creativa, di un ente per la politica editoriale e contenuto di un'opera diacronica. @it
toolkit label: direttore editoriale ente di @it
toolkit definition: Opera che implica una responsabilità legale o intellettuale, ma non una responsabilità creativa, di un ente per la politica editoriale e contenuto di un'opera diacronica. @it
label: είναι διευθυντής σύνταξης συλλογικό όργανο του @el
toolkit label: διευθυντής σύνταξης συλλογικό όργανο του @el
label: est une collectivité directrice de publication de @fr
definition: Met une collectivité en relation avec une œuvre qui comporte une responsabilité légale ou intellectuelle, mais non une responsabilité créative, de la part d’une collectivité en ce qui concerne la politique éditoriale et le contenu d’une œuvre diachronique. @fr
toolkit label: collectivité directrice de publication de @fr
toolkit definition: Œuvre qui comporte une responsabilité légale ou intellectuelle, mais non une responsabilité créative, de la part d’une collectivité en ce qui concerne la politique éditoriale et le contenu d’une œuvre diachronique. @fr
label: ir galvenais redaktors (institūcija) @lv
definition: Sasaista institūciju ar darbu, kas ietver institūcijas juridisku vai intelektuālu, bet ne radošu, atbildību par diahroniskā darba izdošanas politiku un saturu. @lv
toolkit label: ir galvenais redaktors (institūcija) @lv
toolkit definition: Darbs, kas ietver institūcijas juridisku vai intelektuālu, bet ne radošu, atbildību par diahroniskā darba izdošanas politiku un saturu. @lv
label: 是……的主编团体 @zh-hans
definition: 将一个团体与涉及一个团体对一种历时作品的编辑政策和内容的法律或知识责任（但非创作责任）的一种作品关联起来。 @zh-hans
toolkit label: ……的主编团体 @zh-hans
toolkit definition: 涉及一个团体对一种历时作品的编辑政策和内容的法律或知识责任（但非创作责任）的一种作品 @zh-hans
label: yayın yönetmeni tüzel kişisidir @tr
definition: Bir tüzel kişiyi, bir tüzel kişiliğin yayın politikası ve artzamanlı bir eserin içeriğine yönelik yaratıcı sorumluluğunu değil ancak yasal veya entelektüel sorumluluğunu içeren bir eserle ilişkilendirir. @tr
toolkit label: yayın yönetmeni tüzel kişisi @tr
toolkit definition: Artzamanlı bir eserin yayın politikası ve içeriği için tüzel bir kişinin yasal veya entelektüel sorumluluğunu içeren, ancak yaratıcı sorumluluğunu içermeyen bir eser. @tr
has subproperty: P50826

toimituspäällikkö (suku) teoksessa
status: Published
label: is editorial director family of @en
lexical alias: editorialDirectorFamilyOf.en
definition: Relates a family to a work that involves a legal or intellectual responsibility, but not creative responsibility, of a family for the editorial policy and content of a diachronic work. @en
toolkit label: editorial director family of @en
toolkit definition: A work that involves a legal or intellectual responsibility, but not creative responsibility, of a family for the editorial policy and content of a diachronic work. @en
type: Property
domain: C10008
has element type: 2
sub property of: sukuun liittyvä teos
sub property of: toimituspäällikkö (yhteistoimija) teoksessa
definition: Liittää suvun teokseen, jossa suku on juridisesti tai tiedollisesti muttei luovasti vastuussa diakronisen teoksen toimituslinjasta ja sisällöstä.
toolkit label: toimituspäällikkö (suku) teoksessa
toolkit definition: Teos, jossa suku on juridisesti tai tiedollisesti muttei luovasti vastuussa diakronisen teoksen toimituslinjasta ja sisällöstä.
label: er redaksjonssjef for (familie) @no
definition: Relaterer en familie til et verk som involverer juridisk eller intellektuelt ansvar, bortsett fra kreativt ansvar, for det redaksjonelle innholdet i et diakronisk verk. @no
toolkit label: redaksjonssjef for (familie) @no
toolkit definition: Et verk som involverer juridisk eller intellektuelt ansvar, bortsett fra kreativt ansvar, for det redaksjonelle innholdet i et diakronisk verk. @no
label: is hoofdredacteur-familie van @nl
definition: Relateert een familie aan een werk dat met zich meebrengt een wettelijke of intellectuele verantwoordelijkheid, maar niet creatieve verantwoordelijkheid, van een familie voor redactioneel beleid en content van een diachronisch werk. @nl
toolkit label: hoofdredacteur-familie van @nl
toolkit definition: Een werk dat met zich meebrengt een wettelijke of intellectuele verantwoordelijkheid, maar niet creatieve verantwoordelijkheid, van een familie voor redactioneel beleid en content van een diachronisch werk. @nl
label: هي عائلة مسئولة عن إدارة التحرير لـ @ar
definition: يربط عائلة بعمل يترتب عليه تحمل المسئولية القانونية أو الفكرية، وليس الإبداعية عن السياسة التحريرية وعن محتوى عمل ممتد زمنيا. @ar
toolkit label: عائلة مسئولة عن إدارة التحرير @ar
toolkit definition: عمل يترتب عليه تحمل عائلة المسئولية القانونية أو الفكرية، وليس الإبداعية عن السياسة التحريرية وعن محتوى عمل ممتد زمنيا. @ar
label: és família directora editorial de @ca
definition: Relaciona una família amb una obra que implica una responsabilitat legal o intel·lectual, però no una responsabilitat creativa, d’una família en la política editorial i el contingut d’una obra diacrònica. @ca
toolkit label: família directora editorial de @ca
toolkit definition: Obra que implica una responsabilitat legal o intel·lectual, però no una responsabilitat creativa, d’una família en la política editorial i el contingut d’una obra diacrònica. @ca
label: er familie, som er ansvarshavende redaktør af @da
definition: Relaterer en familie til et værk, som involverer en families juridiske eller intellektuelle ansvar, men ikke skabelsesansvar, for et diakronisk værks redaktionelle linje og indhold. @da
toolkit label: familie, som er ansvarshavende redaktør af @da
toolkit definition: Værk, som involverer en families juridiske eller intellektuelle ansvar, men ikke skabelsesansvar, for et diakronisk værks redaktionelle linje og indhold. @da
label: peatoimetaja (perekond) teoses @et
definition: Seostab perekonna teosega, mis sisaldab perekonna juriidilist või intellektuaalset, kuid mitte loomingulist vastutust diakroonilise teose toimetamispõhimõtete ja sisu eest. @et
toolkit label: peatoimetaja (perekond) teoses @et
toolkit definition: Teos, mis sisaldab perekonna juriidilist või intellektuaalset, kuid mitte loomingulist vastutust diakroonilise teose toimetamispõhimõtete ja sisu eest. @et
label: ist Familie als Chefredakteurin/Chefredakteur von @de
definition: Setzt eine Familie in Beziehung zu einem Werk, bei dem eine Familie die rechtliche oder intellektuelle, aber keine kreative, Verantwortung für die redaktionelle Vorgehensweise und den Inhalt eines diachronen Werks trägt. @de
toolkit label: Familie als Chefredakteurin/Chefredakteur von @de
toolkit definition: Ein Werk, bei dem eine Familie die rechtliche oder intellektuelle, aber keine kreative, Verantwortung für die redaktionelle Vorgehensweise und den Inhalt eines diachronen Werks trägt. @de
label: è direttore editoriale famiglia di @it
definition: Correla una famiglia a un'opera che implica una responsabilità legale o intellettuale, ma non una responsabilità creativa, di una famiglia per la politica editoriale e contenuto di un'opera diacronica. @it
toolkit label: direttore editoriale famiglia di @it
toolkit definition: Opera che implica una responsabilità legale o intellettuale, ma non una responsabilità creativa, di una famiglia per la politica editoriale e contenuto di un'opera diacronica. @it
label: είναι διευθυντής σύνταξης οικογένεια του @el
toolkit label: διευθυντής σύνταξης οικογένεια του @el
label: est une famille directrice de publication de @fr
definition: Met une famille en relation avec une œuvre qui comporte une responsabilité légale ou intellectuelle, mais non une responsabilité créative, de la part d’une famille en ce qui concerne la politique éditoriale et le contenu d’une œuvre diachronique. @fr
toolkit label: famille directrice de publication de @fr
toolkit definition: Œuvre qui comporte une responsabilité légale ou intellectuelle, mais non une responsabilité créative, de la part d’une famille en ce qui concerne la politique éditoriale et le contenu d’une œuvre diachronique. @fr
label: ir galvenais redaktors (dzimta/ģimene) @lv
definition: Sasaista dzimtu/ģimeni ar darbu, kas ietver dzimtas/ģimenes juridisku vai intelektuālu, bet ne radošu, atbildību par diahroniskā darba izdošanas politiku un saturu. @lv
toolkit label: ir galvenais redaktors (dzimta/ģimene) @lv
toolkit definition: Darbs, kas ietver dzimtas/ģimenes juridisku vai intelektuālu, bet ne radošu, atbildību par diahroniskā darba izdošanas politiku un saturu. @lv
label: 是……的主编家族 @zh-hans
definition: 将一个家族与涉及一个家族对一种历时作品的编辑政策和内容的法律或知识责任（但非创作责任）的一种作品关联起来。 @zh-hans
toolkit label: ……的主编家族 @zh-hans
toolkit definition: 涉及一个家族对一种历时作品的编辑政策和内容的法律或知识责任（但非创作责任）的一种作品 @zh-hans
label: főszerkesztő családja a következőnek: @hu
definition: Hozzákapcsol egy családot egy műhöz, amely magában foglalja egy család jogi vagy szellemi, de nem alkotói felelősségét egy diakronikus mű szerkesztési politikájáért és tartalmáért. @hu
toolkit label: főszerkesztő családja: @hu
toolkit definition: Egy mű, amely magában foglalja egy család jogi vagy szellemi, de nem létrehozói felelősségét egy diakronikus mű szerkesztési politikájáért és tartalmáért. @hu
label: yayın yönetmeni ailesidir @tr
definition: Bir aileyi, çağdışı bir çalışmanın yayın politikası ve içeriği için bir ailenin yasal veya entelektüel sorumluluğunu içeren, ancak yaratıcı sorumluluğunu içermeyen bir eserle ilişkilendirir. @tr
toolkit label: yayın yönetmeni ailesi @tr
toolkit definition: Artzamanlı bir eserin yayın politikası ve içeriği için bir ailenin yasal veya entelektüel sorumluluğunu içeren, ancak yaratıcı sorumluluğunu içermeyen bir eser. @tr
has subproperty: P50977

toimituspäällikkö (henkilö) teoksessa
status: Published
label: is editorial director person of @en
lexical alias: editorialDirectorPersonOf.en
definition: Relates a person to a work that involves a legal or intellectual responsibility, but not creative responsibility, of a person for the editorial policy and content of a diachronic work. @en
toolkit label: editorial director person of @en
toolkit definition: A work that involves a legal or intellectual responsibility, but not creative responsibility, of a person for the editorial policy and content of a diachronic work. @en
type: Property
domain: C10004
has element type: 2
sub property of: henkilöön liittyvä teos
sub property of: toimituspäällikkö (toimija) teoksessa
definition: Liittää henkilön teokseen, jossa henkilö on juridisesti tai tiedollisesti muttei luovasti vastuussa diakronisen teoksen toimituslinjasta ja sisällöstä.
toolkit label: toimituspäällikkö (henkilö) teoksessa
toolkit definition: Teos, jossa henkilö on juridisesti tai tiedollisesti muttei luovasti vastuussa diakronisen teoksen toimituslinjasta ja sisällöstä.
label: er redaksjonssjef for (person) @no
definition: Relaterer en person til et verk som involverer juridisk eller intellektuelt ansvar, bortsett fra kreativt ansvar, for det redaksjonelle innholdet i et diakronisk verk. @no
toolkit label: redaksjonssjef for (person) @no
toolkit definition: Et verk som involverer juridisk eller intellektuelt ansvar, bortsett fra kreativt ansvar, for det redaksjonelle innholdet i et diakronisk verk. @no
label: is hoofdredacteur-persoon van @nl
definition: Relateert een persoon aan een werk dat met zich meebrengt een wettelijke of intellectuele verantwoordelijkheid, maar niet creatieve verantwoordelijkheid, van een persoon voor redactioneel beleid en content van een diachronisch werk. @nl
toolkit label: hoofdredacteur-persoon van @nl
toolkit definition: Een werk dat met zich meebrengt een wettelijke of intellectuele verantwoordelijkheid, maar niet creatieve verantwoordelijkheid, van een persoon voor redactioneel beleid en content van een diachronisch werk. @nl
label: هو شخص مدير تحرير لـ @ar
definition: يربط شخصا بعمل يترتب عليه مسئوليته القانونية أو الفكرية، وليس الإبداعية عن السياسة التحريرية وعن محتوى عمل ممتد زمنيا. @ar
toolkit label: شخص مدير تحرير @ar
toolkit definition: عمل يترتب عليه تحمل وكيل المسئولية القانونية أو الفكرية، وليس الإبداعية عن السياسة التحريرية ومحتوى عمل ممتد زمنيا. @ar
label: és persona directora editorial de @ca
definition: Relaciona una persona amb una obra que implica una responsabilitat legal o intel·lectual, però no una responsabilitat creativa, d’una persona en la política i el contingut editorial d’una obra diacrònica. @ca
toolkit label: persona directora editorial de @ca
toolkit definition: Obra que implica una responsabilitat legal o intel·lectual, però no una responsabilitat creativa, d’una persona en la política i el contingut editorial d’una obra diacrònica. @ca
label: er person, som er ansvarshavende redaktør af @da
definition: Relaterer en person til et værk, som involverer en persons juridiske eller intellektuelle ansvar, men ikke skabelsesansvar, for et diakronisk værks redaktionelle linje og indhold. @da
toolkit label: person, som er ansvarshavende redaktør af @da
toolkit definition: Værk, som involverer en persons juridiske eller intellektuelle ansvar, men ikke skabelsesansvar, for et diakronisk værks redaktionelle linje og indhold. @da
label: peatoimetaja (isik) teoses @et
definition: Seostab isiku teosega, mis sisaldab isiku juriidilist või intellektuaalset, kuid mitte loomingulist vastutust diakroonilise teose toimetamispõhimõtete ja sisu eest. @et
toolkit label: peatoimetaja (isik) teoses @et
toolkit definition: Teos, mis sisaldab isiku juriidilist või intellektuaalset, kuid mitte loomingulist vastutust diakroonilise teose toimetamispõhimõtete ja sisu eest. @et
label: ist Person als Chefredakteurin/Chefredakteur von @de
definition: Setzt eine Person in Beziehung zu einem Werk, bei dem eine Person die rechtliche oder intellektuelle, aber keine kreative, Verantwortung für die redaktionelle Vorgehensweise und den Inhalt eines diachronen Werks trägt. @de
toolkit label: Person als Chefredakteurin/Chefredakteur von @de
toolkit definition: Ein Werk, bei dem eine Person die rechtliche oder intellektuelle, aber keine kreative, Verantwortung für die redaktionelle Vorgehensweise und den Inhalt eines diachronen Werks trägt. @de
label: è direttore editoriale persona di @it
definition: Correla una persona a un'opera che implica una responsabilità legale o intellettuale, ma non una responsabilità creativa, di una persona nella politica editoriale e contenuto di un'opera diacronica. @it
toolkit label: direttore editoriale persona di @it
toolkit definition: Opera che implica una responsabilità legale o intellettuale, ma non una responsabilità creativa, di una persona nella politica editoriale e contenuto di un'opera diacronica. @it
label: είναι διευθυντής σύνταξης φυσικό πρόσωπο του @el
toolkit label: διευθυντής σύνταξης φυσικό πρόσωπο του @el
label: est une personne directrice de publication de @fr
definition: Met une personne en relation avec une œuvre qui comporte une responsabilité légale ou intellectuelle, mais non une responsabilité créative, de la part d’une personne en ce qui concerne la politique éditoriale et le contenu d’une œuvre diachronique. @fr
toolkit label: personne directrice de publication de @fr
toolkit definition: Œuvre qui comporte une responsabilité légale ou intellectuelle, mais non une responsabilité créative, de la part d’une personne en ce qui concerne la politique éditoriale et le contenu d’une œuvre diachronique. @fr
label: ir galvenais redaktors (persona) @lv
definition: Sasaista personu ar darbu, kas ietver personas juridisku vai intelektuālu, bet ne radošu, atbildību par diahroniskā darba izdošanas politiku un saturu. @lv
toolkit label: ir galvenais redaktors (persona) @lv
toolkit definition: Darbs, kas ietver personas juridisku vai intelektuālu, bet ne radošu, atbildību par diahroniskā darba izdošanas politiku un saturu. @lv
label: 是……的主编个人 @zh-hans
definition: 将一个个人与涉及一个个人对一种历时作品的编辑政策和内容的法律或知识责任（但非创作责任）的一种作品关联起来。 @zh-hans
toolkit label: ……的主编个人 @zh-hans
toolkit definition: 涉及一个个人对一种历时作品的编辑政策和内容的法律或知识责任（但非创作责任）的一种作品 @zh-hans
label: főszerkesztő személye a következőnek: @hu
definition: Hozzákapcsol egy személyt egy műhöz, amely magában foglalja egy személy jogi vagy szellemi, de nem alkotói felelősségét egy diakronikus mű szerkesztési politikájáért és tartalmáért. @hu
toolkit label: főszerkesztő személye: @hu
toolkit definition: Egy mű, amely magában foglalja egy személy jogi vagy szellemi, de nem alkotói felelősségét egy diakronikus mű szerkesztési politikájáért és tartalmáért. @hu
label: yayın yönetmeni kişisidir @tr
definition: Bir kişiyi, artzamanlı bir çalışmanın yayın politikası ve içeriği için bir kişinin yaratıcı sorumluluğu ile değil ancak yasal veya entelektüel sorumluluğunu içeren bir eserle ilişkilendirir. @tr
toolkit label: yayın yönetmeni @tr
toolkit definition: Artzamanlı bir eserin yayın politikası ve içeriği için bir kişinin yasal veya entelektüel sorumluluğunu içeren, ancak yaratıcı sorumluluğunu içermeyen bir eser. @tr
has subproperty: P50524

toimittaja (henkilö) ekspressiossa
status: Published
label: is editor person of @en
lexical alias: editorPersonOf.en
definition: Relates a person to an expression that includes a contribution by a person of amending content created by other agents in order to meet standards for publication or other use. @en
toolkit label: editor person of @en
toolkit definition: An expression that includes a contribution by a person of amending content created by other agents in order to meet standards for publication or other use. @en
type: Property
domain: C10004
has element type: 2
sub property of: yhdistymään osallinen henkilö ekspressiossa
sub property of: toimittaja (toimija) ekspressiossa
scope note: Content includes notated movement, notated music, tactile notated movement, tactile notated music, tactile text, and text. @en
alternative label: editor person of text of @en
definition: Liittää henkilön ekspressioon, jonka tekemisessä henkilö on osallisena tarkistamalla muiden toimijoiden luomaa sisältöä julkaisu- tai muiden käyttöstandardien saavuttamiseksi.
toolkit label: toimittaja (henkilö) ekspressiossa
toolkit definition: Ekspressio, jonka tekemisessä henkilö on osallisena tarkistamalla muiden toimijoiden luomaa sisältöä julkaisu- tai muiden käyttöstandardien saavuttamiseksi.
label: er redaktør av tekst for (person) @no
definition: Relaterer en person til et uttrykk som inkluderer et bidrag fra en person i form av å å gjøre endringer i tekst skrevet av andre personer for å imøtekomme utgivelsesstandarder for sammenheng, tydelighet og stil. @no
toolkit label: redaktør av tekst for (person) @no
toolkit definition: Et uttrykk som inkluderer et bidrag fra en person i form av å å gjøre endringer i tekst skrevet av andre personer for å imøtekomme utgivelsesstandarder for sammenheng, tydelighet og stil. @no
label: is redacteur-persoon van @nl
definition: Relateert een persoon aan een expressie die omvat een bijdrage door een persoon door aanpassen van content gecreëerd door andere actoren met de bedoeling te voldoen aan standaarden voor publicatie of ander gebruik. @nl
toolkit label: redacteur-persoon van tekst van @nl
toolkit definition: Een expressie die omvat een bijdrage door een persoon door aanpassen van content gecreëerd door andere actoren met de bedoeling te voldoen aan standaarden voor publicatie of ander gebruik. @nl
label: هو شخص محرر نص لـ @ar
definition: يربط شخصا بتعبيرة تتضمن إسهام شخص في تعديل نص من تأليف وكلاء آخرين من أجل استيفاء معايير النشر مثل الاتساق والوضوح والأسلوب. @ar
toolkit label: شخص محرر نص @ar
toolkit definition: تعبيرة تتضمن إسهام شخص في تعديل نص من تأليف وكلاء آخرين من أجل استيفاء معايير النشر مثل الاتساق والوضوح والأسلوب. @ar
label: és persona editora literària de @ca
definition: Relaciona una persona amb una expressió que inclou una contribució d’una persona esmenant contingut creat per altres agents per tal de complir els estàndards de publicació o un altre ús. @ca
toolkit label: persona editora literària de @ca
toolkit definition: Expressió que inclou una contribució d’una persona esmenant contingut creat per altres agents per tal de complir els estàndards de publicació o un altre ús. @ca
label: er person, som er redaktør af @da
definition: Relaterer en person til et udtryk, som omfatter en persons bidrag ved at ændre indhold skabt af andre agenter for at opfylde publikationsstandarder eller for andet brug. @da
toolkit label: person, som er redaktør af @da
toolkit definition: Udtryk, som omfatter en persons bidrag ved at ændre indhold skabt af andre agenter for at opfylde publikationsstandarder eller for andet brug. @da
label: tekstitoimetaja (isik) väljenduses @et
definition: Seostab isiku väljendusega, millesse isik on andnud panuse, parandades teiste isikute loodud teksti, et see vastaks loogilisuse, selguse ja stiili poolest avaldamisnõuetele. @et
toolkit label: tekstitoimetaja (isik) väljenduses @et
toolkit definition: Väljendus, millesse isik on andnud panuse, parandades teiste isikute loodud teksti, et see vastaks loogilisuse, selguse ja stiili poolest avaldamisnõuetele. @et
label: ist Person als Herausgeberin/Herausgeber von @de
definition: Setzt eine Person in Beziehung zu einer Expression, zu der eine Person beiträgt, indem sie von anderen Akteuren erstellte Inhalte so verändert, dass sie den Standards für die Veröffentlichung oder einer anderweitigen Verwendung entsprechen. @de
toolkit label: Person als Herausgeberin/Herausgeber von @de
toolkit definition: Eine Expression, zu der eine Person beiträgt, indem sie von anderen Akteuren erstellte Inhalte so verändert, dass sie den Standards für die Veröffentlichung oder einer anderweitigen Verwendung entsprechen. @de
label: szerkesztő személye a következőnek: @hu
definition: Hozzákapcsol egy személyt egy kifejezési formához, amely magában foglalja egy személy közreműködését, melynek során más ágensek által létrehozott szöveget módosít, hogy az megfeleljen az olyan publikációs szabályoknak, mint a következetesség, az egyértelműség és a stílus. @hu
toolkit label: szerkesztő személye: @hu
toolkit definition: Egy kifejezési forma, amely magában foglalja egy személy közreműködését, melynek során más ágensek által létrehozott szöveget módosít, hogy az megfeleljen az olyan publikációs szabályoknak, mint a következetesség, az egyértelműség és a stílus. @hu
label: è curatore persona di testo di @it
definition: Correla una persona a un'espressione che comprende un contributo di una persona nella correzione di testo creato da altre persone per soddisfare standard di pubblicazione come uniformità, chiarezza e stile. @it
toolkit label: curatore persona di testo di @it
toolkit definition: Espressione che comprende un contributo di una persona nella correzione di testo creato da altre persone per soddisfare standard di pubblicazione come uniformità, chiarezza e stile. @it
label: είναι επιμελητής φυσικό πρόσωπο του κειμένου του @el
toolkit label: επιμελητής φυσικό πρόσωπο του κειμένου του @el
label: est une personne éditrice intellectuelle de @fr
definition: Met une personne en relation avec une expression qui intègre une contribution de la part d’une personne consistant à modifier du contenu créé par d’autres agents afin de répondre à des normes pour la publication ou une autre utilisation. @fr
toolkit label: personne éditrice intellectuelle de @fr
toolkit definition: Expression qui intègre une contribution de la part d’une personne consistant à modifier du contenu créé par d’autres agents afin de répondre à des normes pour la publication ou une autre utilisation. @fr
scope note: Content omvat bewegingsnotatie, muzieknotatie, tactiele bewegingsnotatie, tactiele muzieknotatie, tactiele tekst en tekst. @nl
label: ir redaktors (persona) @lv
definition: Sasaista personu ar izteiksmi, kas ietver personas ieguldījumu, pielāgojot citu aģentu radīto saturu, lai tas atbilstu publicēšanas vai citādas izmantošanas standartiem. @lv
toolkit label: ir redaktors (persona) @lv
toolkit definition: Izteiksme, kas ietver personas ieguldījumu, pielāgojot citu aģentu radīto saturu, lai tas atbilstu publicēšanas vai citādas izmantošanas standartiem. @lv
scope note: Saturs ir: teksts, kustību pieraksts, notācija, taktils kustības pieraksts, taktila notācija, taktils teksts. @lv
scope note: Sisältöön kuuluvat liikenotaatio, nuottikirjoitus, taktiili liikenotaatio, taktiili nuottikirjoitus, taktiili teksti ja teksti.
alternative label: tekstin toimittaja (henkilö) ekspressiossa
scope note: Le contenu comprend le mouvement noté, le mouvement noté tactile, la musique notée, la musique notée tactile, le texte et le texte tactile. @fr
alternative label: personne éditrice intellectuelle de texte de @fr
scope note: محتوى يتضمن حركات مدونة، وموسيقى مدونة، حركة مدونة بصورة ملموسة، موسيقى مدونة بصورة ملموسة، ونص ملموس، ونص. @ar
alternative label: شخص محرر لنص لـ @ar
scope note: Indhold omfatter noteret bevægelse, noteret musik, taktil noteret bevægelse, taktil noteret musik og tekst. @da
alternative label: person, som er redaktør af tekst af @da
scope note: Darunter fallen Bewegungsnotationen, Noten, Text, taktile Bewegungsnotationen, taktile Noten und taktiler Text. @de
alternative label: Personal als Herausgeberin/Herausgeber eines Texts von @de
scope note: El contingut inclou moviment notat, música notada, moviment notat tàctil, música notada tàctil, text tàctil i text. @ca
alternative label: persona editora de text de @ca
alternative label: ……的文本的编者个人 @zh-hans
label: 是……的编者个人 @zh-hans
definition: 将一个个人与包括修正其他行为者创作的内容以满足出版标准或其他用途的一个个人的贡献的一种内容表达关联起来。 @zh-hans

leikkaaja (henkilö) ekspressiossa
status: Published
label: is editor person of moving image work of @en
lexical alias: editorPersonOfMovingImageWorkOf.en
definition: Relates a person to an expression that includes a contribution by a person of assembling, arranging, and trimming film, video, or other moving image formats, including both visual and audio aspects. @en
toolkit label: editor person of moving image work of @en
toolkit definition: An expression that includes a contribution by a person of assembling, arranging, and trimming film, video, or other moving image formats, including both visual and audio aspects. @en
type: Property
domain: C10004
has element type: 2
sub property of: esitykseen osallinen henkilö ekspressiossa
sub property of: leikkaaja (toimija) ekspressiossa
definition: Liittää henkilön ekspressioon, jonka tekemisessä henkilö on osallisena elokuvan, videon tai muiden elokuvaformaattien kokoamisessa, järjestämisessä ja leikkauksessa sekä kuvan että äänen osalta.
toolkit label: leikkaaja (henkilö) ekspressiossa
toolkit definition: Ekspressio, jonka tekemisessä henkilö on osallisena elokuvan, videon tai muiden elokuvaformaattien kokoamisessa, järjestämisessä ja leikkauksessa sekä kuvan että äänen osalta.
label: er redaktør av verk i form av levende bilder for (person) @no
definition: Relaterer en person til et uttrykk som inkluderer et bidrag fra en person i form av å sette sammen, arrangere og klippe film, video eller andre formater for levende bilder, inkludert både bilde- og lydaspekter. @no
toolkit label: redaktør av verk i form av levende bilder for (person) @no
toolkit definition: Et uttrykk som inkluderer et bidrag fra en person i form av å sette sammen, arrangere og klippe film, video eller andre formater for levende bilder, inkludert både bilde- og lydaspekter. @no
label: is filmeditor-persoon van bewegend beeldwerk van @nl
definition: Relateert een persoon aan een expressie die omvat een bijdrage door een persoon door samenstellen, arrangeren en couperen van film, video of andere bewegend beeld-vormen, inclusief zowel visuele als geluidaspecten. @nl
toolkit label: filmeditor-persoon van bewegend beeldwerk van @nl
toolkit definition: Een expressie die omvat een bijdrage door een persoon door samenstellen, arrangeren en couperen van film, video of andere bewegend beeld-vormen, inclusief zowel visuele als geluidaspecten. @nl
label: هو شخص محرر عمل صور متحركة لـ @ar
definition: يربط شخصا بتعبيرة تتضمن إسهام شخص في تجميع فيلم، أو فيديو أو شكل آخر من أشكال الصور المتحركة وترتيبها واقتطاعها، بما في ذلك الجوانب المرئية والمسموعة. @ar
toolkit label: شخص محرر عمل صور متحركة @ar
toolkit definition: تعبيرة تتضمن إسهام شخص في تجميع فيلم، أو فيديو أو شكل آخر من أشكال الصور المتحركة وترتيبها واقتطاعها، بما في ذلك الجوانب المرئية والمسموعة. @ar
label: és persona editora d’una obra d’imatge en moviment de @ca
definition: Relaciona una persona amb una expressió que inclou una contribució d’una persona d’aplegar, arranjar i retallar pel·lícules, vídeos i altres formats d’imatge en moviment, inclosos tant els aspectes visuals com els d’àudio. @ca
toolkit label: persona editora d’una obra d’imatge en moviment de @ca
toolkit definition: Expressió que inclou una contribució d’una persona d’aplegar, arranjar i retallar pel·lícules, vídeos i altres formats d’imatge en moviment, inclosos tant els aspectes visuals com els d’àudio. @ca
label: er person, som er klipper af levende billedværk af @da
definition: Relaterer en person til et udtryk, som omfatter en persons bidrag ved at sammensætte, arrangere og klippe film, video eller andre levende billedformater, inkl. både visuelle og lydmæssige aspekter. @da
toolkit label: person, som er klipper af levende billedværk af @da
toolkit definition: Udtryk, som omfatter en persons bidrag ved at sammensætte, arrangere og klippe film, video eller andre levende billedformater, inkl. både visuelle og lydmæssige aspekter. @da
label: filmiteose monteerija (isik) väljenduses @et
definition: Seostab isiku väljendusega, millesse isik on andnud panuse, monteerides, järjestades ja lõigates filmist, videost jm liikuvast pildist koosnevaid formaate, hõlmates nii visuaalseid kui ka heli aspekte. @et
toolkit label: filmiteose monteerija (isik) väljenduses @et
toolkit definition: Väljendus, millesse isik on andnud panuse, monteerides, järjestades ja lõigates filmist, videost jm liikuvast pildist koosnevaid formaate, hõlmates nii visuaalseid kui ka heli aspekte. @et
label: ist Person als Filmeditorin/Filmeditor von @de
definition: Setzt eine Person in Beziehung zu einer Expression, zu der eine Person beiträgt, indem sie für das Zusammensetzen, Arrangieren und Nachschneiden von Film-, Video- oder anderen Bewegtbildformaten zuständig ist. Darunter fallen Video- und Audio-Eigenschaften. @de
toolkit label: Person als Filmeditorin/Filmeditor von @de
toolkit definition: Eine Expression, zu der eine Person beiträgt, indem sie für das Zusammensetzen, Arrangieren und Nachschneiden von Film-, Video- oder anderen Bewegtbildformaten zuständig ist. Darunter fallen Video- und Audio-Eigenschaften. @de
label: vágó személye a következő mozgóképműnek: @hu
definition: Hozzákapcsol egy személyt egy kifejezési formához, amely magában foglalja egy személy film, videó vagy más mozgóképformátum összeállításával, elrendezésével és vágásával járó közreműködését, beleértve mind a vizuális, mind az audió szempontokat. @hu
toolkit label: vágó személye a következő mozgóképműnek: @hu
toolkit definition: Egy kifejezési forma, amely magában foglalja egy személy film, videó vagy más mozgóképformátum összeállításával, elrendezésével és vágásával járó közreműködését, beleértve mind a vizuális, mind az audió szempontokat. @hu
label: è curatore persona di opera immagine in movimento di @it
definition: Correla una persona a un'espressione che comprende un contributo di una persona per l'assemblaggio, organizzazione e taglio di film, video o altri formati di immagini in movimento, inclusi gli aspetti sia visivi sia audio. @it
toolkit label: curatore persona di opera immagine in movimento di @it
toolkit definition: Espressione che comprende un contributo di una persona per l'assemblaggio, organizzazione e taglio di film, video o altri formati di immagini in movimento, inclusi gli aspetti sia visivi sia audio. @it
label: είναι επιμελητής φυσικό πρόσωπο του έργου κινητής εικόνας του @el
toolkit label: επιμελητής φυσικό πρόσωπο του έργου κινητής εικόνας του @el
label: est une personne monteuse d’une œuvre d’images animées de @fr
definition: Met une personne en relation avec une expression qui intègre une contribution de la part d’une personne consistant à assembler, à agencer et à découper du film, de la vidéo ou d’autres formats d’images animées, y compris les aspects visuels et sonores. @fr
toolkit label: personne monteuse d’une œuvre d’images animées de @fr
toolkit definition: Expression qui intègre une contribution de la part d’une personne consistant à assembler, à agencer et à découper du film, de la vidéo ou d’autres formats d’images animées, y compris les aspects visuels et sonores. @fr
label: ir filmas montāžas redaktors (persona) @lv
definition: Sasaista personu ar izteiksmi, kas ietver personas ieguldījumu, montējot, pārkārtojot un saīsinot filmas, video vai citu kustīga attēla formātu, ietverot gan vizuālos, gan audio aspektus. @lv
toolkit label: ir filmas montāžas redaktors (persona) @lv
toolkit definition: Izteiksme, kas ietver personas ieguldījumu, montējot, pārkārtojot un saīsinot filmas, video vai citu kustīga attēla formātu, ietverot gan vizuālos, gan audio aspektus. @lv
label: 是……的动态图像作品的剪辑师个人 @zh-hans
definition: 将一个个人与包括对影片、视频或其他动态图像格式（包括视频和音频方面）的汇编、编排和剪辑的一个个人的贡献的一种内容表达关联起来。 @zh-hans
toolkit label: ……的动态图像作品的剪辑师个人 @zh-hans
toolkit definition: 包括对影片、视频或其他动态图像格式（包括视频和音频方面）的汇编、编排和剪辑的一个个人的贡献的一种内容表达 @zh-hans
label: hareketli görüntü eserinin editör kişisidir @tr
definition: Bir kişiyi, hem görsel hem de işitsel yönleri içeren film, video veya diğer hareketli görüntü formatlarını bir araya getirme, düzenleme ve kırpma konusunda bir kişinin katkısını içeren bir anlatımla ilişkilendirir. @tr
toolkit label: hareketli görüntü eserinin editörü @tr
toolkit definition: Film, video veya diğer hareketli görüntü formatlarının montajı, düzenlenmesi ve kırpılmasından oluşan, hem görsel hem de işitsel yönleri içeren bir kişinin katkısını içeren bir anlatım. @tr
has subproperty: P50573

elämäkerralliset tiedot
status: Published
label: has biographical information @en
definition: Relates a person to a summary of information about the life or history of a person. @en
type: Property
domain: C10004
lexical alias: biographicalInformation.en
instruction number: 9.17
toolkit label: biographical information @en
toolkit definition: A summary of information about the life or history of a person. @en
label: a pour information biographique @fr
definition: Met une personne en relation avec un résumé d’informations sur la vie ou l’histoire d’une personne. @fr
toolkit label: information biographique @fr
toolkit definition: Résumé d’informations sur la vie ou l’histoire d’une personne. @fr
toolkit label: información biográfica @es
toolkit definition: Información perteneciente a la vida o historia de una persona. @es
label: har biografisk information @sv
toolkit label: biografisk information @sv
label: έχει βιογραφική πληροφορία @el
definition: Συνδέει ένα φυσικό πρόσωπο με μια συνοπτική πληροφόρηση αναφορικά με τη ζωή ή την ιστορία ενός φυσικού προσώπου. @el
toolkit label: βιογραφική πληροφορία @el
toolkit definition: Μια συνοπτική πληροφόρηση αναφορικά με τη ζωή ή ιστορία ενός φυσικού προσώπου. @el
definition: Setzt eine Person in Beziehung zu Informationen über das Leben oder die Geschichte einer Person. @de
toolkit label: Biografische Angaben @de
toolkit definition: Informationen über das Leben oder die Geschichte einer Person. @de
label: har biografisk oplysning @da
definition: Relaterer en person til en opsummering af oplysninger om en persons liv eller historie. @da
toolkit label: biografisk oplysning @da
toolkit definition: Opsummering af oplysninger om en persons liv eller historie. @da
label: té com a informació biogràfica @ca
definition: Relaciona una persona amb un resum de la informació sobre la vida o la història d’una persona. @ca
toolkit label: informació biogràfica @ca
toolkit definition: Resum de la informació sobre la vida o la història d’una persona. @ca
definition: Liittää henkilön elämäkerralliseen tietoon henkilöstä.
toolkit label: elämäkerralliset tiedot
toolkit definition: Henkilöön liittyvä elämäkerrallinen tieto.
toolkit label: biografisk informasjon @no
toolkit definition: Et sammendrag av informasjon om en persons liv eller historie. @no
label: hat biografische Angaben @de
has element type: 6
label: életrajzi információja a következő: @hu
definition: Hozzákapcsol egy személyt egy személy történetéről szóló információk összefoglalásához. @hu
toolkit label: életrajzi információ: @hu
toolkit definition: Egy személy életéről vagy történetéről szóló információk összefoglalása. @hu
label: har biografisk informasjon @no
definition: Relaterer en person til et sammendrag av informasjon om en persons liv eller historie. @no
label: heeft biografische informatie @nl
definition: Relateert een persoon aan een samenvatting van informatie over het leven of de geschiedenis van een persoon. @nl
toolkit label: biografische informatie @nl
toolkit definition: Een samenvatting van informatie over het leven of de geschiedenis van een persoon. @nl
label: له معلومات السيرة الذاتية @ar
definition: يربط شخصا بمعلومات موجزة عن حياة أو تاريخ شخص. @ar
toolkit label: معلومات السيرة الذاتية @ar
toolkit definition: ملخص معلومات عن حياة أو تاريخ شخص. @ar
label: eluloolised andmed @et
definition: Seostab isiku kokkuvõtliku infoga isiku elust. @et
toolkit label: eluloolised andmed @et
toolkit definition: Kokkuvõtlik info isiku elust. @et
label: ha come nota biografica @it
definition: Correla una persona a un sommario di informazioni sulla vita o la storia di una persona. @it
toolkit label: nota biografica @it
toolkit definition: Sommario di informazioni sulla vita o la storia di una persona. @it
label: biogrāfiska informācija @lv
definition: Sasaista personu ar informācijas kopumu par personas dzīvi vai vēsturi. @lv
toolkit label: biogrāfiska informācija @lv
toolkit definition: Informācijas kopums par personas dzīvi vai vēsturi. @lv
label: 有传记信息 @zh-hans
definition: 将一个个人与关于一个个人的生平或历史的信息提要关联起来。 @zh-hans
toolkit label: 传记信息 @zh-hans
toolkit definition: 关于一个个人的生平或历史的信息提要 @zh-hans
label: biyografik bilgi ile ilişkilidir @tr
definition: Bir kişiyi, bir kişinin yaşamı veya geçmişi hakkındaki bilgilerin bir özetiyle ilişkilendirir. @tr
toolkit label: biyografik bilgi @tr
toolkit definition: Bir kişinin hayatı veya geçmişi hakkındaki bilgilerin özeti @tr
has subproperty: P50113

preeses teokselle
status: Published
label: is praeses of @en
definition: Relates a person to a work that involves a responsibility as a faculty moderator of an academic disputation, normally proposing a thesis and participating in the ensuing disputation. @en
type: Property
domain: C10004
sub property of: teoksen tekijä (henkilö) teoksessa
lexical alias: praesesOf.en
label: est un praeses de @fr
definition: Met une personne en relation avec une œuvre qui comporte une responsabilité consistant à présider une disputation académique et, normalement, à proposer une thèse et à participer au débat qui s’ensuit. @fr
toolkit label: praeses de @fr
toolkit definition: Œuvre qui comporte une responsabilité consistant à présider une disputation académique et, normalement, à proposer une thèse et à participer au débat qui s’ensuit. @fr
toolkit label: praeses of @en
toolkit definition: A work that involves a responsibility as a faculty moderator of an academic disputation, normally proposing a thesis and participating in the ensuing disputation. @en
instruction number: 18.5
label: είναι επόπτης του @el
definition: Συνδέει ένα φυσικό πρόσωπο, το οποίο είναι επόπτης σχολής/τομέα μιας ακαδημαϊκής διατριβής και ο οποίος συνήθως προτείνει μια θέση και συμμετέχει στην εκπόνηση της διατριβής, με ένα έργο. @el
toolkit label: επόπτης του @el
toolkit definition: Ένα έργο που περιλαμβάνει την ευθύνη του επόπτη σχολής/τομέα μιας ακαδημαϊκής διατριβής, συνήθως μέσω της υποβολής μιας πρότασης και της συμμετοχής στην εκπόνηση της διατριβής. @el
definition: Setzt eine Person in Beziehung zu einem Werk, bei dem eine Person auf Fakultätsseite eine akademische Disputation moderiert, normalerweise eine These vorschlägt und an der sich daraus ergebenden Disputation teilnimmt. @de
toolkit label: Praeses von @de
toolkit definition: Ein Werk, bei dem eine Person auf Fakultätsseite eine akademische Disputation moderiert, normalerweise eine These vorschlägt und an der sich daraus ergebenden Disputation teilnimmt. @de
label: er præses af @da
definition: Relaterer en person til et værk, som involverer et ansvar som en fakultetsordstyrer for en akademisk disputation, normalt ved at fremsætte en tese og deltagelse i den efterfølgende disputation. @da
toolkit label: præses af @da
toolkit definition: Værk, som involverer et ansvar som en fakultetsordstyrer for en akademisk disputation, normalt ved at fremsætte en tese og deltagelse i den efterfølgende disputation. @da
label: és praeses de @ca
definition: Relaciona una persona amb una obra que implica una responsabilitat com a moderador d’una disputa acadèmica, normalment proposa una tesi i participa en el debat subsegüent. @ca
toolkit definition: Obra que implica una responsabilitat com a moderador d’una disputa acadèmica, normalment proposa una tesi i participa en el debat subsegüent. @ca
definition: Liittää henkilön teokseen, jossa henkilö on vastuussa väitöskirjan esittelystä väitöstilasuudessa tiedekunnan edustajana ja osallistuu keskusteluun väitöstilaisuuden puheenjohtajana.
toolkit label: preeses teokselle
toolkit definition: Teos, jossa henkilö on vastuussa väitöskirjan esittelystä väitöstilasuudessa tiedekunnan edustajana ja osallistuu keskusteluun väitöstilaisuuden puheenjohtajana.
toolkit label: preses for @no
toolkit definition: Et verk som involverer ansvar som fakultetets ordstyrer i en akademisk disputas, som vanligvis foreslår en avhandling og deltar i den påfølgende disputasen. @no
label: ist Praeses von @de
has element type: 2
label: elnöke a következőnek: @hu
definition: Hozzákapcsol egy személyt egy műhöz, amelyhez hozzátartozik egy tudományos vita kari moderátorának felelőssége, aki szokásos módon előterjeszt egy szakdolgozatot, és részt vesz az azt követő vitában. @hu
toolkit label: elnöke: @hu
toolkit definition: Egy mű, amelyhez hozzátartozik egy tudományos vita kari moderátorának felelőssége, aki szokásos módon előterjeszt egy szakdolgozatot, és részt vesz az azt követő vitában. @hu
alternative label: preesesinä väitöstilaisuudessa
label: er preses for @no
definition: Relaterer en person til et verk som involverer ansvar som fakultetets ordstyrer i en akademisk disputas, som vanligvis foreslår en avhandling og deltar i den påfølgende disputasen. @no
label: is preses van @nl
definition: Relateert een persoon aan een werk dat met zich meebrengt een verantwoordelijkheid van een faculteitsmoderator van een academische disputatie, gewoonlijk voordragend een stelling en deelnemend in het daaropvolgende dispuut. @nl
toolkit label: preses van @nl
toolkit definition: Een werk dat met zich meebrengt een verantwoordelijkheid van een faculteitsmoderator van een academische disputatie, gewoonlijk voordragend een stelling en deelnemend in het daaropvolgende dispuut. @nl
label: هو رئيس جلسة لـ @ar
definition: يربط شخصا بعمل يترتب عليه مسئولية إدارة حوار في مناقشة أكاديمية، وعادة اقتراح أطروحة، والمشاركة في المناقشة التي تلي ذلك. @ar
toolkit label: رئيس جلسة @ar
toolkit definition: عمل يترتب عليه مسئولية إدارة حوار في مناقشة أكاديمية، وعادة اقتراح أطروحة، والمشاركة في المناقشة التي تلي ذلك. @ar
label: praeses teoses @et
definition: Seostab isiku teosega, mis sisaldab teaduskonna väitlusjuhi vastutust akadeemilise väitluskoosoleku eest, tavaliselt esitledes väitekirja ning osaledes järgnevas väitluses. @et
toolkit label: praeses teoses @et
toolkit definition: Teos, mis sisaldab teaduskonna väitlusjuhi vastutust akadeemilise väitluskoosoleku eest, tavaliselt esitledes väitekirja ning osaledes järgnevas väitluses. @et
alternative label: Präses von @de
label: è presidente di @it
definition: Correla una persona a un'opera che implica la responsabilità come docente moderatore in una discussione accademica, normalmente proponendo una tesi e partecipando alla conseguente discussione. @it
toolkit label: presidente di @it
toolkit definition: Opera che implica la responsabilità come docente moderatore in una discussione accademica, normalmente proponendo una tesi e partecipando alla conseguente discussione. @it
label: ir akadēmiskā disputa vadītājs @lv
definition: Sasaista personu ar darbu, kas ietver personas atbildību, esot par fakultātes akadēmiskā disputa moderatoru, parasti piedāvājot tematu un piedaloties turpmākajā disputā. @lv
toolkit label: ir akadēmiskā disputa vadītājs @lv
toolkit definition: Darbs, kas ietver personas atbildību, esot par fakultātes akadēmiskā disputa moderatoru, parasti piedāvājot tematu un piedaloties turpmākajā disputā. @lv
label: 是……的评审人 @zh-hans
definition: 将一个个人与涉及作为学术辩论的主持教师（通常是提出一个论题并参与后续的辩论）责任的一种作品关联起来。 @zh-hans
toolkit label: ……的评审人 @zh-hans
toolkit definition: 涉及作为学术辩论的主持教师（通常是提出一个论题并参与后续的辩论）责任的一种作品 @zh-hans
label: danışmanıdır @tr
definition: Bir kişiyi, akademik bir tartışma konusunda fakülte moderatörü olarak sorumluluk içeren, normalde bir tez öneren ve ardından gelen tartışmaya katılan bir eserle ilişkilendirir. @tr
toolkit label: Danışman @tr
toolkit definition: Akademik bir tartışma konusunda fakülte moderatörü olarak sorumluluk içeren, normalde bir tez öneren ve ardından gelen tartışmaya katılan bir çalışma olarak ifade etmektedir. @tr
has subproperty: P50127

yhteisön edeltäjä
status: Published
label: has predecessor of corporate body @en
definition: Relates a corporate body to a corporate body who precedes another corporate body. @en
type: Property
domain: C10005
lexical alias: predecessorOfCorporateBody.en
toolkit label: predecessor of corporate body @en
toolkit definition: A corporate body who precedes another corporate body. @en
label: a pour prédécesseur d’une collectivité @fr
definition: Met une collectivité en relation avec une collectivité qui précède une autre collectivité. @fr
toolkit label: prédécesseur d’une collectivité @fr
toolkit definition: Collectivité qui précède une autre collectivité. @fr
toolkit label: predecesora @es
toolkit definition: Una entidad corporativa que precede a otra entidad corporativa @es
instruction number: 29.5
label: έχει πρόγονο του συλλογικού οργάνου @el
definition: Συνδέει ένα συλλογικό όργανο με ένα συλλογικό όργανο το οποίο προηγείται κάποιου άλλου συλλογικού οργάνου. @el
toolkit label: πρόγονος του συλλογικού οργάνου @el
toolkit definition: Ένα συλλογικό όργανο το οποίο προηγείται κάποιου άλλου συλλογικού οργάνου. @el
definition: Setzt eine Körperschaft in Beziehung zu einer Körperschaft, die einer anderen Körperschaft vorausgeht. @de
toolkit label: Vorgängerin/Vorgänger einer Körperschaft @de
toolkit definition: Eine Körperschaft, die einer anderen Körperschaft vorausgeht. @de
label: har forgænger til korporation @da
definition: Relaterer en korporation til en korporation, som går forud for en anden korporation. @da
toolkit label: forgænger til korporation @da
toolkit definition: Korporation, som går forud for en anden korporation. @da
label: té com a predecessor d’una entitat corporativa @ca
definition: Relaciona una entitat corporativa amb una entitat corporativa que precedeix una altra entitat corporativa. @ca
toolkit label: predecessor d’una entitat corporativa @ca
toolkit definition: Entitat corporativa que precedeix una altra entitat corporativa. @ca
definition: Liittää yhteisön yhteisöön, joka edelsi toista yhteisöä.
toolkit label: yhteisön edeltäjä
toolkit definition: Yhteisö, joka edelsi toista yhteisöä.
toolkit label: forløper til korporasjon @no
toolkit definition: En korporasjon som kommer før en annen korporasjon. @no
label: hat Vorgängerin/Vorgänger einer Körperschaft @de
has element type: 2
sub property of: yhteisöön liittyvä yhteisö
sub property of: yhteistoimijan edeltäjä
label: testület jogelődje a következő: @hu
definition: Hozzákapcsol egy testületet egy testülethez, amely egy másik testület elődje. @hu
toolkit label: testület jogelődje: @hu
toolkit definition: Egy testület, amely egy másik testület elődje. @hu
alternative label: predecessor @en
alternative label: edeltäjä
label: har forløper til korporasjon @no
definition: Relaterer en korporasjon til en korporasjon som kommer før en annen korporasjon. @no
alternative label: forløper @no
label: heeft voorganger van corporatie @nl
definition: Relateert een corporatie aan een corporatie die aan een andere corporatie voorafgaat. @nl
toolkit label: voorganger van corporatie @nl
toolkit definition: Een corporatie die aan een andere corporatie voorafgaat. @nl
label: لها هيئة سابقة @ar
definition: يربط هيئة بهيئة سابقة لهيئة أخرى. @ar
alternative label: سابقة @ar
toolkit label: سابقة لهيئة @ar
toolkit definition: هيئة سبقت هيئة أخرى. @ar
alternative label: forløber @da
label: asutuse eelkäija @et
definition: Seostab asutuse asutusega, mis eelneb teisele asutusele. @et
toolkit label: asutuse eelkäija @et
toolkit definition: Asutus, mis eelneb teisele asutusele. @et
alternative label: előd: @hu
label: ha come predecessore di ente @it
definition: Correla un ente a un ente che è predecessore di un altro ente. @it
alternative label: predecessore @it
toolkit label: predecessore di un ente @it
toolkit definition: ente predecessore di un altro ente. @it
alternative label: πρόγονος @el
alternative label: prédécesseur @fr
label: institūcijas priekštecis (institūcija) @lv
definition: Sasaista institūciju ar institūciju, citas institūcijas priekštecis. @lv
toolkit label: institūcijas priekštecis (institūcija) @lv
toolkit definition: Institūcija, citas institūcijas priekštecis. @lv
alternative label: Vorgänger @de
alternative label: 前身 @zh-hans
label: 有团体的前身 @zh-hans
definition: 将一个团体与作为另一个团体前身的团体关联起来。 @zh-hans
toolkit label: 团体的前身 @zh-hans
toolkit definition: 作为另一个团体前身的团体 @zh-hans

esipuheen kirjoittajana ekspressiossa
status: Deprecated
label: is writer of preface of (Deprecated) @en
definition: Relates an agent to an expression that includes a contribution of providing a preface to an original work. (Deprecated) @en
type: Property
domain: C10002
sub property of: oheisteksti
lexical alias: writerOfPrefaceOf.en
label: est un préfacier de @fr
definition: Met un agent qui contribue à une expression d’une œuvre en fournissant une préface à une œuvre originale en relation avec une expression. @fr
toolkit label: préfacier de @fr
toolkit definition: Expression d’une œuvre qui intègre une contribution consistant à fournir une préface à une œuvre originale. @fr
toolkit label: writer of preface of (Deprecated) @en
toolkit definition: An expression that includes a contribution of providing a preface to an original work. (Deprecated) @en
instruction number: 18.5
label: είναι συγγραφέας του προλόγου του @el
definition: Συνδέεει έναν φορέα, ο οποίος συνεισφέρει σε μια έκφραση ενός έργου παρέχοντας έναν πρόλογο στο πρωτότυπο έργο, με μια έκφραση. @el
toolkit label: συγγραφέας του προλόγου του @el
toolkit definition: Μια έκφραση ενός έργου που ενσωματώνει τη συνεισφορά του προλόγου σε ένα πρωτότυπο έργο. @el
definition: Setzt einen Akteur, der an einer Expression eines Werks mitwirkt, indem er ein Geleitwort zum Originalwerk liefert, mit einer Expression in Beziehung. @de
toolkit label: Verfasser eines Geleitwortes von @de
toolkit definition: Eine Expression eines Werks, bei der ein Akteur ein Geleitwort zum Originalwerk liefert. @de
label: er forfatter til forord til @da
definition: Relaterer en agent, der har bidraget til et udtryk af et værk ved at sørge for et forord til det originale værk til et udtryk. @da
toolkit label: forfatter til forord til @da
toolkit definition: Udtryk af et værk der inkorporerer et bidrag ved at sørge for et forord til et oprindeligt værk. @da
label: és escriptor d’un prefaci de @ca
definition: Relaciona un agent, que contribueix a una expressió d’una obra proporcionant un prefaci a l’obra original, amb una expressió. @ca
toolkit label: escriptor d’un prefaci de @ca
toolkit definition: Expressió d’una obra que incorpora una contribució que proporciona un prefaci a l’obra original. @ca
definition: Liittää toimijan teoksen ekspressioon, joka sisältää kirjoitetun esipuheen.
toolkit label: esipuheen kirjoittajana ekspressiossa
toolkit definition: Teoksen ekspressio, joka sisältää kirjoitetun esipuheen.
toolkit label: forfatter av forord til @no
toolkit definition: Et uttrykk av et verk som omfatter et bidrag i form av å tilføre et forord til originalverket. @no
label: ist Verfasser eines Geleitwortes von @de
has element type: 2
label: előszavának írója @hu
definition: Egy ágenst (személyt, családot vagy testületet), aki/amely egy mű kifejezési formájához hozzájárul azzal, hogy egy eredeti művet előszóval lát el, hozzákapcsol egy kifejezési formához. @hu
toolkit label: előszó írója @hu
toolkit definition: Egy mű kifejezési formája, amely hozzájárulást testesít meg azzal, hogy előszóval lát el egy eredeti művet. @hu
has subproperty: P50149

alkusanojen kirjoittajana ekspressiossa
status: Deprecated
type: Property
label: is writer of foreword of (Deprecated) @en
lexical alias: writerOfForewordOf.en
definition: Relates an agent to an expression that includes a contribution of providing a foreword. (Deprecated) @en
domain: C10002
toolkit label: writer of foreword of (Deprecated) @en
toolkit definition: An expression that includes a contribution of providing a foreword. (Deprecated) @en
instruction number: 18.5
sub property of: oheisteksti
label: είναι συγγραφέας του προλόγου του @el
definition: Συνδέει έναν φορέα, ο οποίος συνεισφέρει σε μια έκφραση ενός έργου παρέχοντας έναν πρόλογο στο πρωτότυπο έργο, με μια έκφραση. @el
toolkit label: συγγραφέας του προλόγου του @el
toolkit definition: Μια έκφραση που ενσωματώνει τη συνεισφορά ενός προλόγου στο πρωτότυπο έργο. @el
definition: Setzt einen Akteur, der an einer Expression eines Werks mitwirkt, indem er ein Vorwort zum Originalwerk liefert, mit einer Expression in Beziehung. @de
toolkit label: Verfasser eines Vorworts von @de
toolkit definition: Eine Expression eines Werks, bei der ein Akteur ein Vorwort zum Originalwerk liefert. @de
label: er forfatter til indledning til @da
definition: Relaterer en agent, der bidrager til et udtryk af et værk ved at skrive en indledning til et oprindeligt værk til et udtryk. @da
toolkit label: forfatter til indledning til @da
toolkit definition: Udtryk af et værk, der inkorporerer et bidrag ved at skrive en indledning til et oprindeligt værk. @da
label: és escriptor d’un pròleg de @ca
definition: Relaciona un agent, que contribueix a una expressió d’una obra proporcionant un pròleg a una obra original, amb una expressió. @ca
toolkit label: escriptor d’un pròleg de @ca
toolkit definition: Expressió d’una obra que incorpora una contribució que proporciona un pròleg a una obra original. @ca
definition: Liittää toimijan teoksen ekspressioon, joka sisältää alkuperäiseen teokseen kirjoitetun esipuheen.
toolkit label: alkusanojen kirjoittajana ekspressiossa
toolkit definition: Teoksen ekspressio, joka sisältää alkuperäiseen teokseen kirjoitetun esipuheen.
toolkit label: forfatter av forord til @no
toolkit definition: Et uttrykk av et verk som omfatter et bidrag i form av å tilføre et forord til originalverket. @no
label: ist Verfasser eines Vorworts von @de
label: est un auteur d’avant-propos de @fr
definition: Met un agent qui contribue à une expression d’une œuvre en fournissant un avant-propos à une œuvre originale en relation avec une expression. @fr
toolkit label: auteur d’avant-propos de @fr
toolkit definition: Expression d’une œuvre qui intègre une contribution consistant à fournir un avant-propos à une œuvre originale. @fr
has element type: 2
label: előszó írója @hu
definition: Egy ágenst (személyt, családot vagy testületet), aki/amely hozzájárul egy mű kifejezési formájához azzal, hogy egy eredeti művet előszóval lát el, hozzákapcsol egy kifejezési formához. @hu
toolkit label: előszó írója @hu
toolkit definition: Egy mű kifejezési módja, amely közreműködést testesít meg azzal, hogy egy eredeti művet előszóval lát el. @hu
has subproperty: P50254

kaivertaja (toimija) manifestaatiossa
status: Published
label: is engraver agent of @en
definition: Relates an agent to a manifestation that involves a responsibility of an agent for cutting letters, figures, etc., on a surface such as a wooden or metal plate used for printing. @en
type: Property
domain: C10002
lexical alias: engraverAgentOf.en
label: est un agent graveur de @fr
definition: Met un agent en relation avec une manifestation qui comporte une responsabilité de la part d’un agent consistant à graver des lettres, des figures, etc. sur une surface telle qu’une plaque de bois ou de métal utilisée pour l’impression. @fr
toolkit label: agent graveur de @fr
toolkit definition: Manifestation qui comporte une responsabilité de la part d’un agent consistant à graver des lettres, des figures, etc. sur une surface telle qu’une plaque de bois ou de métal utilisée pour l’impression. @fr
toolkit label: engraver agent of @en
toolkit definition: A manifestation that involves a responsibility of an agent for cutting letters, figures, etc., on a surface such as a wooden or metal plate used for printing. @en
instruction number: 18.5
label: είναι χαράκτης φορέας του @el
definition: Συνδέει έναν φορέα, ο οποίος εμπλέκεται στην κατασκευή μιας εκδήλωσης μέσω της κοπής γραμμάτων, ψηφίων κ.λπ. σε μια επιφάνεια, όπως μια ξύλινη ή μεταλλική πλάκα που χρησιμοποιείται για την εκτύπωση, με μια εκδήλωση. @el
toolkit label: χαράκτης φορέας του @el
toolkit definition: Μια εκδήλωση που κατασκευάζεται από έναν φορέα υπεύθυνο για την κοπή γραμμάτων, ψηφίων κ.λπ. σε μια επιφάνεια, όπως μια ξύλινη ή μεταλλική πλάκα που χρησιμοποιείται για την εκτύπωση. @el
definition: Setzt einen Akteur in Beziehung zu einer Manifestation, bei der ein Akteur für das Schneiden von Buchstaben, figürlichen Darstellungen oder andere Zeichen in eine Oberfläche, wie zum Beispiel eine Holz- oder Metallplatte, die zum Drucken benutzt wird, verantwortlich ist. @de
toolkit label: Akteur als Stecherin/Stecher von @de
toolkit definition: Eine Manifestation, bei der ein Akteur für das Schneiden von Buchstaben, figürliche Darstellungen oder andere Zeichen in eine Oberfläche, wie zum Beispiel eine Holz- oder Metallplatte, die zum Drucken benutzt wird, verantwortlich ist. @de
label: er agent, som er gravør af @da
definition: Relaterer en agent til en manifestation, som involverer en agents ansvar for at udskære bogstaver, figurer etc. på en overflade såsom en træ- eller metalplade, som anvendes til trykning. @da
toolkit label: agent, som er gravør af @da
toolkit definition: Manifestation, som involverer en agents ansvar for at udskære bogstaver, figurer etc. på en overflade såsom en træ- eller metalplade, som anvendes til trykning. @da
label: és agent gravador de @ca
definition: Relaciona un agent amb una manifestació que implica una responsabilitat d’un agent en la gravació de lletres, figures, etc., sobre una superfície com ara una planxa de fusta o de metall usada en la impressió. @ca
toolkit label: agent gravador de @ca
toolkit definition: Manifestació que implica una responsabilitat d’un agent en la gravació de lletres, figures, etc., sobre una superfície com ara una planxa de fusta o de metall usada en la impressió. @ca
definition: Liittää toimijan manifestaatioon, jossa toimija on vastuussa manifestaation valmistamisesta kaivertamalla kirjaimia, kuvioita tms. painamisessa käytettävälle pinnalle, kuten puu- tai metallipinnalle.
toolkit label: kaivertaja (toimija) manifestaatiossa
toolkit definition: Manifestaatio, jossa toimija on vastuussa manifestaation valmistamisesta kaivertamalla kirjaimia, kuvioita tms. painamisessa käytettävälle pinnalle, kuten puu- tai metallipinnalle.
toolkit label: gravør av (agent) @no
toolkit definition: En manifestasjon som involverer ansvar for en agent i form av utskjæring av bokstaver, figurer, etc. i en overflate som en tre- eller metallplate som brukes til trykking. @no
label: ist Akteur als Stecherin/Stecher von @de
has element type: 2
label: vésnök ágense a következőnek: @hu
definition: Hozzákapcsol egy ágenst egy megjelenés formához, amelyhez hozzátartozik egy ágens felelőssége betűknek, számoknak stb. nyomtatáshoz használt fa- vagy fémlemez felületére történő metszéséért. @hu
toolkit label: vésnök ágense: @hu
toolkit definition: Egy megjelenés forma, amelyhez hozzátartozik egy ágens felelőssége betűknek, számoknak stb. nyomtatáshoz használt fa- vagy fémlemez felületére történő metszéséért. @hu
alternative label: engraver of @en
alternative label: kaivertajana painotuotteessa
label: er gravør av (agent) @no
definition: Relaterer en agent til en manifestasjon som involverer ansvar for en agent i form av utskjæring av bokstaver, figurer, etc. i en overflate som en tre- eller metallplate som brukes til trykking. @no
alternative label: gravør av @no
label: is graveur-actor van @nl
definition: Relateert een actor aan een manifestatie die met zich meebrengt een verantwoordelijkheid van een actor voor het snijden van letters, figuren etc., in een ondergrond zoals een houten of metalen plaat gebruikt voor het drukken. @nl
toolkit label: graveur-actor van @nl
toolkit definition: Een manifestatie die met zich meebrengt een verantwoordelijkheid van een actor voor het snijden van letters, figuren etc., in een ondergrond zoals een houten of metalen plaat gebruikt voor het drukken. @nl
label: هو وكيل نقّاش لـ @ar
definition: يربط وكيلا بتجسيدة تنطوي على مسئولية وكيل عن نقش الحروف والأشكال، الخ، على سطح مثل لوح خشبي أو معدني يستخدم للطباعة. @ar
alternative label: نقّاش @ar
toolkit label: وكيل نقّاش @ar
toolkit definition: تجسيدة تنطوي على مسئولية وكيل عن نقش الحروف والأشكال، الخ، على سطح مثل لوح خشبي أو معدني يستخدم للطباعة. @ar
alternative label: gravador de @ca
alternative label: gravør af @da
label: graveerija (tegija) kehastuses @et
definition: Seostab tegija kehastusega, mis sisaldab tegija vastutust tähtede, kujundite jms lõikamise eest trükkimiseks kasutatava puidust, metallist või muust materjalist plaadi pinnale. @et
alternative label: graveerija kehastuses @et
toolkit label: graveerija (tegija) kehastuses @et
toolkit definition: Kehastus, mis sisaldab tegija vastutust tähtede, kujundite jms lõikamise eest trükkimiseks kasutatava puidust, metallist või muust materjalist plaadi pinnale. @et
alternative label: vésnöke: @hu
label: è agente incisore di @it
definition: Correla un agente a una manifestazione che implica la responsabilità di un agente per l'incisione di lettere, figure, etc., su una superficie come una lastra di legno o metallo utilizzata per la stampa. @it
alternative label: incisore di @it
toolkit label: incisore agente di @it
toolkit definition: Manifestazione che implica la responsabilità di un agente per l'incisione di lettere, figure, etc., su una superficie come una lastra di legno o metallo utilizzata per la stampa. @it
alternative label: χαράκτης του @el
alternative label: graveur de @fr
label: ir gravieris (aģents) @lv
definition: Sasaista aģentu ar manifestāciju, kas ietver aģenta atbildību par burtu, zīmju u.tml. iegriešanu uz drukāšanai izmantojama materiāla virsmas (piemēram, uz koka vai metāla plāksnes). @lv
toolkit label: ir gravieris (aģents) @lv
toolkit definition: Manifestācija, kas ietver aģenta atbildību par burtu, zīmju u.tml. iegriešanu uz drukāšanai izmantojama materiāla virsmas (piemēram, uz koka vai metāla plāksnes). @lv
sub property of: kuvalaatan valmistaja (toimija) manifestaatiossa
alternative label: Stecher von @de
alternative label: ……的雕版者 @zh-hans
toolkit label: ……的雕版者行为者 @zh-hans
toolkit definition: 涉及通过在木版或金属版等表面上雕刻字母、图形等以用于印刷的一个行为者的责任的一种载体表现 @zh-hans
toolkit label: gravür sanatçısı temsilcisi @tr
toolkit definition: Baskı için kullanılan ahşap veya metal bir levha gibi bir yüzey üzerine harf, şekil vb. kesmek için bir temsilcinin sorumluluğunu içeren bir gösterim. @tr
has subproperty: kaivertaja (yhteistoimija) manifestaatiossa

kaivertaja (yhteistoimija) manifestaatiossa
status: Published
label: is engraver collective agent of @en
lexical alias: engraverCollectiveAgentOf.en
definition: Relates a collective agent to a manifestation that involves a responsibility of a collective agent for cutting letters, figures, etc., on a surface such as a wooden or metal plate used for printing. @en
toolkit label: engraver collective agent of @en
toolkit definition: A manifestation that involves a responsibility of a collective agent for cutting letters, figures, etc., on a surface such as a wooden or metal plate used for printing. @en
type: Property
domain: C10011
has element type: 2
sub property of: kaivertaja (toimija) manifestaatiossa
definition: Liittää yhteistoimijan manifestaatioon, jossa yhteistoimija on vastuussa manifestaation valmistamisesta kaivertamalla kirjaimia, kuvioita tms. painamisessa käytettävälle pinnalle, kuten puu- tai metallipinnalle.
toolkit label: kaivertaja (yhteistoimija) manifestaatiossa
toolkit definition: Manifestaatio, jossa yhteistoimija on vastuussa manifestaation valmistamisesta kaivertamalla kirjaimia, kuvioita tms. painamisessa käytettävälle pinnalle, kuten puu- tai metallipinnalle.
label: er gravør for (kollektiv agent) @no
definition: Relaterer en kollektiv agent til en manifestasjon som involverer et ansvar for en kollektiv agent i form av å skjære ut bokstaver, figurer, etc. i en overflate som en tre- eller metallplate som brukes til trykking. @no
toolkit label: gravør for (kollektiv agent) @no
toolkit definition: En manifestasjon som involverer et ansvar for en kollektiv agent i form av å skjære ut bokstaver, figurer, etc. i en overflate som en tre- eller metallplate som brukes til trykking. @no
label: is graveur-collectieve actor van @nl
definition: Relateert een collectieve actor aan een manifestatie die met zich meebrengt een verantwoordelijkheid van een collectieve actor voor het snijden van letters, figuren etc., in een ondergrond zoals een houten of metalen plaat gebruikt voor het drukken. @nl
toolkit label: graveur-collectieve actor van @nl
toolkit definition: Een manifestatie die met zich meebrengt een verantwoordelijkheid van een collectieve actor voor het snijden van letters, figuren etc., in een ondergrond zoals een houten of metalen plaat gebruikt voor het drukken. @nl
label: هو وكيل جماعي نقّاش لـ @ar
definition: يربط وكيلا جماعيا بتجسيدة تنطوي على مسئولية وكيل جماعي عن رص الحروف والأشكال، الخ، على سطح مثل لوح خشبي أو معدني يستخدم للطباعة. @ar
toolkit label: وكيل جماعي نقاش @ar
toolkit definition: تجسيدة تنطوي على مسئولية وكيل جماعي عن رص الحروف والأشكال، الخ، على سطح مثل لوح خشبي أو معدني يستخدم للطباعة. @ar
label: és agent col·lectiu gravador de @ca
definition: Relaciona un agent col·lectiu amb una manifestació que implica una responsabilitat d’un agent col·lectiu en la gravació de lletres, figures, etc., sobre una superfície com ara una planxa de fusta o de metall usada en la impressió. @ca
toolkit label: agent col·lectiu gravador de @ca
toolkit definition: Manifestació que implica una responsabilitat d’un agent col·lectiu en la gravació de lletres, figures, etc., sobre una superfície com ara una planxa de fusta o de metall usada en la impressió. @ca
label: er kollektiv agent, som er gravør af @da
definition: Relaterer en kollektiv agent til en manifestation, som involverer en kollektiv agents ansvar for at udskære bogstaver, figurer etc. på en overflade såsom en træ- eller metalplade, som anvendes til trykning. @da
toolkit label: kollektiv agent, som er gravør af @da
toolkit definition: Manifestation, som involverer en kollektiv agents ansvar for at udskære bogstaver, figurer etc. på en overflade såsom en træ- eller metalplade, som anvendes til trykning. @da
label: graveerija (kollektiiv) kehastuses @et
definition: Seostab kollektiivi kehastusega, mis sisaldab kollektiivi vastutust tähtede, kujundite jms lõikamise eest trükkimiseks kasutatava puidust, metallist või muust materjalist plaadi pinnale. @et
toolkit label: graveerija (kollektiiv) kehastuses @et
toolkit definition: Kehastus, mis sisaldab kollektiivi vastutust tähtede, kujundite jms lõikamise eest trükkimiseks kasutatava puidust, metallist või muust materjalist plaadi pinnale. @et
label: ist gemeinschaftlicher Akteur als Stecherin/Stecher von @de
definition: Setzt einen gemeinschaftlichen Akteur in Beziehung zu einer Manifestation, bei der ein gemeinschaftlicher Akteur für das Schneiden von Buchstaben, figürlichen Darstellungen oder andere Zeichen in eine Oberfläche, wie zum Beispiel eine Holz- oder Metallplatte, die zum Drucken benutzt wird, verantwortlich ist. @de
toolkit label: Gemeinschaftlicher Akteur als Stecherin/Stecher von @de
toolkit definition: Eine Manifestation, bei der ein gemeinschaftlicher Akteur für das Schneiden von Buchstaben, figürlichen Darstellungen oder andere Zeichen in eine Oberfläche, wie zum Beispiel eine Holz- oder Metallplatte, die zum Drucken benutzt wird, verantwortlich ist. @de
label: vésnök kollektív ágense a következőnek: @hu
definition: Hozzákapcsol egy kollektív ágenst egy megjelenési formához, amelyhez hozzátartozik egy kollektív ágens felelőssége betűknek, számoknak stb. nyomtatáshoz használt fa- vagy fémlemez felületére történő metszéséért. @hu
toolkit label: vésnök kollektív ágense: @hu
toolkit definition: Egy megjelenési forma, amelyhez hozzátartozik egy kollektív ágens felelőssége betűknek, számoknak stb. nyomtatáshoz használt fa- vagy fémlemez felületére történő metszéséért. @hu
label: è incisore agente collettivo di @it
definition: Correla un agente collettivo a una manifestazione che implica una responsabilità di un agente collettivo per l'incisione di lettere, figure, etc., su una superficie come una lastra di legno o metallo utilizzata per la stampa. @it
toolkit label: incisore agente collettivo di @it
toolkit definition: Manifestazione che implica una responsabilità di un agente collettivo per l'incisione di lettere, figure, etc., su una superficie come una lastra di legno o metallo utilizzata per la stampa. @it
label: είναι χαράκτης συλλογικός φορέας του @el
toolkit label: χαράκτης συλλογικός φορέας του @el
label: est un agent collectif graveur de @fr
definition: Met un agent collectif en relation avec une manifestation qui comporte une responsabilité de la part d’un agent collectif consistant à graver des lettres, des figures, etc. sur une surface telle qu’une plaque de bois ou de métal utilisée pour l’impression. @fr
toolkit label: agent collectif graveur de @fr
toolkit definition: Manifestation qui comporte une responsabilité de la part d’un agent collectif consistant à graver des lettres, des figures, etc. sur une surface telle qu’une plaque de bois ou de métal utilisée pour l’impression. @fr
label: ir gravieris (grupa) @lv
definition: Sasaista grupu ar manifestāciju, kas ietver grupas atbildību par burtu, zīmju u.tml. iegriešanu uz drukāšanai izmantojama materiāla virsmas (piemēram, uz koka vai metāla plāksnes). @lv
toolkit label: ir gravieris (grupa) @lv
toolkit definition: Manifestācija, kas ietver grupas atbildību par burtu, zīmju u.tml. iegriešanu uz drukāšanai izmantojama materiāla virsmas (piemēram, uz koka vai metāla plāksnes). @lv
sub property of: kuvalaatan valmistaja (yhteistoimija) manifestaatiossa
label: 是……的雕版者集体行为者 @zh-hans
definition: 将一个集体行为者与涉及通过在木版或金属版等表面上雕刻字母、图形等以用于印刷的一个集体行为者的责任的一种载体表现关联起来。 @zh-hans
toolkit label: ……的雕版者集体行为者 @zh-hans
toolkit definition: 涉及通过在木版或金属版等表面上雕刻字母、图形等以用于印刷的一个集体行为者的责任的一种载体表现 @zh-hans
label: gravür sanatçısı kolektif temsilcisidir @tr
definition: Kolektif bir temsilciyi, baskı için kullanılan ahşap veya metal bir plaka gibi bir yüzey üzerinde harfleri, şekilleri vb. kesmek için kolektif bir temsilcinin sorumluluğunu içeren bir gösterimle ilişkilendirir. @tr
toolkit label: gravür sanatçısı kolektif temsilcisi @tr
toolkit definition: Baskı için kullanılan ahşap veya metal bir plaka gibi bir yüzey üzerine harfleri, şekilleri vb. kesmek için kolektif bir temsilcinin sorumluluğunu içeren bir gösterim. @tr
has subproperty: kaivertaja (yhteisö) manifestaatiossa
has subproperty: kaivertaja (suku) manifestaatiossa
has subproperty: P50646

kaivertaja (yhteisö) manifestaatiossa
status: Published
label: is engraver corporate body of @en
lexical alias: engraverCorporateBodyOf.en
definition: Relates a corporate body to a manifestation that involves a responsibility of a corporate body for cutting letters, figures, etc., on a surface such as a wooden or metal plate used for printing. @en
toolkit label: engraver corporate body of @en
toolkit definition: A manifestation that involves a responsibility of a corporate body for cutting letters, figures, etc., on a surface such as a wooden or metal plate used for printing. @en
type: Property
domain: C10005
has element type: 2
sub property of: kaivertaja (yhteistoimija) manifestaatiossa
definition: Liittää yhteisön manifestaatioon, jossa yhteisö on vastuussa manifestaation valmistamisesta kaivertamalla kirjaimia, kuvioita tms. painamisessa käytettävälle pinnalle, kuten puu- tai metallipinnalle.
toolkit label: kaivertaja (yhteisö) manifestaatiossa
toolkit definition: Manifestaatio, jossa yhteisö on vastuussa manifestaation valmistamisesta kaivertamalla kirjaimia, kuvioita tms. painamisessa käytettävälle pinnalle, kuten puu- tai metallipinnalle.
label: er gravør for (korporasjon) @no
definition: Relaterer en korporasjon til en manifestasjon som involverer et ansvar for en korporasjon i form av å skjære ut bokstaver, figurer, etc. i en overflate som en tre- eller metallplate som brukes til trykking. @no
toolkit label: gravør for (korporasjon) @no
toolkit definition: En manifestasjon som involverer et ansvar for en korporasjon i form av å skjære ut bokstaver, figurer, etc. i en overflate som en tre- eller metallplate som brukes til trykking. @no
label: is graveur-corporatie van @nl
definition: Relateert een corporatie aan een manifestatie die met zich meebrengt een verantwoordelijkheid van een corporatie voor het snijden van letters, figuren etc., in een ondergrond zoals een houten of metalen plaat gebruikt voor het drukken. @nl
toolkit label: graveur-corporatie van @nl
toolkit definition: Een manifestatie die met zich meebrengt een verantwoordelijkheid van een corporatie voor het snijden van letters, figuren etc., in een ondergrond zoals een houten of metalen plaat gebruikt voor het drukken. @nl
label: هي هيئة مسئولة عن النقش @ar
definition: يربط هيئة بتجسيدة تنطوي على مسئولية هيئة عن رص الحروف والأشكال، الخ، على سطح مثل لوح خشبي أو معدني يستخدم للطباعة. @ar
toolkit label: هيئة مسئولة عن النقش @ar
toolkit definition: تجسيدة تنطوي على مسئولية هيئة عن رص الحروف والأشكال، الخ، على سطح مثل لوح خشبي أو معدني يستخدم للطباعة. @ar
label: és entitat corporativa gravadora de @ca
definition: Relaciona una entitat corporativa amb una manifestació que implica una responsabilitat d’una entitat corporativa en la gravació de lletres, figures, etc., sobre una superfície com ara una planxa de fusta o de metall usada en la impressió. @ca
toolkit label: entitat corporativa gravadora de @ca
toolkit definition: Manifestació que implica una responsabilitat d’una entitat corporativa en la gravació de lletres, figures, etc., sobre una superfície com ara una planxa de fusta o de metall usada en la impressió. @ca
label: er korporation, som er gravør af @da
definition: Relaterer en korporation til en manifestation, som involverer en korporations ansvar for at udskære bogstaver, figurer etc. på en overflade såsom en træ- eller metalplade, som anvendes til trykning. @da
toolkit label: korporation, som er gravør af @da
toolkit definition: Manifestation, som involverer en korporations ansvar for at udskære bogstaver, figurer etc. på en overflade såsom en træ- eller metalplade, som anvendes til trykning. @da
label: graveerija (asutus) kehastuses @et
definition: Seostab asutuse kehastusega, mis sisaldab asutuse vastutust tähtede, kujundite jms lõikamise eest trükkimiseks kasutatava puidust, metallist või muust materjalist plaadi pinnale. @et
toolkit label: graveerija (asutus) kehastuses @et
toolkit definition: Kehastus, mis sisaldab asutuse vastutust tähtede, kujundite jms lõikamise eest trükkimiseks kasutatava puidust, metallist või muust materjalist plaadi pinnale. @et
label: ist Körperschaft als Stecherin/Stecher von @de
definition: Setzt eine Körperschaft in Beziehung zu einer Manifestation, bei der eine Körperschaft für das Schneiden von Buchstaben, figürlichen Darstellungen oder andere Zeichen in eine Oberfläche, wie zum Beispiel eine Holz- oder Metallplatte, die zum Drucken benutzt wird, verantwortlich ist. @de
toolkit label: Körperschaft als Stecherin/Stecher von @de
toolkit definition: Eine Manifestation, bei der eine Körperschaft für das Schneiden von Buchstaben, figürlichen Darstellungen oder andere Zeichen in eine Oberfläche, wie zum Beispiel eine Holz- oder Metallplatte, die zum Drucken benutzt wird, verantwortlich ist. @de
label: vésnök testülete a következőnek: @hu
definition: Hozzákapcsol egy testületet egy megjelenési formához, amelyhez hozzátartozik egy testület felelőssége betűknek, számoknak stb. nyomtatáshoz használt fa- vagy fémlemez felületére történő metszéséért. @hu
toolkit label: vésnök testülete: @hu
toolkit definition: Egy megjelenési forma, amelyhez hozzátartozik egy testület felelőssége betűknek, számoknak stb. nyomtatáshoz használt fa- vagy fémlemez felületére történő metszéséért. @hu
label: è incisore ente di @it
definition: Correla un ente a una manifestazione che implica una responsabilità di un ente per l'incisione di lettere, figure, etc., su una superficie come una lastra di legno o metallo utilizzata per la stampa. @it
toolkit label: incisore ente di @it
toolkit definition: Manifestazione che implica una responsabilità di un ente per l'incisione di lettere, figure, etc., su una superficie come una lastra di legno o metallo utilizzata per la stampa. @it
label: είναι χαράκτης συλλογικό όργανο του @el
toolkit label: χαράκτης συλλογικό όργανο του @el
label: est une collectivité graveuse de @fr
definition: Met une collectivité en relation avec une manifestation qui comporte une responsabilité de la part d’une collectivité consistant à graver des lettres, des figures, etc. sur une surface telle qu’une plaque de bois ou de métal utilisée pour l’impression. @fr
toolkit label: collectivité graveuse de @fr
toolkit definition: Manifestation qui comporte une responsabilité de la part d’une collectivité consistant à graver des lettres, des figures, etc. sur une surface telle qu’une plaque de bois ou de métal utilisée pour l’impression. @fr
label: ir gravieris (institūcija) @lv
definition: Sasaista institūciju ar manifestāciju, kas ietver institūcijas atbildību par burtu, zīmju u.tml. iegriešanu uz drukāšanai izmantojama materiāla virsmas (piemēram, uz koka vai metāla plāksnes). @lv
toolkit label: ir gravieris (institūcija) @lv
toolkit definition: Manifestācija, kas ietver institūcijas atbildību par burtu, zīmju u.tml. iegriešanu uz drukāšanai izmantojama materiāla virsmas (piemēram, uz koka vai metāla plāksnes). @lv
sub property of: kuvalaatan valmistaja (yhteisö) manifestaatiossa
label: 是……的雕版者团体 @zh-hans
definition: 将一个团体与涉及通过在木版或金属版等表面上雕刻字母、图形等以用于印刷的一个团体的责任的一种载体表现关联起来。 @zh-hans
toolkit label: ……的雕版者团体 @zh-hans
toolkit definition: 涉及通过在木版或金属版等表面上雕刻字母、图形等以用于印刷的一个团体的责任的一种载体表现 @zh-hans
label: gravür sanatçısı tüzel kişisidir @tr
definition: Bir tüzel kişiyi, baskı için kullanılan ahşap veya metal plaka gibi bir yüzey üzerinde harflerin, şekillerin vb. kesilmesi için tüzel bir kişiliğin sorumluluğunu içeren bir gösterimle ilişkilendirir. @tr
toolkit label: gravür sanatçısı tüzel kişisi @tr
toolkit definition: Baskı için kullanılan ahşap veya metal plaka gibi bir yüzey üzerinde harflerin, şekillerin vb. kesilmesi için tüzel bir kişinin sorumluluğunu içeren bir gösterim. @tr
has subproperty: P50797

kaivertaja (suku) manifestaatiossa
status: Published
label: is engraver family of @en
lexical alias: engraverFamilyOf.en
definition: Relates a family to a manifestation that involves a responsibility of a family for cutting letters, figures, etc., on a surface such as a wooden or metal plate used for printing. @en
toolkit label: engraver family of @en
toolkit definition: A manifestation that involves a responsibility of a family for cutting letters, figures, etc., on a surface such as a wooden or metal plate used for printing. @en
type: Property
domain: C10008
has element type: 2
sub property of: kaivertaja (yhteistoimija) manifestaatiossa
definition: Liittää suvun manifestaatioon, jossa suku on vastuussa manifestaation valmistamisesta kaivertamalla kirjaimia, kuvioita tms. painamisessa käytettävälle pinnalle, kuten puu- tai metallipinnalle.
toolkit label: kaivertaja (suku) manifestaatiossa
toolkit definition: Manifestaatio, jossa suku on vastuussa manifestaation valmistamisesta kaivertamalla kirjaimia, kuvioita tms. painamisessa käytettävälle pinnalle, kuten puu- tai metallipinnalle.
label: er gravør for (familie) @no
definition: Relaterer en familie til en manifestasjon som involverer et ansvar for en familie i form av å skjære ut bokstaver, figurer, etc. i en overflate som en tre- eller metallplate som brukes til trykking. @no
toolkit label: gravør for (familie) @no
toolkit definition: En manifestasjon som involverer et ansvar for en familie i form av å skjære ut bokstaver, figurer, etc. i en overflate som en tre- eller metallplate som brukes til trykking. @no
label: is graveur-familie van @nl
definition: Relateert een familie aan een manifestatie die met zich meebrengt een verantwoordelijkheid van een familie voor het snijden van letters, figuren etc., in een ondergrond zoals een houten of metalen plaat gebruikt voor het drukken. @nl
toolkit label: graveur-familie van @nl
toolkit definition: Een manifestatie die met zich meebrengt een verantwoordelijkheid van een familie voor het snijden van letters, figuren etc., in een ondergrond zoals een houten of metalen plaat gebruikt voor het drukken. @nl
label: هي عائلة مسئولة عن النقش @ar
definition: يربط عائلة بتجسيدة تنطوي على مسئولية عائلة عن رص الحروف والأشكال، الخ، على سطح مثل لوح خشبي أو معدني يستخدم للطباعة. @ar
toolkit label: عائلة مسئولة عن النقش @ar
toolkit definition: تجسيدة تنطوي على مسئولية عائلة عن رص الحروف والأشكال، الخ، على سطح مثل لوح خشبي أو معدني يستخدم للطباعة. @ar
label: és família gravadora de @ca
definition: Relaciona una família amb una manifestació que implica una responsabilitat d’una família en la gravació de lletres, figures, etc., sobre una superfície com ara una planxa de fusta o de metall usada en la impressió. @ca
toolkit label: família gravadora de @ca
toolkit definition: Manifestació que implica una responsabilitat d’una família en la gravació de lletres, figures, etc., sobre una superfície com ara una planxa de fusta o de metall usada en la impressió. @ca
label: er familie, som er gravør af @da
definition: Relaterer en familie til en manifestation, som involverer en families ansvar for at udskære bogstaver, figurer etc. på en overflade såsom en træ- eller metalplade, som anvendes til trykning. @da
toolkit label: familie, som er gravør af @da
toolkit definition: Manifestation, som involverer en families ansvar for at udskære bogstaver, figurer etc. på en overflade såsom en træ- eller metalplade, som anvendes til trykning. @da
label: graveerija (perekond) kehastuses @et
definition: Seostab perekonna kehastusega, mis sisaldab perekonna vastutust tähtede, kujundite jms lõikamise eest trükkimiseks kasutatava puidust, metallist või muust materjalist plaadi pinnale. @et
toolkit label: graveerija (perekond) kehastuses @et
toolkit definition: Kehastus, mis sisaldab perekonna vastutust tähtede, kujundite jms lõikamise eest trükkimiseks kasutatava puidust, metallist või muust materjalist plaadi pinnale. @et
label: ist Familie als Stecherin/Stecher von @de
definition: Setzt eine Familie in Beziehung zu einer Manifestation, bei der eine Familie für das Schneiden von Buchstaben, figürlichen Darstellungen oder andere Zeichen in eine Oberfläche, wie zum Beispiel eine Holz- oder Metallplatte, die zum Drucken benutzt wird, verantwortlich ist. @de
toolkit label: Familie als Stecherin/Stecher von @de
toolkit definition: Eine Manifestation, bei der eine Familie für das Schneiden von Buchstaben, figürlichen Darstellungen oder andere Zeichen in eine Oberfläche, wie zum Beispiel eine Holz- oder Metallplatte, die zum Drucken benutzt wird, verantwortlich ist. @de
label: vésnök családja a következőnek: @hu
definition: Hozzákapcsol egy családot egy megjelenési formához, amelyhez hozzátartozik egy család felelőssége betűknek, számoknak stb. nyomtatáshoz használt fa- vagy fémlemez felületére történő metszéséért. @hu
toolkit label: vésnök családja: @hu
toolkit definition: Egy kifejezési forma, amelyhez hozzátartozik egy család felelőssége betűknek, számoknak stb. nyomtatáshoz használt fa- vagy fémlemez felületére történő metszéséért. @hu
label: è incisore famiglia di @it
definition: Correla una famiglia a una manifestazione che implica una responsabilità di una famiglia per l'incisione di lettere, figure, etc., su una superficie come una lastra di legno o metallo utilizzata per la stampa. @it
toolkit label: incisore famiglia di @it
toolkit definition: Manifestazione che implica una responsabilità di una famiglia per l'incisione di lettere, figure, etc., su una superficie come una lastra di legno o metallo utilizzata per la stampa. @it
label: είναι χαράκτης οικογένεια του @el
toolkit label: χαράκτης οικογένεια του @el
label: est une famille graveuse de @fr
definition: Met une famille en relation avec une manifestation qui comporte une responsabilité de la part d’une famille consistant à graver des lettres, des figures, etc. sur une surface telle qu’une plaque de bois ou de métal utilisée pour l’impression. @fr
toolkit label: famille graveuse de @fr
toolkit definition: Manifestation qui comporte une responsabilité de la part d’une famille consistant à graver des lettres, des figures, etc. sur une surface telle qu’une plaque de bois ou de métal utilisée pour l’impression. @fr
label: ir gravieris (dzimta/ģimene) @lv
definition: Sasaista dzimtu/ģimeni ar manifestāciju, kas ietver dzimtas/ģimenes atbildību par burtu, zīmju u.tml. iegriešanu uz drukāšanai izmantojama materiāla virsmas (piemēram, uz koka vai metāla plāksnes). @lv
toolkit label: ir gravieris (dzimta/ģimene) @lv
toolkit definition: Manifestācija, kas ietver dzimtas/ģimenes atbildību par burtu, zīmju u.tml. iegriešanu uz drukāšanai izmantojama materiāla virsmas (piemēram, uz koka vai metāla plāksnes). @lv
sub property of: kuvalaatan valmistaja (suku) manifestaatiossa
label: 是……的雕版者家族 @zh-hans
definition: 将一个家族与涉及通过在木版或金属版等表面上雕刻字母、图形等以用于印刷的一个家族的责任的一种载体表现关联起来。 @zh-hans
toolkit label: ……的雕版者家族 @zh-hans
toolkit definition: 涉及通过在木版或金属版等表面上雕刻字母、图形等以用于印刷的一个家族的责任的一种载体表现 @zh-hans
label: gravür sanatçısı ailesidir @tr
definition: Bir aileyi, baskı için kullanılan ahşap veya metal bir plaka gibi bir yüzey üzerinde harfleri, şekilleri vb. kesme sorumluluğunu içeren gösterimle ilişkilendirir. @tr
toolkit label: gravür sanatçısı aile @tr
toolkit definition: Baskı için kullanılan ahşap veya metal plaka gibi bir yüzey üzerinde harfleri, şekilleri vb. kesmek için bir ailenin sorumluluğunu içeren bir gösterim. @tr
has subproperty: P50948

kaivertaja (henkilö) manifestaatiossa
status: Published
label: is engraver person of @en
lexical alias: engraverPersonOf.en
definition: Relates a person to a manifestation that involves a responsibility of a person for cutting letters, figures, etc., on a surface such as a wooden or metal plate used for printing. @en
toolkit label: engraver person of @en
toolkit definition: A manifestation that involves a responsibility of a person for cutting letters, figures, etc., on a surface such as a wooden or metal plate used for printing. @en
type: Property
domain: C10004
has element type: 2
sub property of: kaivertaja (toimija) manifestaatiossa
definition: Liittää henkilön manifestaatioon, jossa henkilö on vastuussa manifestaation valmistamisesta kaivertamalla kirjaimia, kuvioita tms. painamisessa käytettävälle pinnalle, kuten puu- tai metallipinnalle.
toolkit label: kaivertaja (henkilö) manifestaatiossa
toolkit definition: Manifestaatio, jossa henkilö on vastuussa manifestaation valmistamisesta kaivertamalla kirjaimia, kuvioita tms. painamisessa käytettävälle pinnalle, kuten puu- tai metallipinnalle.
label: er gravør for (person) @no
definition: Relaterer en person til en manifestasjon som involverer et ansvar for en person i form av å skjære ut bokstaver, figurer, etc. i en overflate som en tre- eller metallplate som brukes til trykking. @no
toolkit label: gravør for (person) @no
toolkit definition: En manifestasjon som involverer et ansvar for en person i form av å skjære ut bokstaver, figurer, etc. i en overflate som en tre- eller metallplate som brukes til trykking. @no
label: is graveur-persoon van @nl
definition: Relateert een persoon aan een manifestatie die met zich meebrengt een verantwoordelijkheid van een persoon voor het snijden van letters, figuren etc., in een ondergrond zoals een houten of metalen plaat gebruikt voor het drukken. @nl
toolkit label: graveur-persoon van @nl
toolkit definition: Een manifestatie die met zich meebrengt een verantwoordelijkheid van een persoon voor het snijden van letters, figuren etc., in een ondergrond zoals een houten of metalen plaat gebruikt voor het drukken. @nl
label: هو شخص نقاش لـ @ar
definition: يربط شخصا بتجسيدة تنطوي على مسئولية شخص عن رص الحروف والأشكال، الخ، على سطح مثل لوح خشبي أو معدني يستخدم للطباعة. @ar
toolkit label: شخص نقاش @ar
toolkit definition: تجسيدة تنطوي على مسئولية شخص عن رص الحروف والأشكال، الخ، على سطح مثل لوح خشبي أو معدني يستخدم للطباعة. @ar
label: és persona gravadora de @ca
definition: Relaciona una persona amb una manifestació que implica una responsabilitat d’una persona en la gravació de lletres, figures, etc., sobre una superfície com ara una planxa de fusta o de metall usada en la impressió. @ca
toolkit label: persona gravadora de @ca
toolkit definition: Manifestació que implica una responsabilitat d’una persona en la gravació de lletres, figures, etc., sobre una superfície com ara una planxa de fusta o de metall usada en la impressió. @ca
label: er person, som er gravør af @da
definition: Relaterer en person til en manifestation, som involverer en persons ansvar for at udskære bogstaver, figurer etc. på en overflade såsom en træ- eller metalplade, som anvendes til trykning. @da
toolkit label: person, som er gravør af @da
toolkit definition: Manifestation, som involverer en persons ansvar for at udskære bogstaver, figurer etc. på en overflade såsom en træ- eller metalplade, som anvendes til trykning. @da
label: graveerija (isik) kehastuses @et
definition: Seostab isiku kehastusega, mis sisaldab isiku vastutust tähtede, kujundite jms lõikamise eest trükkimiseks kasutatava puidust, metallist või muust materjalist plaadi pinnale. @et
toolkit label: graveerija (isik) kehastuses @et
toolkit definition: Kehastus, mis sisaldab isiku vastutust tähtede, kujundite jms lõikamise eest trükkimiseks kasutatava puidust, metallist või muust materjalist plaadi pinnale. @et
label: ist Person als Stecherin/Stecher von @de
definition: Setzt eine Person in Beziehung zu einer Manifestation, bei der eine Person für das Schneiden von Buchstaben, figürlichen Darstellungen oder andere Zeichen in eine Oberfläche, wie zum Beispiel eine Holz- oder Metallplatte, die zum Drucken benutzt wird, verantwortlich ist. @de
toolkit label: Person als Stecherin/Stecher von @de
toolkit definition: Eine Manifestation, bei der eine Person für das Schneiden von Buchstaben, figürlichen Darstellungen oder andere Zeichen in eine Oberfläche, wie zum Beispiel eine Holz- oder Metallplatte, die zum Drucken benutzt wird, verantwortlich ist. @de
label: vésnök személye a következőnek: @hu
definition: Hozzákapcsol egy személyt egy megjelenési formához, amelyhez hozzátartozik egy személy felelőssége betűknek, számoknak stb. nyomtatáshoz használt fa- vagy fémlemez felületére történő metszéséért. @hu
toolkit label: vésnök személye: @hu
toolkit definition: Egy megjelenési forma, amelyhez hozzátartozik egy személy felelőssége betűknek, számoknak stb. nyomtatáshoz használt fa- vagy fémlemez felületére történő metszéséért. @hu
label: è incisore persona di @it
definition: Correla una persona a una manifestazione che implica una responsabilità di una persona per l'incisione di lettere, figure, etc., su una superficie come una lastra di legno o metallo utilizzata per la stampa. @it
toolkit label: incisore persona di @it
toolkit definition: Manifestazione che implica una responsabilità di una persona per l'incisione di lettere, figure, etc., su una superficie come una lastra di legno o metallo utilizzata per la stampa. @it
label: είναι χαράκτης φυσικό πρόσωπο του @el
toolkit label: χαράκτης φυσικό πρόσωπο του @el
label: est une personne graveuse de @fr
definition: Met une personne en relation avec une manifestation qui comporte une responsabilité de la part d’une personne consistant à graver des lettres, des figures, etc. sur une surface telle qu’une plaque de bois ou de métal utilisée pour l’impression. @fr
toolkit label: personne graveuse de @fr
toolkit definition: Manifestation qui comporte une responsabilité de la part d’une personne consistant à graver des lettres, des figures, etc. sur une surface telle qu’une plaque de bois ou de métal utilisée pour l’impression. @fr
label: ir gravieris (persona) @lv
definition: Sasaista personu ar manifestāciju, kas ietver personas atbildību par burtu, zīmju u.tml. iegriešanu uz drukāšanai izmantojama materiāla virsmas (piemēram, uz koka vai metāla plāksnes). @lv
toolkit label: ir gravieris (persona) @lv
toolkit definition: Manifestācija, kas ietver personas atbildību par burtu, zīmju u.tml. iegriešanu uz drukāšanai izmantojama materiāla virsmas (piemēram, uz koka vai metāla plāksnes). @lv
sub property of: kuvalaatan valmistaja (henkilö) manifestaatiossa
label: 是……的雕版者个人 @zh-hans
definition: 将一个个人与涉及在木质或金属印刷平板的表面上刻字母、图形等的一个个人的责任的一种载体表现关联起来。 @zh-hans
toolkit label: ……的雕版者个人 @zh-hans
toolkit definition: 涉及在木质或金属印刷平板的表面上刻字母、图形等的一个个人的责任的一种载体表现 @zh-hans
label: gravür sanatçısı kişisidir @tr
definition: Bir kişiyi, baskı için kullanılan ahşap veya metal bir levha gibi bir yüzey üzerine harf, şekil vb. kesme sorumluluğunu içeren gösterimle ilişkilendirir. @tr
toolkit label: gravür sanatçısı @tr
toolkit definition: Baskı için kullanılan ahşap veya metal bir levha gibi bir yüzey üzerine harf, şekil vb. kesmek için bir kişinin sorumluluğunu içeren bir gösterim. @tr
has subproperty: P50495

etsaaja (toimija) mainifestaatiossa
status: Published
label: is etcher agent of @en
definition: Relates an agent to a manifestation that involves a responsibility of an agent for subjecting metal, glass, or some other surface used for printing, to acid or another corrosive substance. @en
type: Property
domain: C10002
lexical alias: etcherAgentOf.en
label: est un agent aquafortiste de @fr
definition: Met un agent en relation avec une manifestation qui comporte une responsabilité de la part d’un agent consistant à soumettre à l’acide ou à une autre substance corrosive du métal, du verre ou une autre surface utilisée pour l’impression. @fr
toolkit label: agent aquafortiste de @fr
toolkit definition: Manifestation qui comporte une responsabilité de la part d’un agent consistant à soumettre à l’acide ou à une autre substance corrosive du métal, du verre ou une autre surface utilisée pour l’impression. @fr
toolkit label: etcher agent of @en
toolkit definition: A manifestation that involves a responsibility of an agent for subjecting metal, glass, or some other surface used for printing, to acid or another corrosive substance. @en
instruction number: 18.5
label: είναι οξυγράφος φορέας του @el
definition: Συνδέει έναν φορέα, ο οποίος εμπλέκεται στην κατασκευή μιας εκδήλωσης υποβάλλοντας μέταλλο, γυαλί ή κάποια άλλη επιφάνεια που χρησιμοποιείται για την εκτύπωση, σε οξύ ή άλλη οξειδωτική ουσία, με μια εκδήλωση. @el
toolkit label: οξυγράφος φορέας του @el
toolkit definition: Μια εκδήλωση που κατασκευάζεται από έναν φορέα υπεύθυνο για την υποβολή μετάλλου, γυαλιού ή κάποιας άλλης επιφάνειας που χρησιμοποιείται για εκτύπωση, σε οξύ ή άλλη οξειδωτική ουσία. @el
definition: Setzt einen Akteur in Beziehung zu einer Manifestation, bei der ein Akteur dafür verantwortlich ist, Metall, Glas oder eine andere Oberfläche, die zum Drucken benutzt wird, mit Säure oder einer anderen ätzenden Substanz zu behandeln. @de
toolkit label: Akteur als Radiererin/Radierer von @de
toolkit definition: Eine Manifestation, bei der ein Akteur dafür verantwortlich ist, Metall, Glas oder eine andere Oberfläche, die zum Drucken benutzt wird, mit Säure oder einer anderen ätzenden Substanz zu behandeln. @de
label: er agent, som er raderer af @da
definition: Relaterer en agent til en manifestation, som involverer en agents ansvar for at udsætte metal, glas eller en anden overflade, som anvendes til trykning, for syre eller et andet ætsende stof. @da
toolkit label: agent, som er raderer af @da
toolkit definition: Manifestation, som involverer en agents ansvar for at udsætte metal, glas eller en anden overflade, som anvendes til trykning, for syre eller et andet ætsende stof. @da
label: és agent aiguafortista de @ca
definition: Relaciona un agent amb una manifestació que implica una responsabilitat d’un agent sotmetent a l’àcid, o a qualsevol altra substància corrosiva, el metall, el vidre o qualsevol altra superfície usada en la impressió. @ca
toolkit label: agent aiguafortista de @ca
toolkit definition: Manifestació que implica una responsabilitat d’un agent sotmetent a l’àcid, o a qualsevol altra substància corrosiva, el metall, el vidre o qualsevol altra superfície usada en la impressió. @ca
definition: Liittää toimijan manifestaatioon, jossa toimija on vastuussa metallin, lasin tms. pinnan etsaamisesta hapon tai muun syövyttävän aineen avulla.
toolkit label: etsaaja (toimija) mainifestaatiossa
toolkit definition: Manifestaatio, jossa toimija on vastuussa metallin, lasin tms. pinnan etsaamisesta hapon tai muun syövyttävän aineen avulla.
toolkit label: etser av (agent) @no
toolkit definition: En manifestasjon som involverer ansvar for en agent i form av å utsette metall, glass eller et annet overflatemateriale som brukes til trykking, for syre eller et annet etsende stoff. @no
label: ist Akteur als Radiererin/Radierer von @de
has element type: 2
label: karckészítő ágense a következőnek: @hu
definition: Hozzákapcsol egy ágenst egy megjelenési formához, amelyhez hozzátartozik egy ágens felelőssége nyomtatáshoz használt fém-, üveg- vagy valamilyen más felület savnak vagy más maró anyagnak történő alávetéséért. @hu
toolkit label: karckészítő ágense: @hu
toolkit definition: Egy megjelenési forma, amelyhez hozzátartozik egy ágens felelőssége nyomtatáshoz használt fém-, üveg- vagy valamilyen más felület savnak vagy más maró anyagnak történő alávetéséért. @hu
alternative label: etcher of @en
alternative label: etsaajana etsauksessa
label: er etser av (agent) @no
definition: Relaterer en agent til en manifestasjon som involverer ansvar for en agent i form av å utsette metall, glass eller et annet overflatemateriale som brukes til trykking, for syre eller et annet etsende stoff. @no
alternative label: etser av @no
label: is etser-actor van @nl
definition: Relateert een actor aan een manifestatie die met zich meebrengt een verantwoordelijkheid van een actor voor het onderwerpen van metaal, glas of een ander oppervlak gebruikt voor drukken, aan zuur of andere bijtende substantie. @nl
toolkit label: etser-actor van @nl
toolkit definition: Een manifestatie die met zich meebrengt een verantwoordelijkheid van een actor voor het onderwerpen van metaal, glas of een ander oppervlak gebruikt voor drukken, aan zuur of andere bijtende substantie. @nl
label: هو وكيل حَفَّارُ بالزِنْكُوغْراف (الكليشيهات) لـ @ar
definition: يربط وكيلا بتجسيدة تنطوي على مسئولية وكيل عن غمر معدن أو زجاج أو أي سطح آخر يستخدم للطباعة، في حامض، أو في أي مادة أخرى كاوية. @ar
alternative label: حَفَّارُ زِنْكُوغْراف (الكليشيهات) @ar
toolkit label: وكيل حَفَّارُ بالزِنْكُوغْراف (الكليشيهات) @ar
toolkit definition: تجسيدة تنطوي على مسئولية وكيل عن غمر معدن أو زجاج أو أي سطح آخر يستخدم للطباعة، في حامض، أو في أي مادة أخرى كاوية. @ar
alternative label: aiguafortista de @ca
alternative label: raderer af @da
label: söövitaja (tegija) kehastuses @et
definition: Seostab tegija kehastusega, mis sisaldab tegija vastutust trükkimiseks kasutatava metallist, klaasist või muust materjalist pinna töötlemise eest happe või muu söövitava ainega. @et
alternative label: söövitaja kehastuses @et
toolkit label: söövitaja (tegija) kehastuses @et
toolkit definition: Kehastus, mis sisaldab tegija vastutust trükkimiseks kasutatava metallist, klaasist või muust materjalist pinna töötlemise eest happe või muu söövitava ainega. @et
alternative label: karckészítője: @hu
label: è acquafortista agente di @it
definition: Correla un agente a una manifestazione che implica la responsabilità di un agente per l'esposizione di metallo, vetro o altra superficie utilizzata per la stampa, all'acido o altra sostanza corrosiva. @it
alternative label: acquafortista di @it
toolkit label: acquafortista agente di @it
toolkit definition: Manifestazione che implica la responsabilità di un agente per l'esposizione di metallo, vetro o altra superficie utilizzata per la stampa, all'acido o altra sostanza corrosiva. @it
alternative label: οξυγράφος του @el
alternative label: aquafortiste de @fr
label: ir ofortists (aģents) @lv
definition: Sasaista aģentu ar manifestāciju, kas ietver aģenta atbildību par metāla, stikla vai citas virsmas pakļaušanu skābei vai citai kodīgai vielai, kas tikusi izmantota drukāšanai. @lv
toolkit label: ir ofortists (aģents) @lv
toolkit definition: Manifestācija, kas ietver aģenta atbildību par metāla, stikla vai citas virsmas pakļaušanu skābei vai citai kodīgai vielai, kas tikusi izmantota drukāšanai. @lv
sub property of: kuvalaatan valmistaja (toimija) manifestaatiossa
alternative label: Radierer von @de
alternative label: ……的蚀刻者 @zh-hans
toolkit label: ……的蚀刻者行为者 @zh-hans
toolkit definition: 涉及使用酸或其他腐蚀性物质施于用来印刷的金属、玻璃或其他表面上的一个行为者的责任的一种载体表现 @zh-hans
toolkit label: oymacı temsilcisi @tr
toolkit definition: Baskı için kullanılan metal, cam veya diğer bazı yüzeyleri asit veya başka bir aşındırıcı maddeye maruz bırakmakla görevli temsilcinin sorumluluğunu içeren bir gösterim. @tr
has subproperty: etsaaja (yhteistoimija) manifestaatiossa

etsaaja (yhteistoimija) manifestaatiossa
status: Published
label: is etcher collective agent of @en
lexical alias: etcherCollectiveAgentOf.en
definition: Relates a collective agent to a manifestation that involves a responsibility of a collective agent for subjecting metal, glass, or some other surface used for printing, to acid or another corrosive substance. @en
toolkit label: etcher collective agent of @en
toolkit definition: A manifestation that involves a responsibility of a collective agent for subjecting metal, glass, or some other surface used for printing, to acid or another corrosive substance. @en
type: Property
domain: C10011
has element type: 2
sub property of: etsaaja (toimija) mainifestaatiossa
definition: Liittää yhteistoimijan manifestaatioon, jossa yhteistoimija on vastuussa metallin, lasin tms. pinnan etsaamisesta hapon tai muun syövyttävän aineen avulla.
toolkit label: etsaaja (yhteistoimija) manifestaatiossa
toolkit definition: Manifestaatio, jossa yhteistoimija on vastuussa metallin, lasin tms. pinnan etsaamisesta hapon tai muun syövyttävän aineen avulla.
label: er etser av (kollektiv agent) @no
definition: Relaterer en kollektiv agent til en manifestasjon som involverer et ansvar for en kollektiv agent i form av å utsette metall, glass eller et annet overflatemateriale som brukes til trykking, for syre eller et annet etsende stoff. @no
toolkit label: etser av (kollektiv agent) @no
toolkit definition: En manifestasjon som involverer et ansvar for en kollektiv agent i form av å utsette metall, glass eller et annet overflatemateriale som brukes til trykking, for syre eller et annet etsende stoff. @no
label: is etser-collectieve actor van @nl
definition: Relateert een collectieve actor aan een manifestatie die met zich meebrengt een verantwoordelijkheid van een collectieve actor voor het onderwerpen van metaal, glas of een ander oppervlak gebruikt voor drukken, aan zuur of andere bijtende substantie. @nl
toolkit label: etser-collectieve actor van @nl
toolkit definition: Een manifestatie die met zich meebrengt een verantwoordelijkheid van een collectieve actor voor het onderwerpen van metaal, glas of een ander oppervlak gebruikt voor drukken, aan zuur of andere bijtende substantie. @nl
label: هو وكيل جماعي حَفَّارُ بالزِنْكُوغْراف (الكليشيهات) لـ @ar
definition: يربط وكيلا جماعيا بتجسيدة تنطوي على مسئولية وكيل جماعي عن غمر معدن أو زجاج أو أي سطح آخر يستخدم للطباعة، في حامض، أو في أي مادة أخرى كاوية. @ar
toolkit label: وكيل جماعي حَفَّار بالزِنْكُوغْراف (الكليشيهات) @ar
toolkit definition: تجسيدة تنطوي على مسئولية وكيل جماعيعن غمر معدن أو زجاج أو أي سطح آخر يستخدم للطباعة، في حامض، أو في أي مادة أخرى كاوية. @ar
label: és agent col·lectiu aiguafortista de @ca
definition: Relaciona un agent col·lectiu amb una manifestació que implica una responsabilitat d’un agent col·lectiu sotmetent a l’àcid, o a qualsevol altra substància corrosiva, el metall, el vidre o qualsevol altra superfície usada en la impressió. @ca
toolkit label: agent col·lectiu aiguafortista de @ca
toolkit definition: Manifestació que implica una responsabilitat d’un agent col·lectiu sotmetent a l’àcid, o a qualsevol altra substància corrosiva, el metall, el vidre o qualsevol altra superfície usada en la impressió. @ca
label: er kollektiv agent, som er raderer af @da
definition: Relaterer en kollektiv agent til en manifestation, som involverer en kollektiv agents ansvar for at udsætte metal, glas eller en anden overflade, som anvendes til trykning, for syre eller et andet ætsende stof. @da
toolkit label: kollektiv agent, som er raderer af @da
toolkit definition: Manifestation, som involverer en kollektiv agents ansvar for at udsætte metal, glas eller en anden overflade, som anvendes til trykning, for syre eller et andet ætsende stof. @da
label: söövitaja (kollektiiv) kehastuses @et
definition: Seostab kollektiivi kehastusega, mis sisaldab kollektiivi vastutust trükkimiseks kasutatava metallist, klaasist või muust materjalist pinna töötlemise eest happe või muu söövitava ainega. @et
toolkit label: söövitaja (kollektiiv) kehastuses @et
toolkit definition: Kehastus, mis sisaldab kollektiivi vastutust trükkimiseks kasutatava metallist, klaasist või muust materjalist pinna töötlemise eest happe või muu söövitava ainega. @et
label: ist gemeinschaftlicher Akteur als Radiererin/Radierer von @de
definition: Setzt einen gemeinschaftlichen Akteur in Beziehung zu einer Manifestation, bei der ein gemeinschaftlicher Akteur dafür verantwortlich ist, Metall, Glas oder eine andere Oberfläche, die zum Drucken benutzt wird, mit Säure oder einer anderen ätzenden Substanz zu behandeln. @de
toolkit label: Gemeinschaftlicher Akteur als Radiererin/Radierer von @de
toolkit definition: Eine Manifestation, bei der ein gemeinschaftlicher Akteur dafür verantwortlich ist, Metall, Glas oder eine andere Oberfläche, die zum Drucken benutzt wird, mit Säure oder einer anderen ätzenden Substanz zu behandeln. @de
label: karckészítő kollektív ágense a következőnek: @hu
definition: Hozzákapcsol egy kollektív ágenst egy megjelenési formához, amelyhez hozzátartozik egy kollektív ágens felelőssége nyomtatáshoz használt fém-, üveg- vagy valamilyen más felület savnak vagy más maró anyagnak történő alávetéséért. @hu
toolkit label: karckészítő kollektív ágense: @hu
toolkit definition: Egy megjelenési forma, amelyhez hozzátartozik egy kollektív ágens felelőssége nyomtatáshoz használt fém-, üveg- vagy valamilyen más felület savnak vagy más maró anyagnak történő alávetéséért. @hu
label: è acquafortista agente collettivo di @it
definition: Correla un agente collettivo a una manifestazione che implica una responsabilità di un agente collettivo per l'esposizione di metallo, vetro o altra superficie utilizzata per la stampa, all'acido o altra sostanza corrosiva. @it
toolkit label: acquafortista agente collettivo di @it
toolkit definition: Manifestazione che implica una responsabilità di un agente collettivo per l'esposizione di metallo, vetro o altra superficie utilizzata per la stampa, all'acido o altra sostanza corrosiva. @it
label: είναι οξυγράφος συλλογικός φορέας του @el
toolkit label: οξυγράφος συλλογικός φορέας του @el
label: est un agent collectif aquafortiste de @fr
definition: Met un agent collectif en relation avec une manifestation qui comporte une responsabilité de la part d’un agent collectif consistant à soumettre à l’acide ou à une autre substance corrosive du métal, du verre ou une autre surface utilisée pour l’impression. @fr
toolkit label: agent collectif aquafortiste de @fr
toolkit definition: Manifestation qui comporte une responsabilité de la part d’un agent collectif consistant à soumettre à l’acide ou à une autre substance corrosive du métal, du verre ou une autre surface utilisée pour l’impression. @fr
label: ir ofortists (grupa) @lv
definition: Sasaista grupu ar manifestāciju, kas ietver grupas atbildību par metāla, stikla vai citas virsmas pakļaušanu skābei vai citai kodīgai vielai, kas tikusi izmantota drukāšanai. @lv
toolkit label: ir ofortists (grupa) @lv
toolkit definition: Manifestācija, kas ietver grupas atbildību par metāla, stikla vai citas virsmas pakļaušanu skābei vai citai kodīgai vielai, kas tikusi izmantota drukāšanai. @lv
sub property of: kuvalaatan valmistaja (yhteistoimija) manifestaatiossa
label: 是……的蚀刻者行为者 @zh-hans
definition: 将一个集体行为者与涉及使用酸或其他腐蚀性物质施于用来印刷的金属、玻璃或其他表面上的一个集体行为者的责任的一种载体表现关联起来。 @zh-hans
toolkit label: ……的蚀刻者行为者 @zh-hans
toolkit definition: 涉及使用酸或其他腐蚀性物质施于用来印刷的金属、玻璃或其他表面上的一个集体行为者的责任的一种载体表现 @zh-hans
label: oymacı kolektif temsilcisidir @tr
definition: Kolektif bir temsilciyi, baskı için kullanılan metal, cam veya diğer bazı yüzeyleri asit veya başka bir aşındırıcı maddeye maruz bırakması sorumluluğunu içeren gösterimle ilişkilendirir. @tr
toolkit label: oymacı kolektif temsilcisi @tr
toolkit definition: Metal, cam veya baskı için kullanılan diğer bazı yüzeyleri asit veya başka bir aşındırıcı maddeye maruz bırakmak için kolektif bir temsilcinin sorumluluğunu içeren bir gösterim. @tr
has subproperty: etsaaja (yhteisö) manifestaatiossa
has subproperty: etsaaja (suku) manifestaatiossa
has subproperty: P50659

etsaaja (yhteisö) manifestaatiossa
status: Published
label: is etcher corporate body of @en
lexical alias: etcherCorporateBodyOf.en
definition: Relates a corporate body to a manifestation that involves a responsibility of a corporate body for subjecting metal, glass, or some other surface used for printing, to acid or another corrosive substance. @en
toolkit label: etcher corporate body of @en
toolkit definition: A manifestation that involves a responsibility of a corporate body for subjecting metal, glass, or some other surface used for printing, to acid or another corrosive substance. @en
type: Property
domain: C10005
has element type: 2
sub property of: etsaaja (yhteistoimija) manifestaatiossa
definition: Liittää yhteisön manifestaatioon, jossa yhteisö on vastuussa metallin, lasin tms. pinnan etsaamisesta hapon tai muun syövyttävän aineen avulla.
toolkit label: etsaaja (yhteisö) manifestaatiossa
toolkit definition: Manifestaatio, jossa yhteisö on vastuussa metallin, lasin tms. pinnan etsaamisesta hapon tai muun syövyttävän aineen avulla.
label: er etser av (korporasjon) @no
definition: Relaterer en korporasjon til en manifestasjon som involverer et ansvar for en korporasjon i form av å utsette metall, glass eller et annet overflatemateriale som brukes til trykking, for syre eller et annet etsende stoff. @no
toolkit label: etser av (korporasjon) @no
toolkit definition: En manifestasjon som involverer et ansvar for en korporasjon i form av å utsette metall, glass eller et annet overflatemateriale som brukes til trykking, for syre eller et annet etsende stoff. @no
label: is etser-corporatie van @nl
definition: Relateert een corporatie aan een manifestatie die met zich meebrengt een verantwoordelijkheid van een corporatie voor het onderwerpen van metaal, glas of een ander oppervlak gebruikt voor drukken, aan zuur of andere bijtende substantie. @nl
toolkit label: etser-corporatie van @nl
toolkit definition: Een manifestatie die met zich meebrengt een verantwoordelijkheid van een corporatie voor het onderwerpen van metaal, glas of een ander oppervlak gebruikt voor drukken, aan zuur of andere bijtende substantie. @nl
label: هي هيئة مسئولة عن الحفر بالزِنْكُوغْراف (الكليشيهات) لـ @ar
definition: يربط هيئة بتجسيدة تنطوي على مسئولية هيئة عن غمر معدن أو زجاج أو أي سطح آخر يستخدم للطباعة، في حامض، أو في أي مادة أخرى كاوية. @ar
toolkit label: هيئة مسئولة عن الحفر بالزِنْكُوغْراف (الكليشيهات) @ar
toolkit definition: تجسيدة تنطوي على مسئولية هيئة عن غمر معدن أو زجاج أو أي سطح آخر يستخدم للطباعة، في حامض، أو في أي مادة أخرى كاوية. @ar
label: és entitat corporativa aiguafortista de @ca
definition: Manifestació que implica una responsabilitat d’un agent col·lectiu sotmetent a l’àcid, o a qualsevol altra substància corrosiva, el metall, el vidre o qualsevol altra superfície usada en la impressió. @ca
toolkit label: entitat corporativa aiguafortista de @ca
toolkit definition: Manifestació que implica una responsabilitat d’una entitat corporativa sotmetent a l’àcid, o a qualsevol altra substància corrosiva, del metall, el vidre o qualsevol altra superfície usada en la impressió. @ca
label: er korporation, som er raderer af @da
definition: Relaterer en korporation til en manifestation, som involverer en korporations ansvar for at udsætte metal, glas eller en anden overflade, som anvendes til trykning, for syre eller et andet ætsende stof. @da
toolkit label: korporation, som er raderer af @da
toolkit definition: Manifestation, som involverer en korporations ansvar for at udsætte metal, glas eller en anden overflade, som anvendes til trykning, for syre eller et andet ætsende stof. @da
label: söövitaja (asutus) kehastuses @et
definition: Seostab asutuse kehastusega, mis sisaldab asutuse vastutust trükkimiseks kasutatava metallist, klaasist või muust materjalist pinna töötlemise eest happe või muu söövitava ainega. @et
toolkit label: söövitaja (asutus) kehastuses @et
toolkit definition: Kehastus, mis sisaldab asutuse vastutust trükkimiseks kasutatava metallist, klaasist või muust materjalist pinna töötlemise eest happe või muu söövitava ainega. @et
label: ist Körperschaft als Radiererin/Radierer von @de
definition: Setzt eine Körperschaft in Beziehung zu einer Manifestation, bei der eine Körperschaft dafür verantwortlich ist, Metall, Glas oder eine andere Oberfläche, die zum Drucken benutzt wird, mit Säure oder einer anderen ätzenden Substanz zu behandeln. @de
toolkit label: Körperschaft als Radiererin/Radierer von @de
toolkit definition: Eine Manifestation, bei der eine Körperschaft dafür verantwortlich ist, Metall, Glas oder eine andere Oberfläche, die zum Drucken benutzt wird, mit Säure oder einer anderen ätzenden Substanz zu behandeln. @de
label: karckészítő testülete a következőnek: @hu
definition: Hozzákapcsol egy testület egy megjelenési formához, amelyhez hozzátartozik egy testület felelőssége nyomtatáshoz használt fém-, üveg- vagy valamilyen más felület savnak vagy más maró anyagnak történő alávetéséért. @hu
toolkit label: karckészítő testülete: @hu
toolkit definition: Egy megjelenési forma, amelyhez hozzátartozik egy testület felelőssége nyomtatáshoz használt fém-, üveg- vagy valamilyen más felület savnak vagy más maró anyagnak történő alávetéséért. @hu
label: è acquafortista ente di @it
definition: Correla un ente a una manifestazione che implica una responsabilità di un ente per l'esposizione di metallo, vetro o altra superficie utilizzata per la stampa, all'acido o altra sostanza corrosiva. @it
toolkit label: acquafortista ente di @it
toolkit definition: Manifestazione che implica una responsabilità di un ente per l'esposizione di metallo, vetro o altra superficie utilizzata per la stampa, all'acido o altra sostanza corrosiva. @it
label: είναι οξυγράφος συλλογικό όργανο του @el
toolkit label: οξυγράφος συλλογικό όργανο του @el
label: est une collectivité aquafortiste de @fr
definition: Met une collectivité en relation avec une manifestation qui comporte une responsabilité de la part d’une collectivité consistant à soumettre à l’acide ou à une autre substance corrosive du métal, du verre ou une autre surface utilisée pour l’impression. @fr
toolkit label: collectivité aquafortiste de @fr
toolkit definition: Manifestation qui comporte une responsabilité de la part d’une collectivité consistant à soumettre à l’acide ou à une autre substance corrosive du métal, du verre ou une autre surface utilisée pour l’impression. @fr
label: ir ofortists (institūcija) @lv
definition: Sasaista institūciju ar manifestāciju, kas ietver institūcijas atbildību par metāla, stikla vai citas virsmas pakļaušanu skābei vai citai kodīgai vielai, kas tikusi izmantota drukāšanai. @lv
toolkit label: ir ofortists (institūcija) @lv
toolkit definition: Manifestācija, kas ietver institūcijas atbildību par metāla, stikla vai citas virsmas pakļaušanu skābei vai citai kodīgai vielai, kas tikusi izmantota drukāšanai. @lv
sub property of: kuvalaatan valmistaja (yhteisö) manifestaatiossa
label: 是……的蚀刻者团体 @zh-hans
definition: 将一个团体与涉及使用酸或其他腐蚀性物质施于用来印刷的金属、玻璃或其他表面上的一个团体的责任的一种载体表现关联起来。 @zh-hans
toolkit label: ……的蚀刻者团体 @zh-hans
toolkit definition: 涉及使用酸或其他腐蚀性物质施于用来印刷的金属、玻璃或其他表面上的一个团体的责任的一种载体表现 @zh-hans
label: oymacı tüzel kişisidir @tr
definition: Bir tüzel kişiyi, metal, cam veya baskı için kullanılan diğer bazı yüzeyleri asit veya başka bir aşındırıcı maddeye maruz bırakma sorumluluğunu içeren bir gösterim ile ilişkilendirir. @tr
toolkit label: oymacı tüzel kişisi @tr
toolkit definition: Metal, cam veya baskı için kullanılan diğer bazı yüzeyleri asit veya başka bir aşındırıcı maddeye maruz bırakmak için bir tüzel kişinin sorumluluğunu içeren bir gösterim @tr
has subproperty: P50810

etsaaja (suku) manifestaatiossa
status: Published
label: is etcher family of @en
lexical alias: etcherFamilyOf.en
definition: Relates a family to a manifestation that involves a responsibility of a family for subjecting metal, glass, or some other surface used for printing, to acid or another corrosive substance. @en
toolkit label: etcher family of @en
toolkit definition: A manifestation that involves a responsibility of a family for subjecting metal, glass, or some other surface used for printing, to acid or another corrosive substance. @en
type: Property
domain: C10008
has element type: 2
sub property of: etsaaja (yhteistoimija) manifestaatiossa
definition: Liittää suvun manifestaatioon, jossa suku on vastuussa metallin, lasin tms. pinnan etsaamisesta hapon tai muun syövyttävän aineen avulla.
toolkit label: etsaaja (suku) manifestaatiossa
toolkit definition: Manifestaatio, jossa suku on vastuussa metallin, lasin tms. pinnan etsaamisesta hapon tai muun syövyttävän aineen avulla.
label: er etser av (familie) @no
definition: Relaterer en familie til en manifestasjon som involverer et ansvar for en familie i form av å utsette metall, glass eller et annet overflatemateriale som brukes til trykking, for syre eller et annet etsende stoff. @no
toolkit label: etser av (familie) @no
toolkit definition: En manifestasjon som involverer et ansvar for en familie i form av å utsette metall, glass eller et annet overflatemateriale som brukes til trykking, for syre eller et annet etsende stoff. @no
label: is etser-familie van @nl
definition: Relateert een familie aan een manifestatie die met zich meebrengt een verantwoordelijkheid van een familie voor het onderwerpen van metaal, glas of een ander oppervlak gebruikt voor drukken, aan zuur of andere bijtende substantie. @nl
toolkit label: etser-familie van @nl
toolkit definition: Een manifestatie die met zich meebrengt een verantwoordelijkheid van een familie voor het onderwerpen van metaal, glas of een ander oppervlak gebruikt voor drukken, aan zuur of andere bijtende substantie. @nl
label: هي عائلة مسئولة عن الحفر بالزِنْكُوغْراف (الكليشيهات) لـ @ar
definition: يربط عائلة بتجسيدة تنطوي على مسئولية عائلة عن غمر معدن أو زجاج أو أي سطح آخر يستخدم للطباعة، في حامض، أو في أي مادة أخرى كاوية. @ar
toolkit label: عائلة مسئولة عن الحفر بالزِنْكُوغْراف (الكليشيهات) @ar
toolkit definition: تجسيدة تنطوي على مسئولية عائلة عن غمر معدن أو زجاج أو أي سطح آخر يستخدم للطباعة، في حامض، أو في أي مادة أخرى كاوية. @ar
label: és família aiguafortista de @ca
definition: Relaciona una família amb una manifestació que implica una responsabilitat d’una família sotmetent a l’àcid, o a qualsevol altra substància corrosiva, el metall, el vidre o qualsevol altra superfície usada en la impressió. @ca
toolkit label: família aiguafortista de @ca
toolkit definition: Manifestació que implica una responsabilitat d’una família sotmetent a l’àcid, o a qualsevol altra substància corrosiva, el metall, el vidre o qualsevol altra superfície usada en la impressió. @ca
label: er familie, som er raderer af @da
definition: Relaterer en familie til en manifestation, som involverer en families ansvar for at udsætte metal, glas eller en anden overflade, som anvendes til trykning, for syre eller et andet ætsende stof. @da
toolkit label: familie, som er raderer af @da
toolkit definition: Manifestation, som involverer en families ansvar for at udsætte metal, glas eller en anden overflade, som anvendes til trykning, for syre eller et andet ætsende stof. @da
label: söövitaja (perekond) kehastuses @et
definition: Seostab perekonna kehastusega, mis sisaldab perekonna vastutust trükkimiseks kasutatava metallist, klaasist või muust materjalist pinna töötlemise eest happe või muu söövitava ainega. @et
toolkit label: söövitaja (perekond) kehastuses @et
toolkit definition: Kehastus, mis sisaldab perekonna vastutust trükkimiseks kasutatava metallist, klaasist või muust materjalist pinna töötlemise eest happe või muu söövitava ainega. @et
label: ist Familie als Radiererin/Radierer von @de
definition: Setzt eine Familie in Beziehung zu einer Manifestation, bei der eine Familie dafür verantwortlich ist, Metall, Glas oder eine andere Oberfläche, die zum Drucken benutzt wird, mit Säure oder einer anderen ätzenden Substanz zu behandeln. @de
toolkit label: Familie als Radiererin/Radierer von @de
toolkit definition: Eine Manifestation, bei der eine Familie dafür verantwortlich ist, Metall, Glas oder eine andere Oberfläche, die zum Drucken benutzt wird, mit Säure oder einer anderen ätzenden Substanz zu behandeln. @de
label: karckészítő családja a következőnek: @hu
definition: Hozzákapcsol egy családot egy megjelenési formához, amelyhez hozzátartozik egy család felelőssége nyomtatáshoz használt fém-, üveg- vagy valamilyen más felület savnak vagy más maró anyagnak történő alávetéséért. @hu
toolkit label: karckészítő családja: @hu
toolkit definition: Egy megjelenési forma, amelyhez hozzátartozik egy család felelőssége nyomtatáshoz használt fém-, üveg- vagy valamilyen más felület savnak vagy más maró anyagnak történő alávetéséért. @hu
label: è acquafortista famiglia di @it
definition: Correla una famiglia a una manifestazione che implica una responsabilità di una famiglia per l'esposizione di metallo, vetro o altra superficie utilizzata per la stampa, all'acido o altra sostanza corrosiva. @it
toolkit label: acquafortista famiglia di @it
toolkit definition: Manifestazione che implica una responsabilità di una famiglia per l'esposizione di metallo, vetro o altra superficie utilizzata per la stampa, all'acido o altra sostanza corrosiva. @it
label: είναι οξυγράφος οικογένεια του @el
toolkit label: οξυγράφος οικογένεια του @el
label: est une famille aquafortiste de @fr
definition: Met une famille en relation avec une manifestation qui comporte une responsabilité de la part d’une famille consistant à soumettre à l’acide ou à une autre substance corrosive du métal, du verre ou une autre surface utilisée pour l’impression. @fr
toolkit label: famille aquafortiste de @fr
toolkit definition: Manifestation qui comporte une responsabilité de la part d’une famille consistant à soumettre à l’acide ou à une autre substance corrosive du métal, du verre ou une autre surface utilisée pour l’impression. @fr
label: ir ofortists (dzimta/ģimene) @lv
definition: Sasaista dzimtu/ģimeni ar manifestāciju, kas ietver dzimtas/ģimenes atbildību par metāla, stikla vai citas virsmas pakļaušanu skābei vai citai kodīgai vielai, kas tikusi izmantota drukāšanai. @lv
toolkit label: ir ofortists (dzimta/ģimene) @lv
toolkit definition: Manifestācija, kas ietver dzimtas/ģimenes atbildību par metāla, stikla vai citas virsmas pakļaušanu skābei vai citai kodīgai vielai, kas tikusi izmantota drukāšanai. @lv
sub property of: kuvalaatan valmistaja (suku) manifestaatiossa
label: 是……的蚀刻者家族 @zh-hans
definition: 将一个家族与涉及使用酸或其他腐蚀性物质施于用来印刷的金属、玻璃或其他表面上的一个家族的责任的一种载体表现关联起来。 @zh-hans
toolkit label: ……的蚀刻者家族 @zh-hans
toolkit definition: 涉及使用酸或其他腐蚀性物质施于用来印刷的金属、玻璃或其他表面上的一个家族的责任的一种载体表现 @zh-hans
label: oymacı ailesidir @tr
definition: Bir aileyi, ailenin metal, cam veya baskı için kullanılan başka bir yüzeyi asit veya başka bir aşındırıcı maddeye maruz bırakma sorumluluğunu içeren gösterimle ilişkilendirir. @tr
toolkit label: oymacı ailesi @tr
toolkit definition: Bir ailenin metal, cam veya baskı için kullanılan başka bir yüzeyi asit veya başka bir aşındırıcı maddeye maruz bırakma sorumluluğunu içeren bir gösterim. @tr
has subproperty: P50961

etsaaja (henkilö) manifestaatiossa
status: Published
label: is etcher person of @en
lexical alias: etcherPersonOf.en
definition: Relates a person to a manifestation that involves a responsibility of a person for subjecting metal, glass, or some other surface used for printing, to acid or another corrosive substance. @en
toolkit label: etcher person of @en
toolkit definition: A manifestation that involves a responsibility of a person for subjecting metal, glass, or some other surface used for printing, to acid or another corrosive substance. @en
type: Property
domain: C10004
has element type: 2
sub property of: etsaaja (toimija) mainifestaatiossa
definition: Liittää henkilön manifestaatioon, jossa henkilö on vastuussa metallin, lasin tms. pinnan etsaamisesta hapon tai muun syövyttävän aineen avulla.
toolkit label: etsaaja (henkilö) manifestaatiossa
toolkit definition: Manifestaatio, jossa henkilö on vastuussa metallin, lasin tms. pinnan etsaamisesta hapon tai muun syövyttävän aineen avulla.
label: er etser av (person) @no
definition: Relaterer en person til en manifestasjon som involverer et ansvar for en person i form av å utsette metall, glass eller et annet overflatemateriale som brukes til trykking, for syre eller et annet etsende stoff. @no
toolkit label: etser av (person) @no
toolkit definition: En manifestasjon som involverer et ansvar for en person i form av å utsette metall, glass eller et annet overflatemateriale som brukes til trykking, for syre eller et annet etsende stoff. @no
label: is etser-persoon van @nl
definition: Relateert een persoon aan een manifestatie die met zich meebrengt een verantwoordelijkheid van een persoon voor het onderwerpen van metaal, glas of een ander oppervlak gebruikt voor drukken, aan zuur of andere bijtende substantie. @nl
toolkit label: etser-persoon van @nl
toolkit definition: Een manifestatie die met zich meebrengt een verantwoordelijkheid van een persoon voor het onderwerpen van metaal, glas of een ander oppervlak gebruikt voor drukken, aan zuur of andere bijtende substantie. @nl
label: هو شخص حَفَّارُ بالزِنْكُوغْراف (الكليشيهات) لـ @ar
definition: يربط شخصا بتجسيدة تنطوي على مسئولية شخص عن غمر معدن أو زجاج أو أي سطح آخر يستخدم للطباعة، في حامض، أو في أي مادة أخرى كاوية. @ar
toolkit label: شخص حَفَّارُ بالزِنْكُوغْراف (الكليشيهات) @ar
toolkit definition: تجسيدة تنطوي على مسئولية شخص عن غمر معدن أو زجاج أو أي سطح آخر يستخدم للطباعة، في حامض، أو في أي مادة أخرى كاوية. @ar
label: és persona aiguafortista de @ca
definition: Relaciona una persona amb una manifestació que implica una responsabilitat d’una persona sotmetent a l’àcid, o a qualsevol altra substància corrosiva, el metall, el vidre o qualsevol altra superfície usada en la impressió. @ca
toolkit label: persona aiguafortista de @ca
toolkit definition: Manifestació que implica una responsabilitat d’una persona sotmetent a l’àcid, o a qualsevol altra substància corrosiva, el metall, el vidre o qualsevol altra superfície usada en la impressió. @ca
label: er person, som er raderer af @da
definition: Relaterer en person til en manifestation, som involverer en persons ansvar for at udsætte metal, glas eller en anden overflade, som anvendes til trykning, for syre eller et andet ætsende stof. @da
toolkit label: person, som er raderer af @da
toolkit definition: Manifestation, som involverer en persons ansvar for at udsætte metal, glas eller en anden overflade, som anvendes til trykning, for syre eller et andet ætsende stof. @da
label: söövitaja (isik) kehastuses @et
definition: Seostab isiku kehastusega, mis sisaldab isiku vastutust trükkimiseks kasutatava metallist, klaasist või muust materjalist pinna töötlemise eest happe või muu söövitava ainega. @et
toolkit label: söövitaja (isik) kehastuses @et
toolkit definition: Kehastus, mis sisaldab isiku vastutust trükkimiseks kasutatava metallist, klaasist või muust materjalist pinna töötlemise eest happe või muu söövitava ainega. @et
label: ist Person als Radiererin/Radierer von @de
definition: Setzt eine Person in Beziehung zu einer Manifestation, bei der eine Person dafür verantwortlich ist, Metall, Glas oder eine andere Oberfläche, die zum Drucken benutzt wird, mit Säure oder einer anderen ätzenden Substanz zu behandeln. @de
toolkit label: Person als Radiererin/Radierer von @de
toolkit definition: Eine Manifestation, bei der eine Person dafür verantwortlich ist, Metall, Glas oder eine andere Oberfläche, die zum Drucken benutzt wird, mit Säure oder einer anderen ätzenden Substanz zu behandeln. @de
label: karckészítő személye a következőnek: @hu
definition: Hozzákapcsol egy személyt egy megjelenési formához, amelyhez hozzátartozik egy személy felelőssége nyomtatáshoz használt fém-, üveg- vagy valamilyen más felület savnak vagy más maró anyagnak történő alávetéséért. @hu
toolkit label: karckészítő személye: @hu
toolkit definition: Egy megjelenési forma, amelyhez hozzátartozik egy személy felelőssége nyomtatáshoz használt fém-, üveg- vagy valamilyen más felület savnak vagy más maró anyagnak történő alávetéséért. @hu
label: è acquafortista persona di @it
definition: Correla una persona a una manifestazione che implica una responsabilità di una persona per l'esposizione di metallo, vetro o altra superficie utilizzata per la stampa, all'acido o altra sostanza corrosiva. @it
toolkit label: acquafortista persona di @it
toolkit definition: Manifestazione che implica una responsabilità di una persona per l'esposizione di metallo, vetro o altra superficie utilizzata per la stampa, all'acido o altra sostanza corrosiva. @it
label: είναι οξυγράφος φυσικό πρόσωπο του @el
toolkit label: οξυγράφος φυσικό πρόσωπο του @el
label: est une personne aquafortiste de @fr
definition: Met une personne en relation avec une manifestation qui comporte une responsabilité de la part d’une personne consistant à soumettre à l’acide ou à une autre substance corrosive du métal, du verre ou une autre surface utilisée pour l’impression. @fr
toolkit label: personne aquafortiste de @fr
toolkit definition: Manifestation qui comporte une responsabilité de la part d’une personne consistant à soumettre à l’acide ou à une autre substance corrosive du métal, du verre ou une autre surface utilisée pour l’impression. @fr
label: ir ofortists (persona) @lv
definition: Sasaista personu ar manifestāciju, kas ietver personas atbildību par metāla, stikla vai citas virsmas pakļaušanu skābei vai citai kodīgai vielai, kas tikusi izmantota drukāšanai. @lv
toolkit label: ir ofortists (persona) @lv
toolkit definition: Manifestācija, kas ietver personas atbildību par metāla, stikla vai citas virsmas pakļaušanu skābei vai citai kodīgai vielai, kas tikusi izmantota drukāšanai. @lv
sub property of: kuvalaatan valmistaja (henkilö) manifestaatiossa
label: 是……的蚀刻者个人 @zh-hans
definition: 将一个个人与涉及使用酸或其他腐蚀性物质施于用来印刷的金属、玻璃或其他表面上的一个个人的责任的一种载体表现关联起来。 @zh-hans
toolkit label: ……的蚀刻者个人 @zh-hans
toolkit definition: 涉及使用酸或其他腐蚀性物质施于用来印刷的金属、玻璃或其他表面上的一个个人的责任的一种载体表现 @zh-hans
label: oymacı kişisidir @tr
definition: Bir kişiyi, kişinin metal, cam veya baskı için kullanılan başka bir yüzeyi asit veya başka bir aşındırıcı maddeye maruz bırakma sorumluluğunu içeren gösterimle ilişkilendirir. @tr
toolkit label: oymacı @tr
toolkit definition: Bir kişinin metal, cam veya baskı için kullanılan başka bir yüzeyi asit veya başka bir aşındırıcı maddeye maruz bırakma sorumluluğunu içeren bir gösterim. @tr
has subproperty: P50508

yhteistoimijan sukujäsen
status: Published
label: has family member of collective agent @en
type: Property
lexical alias: familyMemberOfCollectiveAgent.en
definition: Relates a collective agent to a family who is a member of a collective agent. @en
domain: C10011
toolkit label: family member of collective agent @en
toolkit definition: A family who is a member of a collective agent. @en
sub property of: yhteistoimijaan liittyvä suku
has element type: 2
definition: Liittää yhteistoimijan sukuun, joka on yhteistoimijan jäsen.
toolkit label: yhteistoimijan sukujäsen
toolkit definition: Suku, joka on yhteistoimijan jäsen.
label: har familie som medlem av kollektiv agent @no
definition: Relaterer en kollektiv agent til en familie som er et medlem av en kollektiv agent. @no
toolkit label: familie som medlem av kollektiv agent @no
toolkit definition: En familie som er et medlem av en kollektiv agent. @no
label: heeft familielid van collectieve actor @nl
definition: Relateert een collectieve actor aan een familie die een lid is van een collectieve actor. @nl
toolkit label: familielid van collectieve actor @nl
toolkit definition: Een familie die een lid is van een collectieve actor. @nl
label: له عائلة عضو في وكيل جماعي @ar
definition: يربط وكيلا جماعيا بعائلة هي عضو في وكيل جماعي. @ar
toolkit label: عائلة عضو في وكيل جماعي @ar
toolkit definition: عائلة عضو في وكيل جماعي. @ar
label: té com a família membre d’un agent col·lectiu @ca
definition: Relaciona un agent col·lectiu amb una família que és un membre d’un agent col·lectiu. @ca
toolkit label: família membre d’un agent col·lectiu @ca
toolkit definition: Família que és un membre d’un agent col·lectiu. @ca
label: har familie, som er medlem af kollektiv agent @da
definition: Relaterer en kollektiv agent til en familie, som er et medlem af en kollektiv agent. @da
toolkit label: familie, som er medlem af kollektiv agent @da
toolkit definition: Familie, som er et medlem af en kollektiv agent. @da
label: kollektiivi liige (perekond) @et
definition: Seostab kollektiivi perekonnaga, kes on kollektiivi liige. @et
toolkit label: kollektiivi liige (perekond) @et
toolkit definition: Perekond, kes on kollektiivi liige. @et
label: hat Mitglied eines gemeinschaftlichen Akteurs (Familie) @de
definition: Setzt einen gemeinschaftlichen Akteur in Beziehung zu einer Familie, die Mitglied eines gemeinschaftlichen Akteurs ist. @de
toolkit label: Mitglied eines gemeinschaftlichen Akteurs (Familie) @de
toolkit definition: Eine Familie, die Mitglied eines gemeinschaftlichen Akteurs ist. @de
label: kollektív ágens családtagja a következő: @hu
definition: Hozzákapcsol egy kollektív ágenst egy családhoz, amely egy kollektív ágens tagja. @hu
toolkit label: kollektív ágens családtagja. @hu
toolkit definition: Egy család, amely egy kollektív ágens tagja. @hu
label: ha come famiglia membro di agente collettivo @it
definition: Correla un agente collettivo a un famiglia che è un membro di un agente collettivo. @it
toolkit label: famiglia membro di agente collettivo @it
toolkit definition: Famiglia membro di un agente collettivo. @it
label: έχει μέλος οικογένειας του συλλογικού φορέα @el
toolkit label: μέλος οικογένειας του συλλογικού φορέα @el
label: a pour famille membre d’un agent collectif @fr
definition: Met un agent collectif en relation avec une famille qui est membre d’un agent collectif. @fr
toolkit label: famille membre d’un agent collectif @fr
toolkit definition: Famille qui est membre d’un agent collectif. @fr
label: grupai piederīgā dzimta/ģimene @lv
definition: Sasaista grupu ar dzimtu/ģimeni, kas ir grupas piederīgā. @lv
toolkit label: grupai piederīgā dzimta/ģimene @lv
toolkit definition: Dzimta/ģimene, kas ir grupas piederīgā. @lv
label: 有集体行为者的家族成员 @zh-hans
definition: 将一个集体行为者与是一个集体行为者的一个成员的一个家族关联起来。 @zh-hans
toolkit label: 集体行为者的家族成员 @zh-hans
toolkit definition: 是一个集体行为者的一个成员的一个家族 @zh-hans
label: kolektif temsilcinin aile üyesi ile ilişkilidir @tr
definition: Kolektif bir temsilciyi, bir kolektif temsilcinin üyesi olan bir aileyle ilişkilendirir. @tr
toolkit label: kolektif temsilcinin aile üyesi @tr
toolkit definition: Kolektif bir temsilcinin üyesi olan bir aile @tr
has subproperty: yhteisön sukujäsen
has subproperty: suvun sukuhaara
has subproperty: P50436

sukujäsen yhteistoimijassa
status: Published
label: is family member of collective agent of @en
type: Property
lexical alias: familyMemberOfCollectiveAgentOf.en
definition: Relates a family to a collective agent of whom a family is a member. @en
domain: C10008
toolkit label: family member of collective agent of @en
toolkit definition: A collective agent of whom a family is a member. @en
sub property of: sukuun liittyvä yhteistoimija
has element type: 2
definition: Liittää suvun yhteistoimijaan, jonka jäsen suku on.
toolkit label: sukujäsen yhteistoimijassa
toolkit definition: Yhteistoimija, jonka jäsen suku on.
label: er familie som medlem av kollektiv agent for @no
definition: Relaterer en familie til en kollektiv agent som en familie er medlem av. @no
toolkit label: familie som medlem av kollektiv agent for @no
toolkit definition: En kollektiv agent som en familie er medlem av. @no
label: is familielid van collectieve actor van @nl
definition: Relateert een familie aan een collectieve actor waarvan een familie lid is. @nl
toolkit label: familielid van collectieve actor van @nl
toolkit definition: Een collectieve actor waarvan een familie lid is. @nl
label: هي عائلة عضو في وكيل جماعي @ar
definition: يربط عائلة بوكيل جماعي هي عضو فيه. @ar
toolkit label: عائلة عضو في وكيل جماعي @ar
toolkit definition: وكيل جماعي عائلة عضو فيه. @ar
label: és família membre d’un agent col·lectiu de @ca
definition: Relaciona una família amb un agent col·lectiu del qual una família n’és un membre. @ca
toolkit label: família membre d’un agent col·lectiu de @ca
toolkit definition: Agent col·lectiu del qual una família n’és un membre. @ca
label: er familie, som er medlem af kollektiv agent af @da
definition: Relaterer en familie til en kollektiv agent, som en familie er medlem af. @da
toolkit label: familie, som er medlem af kollektiv agent af @da
toolkit definition: Kollektiv agent, som en familie er medlem af. @da
label: kollektiivi liige (perekond) kollektiivis @et
definition: Seostab perekonna kollektiiviga, milles perekond on liige. @et
toolkit label: kollektiivi liige (perekond) kollektiivis @et
toolkit definition: Kollektiiv, milles perekond on liige. @et
label: ist Familie als Mitglied eines gemeinschaftlichen Akteurs von @de
definition: Setzt eine Familie in Beziehung zu einem gemeinschaftlichen Akteur, dem eine Familie angehört. @de
toolkit label: Familie als Mitglied eines gemeinschaftlichen Akteurs von @de
toolkit definition: Ein gemeinschaftlicher Akteur, dem eine Familie angehört. @de
label: családtagja a következő kollektív ágensnek: @hu
definition: Hozzákapcsol egy családot egy kollektív ágenshez, amelynek egy család a tagja. @hu
toolkit label: családtagja a következő kollektív ágensnek: @hu
toolkit definition: Egy kollektív ágens, amelynek egy család a tagja. @hu
label: è famiglia membro di agente collettivo di @it
definition: Correla una famiglia a un agente collettivo di cui una famiglia è un membro. @it
toolkit label: famiglia membro di agente collettivo di @it
toolkit definition: Agente collettivo di cui una famiglia è membro. @it
label: είναι μέλος οικογένειας του συλλογικού φορέα του @el
toolkit label: μέλος οικογένειας του συλλογικού φορέα του @el
label: est une famille membre d’un agent collectif de @fr
definition: Met une famille en relation avec un agent collectif dont une famille est membre. @fr
toolkit label: famille membre d’un agent collectif de @fr
toolkit definition: Agent collectif dont une famille est membre. @fr
label: ir grupas dalībnieks (dzimta/ģimene) @lv
definition: Sasaista dzimtu/ģimeni ar grupu, kam dzimta/ģimene ir piederīga. @lv
toolkit label: ir grupas dalībnieks (dzimta/ģimene) @lv
toolkit definition: Grupa, kam dzimta/ģimene ir piederīga. @lv
label: 是……的集体行为者的家族成员 @zh-hans
definition: 将一个家族与有一个家族作为其成员的一个集体行为者关联起来。 @zh-hans
toolkit label: ……的集体行为者的家族成员 @zh-hans
toolkit definition: 有一个家族作为其成员的一个集体行为者 @zh-hans
label: kolektif temsilcisinin aile üyesidir @tr
definition: Bir aileyi, ailenin üyesi olduğu kolektif bir temsilciyle ilişkilendirir. @tr
toolkit label: kolektif temsilcinin aile üyesi @tr
toolkit definition: Bir ailenin üyesi olduğu kolektif bir temsilci @tr
has subproperty: sukujäsen yhteisössä
has subproperty: sukuhaara suvussa
has subproperty: P50441

yhteisön sukujäsen
status: Published
label: has family member of corporate body @en
type: Property
lexical alias: familyMemberOfCorporateBody.en
definition: Relates a corporate body to a family who is a member of a corporate body. @en
domain: C10005
toolkit label: family member of corporate body @en
toolkit definition: A family who is a member of a corporate body. @en
sub property of: yhteisöön liittyvä suku
sub property of: yhteistoimijan sukujäsen
has element type: 2
definition: Liittää yhteisön sukuun, joka kuuluu yhteisöön.
toolkit label: yhteisön sukujäsen
toolkit definition: Suku, joka kuuluu yhteisöön.
label: har familie som medlem av korporasjon @no
definition: Relaterer en korporasjon til en familie som er et medlem av korporasjon. @no
toolkit label: familie som medlem av korporasjon @no
toolkit definition: En familie som er et medlem av korporasjon. @no
label: heeft familielid van corporatie @nl
definition: Relateert een corporatie aan een familie die een lid is van een corporatie. @nl
toolkit label: familielid van corporatie @nl
toolkit definition: Een familie die een lid is van een corporatie. @nl
label: له عائلة عضو في هيئة @ar
definition: يربط هيئة بعائلة هي عضو في هيئة. @ar
toolkit label: عائلة عضو في هيئة @ar
toolkit definition: عائلة هي عضو في هيئة. @ar
label: té com a família membre d’una entitat corporativa @ca
definition: Relaciona una entitat corporativa amb una família que és un membre d’una entitat corporativa. @ca
toolkit label: família membre d’una entitat corporativa @ca
toolkit definition: Família que és un membre d’una entitat corporativa. @ca
label: har familie, som er medlem af korporation @da
definition: Relaterer en korporation til en familie, som er et medlem af en korporation. @da
toolkit label: familie, som er medlem af korporation @da
toolkit definition: Familie, som er et medlem af en korporation. @da
label: asutuse liige (perekond) @et
definition: Seostab asutuse perekonnaga, kes on asutuse liige. @et
alternative label: liige (perekond) @et
toolkit label: asutuse liige (perekond) @et
toolkit definition: Perekond, kes on asutuse liige. @et
label: hat Mitglied einer Körperschaft (Familie) @de
definition: Setzt eine Körperschaft in Beziehung zu einer Familie, die Mitglied einer Körperschaft ist. @de
toolkit label: Mitglied einer Körperschaft (Familie) @de
toolkit definition: Eine Familie, die Mitglied einer Körperschaft ist. @de
label: testület családtagja a következő: @hu
definition: Hozzákapcsol egy testületet egy családhoz, amely egy testület tagja. @hu
toolkit label: testület családtagja: @hu
toolkit definition: Egy család, amely egy testület tagja. @hu
label: ha come famiglia membro di ente @it
definition: Correla un ente a una famiglia che è un membro di un ente. @it
toolkit label: famiglia membro di ente @it
toolkit definition: Famiglia membro di un ente. @it
label: έχει μέλος οικογένειας του συλλογικού οργάνου @el
toolkit label: μέλος οικογένειας του συλλογικού οργάνου @el
label: a pour famille membre d’une collectivité @fr
definition: Met une collectivité en relation avec une famille qui est membre d’une collectivité. @fr
toolkit label: famille membre d’une collectivité @fr
toolkit definition: Famille qui est membre d’une collectivité. @fr
label: institūcijai piederīgā dzimta/ģimene @lv
definition: Sasaista institūciju ar dzimtu/ģimeni, kas ir institūcijas piederīgais. @lv
toolkit label: institūcijai piederīgā dzimta/ģimene @lv
toolkit definition: Dzimta/ģimene, kas ir institūcijas piederīgais. @lv
label: 有团体的家族成员 @zh-hans
definition: 将一个团体与是一个团体的一个成员的一个家族关联起来。 @zh-hans
toolkit label: 团体的家族成员 @zh-hans
toolkit definition: 是一个团体的一个成员的一个家族 @zh-hans
label: tüzel kişinin aile üyesi ile ilişkilidir @tr
definition: Bir tüzel kişiyi, bir tüzel kişiliğin üyesi olan bir aileyle ilişkilendirir. @tr
toolkit label: tüzel kişinin aile üyesi @tr
toolkit definition: Tüzel bir kişiliğin üyesi olan bir aile @tr
has subproperty: P50437

sukujäsen yhteisössä
status: Published
label: is family member of corporate body of @en
type: Property
lexical alias: familyMemberOfCorporateBodyOf.en
definition: Relates a family to a corporate body of whom a family is a member. @en
domain: C10008
toolkit label: family member of corporate body of @en
toolkit definition: A corporate body of whom a family is a member. @en
sub property of: sukuun liittyvä yhteisö
sub property of: sukujäsen yhteistoimijassa
has element type: 2
definition: Liittää suvun yhteisöön, jonka jäsen suku on.
toolkit label: sukujäsen yhteisössä
toolkit definition: Yhteisö, jonka jäsen suku on.
label: er familie som medlem av korporasjon for @no
definition: Relaterer en familie til en korporasjon som en familie er medlem av. @no
toolkit label: familie som medlem av korporasjon for @no
toolkit definition: En korporasjon som en familie er medlem av. @no
label: is familielid van corporatie van @nl
definition: Relateert een familie aan een corporatie waarvan een familie lid is. @nl
toolkit label: familielid van corporatie van @nl
toolkit definition: Een corporatie waarvan een familie lid is. @nl
label: هي عائلة عضو في هيئة @ar
definition: يربط عائلة بهيئة تكون العائلة عضوا فيها. @ar
toolkit label: عائلة عضو في هيئة @ar
toolkit definition: هيئة حيث عائلة عضو فيها. @ar
label: és família membre d’una entitat corporativa de @ca
definition: Relaciona una família amb una entitat corporativa de la qual una família n’és un membre. @ca
toolkit label: família membre d’una entitat corporativa de @ca
toolkit definition: Entitat corporativa de la qual una família n’és un membre. @ca
label: er familie, som er medlem af korporation af @da
definition: Relaterer en familie til en korporation, som en familie er medlem af. @da
toolkit label: familie, som er medlem af korporation af @da
toolkit definition: Korporation, som en familie er medlem af. @da
label: asutuse liige (perekond) asutuses @et
definition: Seostab perekonna asutusega, milles perekond on liige. @et
toolkit label: asutuse liige (perekond) asutuses @et
toolkit definition: Asutus, milles perekond on liige. @et
label: ist Familie als Mitglied einer Körperschaft von @de
definition: Setzt eine Familie in Beziehung zu einer Körperschaft, zu der eine Familie gehört. @de
toolkit label: Familie als Mitglied einer Körperschaft von @de
toolkit definition: Eine Körperschaft, zu der eine Familie gehört. @de
label: családtagja a következő testületnek: @hu
definition: Hozzákapcsol egy családot egy testülethez, amelynek egy család a tagja. @hu
toolkit label: családtagja a következő testületnek: @hu
toolkit definition: Egy testület, amelynek tagja egy család. @hu
label: è famiglia membro di ente di @it
definition: Correla una famiglia a un ente di cui una famiglia è un membro. @it
toolkit label: famiglia membro di ente di @it
toolkit definition: Ente di cui una famiglia è membro. @it
label: είναι μέλος οικογένειας του συλλογικού οργάνου του @el
toolkit label: μέλος οικογένειας του συλλογικού οργάνου του @el
label: est une famille membre d’une collectivité de @fr
definition: Met une famille en relation avec une collectivité dont une famille est membre. @fr
toolkit label: famille membre d’une collectivité de @fr
toolkit definition: Collectivité dont une famille est membre. @fr
label: ir institūcijas dalībnieks (dzimta/ģimene) @lv
definition: Sasaista dzimtu/ģimeni ar institūciju, kā piederīgais ir dzimta/ģimene. @lv
toolkit label: ir institūcijas dalībnieks (dzimta/ģimene) @lv
toolkit definition: Institūcija, kā piederīgais ir dzimta/ģimene. @lv
label: 是……的团体的家族成员 @zh-hans
definition: 将一个家族与有一个家族是其成员的一个团体关联起来。 @zh-hans
toolkit label: ……的团体的家族成员 @zh-hans
toolkit definition: 有一个家族是其成员的一个团体 @zh-hans
label: tüzel kişisinin aile üyesidir @tr
definition: Bir aileyi, ailenin üyesi olduğu bir tüzel kişiyle ilişkilendirir. @tr
toolkit label: tüzel kişinin aile üyesi @tr
toolkit definition: Bir ailenin üyesi olduğu tüzel bir kişi @tr
has subproperty: P50442

suvun sukuhaara
status: Published
label: has family member of family @en
type: Property
lexical alias: familyMemberOfFamily.en
definition: Relates a family to a family who is a member of a family. @en
domain: C10008
toolkit label: family member of family @en
toolkit definition: A family who is a member of a family. @en
sub property of: sukuun liittyvä suku
sub property of: yhteistoimijan sukujäsen
has element type: 2
definition: Liittää suvun sukuun, joka on suvun jäsen.
alternative label: suvun jäsen (suku)
toolkit label: suvun sukuhaara
toolkit definition: Suku, joka on suvun jäsen.
label: har familie som medlem av familie @no
definition: Relaterer en familie til en familie som er et medlem av en familie. @no
toolkit label: familie som medlem av familie @no
toolkit definition: En familie som er et medlem av en familie. @no
label: heeft familielid van familie @nl
definition: Relateert een familie aan een familie die een lid is van een familie. @nl
toolkit label: familielid van familie @nl
toolkit definition: Een familie die een lid is van een familie. @nl
label: له عائلة عضو في عائلة @ar
definition: يربط عائلة بعائلة هي عضو في عائلة. @ar
toolkit label: عائلة عضو في عائلة @ar
toolkit definition: عائلة هي عضو في عائلة. @ar
label: té com a família membre d’una família @ca
definition: Relaciona una família amb una família que és un membre d’una família. @ca
toolkit label: família membre d’una família @ca
toolkit definition: Família que és un membre d’una família. @ca
label: har familie, som er medlem af familie @da
definition: Relaterer en familie til en familie, som er et medlem af en familie. @da
toolkit label: familie, som er medlem af familie @da
toolkit definition: Familie, som er et medlem af en familie. @da
label: perekonna liige (perekond) @et
definition: Seostab perekonna perekonnaga, kes on perekonna liige. @et
toolkit label: perekonna liige (perekond) @et
toolkit definition: Perekond, kes on perekonna liige. @et
label: hat Familienmitglied (Familie) @de
definition: Setzt eine Familie in Beziehung zu einer Familie, die Mitglied einer Familie ist. @de
toolkit label: Familienmitglied (Familie) @de
toolkit definition: Eine Familie, die Mitglied einer Familie ist. @de
label: család családtagja a következő: @hu
definition: Hozzákapcsol egy családot egy családhoz, amely egy család tagja. @hu
toolkit label: család családtagja: @hu
toolkit definition: Egy család, amely egy család tagja. @hu
label: ha come famiglia membro di famiglia @it
definition: Correla una famiglia a una famiglia che è membro di una famiglia. @it
toolkit label: famiglia membro di famiglia @it
toolkit definition: Famiglia membro di una famiglia. @it
label: έχει μέλος οικογένειας της οικογένειας @el
toolkit label: μέλος οικογένειας της οικογένειας @el
label: a pour famille membre d’une famille @fr
definition: Met une famille en relation avec une famille qui est membre d’une famille. @fr
toolkit label: famille membre d’une famille @fr
toolkit definition: Famille qui est membre d’une famille. @fr
label: dzimtai/ģimenei piederīgā dzimta/ģimene @lv
definition: Sasaista dzimtu/ģimeni ar dzimtu/ģimeni, kas ir dzimtas /ģimenes piederīgais. @lv
toolkit label: dzimtai/ģimenei piederīgā dzimta/ģimene @lv
toolkit definition: Dzimta/ģimene, kas ir dzimtas /ģimenes piederīgais. @lv
label: 有家族的家族成员 @zh-hans
definition: 将一个家族与是一个家族的一个成员的一个家族关联起来。 @zh-hans
toolkit label: 家族的家族成员 @zh-hans
toolkit definition: 是一个家族的一个成员的一个家族 @zh-hans
label: ailenin aile üyesi ile ilişkilidir @tr
definition: Bir aileyi, bir ailenin üyesi olan bir aileyle ilişkilendirir. @tr
toolkit label: ailenin aile üyesi @tr
toolkit definition: Bir ailenin üyesi olan bir aile @tr
has subproperty: suvusta polveutuva suku
has subproperty: P50438

sukuhaara suvussa
status: Published
label: is family member of family of @en
type: Property
lexical alias: familyMemberOfFamilyOf.en
definition: Relates a family to a family of whom a family is a member. @en
domain: C10008
toolkit label: family member of family of @en
toolkit definition: A family of whom a family is a member. @en
sub property of: sukuun liittyvä suku
sub property of: sukujäsen yhteistoimijassa
has element type: 2
definition: Liittää suvun sukuun, jonka jäsen suku on.
alternative label: suvun jäsen suvussa
toolkit label: sukuhaara suvussa
toolkit definition: Suku, jonka jäsen suku on.
label: er familie som medlem av familie for @no
definition: Relaterer en familie til en familie som en familie er medlem av. @no
toolkit label: familie som medlem av familie for @no
toolkit definition: En familie som en familie er medlem av. @no
label: is familielid van familie van @nl
definition: Relateert een familie aan een familie waarvan een familie lid is. @nl
toolkit label: familielid van familie van @nl
toolkit definition: Een familie waarvan een familie lid is. @nl
label: هي عائلة عضو في عائلة @ar
definition: يربط عائلة بعائلة تكون العائلة عضوا فيها. @ar
toolkit label: عائلة عضو في عائلة @ar
toolkit definition: عائلة حيث عائلة عضو فيها. @ar
label: és família membre d’una família de @ca
definition: Relaciona una família amb una família de la qual una família n’és un membre. @ca
toolkit label: família membre d’una família de @ca
toolkit definition: Família de la qual una família n’és un membre. @ca
label: er familie, som er medlem af familie af @da
definition: Relaterer en familie til en familie, som en familie er medlem af. @da
toolkit label: familie, som er medlem af familie af @da
toolkit definition: Familie, som en familie er medlem af. @da
label: perekonna liige (perekond) perekonnas @et
definition: Seostab perekonna perekonnaga, milles perekond on liige. @et
toolkit label: perekonna liige (perekond) perekonnas @et
toolkit definition: Perekond, milles perekond on liige. @et
label: ist Familie als Familienmitglied von @de
definition: Setzt eine Familie in Beziehung zu einer Familie, zu der eine Familie gehört. @de
toolkit label: Familie als Familienmitglied von @de
toolkit definition: Eine Familie, zu der eine Familie gehört. @de
label: családtagja a következő családnak: @hu
definition: Hozzákapcsol egy családot egy családhoz, amelynek egy család a tagja. @hu
toolkit label: családtagja a következő családnak: @hu
toolkit definition: Egy család, amelynek tagja egy család. @hu
label: è famiglia membro di famiglia di @it
definition: Correla una famiglia a una famiglia di cui una famiglia è un membro. @it
toolkit label: famiglia membro di famiglia di @it
toolkit definition: Famiglia di cui una famiglia è membro. @it
label: είναι μέλος οικογένειας της οικογένειας του @el
toolkit label: μέλος οικογένειας της οικογένειας του @el
label: est une famille membre d’une famille de @fr
definition: Met une famille en relation avec une famille dont une famille est membre. @fr
toolkit label: famille membre d’une famille de @fr
toolkit definition: Famille dont une famille est membre. @fr
label: ir dzimtas/ģimenes dalībnieks (dzimta/ģimene) @lv
definition: Sasaista dzimtu/ģimeni ar dzimtu/ģimeni, kā piederīgie ir dzimta/ģimene. @lv
toolkit label: ir dzimtas/ģimenes dalībnieks (dzimta/ģimene) @lv
toolkit definition: Dzimta/ģimene, kā piederīgie ir dzimta/ģimene. @lv
label: 是……的家族的家族成员 @zh-hans
definition: 将一个家族与有一个家族是其一个成员的一个家族关联起来。 @zh-hans
toolkit label: ……的家族的家族成员 @zh-hans
toolkit definition: 有一个家族是其一个成员的一个家族 @zh-hans
label: ailesinin aile üyesidir @tr
definition: Bir aileyi, ailenin üyesi olduğu bir aileyle ilişkilendirir. @tr
toolkit label: ailenin aile üyesi @tr
toolkit definition: Bir ailenin üyesi olduğu bir aile. @tr
has subproperty: suvun kantasuku
has subproperty: P50443

henkilön muutoshakemus oikeudessa
status: Published
label: is appellant person of @en
definition: Relates a person to a work that is a legal work of a higher court that records a decision of a lower court that is appealed by a person. @en
type: Property
domain: C10004
lexical alias: appellantPersonOf.en
label: est une personne appelante de @fr
definition: Met une personne en relation avec une œuvre juridique d’un tribunal supérieur qui enregistre une décision d’un tribunal inférieur portée en appel par une personne. @fr
toolkit label: personne appelante de @fr
toolkit definition: Œuvre juridique d’un tribunal supérieur qui enregistre une décision d’un tribunal inférieur portée en appel par une personne. @fr
toolkit label: appellant person of @en
toolkit definition: A work that is a legal work of a higher court that records a decision of a lower court that is appealed by a person. @en
instruction number: 18.5
sub property of: teoksen tekijä (henkilö) teoksessa
label: είναι εκαλλούν/αναιρεσείον φυσικό πρόσωπο του @el
definition: Συνδέει ένα φυσικό πρόσωπο, που ασκεί έφεση εναντίον απόφασης κατώτερου δικαστηρίου, που καταχωρίστηκε στα πρακτικά ενός ανωτέρου δικαστηρίου, με ένα έργο. @el
toolkit label: εκκαλούν/αναιρεσείον φυσικό πρόσωπο του @el
toolkit definition: Ένα νομικό έργο, που καταχωρίστηκε στα πρακτικά ενός ανωτέρου δικαστηρίου, για φυσικό πρόσωπο που ασκεί έφεση εναντίον απόφασης κατώτερου δικαστηρίου. @el
definition: Setzt eine Person in Beziehung zu einem juristisches Werk einer höheren Instanz, das ein Gerichtsurteil einer unteren Instanz erfasst, gegen das eine Person Rechtsmittel (Berufung/Revision) einlegt. @de
toolkit label: Person als Berufungsklagende/Berufungsklagender/Revisionsbeklagende/Revisionsklagender von @de
toolkit definition: Ein juristisches Werk einer höheren Instanz, das ein Gerichtsurteil einer unteren Instanz erfasst, gegen das eine Person Rechtsmittel (Berufung/Revision) einlegt. @de
label: er person, som er appellant af @da
definition: Relaterer en person til et juridisk værk fra en højere retsinstans, som registerer en lavere retsinstans dom, som er appelleret af en person. @da
toolkit label: person, som er appellant af @da
toolkit definition: Juridisk værk fra en højere retsinstans, som registerer en lavere retsinstans dom, som er appelleret af en person. @da
label: és persona apel·lant de @ca
definition: Relaciona una persona amb una obra que és una obra jurídica d’un tribunal superior que enregistra una decisió d’un tribunal inferior que és apel·lada per una persona. @ca
toolkit label: persona apel·lant de @ca
toolkit definition: Obra que és una obra jurídica d’un tribunal superior que enregistra una decisió d’un tribunal inferior que és apel·lada per una persona. @ca
definition: Liittää henkilön juridiseen teokseen, jolla henkilö hakee muutosta alemman oikeusasteen päätökseen.
toolkit label: henkilön muutoshakemus oikeudessa
toolkit definition: Juridinen teos, jolla henkilö hakee muutosta alemman oikeusasteen päätökseen.
toolkit label: appellantperson for @no
toolkit definition: Et juridisk verk fra en høyere rettsinstans som registrerer en avgjørelse fra en lavere rettsinstans som ankes av en person. @no
label: ist Person als Berufungsklagende/Berufungsklagender/Revisionsklagende/Revisionsklagender von @de
has element type: 2
label: fellebbező személye a következőnek: @hu
definition: Hozzákapcsol egy személyt egy felsőbb bíróság jogi művéhez, amely rögzíti egy alsóbb bíróság ítéletét, amelyet egy személy megfellebbezett. @hu
toolkit label: fellebbező személye: @hu
toolkit definition: Egy felsőbb bíróság jogi mű, amely rögzíti egy alsóbb bíróság ítéletét, amelyet egy személy megfellebbezett. @hu
alternative label: henkilön muutoshakemus
label: er appellantperson for @no
definition: Relaterer en person til et juridisk verk fra en høyere rettsinstans som registrerer en avgjørelse fra en lavere rettsinstans som ankes av en person. @no
label: is aanklager in beroep-persoon van @nl
definition: Relateert een persoon aan een juridisch werk van een hoger gerechtshof dat een oordeel vastlegt van een lager gerechtshof waarbij een persoon in beroep gaat. @nl
toolkit label: aanklager in beroep-persoon van @nl
toolkit definition: Een juridisch werk van een hoger gerechtshof dat een oordeel vastlegt van een lager gerechtshof waarbij een persoon in beroep gaat. @nl
label: هو شخص مستأنِف لـ @ar
definition: يربط شخصا بعمل قضائي لمحكمة أعلى درجة يُسجل قرار محكمة أدنى درجة يطعن فيه شخص. @ar
toolkit label: شخص مستأنف لـ @ar
toolkit definition: عمل قانوني لمحكمة أعلى درجة يُسجل قرار محكمة أدنى درجة يطعن فيه شخص. @ar
label: apellant (isik) teoses @et
definition: Seostab isiku kõrgema astme kohtu juriidilise teosega, milles on dokumenteeritud alama astme kohtu otsus, mille peale isik on esitanud apellatsiooni. @et
toolkit label: apellant (isik) teoses @et
toolkit definition: Kõrgema astme kohtu juriidiline teos, milles on dokumenteeritud alama astme kohtu otsus, mille peale isik on esitanud apellatsiooni. @et
label: è ricorrente persona di @it
definition: Correla una persona a un opera legale di un tribunale superiore che registra una decisione di un tribunale inferiore a cui la persona ha fatto ricorso. @it
toolkit label: persona ricorrente di @it
toolkit definition: Opera legale di un tribunale superiore che registra una decisione di un tribunale inferiore a cui la persona ha fatto ricorso. @it
label: ir apelācijas iesniedzējs (persona) @lv
definition: Sasaista personu ar augstākas instances tiesas spriedumu zemākās instances tiesas sprieduma izskatīšanā, ko pārsūdz persona. @lv
toolkit label: ir apelācijas iesniedzējs (persona) @lv
toolkit definition: Augstākas instances tiesas spriedums zemākās instances tiesas sprieduma izskatīšanā, ko pārsūdz persona. @lv
label: 是……的上诉个人 @zh-hans
definition: 将一个个人与一种记录下级法院被一个个人起诉的决定的上级法院的一种法律作品关联起来。 @zh-hans
toolkit label: ……的上诉个人 @zh-hans
toolkit definition: 一种记录下级法院被一个个人起诉的决定的上级法院的法律作品 @zh-hans
label: temyiz eden kişisidir @tr
definition: Bir kişiyi, eser ile o eserin oluşumunda rol alan kişiyi bir üst mahkeme tarafından bir alt mahkemenin kararına dair temyizini içeren resmi belge ve o belgeyi oluşturan olarak ilişkilendirir. @tr
toolkit label: temyiz eden kişi @tr
toolkit definition: Bir kişi tarafından temyiz edilen bir alt mahkeme kararını kaydeden yüksek mahkemeye ait hukuki bir çalışma. @tr
has subproperty: P50122

henkilökantaja teoksessa
status: Published
label: is plaintiff person of @en
definition: Relates a person to a work that involves a responsibility for bringing a suit as a person in a civil proceeding. @en
type: Property
domain: C10004
sub property of: teoksen tekijä (henkilö) teoksessa
lexical alias: plaintiffPersonOf.en
label: est une personne demanderesse de @fr
definition: Met une personne en relation avec une œuvre qui comporte une responsabilité consistant à intenter une poursuite civile en tant que personne. @fr
toolkit label: personne demanderesse de @fr
toolkit definition: Œuvre qui comporte une responsabilité consistant à intenter une poursuite civile en tant que personne. @fr
toolkit label: plaintiff person of @en
toolkit definition: A work that involves a responsibility for bringing a suit as a person in a civil proceeding. @en
instruction number: 18.5
label: είναι ενάγον φυσικό πρόσωπο του @el
definition: Συνδέει ένα φυσικό πρόσωπο, το οποίο ασκεί αγωγή στο πλαίσιο αστικής διαδικασίας, με ένα έργο. @el
toolkit label: ενάγον φυσικό πρόσωπο του @el
toolkit definition: Ένα έργο, το οποίο περιλαμβάνει την άσκηση αγωγήςστο πλαίσιο αστικής διαδικασίας, από ένα φυσικό πρόσωπο. @el
definition: Setzt eine Person in Beziehung zu einem Werk, bei dem eine Person eine Klage in ein Zivilverfahren einbringt. @de
toolkit label: Zivilklagende Person von @de
toolkit definition: Ein Werk, bei dem eine Person eine Klage in ein Zivilverfahren einbringt. @de
label: er person, som er sagsøger af @da
definition: Relaterer en person til et værk, som involverer et ansvar for at anlægge en sag, som en person, i en civilproces. @da
toolkit label: person, som er sagsøger af @da
toolkit definition: Værk, som involverer et ansvar for at anlægge en sag, som en person, i en civilproces. @da
label: és persona demandant de @ca
definition: Relaciona una persona amb una obra que implica una responsabilitat d’interposar una demanda civil com a persona en un procés civil. @ca
toolkit label: persona demandant de @ca
toolkit definition: Obra que implica una responsabilitat d’interposar una demanda civil com a persona en un procés civil. @ca
definition: Liittää henkilön teokseen, jossa henkilö on vastuussa kanteen tuomisesta siviilioikeudenkäyntiin.
toolkit label: henkilökantaja teoksessa
toolkit definition: Teos, jossa henkilö on vastuussa kenteen tuomisesta siviilioikeudenkäyntiin.
toolkit label: saksøker av (person) @no
toolkit definition: Et verk som involverer ansvar for å være en person som er saksøker i en sivilrettslig sak. @no
label: ist zivilklagende Person von @de
has element type: 2
label: felperes személye a következőnek: @hu
definition: Hozzákapcsol egy személyt egy műhöz, amelyhez hozzátartozik egy személy felelőssége egy per elindításáért egy polgári jogi eljárásban. @hu
toolkit label: felperes személye: @hu
toolkit definition: Egy mű, amelyhez hozzátartozik egy személy felelőssége egy per elindításáért egy polgári jogi eljárásban. @hu
alternative label: henkilön tekemä kanne
label: er saksøker av (person) @no
definition: Relaterer en person til et verk som involverer ansvar for å være en person som er saksøker i en sivilrettslig sak. @no
label: is aanklager-persoon van @nl
definition: Relateert een persoon aan een werk dat met zich meebrengt een verantwoordelijkheid voor het aanspannen van een proces als een persoon in een civielrechtelijke procedure. @nl
toolkit label: aanklager-persoon van @nl
toolkit definition: Een werk dat met zich meebrengt een verantwoordelijkheid voor het aanspannen van een proces als een persoon in een civielrechtelijke procedure. @nl
label: هو شخص مُدّعِ لـ @ar
definition: يربط شخصا بعمل يترتب عليه تحمل شخص مسئولية رفع دعوى مدنية. @ar
toolkit label: شخص مدع لـ @ar
toolkit definition: عمل يترتب عليه تحمل شخص مسئولية رفع دعوى مدنية. @ar
label: hageja (isik) teoses @et
definition: Seostab isiku teosega, mis sisaldab isiku vastutust tsiviilkohtumenetluses hagi esitamise eest. @et
toolkit label: hageja (isik) teoses @et
toolkit definition: Teos, mis sisaldab isiku vastutust tsiviilkohtumenetluses hagi esitamise eest. @et
label: è querelante persona di @it
definition: Correla una persona a un'opera che implica una responsabilità nell'intentare una causa come persona in un processo civile. @it
toolkit label: querelante persona di @it
toolkit definition: Opera che implica una responsabilità nell'intentare una causa come persona in un processo civile. @it
label: ir prasītājs (persona) @lv
definition: Sasaista personu ar darbu, kas ietver atbildību par to, ka persona ceļ prasību civiltiesā. @lv
toolkit label: ir prasītājs (persona) @lv
toolkit definition: Darbs, kas ietver atbildību par to, ka persona ceļ prasību civiltiesā. @lv
label: 是……的原告个人 @zh-hans
definition: 将一个个人与涉及民事诉讼中作为个人起诉的责任的作品关联起来。 @zh-hans
toolkit label: ……的原告个人 @zh-hans
toolkit definition: 涉及民事诉讼中作为个人起诉的责任的作品 @zh-hans
label: davacı kişisidir @tr
definition: Bir kişiyi, hukuk davasında kişi olarak dava açma sorumluluğunu içeren bir eserle ilişkilendirir. @tr
toolkit label: davacı kişi @tr
toolkit definition: Bir hukuk davasında kişi olarak dava açma sorumluluğunu içeren bir çalışma. @tr
has subproperty: P50124

valokuva (ekspressio)
status: Deprecated
type: Property
label: is photographer of expression of (Deprecated) @en
lexical alias: photographerOfExpressionOf.en
definition: Relates an agent to an expression that includes a contribution of providing supplementary photographic content. (Deprecated) @en
domain: C10002
toolkit label: photographer of expression of (Deprecated) @en
toolkit definition: An expression that includes a contribution of providing supplementary photographic content. (Deprecated) @en
see also: teoksen valokuvaaja (toimija) teoksessa
instruction number: 18.5
sub property of: is contributor to aggregated content of (Deprecated)
label: είναι φωτογράφος (έκφραση) του @el
definition: Συνδέει έναν εικονογράφο, που συνεισφέρει σε μια έκφραση ενός έργου παρέχοντας συμπληρωματικό φωτογραφικό περιεχόμενο σε ένα πρωτότυπο έργο, με μια έκφραση. @el
toolkit label: φωτογράφος (έκφραση) του @el
toolkit definition: Μια έκφραση ενός έργου που ενσωματώνει την παροχή συμπληρωματικού φωτογραφικού περιεχομένου στο πρωτότυπο έργο. @el
definition: Setzt einen Illustrator, der an einer Expression eines Werks mitwirkt, indem er einem Originalwerk zusätzliche fotografische Inhalte liefert, mit einer Expression in Beziehung. @de
toolkit label: Fotograf (Expression) von @de
toolkit definition: Eine Expression eines Werks, bei der ein Akteur einem Originalwerk zusätzliche fotografische Inhalte liefert. @de
label: er fotograf (udtryk) til @da
definition: Relaterer en illustrator, der har bidraget til et udtryk af et værk ved at sørge for supplerende fotografisk indhold til det oprindelige værk til et udtryk. @da
toolkit label: fotograf (udtryk) til @da
toolkit definition: Udtryk af et værk, der inkorporerer et illustrationsbidrag ved at sørge for supplerende fotografisk indhold til det oprindelige værk. @da
label: és fotògraf (expressió) de @ca
definition: Relaciona un il·lustrador, que contribueix a una expressió d’una obra proporcionant un contingut fotogràfic suplementari a una obra original, amb una expressió. @ca
toolkit label: fotògraf (expressió) de @ca
toolkit definition: Expressió d’una obra que incorpora una contribució il·lustrativa que proporciona un contingut fotogràfic suplementari a una obra original. @ca
definition: Liittää kuvittajan teoksen ekspressioon, joka sisältää alkuperäistä teosta täydentävää valokuvasisältöä.
toolkit label: valokuva (ekspressio)
toolkit definition: Teoksen ekspressio, joka sisältää alkuperäistä teosta täydentävää valokuvasisältöä.
toolkit label: fotograf (uttrykk) av @no
toolkit definition: Et uttrykk av et verk som omfatter et illustrerende bidrag i form av å tilføre supplerende fotografisk innhold til et originalverk. @no
label: ist Fotograf (Expression) von @de
label: est un photographe (expression) de @fr
definition: Met un illustrateur qui contribue à une expression d’une œuvre en fournissant du contenu photographique supplémentaire à une œuvre originale en relation avec une expression. @fr
toolkit label: photographe (expression) de @fr
toolkit definition: Expression d’une œuvre qui intègre une contribution d’illustration consistant à fournir du contenu photographique supplémentaire à une œuvre originale. @fr
has element type: 2
label: fényképésze (kifejezési forma) @hu
definition: Egy illusztrátort, aki hozzájárul egy mű kifejezési formájához azzal, hogy egy eredeti műhöz kiegészítő fotográfiai tartalmat szolgáltat, hozzákapcsol egy kifejezési formához. @hu
toolkit label: fényképésze (kifejezési forma) @hu
toolkit definition: Egy mű kifejezési formája, amely illusztráló közreműködést testesít meg azzal, hogy egy eredeti műhöz kiegészítő fényképészeti tartalmat ad hozzá. @hu
has subproperty: P50272

toimijan toiminta-ala
status: Published
type: Property
label: has field of activity of agent @en
lexical alias: fieldOfActivityOfAgent.en
definition: Relates an agent to a field of endeavor, area of expertise, etc., in which an agent is engaged. @en
domain: C10002
toolkit label: field of activity of agent @en
toolkit definition: A field of endeavor, area of expertise, etc., in which an agent is engaged. @en
has element type: 5
definition: Liittää toimijan alaan, jolla toimija toimii tai on toiminut, tai jonka asiantuntija tms. hän on.
toolkit label: toimijan toiminta-ala
toolkit definition: Ala, jolla toimija toimii tai on toiminut, tai jonka asiantuntija tms. hän on.
label: har virksomhetsområde for agent @no
definition: Relaterer en agent til et arbeidsfelt, et ekspertiseområde, etc., som en agent er involvert i. @no
toolkit label: virksomhetsområde for agent @no
toolkit definition: Et arbeidsfelt, et ekspertiseområde, etc., som en agent er involvert i. @no
label: heeft veld van activiteit van actor @nl
definition: Relateert een actor aan een veld van inspanning, vakgebied etc. waarbij een actor betrokken is. @nl
toolkit label: veld van activiteit van actor @nl
toolkit definition: Een veld van inspanning, vakgebied etc. waarbij een actor betrokken is. @nl
label: له مجال نشاط وكيل @ar
definition: يربط وكيلا بمجال العمل والخبرة، الخ، الذي يمارسه الوكيل @ar
toolkit label: له مجال نشاط وكيل @ar
toolkit definition: مجال العمل والخبرة، الخ، الذي يمارسه الوكيل. @ar
label: té com a camp d’activitat d’un agent @ca
definition: Relaciona un agent amb un camp d’acció, àrea d’experiència, etc., al qual es dedica un agent. @ca
toolkit label: camp d’activitat d’un agent @ca
toolkit definition: Camp d’acció, àrea d’experiència, etc., al qual es dedica un agent. @ca
label: har virkefelt for agent @da
definition: Relaterer en agent til et indsatsområde, ekspertiseområde osv., inden for hvilket en agent er engageret. @da
toolkit label: virkefelt for agent @da
toolkit definition: Indsatsområde, ekspertiseområde osv., inden for hvilket en agent er engageret. @da
label: tegija tegevusala @et
definition: Seostab tegija tegevus- või erialaga, millega tegija tegeleb või on tegelnud. @et
toolkit label: tegija tegevusala @et
toolkit definition: Tegevus- või eriala, millega tegija tegeleb või on tegelnud. @et
label: hat Betätigungsfeld eines Akteurs @de
definition: Setzt einen Akteur in Beziehung zu einem Tätigkeitsfeld, einem Wissensgebiet und so weiter, in dem ein Akteur aktiv ist. @de
toolkit label: Betätigungsfeld eines Akteurs @de
toolkit definition: Ein Tätigkeitsfeld, ein Wissensgebiet und so weiter, in dem ein Akteur aktiv ist. @de
label: ágens tevékenységi köre a következő: @hu
definition: Hozzákapcsol egy ágenst egy tevékenységhez, szakterülethez, illetékességi, stb. területhez, amely iránt az ágens elkötelezett. @hu
toolkit label: ágens tevékenységi köre: @hu
toolkit definition: Egy tevékenység, szakterület, illetékességi, stb. terület, amely iránt az ágens elkötelezett. @hu
label: ha come campo di attività di agente @it
definition: Correla un agente a un campo di impegno, area di competenza, etc. in cui un agente è impegnato. @it
toolkit label: campo di attività di agente @it
toolkit definition: Campo di impegno, area di competenza, etc. in cui un agente è impegnato. @it
label: έχει πεδίο δραστηριοποίησης του φορέα @el
toolkit label: πεδίο δραστηριοποίησης του φορέα @el
label: a pour domaine d’activité d’un agent @fr
definition: Met un agent en relation avec un champ d’activité, domaine d’expertise, etc. dans lequel un agent évolue. @fr
toolkit label: domaine d’activité d’un agent @fr
toolkit definition: Champ d’activité, domaine d’expertise, etc. dans lequel un agent évolue. @fr
label: aģenta darbības joma @lv
definition: Sasaista aģentu ar aģenta darbības jomu, kurā tas iesaistīts. @lv
toolkit label: aģenta darbības joma @lv
toolkit definition: Aģenta darbības joma, kurā tas iesaistīts. @lv
label: 有行为者的活跃领域 @zh-hans
definition: 将一个行为者与一个行为者所从事的努力领域、专业范围等关联起来。 @zh-hans
toolkit label: 行为者的活跃领域 @zh-hans
toolkit definition: 一个行为者所从事的努力领域、专业范围等 @zh-hans
label: temsilcinin faaliyet alanı ile ilişkilidir @tr
definition: Bir temsilciyi, bir temsilcinin dahil olduğu bir uğraş, çalışma alanı vb. ile ilişkilendirir. @tr
toolkit label: temsilcinin faaliyet alanı @tr
toolkit definition: Bir temsilcinin dahil olduğu bir uğraş, uzmanlık alanı vb. @tr
has subproperty: yhteistoimijan toiminta-ala
has subproperty: henkilön toiminta-ala
has subproperty: P50387

yhteistoimijan toiminta-ala
status: Published
type: Property
label: has field of activity of collective agent @en
lexical alias: fieldOfActivityOfCollectiveAgent.en
definition: Relates a collective agent to a field of endeavor, area of expertise, etc., in which a collective agent is engaged. @en
domain: C10011
toolkit label: field of activity of collective agent @en
toolkit definition: A field of endeavor, area of expertise, etc., in which a collective agent is engaged. @en
sub property of: toimijan toiminta-ala
has element type: 5
definition: Liittää yheistoimijan alaan, jolla yhteishenkilö toimii tai on toiminut, tai jonka asiantuntija tms. se on.
toolkit label: yhteistoimijan toiminta-ala
toolkit definition: Ala, jolla yhteishenkilö toimii tai on toiminut, tai jonka asiantuntija tms. se on.
label: har virksomhetsområde for kollektiv agent @no
definition: Relaterer en kollektiv agent til et arbeidsfelt, et ekspertiseområde, etc., som en kollektiv agent er involvert i. @no
toolkit label: virksomhetsområde for kollektiv agent @no
toolkit definition: Et arbeidsfelt, et ekspertiseområde, etc., som en kollektiv agent er involvert i. @no
label: heeft veld van activiteit van collectieve actor @nl
definition: Relateert een collectieve actor aan een veld van inspanning, vakgebied etc. waarbij een collectieve actor betrokken is. @nl
toolkit label: veld van activiteit van collectieve actor @nl
toolkit definition: Een veld van inspanning, vakgebied etc. waarbij een collectieve actor betrokken is. @nl
label: له مجال نشاط وكيل جماعي @ar
definition: يربط وكيلا جماعيا بمجال العمل والخبرة، الخ، الذي يمارسه الوكيل الجماعي. @ar
toolkit label: مجال نشاط وكيل جماعي @ar
toolkit definition: مجال العمل والخبرة، الخ، الذي يمارسه الوكيل الجماعي. @ar
label: té com a camp d’activitat d’un agent col·lectiu @ca
definition: Relaciona un agent col·lectiu amb un camp d’acció, àrea d’experiència, etc., al qual es dedica un agent col·lectiu. @ca
toolkit label: camp d’activitat d’un agent col·lectiu @ca
toolkit definition: Camp d’acció, àrea d’experiència, etc., al qual es dedica un agent col·lectiu. @ca
label: har virkefelt for kollektiv agent @da
definition: Relaterer en kollektiv agent til et indsatsområde, ekspertiseområde osv., inden for hvilket en kollektiv agent er engageret. @da
toolkit label: virkefelt for kollektiv agent @da
toolkit definition: Indsatsområde, ekspertiseområde osv., inden for hvilket en kollektiv agent er engageret. @da
label: kollektiivi tegevusala @et
definition: Seostab kollektiivi tegevus- või erialaga, millega kollektiiv tegeleb või on tegelnud. @et
toolkit label: kollektiivi tegevusala @et
toolkit definition: Tegevus- või eriala, millega kollektiiv tegeleb või on tegelnud. @et
label: hat Betätigungsfeld eines gemeinschaftlichen Akteurs @de
definition: Setzt einen gemeinschaftlichen Akteur in Beziehung zu einem Tätigkeitsfeld, einem Wissensgebiet und so weiter, in dem ein gemeinschaftlicher Akteur aktiv ist. @de
toolkit label: Betätigungsfeld eines gemeinschaftlichen Akteurs @de
toolkit definition: Ein Tätigkeitsfeld, ein Wissensgebiet und so weiter, in dem ein gemeinschaftlicher Akteur aktiv ist. @de
label: kollektív ágens tevékenységi köre a következő: @hu
definition: Hozzákapcsol egy kollektív ágenst egy tevékenységhez, szakterülethez, illetékességi, stb. területhez, amely iránt a kollektív ágens elkötelezett. @hu
toolkit label: kollektív ágens tevékenységi köre: @hu
toolkit definition: Egy tevékenység, szakterület, illetékességi, stb. terület, amely iránt a kollektív ágens elkötelezett. @hu
label: ha come campo di attività di agente collettivo @it
definition: Correla un agente collettivo a un campo di impegno, area di competenza, etc. in cui un agente collettivo è impegnato. @it
toolkit label: campo di attività di agente collettivo @it
toolkit definition: Campo di impegno, area di competenza, etc. in cui un agente collettivo è impegnato. @it
label: έχει πεδίο δραστηριοποίησης του συλλογικού φορέα @el
toolkit label: πεδίο δραστηριοποίησης του συλλογικού φορέα @el
label: a pour domaine d’activité d’un agent collectif @fr
definition: Met un agent collectif en relation avec un champ d’activité, domaine d’expertise, etc. dans lequel un agent collectif évolue. @fr
toolkit label: domaine d’activité d’un agent collectif @fr
toolkit definition: Champ d’activité, domaine d’expertise, etc. dans lequel un agent collectif évolue. @fr
label: grupas darbības joma @lv
definition: Sasaista grupu ar grupas darbības jomu, kurā tā iesaistīta. @lv
toolkit label: grupas darbības joma @lv
toolkit definition: Grupas darbības joma, kurā tā iesaistīta. @lv
label: 有集体行为者的活跃领域 @zh-hans
definition: 将一个集体行为者与一个集体行为者所从事的努力领域、专业范围等关联起来。 @zh-hans
toolkit label: 集体行为者的活跃领域 @zh-hans
toolkit definition: 一个集体行为者所从事的努力领域、专业范围等 @zh-hans
label: kolektif temsilcinin faaliyet alanı ile ilişkilidir @tr
definition: Kolektif bir temsilciyi, bir kolektif temsilcinin dahil olduğu bir çalışma alanı, uzmanlık alanı vb. ile ilişkilendirir. @tr
toolkit label: kolektif temsilcinin faaliyet alanı @tr
toolkit definition: Bir kolektif temsilcinin dahil olduğu bir uğraş, uzmanlık alanı vb. @tr
has subproperty: suvun toiminta-ala
has subproperty: yhteisön toiminta-ala
has subproperty: P50388

suvun toiminta-ala
status: Published
type: Property
label: has field of activity of family @en
lexical alias: fieldOfActivityOfFamily.en
definition: Relates a family to a field of endeavor, area of expertise, etc., in which a family is engaged. @en
domain: C10008
toolkit label: field of activity of family @en
toolkit definition: A field of endeavor, area of expertise, etc., in which a family is engaged. @en
sub property of: yhteistoimijan toiminta-ala
has element type: 5
definition: Liittää suvun alaan, jolla suku toimii tai on toiminut, tai jonka asiantuntija tms. se on.
toolkit label: suvun toiminta-ala
toolkit definition: Ala, jolla suku toimii tai on toiminut, tai jonka asiantuntija tms. se on.
label: har virksomhetsområde for familie @no
definition: Relaterer en familie til et arbeidsfelt, et ekspertiseområde, etc., som en familie er involvert i. @no
toolkit label: virksomhetsområde for familie @no
toolkit definition: Et arbeidsfelt, et ekspertiseområde, etc., som en familie er involvert i. @no
label: heeft veld van activiteit van familie @nl
definition: Relateert een familie aan een veld van inspanning, vakgebied etc. waarbij een familie betrokken is. @nl
toolkit label: veld van activiteit van familie @nl
toolkit definition: Een veld van inspanning, vakgebied etc. waarbij een familie betrokken is. @nl
label: له مجال نشاط عائلة @ar
definition: يربط عائلة بمجال العمل والخبرة، الخ، الذي تمارسه العائلة. @ar
toolkit label: مجال نشاط عائلة @ar
toolkit definition: مجال العمل والخبرة، الخ، الذي تمارسه العائلة. @ar
label: té com a camp d’activitat d’una família @ca
definition: Relaciona una família amb un camp d’acció, àrea d’experiència, etc., al qual es dedica una família. @ca
toolkit label: camp d’activitat d’una família @ca
toolkit definition: Camp d’acció, àrea d’experiència, etc., al qual es dedica una família. @ca
label: har virkefelt for familie @da
definition: Relaterer en familie til et indsatsområde, ekspertiseområde osv., inden for hvilket en familie er engageret. @da
toolkit label: virkefelt for familie @da
toolkit definition: Indsatsområde, ekspertiseområde osv., inden for hvilket en familie er engageret. @da
label: perekonna tegevusala @et
definition: Seostab perekonna tegevus- või erialaga, millega perekond tegeleb või on tegelnud. @et
toolkit label: perekonna tegevusala @et
toolkit definition: Tegevus- või eriala, millega perekond tegeleb või on tegelnud. @et
label: hat Betätigungsfeld einer Familie @de
definition: Setzt eine Familie in Beziehung zu einem Tätigkeitsfeld, einem Wissensgebiet und so weiter, in dem eine Familie aktiv ist. @de
toolkit label: Betätigungsfeld einer Familie @de
toolkit definition: Ein Tätigkeitsfeld, ein Wissensgebiet und so weiter, in dem eine Familie aktiv ist. @de
label: család tevékenységi köre a következő: @hu
definition: Hozzákapcsol egy családot egy tevékenységhez, szakterülethez, illetékességi, felelősségi, joghatósági, stb. területhez, amely iránt a család elkötelezett. @hu
toolkit label: család tevékenységi köre: @hu
toolkit definition: Egy tevékenység, szakterület, illetékességi, stb. terület, amely iránt a család elkötelezett. @hu
label: ha come campo di impegno di famiglia @it
definition: Correla una famiglia a un campo di impegno, area di competenza, etc. in cui una famiglia è impegnata. @it
toolkit label: campo di attività di famiglia @it
toolkit definition: Campo di impegno, area di competenza, etc. in cui una famiglia è impegnata. @it
label: έχει πεδίο δραστηριοποίησης της οικογένειας @el
toolkit label: πεδίο δραστηριοποίησης της οικογένειας @el
label: a pour domaine d’activité d’une famille @fr
definition: Met une famille en relation avec un champ d’activité, domaine d’expertise, etc. dans lequel une famille évolue. @fr
toolkit label: domaine d’activité d’une famille @fr
toolkit definition: Champ d’activité, domaine d’expertise, etc. dans lequel une famille évolue. @fr
label: dzimtas/ģimenes darbības joma @lv
definition: Sasaista dzimtu/ģimeni ar dzimtas/ģimenes darbības jomu, kurā tā iesaistīta. @lv
toolkit label: dzimtas/ģimenes darbības joma @lv
toolkit definition: Dzimtas/ģimenes darbības joma, kurā tā iesaistīta. @lv
label: 有家族的活动领域 @zh-hans
definition: 将一个家族与一个家族所从事的努力领域、专业范围等关联起来。 @zh-hans
toolkit label: 家族的活动领域 @zh-hans
toolkit definition: 一个家族所从事的努力领域、专业范围等 @zh-hans
label: ailenin faaliyet alanı ile ilişkilidir @tr
definition: Bir aileyi, bir ailenin dahil olduğu bir uğraş, uzmanlık alanı vb. ile ilişkilendirir. @tr
toolkit label: ailenin faaliyet alanı @tr
toolkit definition: Bir ailenin dahil olduğu bir uğraş, uzmanlık alanı vb. @tr
has subproperty: P50389

elokuvaohjaaja (toimija) teoksessa
status: Published
label: is film director agent of @en
definition: Relates an agent to a work that involves a responsibility of an agent for the general management and supervision of a filmed performance. @en
type: Property
domain: C10002
sub property of: ohjaaja (toimija) teoksessa
lexical alias: filmDirectorAgentOf.en
label: est un agent réalisateur de cinéma de @fr
definition: Met un agent en relation avec une œuvre qui comporte une responsabilité de la part d’un agent consistant à assurer la gestion et la supervision générales d’une prestation filmée. @fr
toolkit label: agent réalisateur de cinéma de @fr
toolkit definition: Œuvre qui comporte une responsabilité de la part d’un agent consistant à assurer la gestion et la supervision générales d’une prestation filmée. @fr
toolkit label: film director agent of @en
toolkit definition: A work that involves a responsibility of an agent for the general management and supervision of a filmed performance. @en
instruction number: 18.5
label: είναι σκηνοθέτης φορέας του @el
definition: Συνδέει έναν σκηνοθέτη υπεύθυνο για τη γενική διεύθυνση και εποπτεία μίας κινηματογραφικής ερμηνείας, με ένα έργο. @el
toolkit label: σκηνοθέτης φορέας του @el
toolkit definition: Ένα έργο το οποίο περιλαμβάνει την ευθύνη για τη γενική διαχείριση και εποπτεία μιας κινηματογραφικής ερμηνείας. @el
definition: Setzt einen Akteur in Beziehung zu einem Werk, bei dem ein Akteur für das allgemeine Management und die Leitung einer verfilmten Darbietung verantwortlich ist. @de
toolkit label: Akteur als Filmregisseurin/Filmregisseur von @de
toolkit definition: Ein Werk, bei dem ein Akteur für das allgemeine Management und die Leitung einer verfilmten Darbietung verantwortlich ist. @de
label: er agent, som er filminstruktør af @da
definition: Relaterer en agent til et værk, som involverer en agents ansvar for den generelle ledelse af- og tilsyn med en filmoptagelse. @da
toolkit label: agent, som er filminstruktør af @da
toolkit definition: Værk, som involverer en agents ansvar for den generelle ledelse af- og tilsyn med en filmoptagelse. @da
label: és agent director cinematogràfic de @ca
definition: Relaciona un agent amb una obra que implica una responsabilitat d’un agent en la gestió general i la supervisió d’una actuació filmada. @ca
toolkit label: agent director cinematogràfic de @ca
toolkit definition: Obra que implica una responsabilitat d’un agent en la gestió general i la supervisió d’una actuació filmada. @ca
definition: Liittää toimijan teokseen, joka sisältää vastuun elokuvatun esityksen yleisestä johtamisesta ja valvonnasta.
toolkit label: elokuvaohjaaja (toimija) teoksessa
toolkit definition: Teos, joka sisältää toimijan vastuun elokuvatun esityksen yleisestä johtamisesta ja valvonnasta.
toolkit label: filmregissør av (agent) @no
toolkit definition: Et verk som involverer ansvar av en agent for generell ledelse av en filmet forestilling. @no
label: ist Akteur als Filmregisseurin/Filmregisseur von @de
has element type: 2
label: filmrendező ágense a következőnek: @hu
definition: Hozzákapcsol egy ágenst egy műhöz, amelyhez hozzátartozik egy ágens felelőssége egy filmforgatás általános menedzseléséért és felügyeletéért. @hu
toolkit label: filmrendező ágense: @hu
toolkit definition: Egy mű, amelyhez hozzátartozik egy ágens felelőssége egy filmforgatás általános menedzseléséért és felügyeletéért. @hu
alternative label: film director of @en
alternative label: elokuvaohjaaja teoksessa
label: er filmregissør av (agent) @no
definition: Relaterer en agent til et verk som involverer ansvar av en agent for generell ledelse av en filmet forestilling. @no
alternative label: filmregissør av @no
label: is filmregisseur-actor van @nl
definition: Relateert een actor aan een werk dat met zich meebrengt een verantwoordelijkheid van een actor voor het algemeen beheer en toezicht van een gefilmde uitvoering. @nl
toolkit label: filmregisseur-actor van @nl
toolkit definition: Een werk dat met zich meebrengt een verantwoordelijkheid van een actor voor het algemeen beheer en toezicht van een gefilmde uitvoering. @nl
label: هو وكيل مخرج فيلم لـ @ar
definition: يربط وكيلا بعمل يترتب عليه تحمل وكيل مسئولية الإدارة العامة والإشراف على أداء مصور. @ar
alternative label: مخرج الفيلم @ar
toolkit label: وكيل مخرج فيلم لـ @ar
toolkit definition: عمل يترتب عليه مسئولية وكيل عن الإدارة العامة والإشراف على أداء مصور. @ar
alternative label: director cinematogràfic de @ca
alternative label: filminstruktør af @da
label: filmirežissöör (tegija) teoses @et
definition: Seostab tegija teosega, mis sisaldab tegija vastutust filmitava etenduse üldise juhtimise ja juhendamise eest. @et
alternative label: filmirežissöör teoses @et
toolkit label: filmirežissöör (tegija) teoses @et
toolkit definition: Teos, mis sisaldab tegija vastutust filmitava etenduse üldise juhtimise ja juhendamise eest. @et
label: è regista agente di @it
definition: Correla un agente a un'opera che implica una responsabilità di un agente per la gestione generale e la supervisione di un'interpretazione filmata. @it
alternative label: regista di @it
toolkit label: agente regista di film @it
toolkit definition: Opera che implica una responsabilità di un agente della gestione generale e la supervisione di un'interpretazione filmata. @it
alternative label: σκηνοθέτης του @el
label: ir kinorežisors (aģents) @lv
definition: Sasaista aģentu ar darbu, kas ietver aģenta atbildību par uzfilmētā pasākuma vispārējo vadību un uzraudzību. @lv
toolkit label: ir kinorežisors (aģents) @lv
toolkit definition: Darbs, kas ietver aģenta atbildību par uzfilmētā pasākuma vispārējo vadību un uzraudzību @lv
alternative label: Filmregisseur von @de
alternative label: ……的电影导演 @zh-hans
label: 是……的电影导演行为者 @zh-hans
definition: 将一个行为者与涉及拍摄表演的总体管理和监督的一个行为者的责任的一种作品关联起来。 @zh-hans
toolkit label: ……的电影导演行为者 @zh-hans
toolkit definition: 涉及拍摄表演的总体管理和监督的一个行为者的责任的一种作品 @zh-hans
toolkit label: film yönetmeni temsilcisi @tr
toolkit definition: Filme alınmış bir performansın genel yönetimi ve denetimi için bir temsilcinin sorumluluğunu içeren bir eser. @tr
has subproperty: elokuvaohjaaja (yhteistoimija) teoksessa

elokuvaohjaaja (yhteistoimija) teoksessa
status: Published
label: is film director collective agent of @en
lexical alias: filmDirectorCollectiveAgentOf.en
definition: Relates a collective agent to a work that involves a responsibility of a collective agent for the general management and supervision of a filmed performance. @en
toolkit label: film director collective agent of @en
toolkit definition: A work that involves a responsibility of a collective agent for the general management and supervision of a filmed performance. @en
type: Property
domain: C10011
has element type: 2
sub property of: ohjaaja (yhteistoimija) teoksessa
sub property of: elokuvaohjaaja (toimija) teoksessa
definition: Liittää yhteistoimijan teokseen, joka sisältää vastuun elokuvatun esityksen yleisestä johtamisesta ja valvonnasta.
toolkit label: elokuvaohjaaja (yhteistoimija) teoksessa
toolkit definition: Teos, joka sisältää vastuun elokuvatun esityksen yleisestä johtamisesta ja valvonnasta.
label: er filmregissør for (kollektiv agent) @no
definition: Relaterer en kollektiv agent til et verk som involverer et ansvar for en kollektiv agent for den generelle ledelsen og tilsyn med en filmet forestilling. @no
toolkit label: filmregissør for (kollektiv agent) @no
toolkit definition: Et verk som involverer et ansvar for en kollektiv agent for den generelle ledelsen og tilsyn med en filmet forestilling. @no
label: is filmregisseur-collectieve actor van @nl
definition: Relateert een collectieve actor aan een werk dat met zich meebrengt een verantwoordelijkheid van een collectieve actor voor het algemeen beheer en toezicht van een gefilmde uitvoering. @nl
toolkit label: filmregisseur-collectieve actor van @nl
toolkit definition: Een werk dat met zich meebrengt een verantwoordelijkheid van een collectieve actor voor het algemeen beheer en toezicht van een gefilmde uitvoering. @nl
label: هو وكيل جماعي مخرج الفيلم لـ @ar
definition: يربط وكيلا جماعيا بعمل يترتب عليه مسئولية وكيل جماعي عن الإدارة العامة والإشراف على أداء مصور. @ar
toolkit label: وكيل جماعي مخرج فيلم @ar
toolkit definition: عمل يترتب عليه مسئولية وكيل جماعي عن الإدارة العامة والإشراف على أداء مصور. @ar
label: és agent col·lectiu director cinematogràfic de @ca
definition: Relaciona un agent col·lectiu amb una obra que implica una responsabilitat d’un agent col·lectiu en la gestió general i la supervisió d’una actuació filmada. @ca
toolkit label: agent col·lectiu director cinematogràfic de @ca
toolkit definition: Obra que implica una responsabilitat d’un agent col·lectiu en la gestió general i la supervisió d’una actuació filmada. @ca
label: er kollektiv agent, som er filminstruktør af @da
definition: Relaterer en kollektiv agent til et værk, som involverer en kollektiv agents ansvar for den generelle ledelse af- og tilsyn med en filmoptagelse. @da
toolkit label: kollektiv agent, som er filminstruktør af @da
toolkit definition: Værk, som involverer en kollektiv agents ansvar for den generelle ledelse af- og tilsyn med en filmoptagelse. @da
label: filmirežissöör (kollektiiv) teoses @et
definition: Seostab kollektiivi teosega, mis sisaldab kollektiivi vastutust filmitava etenduse üldise juhtimise ja juhendamise eest. @et
toolkit label: filmirežissöör (kollektiiv) teoses @et
toolkit definition: Teos, mis sisaldab kollektiivi vastutust filmitava etenduse üldise juhtimise ja juhendamise eest. @et
label: ist gemeinschaftlicher Akteur als Filmregisseurin/Filmregisseur von @de
definition: Setzt einen gemeinschaftlichen Akteur in Beziehung zu einem Werk, bei dem ein gemeinschaftlicher Akteur für das allgemeine Management und die Leitung einer verfilmten Darbietung verantwortlich ist. @de
toolkit label: Gemeinschaftlicher Akteur als Filmregisseurin/Filmregisseur von @de
toolkit definition: Ein Werk, bei dem ein gemeinschaftlicher Akteur für das allgemeine Management und die Leitung einer verfilmten Darbietung verantwortlich ist. @de
label: filmrendező kollektív ágense a következőnek: @hu
definition: Hozzákapcsol egy kollektív ágenst egy műhöz, amelyhez hozzátartozik egy kollektív ágens felelőssége egy filmforgatás általános menedzseléséért és felügyeletéért. @hu
toolkit label: filmrendező kollektív ágense: @hu
toolkit definition: Egy mű, amelyhez hozzátartozik egy kollektív ágens felelőssége egy filmforgatás általános menedzseléséért és felügyeletéért. @hu
label: è regista cinematografico agente collettivo di @it
definition: Correla un agente collettivo a un'opera che implica una responsabilità di un agente collettivo per la gestione e supervisione generale di un'interpretazione filmata. @it
toolkit label: regista cinematografico agente collettivo di @it
toolkit definition: Opera che implica una responsabilità di un agente collettivo per la gestione e supervisione generale di un'interpretazione filmata. @it
label: είναι σκηνοθέτης συλλογικός φορέας του @el
toolkit label: σκηνοθέτης συλλογικός φορέας του @el
label: est un agent collectif réalisateur de cinéma de @fr
definition: Met un agent collectif en relation avec une œuvre qui comporte une responsabilité de la part d’un agent collectif consistant à assurer la gestion et la supervision générales d’une prestation filmée. @fr
alternative label: agent collectif réalisateur de film de @fr
toolkit label: agent collectif réalisateur de cinéma de @fr
toolkit definition: Œuvre qui comporte une responsabilité de la part d’un agent collectif consistant à assurer la gestion et la supervision générales d’une prestation filmée. @fr
label: ir kinorežisors (grupa) @lv
definition: Sasaista grupu ar darbu, kas ietver grupas atbildību par uzfilmētā pasākuma vispārējo vadību un uzraudzību. @lv
toolkit label: ir kinorežisors (grupa) @lv
toolkit definition: Darbs, kas ietver grupas atbildību par uzfilmētā pasākuma vispārējo vadību un uzraudzību @lv
label: 是……的电影导演集体行为者 @zh-hans
definition: 将一个集体行为者与涉及拍摄表演的总体管理和监督的一个集体行为者的责任的一种作品关联起来。 @zh-hans
toolkit label: ……的电影导演集体行为者 @zh-hans
toolkit definition: 涉及拍摄表演的总体管理和监督的一个集体行为者的责任的一种作品 @zh-hans
label: film yönetmeni kolektif temsilcisidir @tr
definition: Kolektif bir temsilciyi, filme alınmış bir performansın genel yönetimi ve denetimi için bir kolektif temsilcinin sorumluluğunu içeren bir eserle ilişkilendirir. @tr
toolkit label: film yönetmeni kolektif temsilcisi @tr
toolkit definition: Filme alınmış bir performansın genel yönetimi ve denetimi için kollektif bir temsilcinin sorumluluğunu içeren bir eser. @tr
has subproperty: elokuvaohjaaja (yhteisö) teoksessa
has subproperty: elokuvaohjaaja (suku) teoksessa
has subproperty: P50713

elokuvaohjaaja (yhteisö) teoksessa
status: Published
label: is film director corporate body of @en
lexical alias: filmDirectorCorporateBodyOf.en
definition: Relates a corporate body to a work that involves a responsibility of a corporate body for the general management and supervision of a filmed performance. @en
toolkit label: film director corporate body of @en
toolkit definition: A work that involves a responsibility of a corporate body for the general management and supervision of a filmed performance. @en
type: Property
domain: C10005
has element type: 2
sub property of: ohjaaja (yhteisö) teoksessa
sub property of: elokuvaohjaaja (yhteistoimija) teoksessa
definition: Liittää yhteisön teokseen, joka sisältää vastuun elokuvatun esityksen yleisestä johtamisesta ja valvonnasta.
toolkit label: elokuvaohjaaja (yhteisö) teoksessa
toolkit definition: Teos, joka sisältää vastuun elokuvatun esityksen yleisestä johtamisesta ja valvonnasta.
label: er filmregissør for (korporasjon) @no
definition: Relaterer en korporasjon til et verk som involverer et ansvar for en korporasjon for den generelle ledelsen og tilsyn med en filmet forestilling. @no
toolkit label: filmregissør for (korporasjon) @no
toolkit definition: Et verk som involverer et ansvar for en korporasjon for den generelle ledelsen og tilsyn med en filmet forestilling. @no
label: is filmregisseur-corporatie van @nl
definition: Relateert een corporatie aan een werk dat met zich meebrengt een verantwoordelijkheid van een corporatie voor het algemeen beheer en toezicht van een gefilmde uitvoering. @nl
toolkit label: filmregisseur-corporatie van @nl
toolkit definition: Een werk dat met zich meebrengt een verantwoordelijkheid van een corporatie voor het algemeen beheer en toezicht van een gefilmde uitvoering. @nl
label: هي هيئة مخرجة لفيلم لـ @ar
definition: يربط هيئة بعمل يترتب عليه مسئولية هيئة عن الإدارة العامة والإشراف على أداء مصور. @ar
toolkit label: هيئة مخرجة لفيلم @ar
toolkit definition: عمل يترتب عليه مسئولية هيئة عن الإدارة العامة والإشراف على أداء مصور. @ar
label: és entitat corporativa directora cinematogràfica de @ca
definition: Relaciona una entitat corporativa amb una obra que implica una responsabilitat d’una entitat corporativa en la gestió general i la supervisió d’una actuació filmada. @ca
toolkit label: entitat corporativa directora cinematogràfica de @ca
toolkit definition: Obra que implica una responsabilitat d’una entitat corporativa en la gestió general i la supervisió d’una actuació filmada. @ca
label: er korporation, som er filminstruktør af @da
definition: Relaterer en korporation til et værk, som involverer en korporations ansvar for den generelle ledelse af- og tilsyn med en filmoptagelse. @da
toolkit label: korporation, som er filminstruktør af @da
toolkit definition: Værk, som involverer en korporations ansvar for den generelle ledelse af- og tilsyn med en filmoptagelse. @da
label: filmirežissöör (asutus) teoses @et
definition: Seostab asutuse teosega, mis sisaldab asutuse vastutust filmitava etenduse üldise juhtimise ja juhendamise eest. @et
toolkit label: filmirežissöör (asutus) teoses @et
toolkit definition: Teos, mis sisaldab asutuse vastutust filmitava etenduse üldise juhtimise ja juhendamise eest. @et
label: ist Körperschaft als Filmregisseurin/Filmregisseur von @de
definition: Setzt eine Körperschaft in Beziehung zu einem Werk, bei dem eine Körperschaft für das allgemeine Management und die Leitung einer verfilmten Darbietung verantwortlich ist. @de
toolkit label: Körperschaft als Filmregisseurin/Filmregisseur von @de
toolkit definition: Ein Werk, bei dem eine Körperschaft für das allgemeine Management und die Leitung einer verfilmten Darbietung verantwortlich ist. @de
label: filmrendező testülete a következőnek: @hu
definition: Hozzákapcsol egy testületet egy műhöz, amelyhez hozzátartozik egy testület felelőssége egy filmforgatás általános menedzseléséért és felügyeletéért. @hu
toolkit label: filmrendező testülete: @hu
toolkit definition: Egy mű, amelyhez hozzátartozik egy testület felelőssége egy filmforgatás általános menedzseléséért és felügyeletéért. @hu
label: è regista cinematografico ente di @it
definition: Correla un ente a un'opera che implica una responsabilità di un ente per la gestione e supervisione generale di un'interpretazione filmata. @it
toolkit label: regista cinematografico ente di @it
toolkit definition: Opera che implica una responsabilità di un ente per la gestione e supervisione generale di un'interpretazione filmata. @it
label: είναι σκηνοθέτης συλλογικό όργανο του @el
toolkit label: σκηνοθέτης συλλογικό όργανο του @el
label: est une collectivité réalisatrice de cinéma de @fr
definition: Met une collectivité en relation avec une œuvre qui comporte une responsabilité de la part d’une collectivité consistant à assurer la gestion et la supervision générales d’une prestation filmée. @fr
alternative label: collectivité réalisatrice de film de @fr
toolkit label: collectivité réalisatrice de cinéma de @fr
toolkit definition: Œuvre qui comporte une responsabilité de la part d’une collectivité consistant à assurer la gestion et la supervision générales d’une prestation filmée. @fr
label: ir kinorežisors (institūcija) @lv
definition: Sasaista institūciju ar darbu, kas ietver institūcijas atbildību par uzfilmētā pasākuma vispārējo vadību un uzraudzību. @lv
toolkit label: ir kinorežisors (institūcija) @lv
toolkit definition: Darbs, kas ietver institūcijas atbildību par uzfilmētā pasākuma vispārējo vadību un uzraudzību @lv
label: 是……的电影导演团体 @zh-hans
definition: 将一个团体与涉及拍摄表演的总体管理和监督的一个团体的责任的一种作品关联起来。 @zh-hans
toolkit label: ……的电影导演团体 @zh-hans
toolkit definition: 涉及拍摄表演的总体管理和监督的一个团体的责任的一种作品 @zh-hans
label: film yönetmeni tüzel kişisidir @tr
definition: Bir tüzel kişiyi, filme alınmış bir performansın genel yönetimi ve denetimi için bir tüzel kişinin sorumluluğunu içeren bir eser ile ilişkilendirir. @tr
toolkit label: film yönetmeni tüzel kişisi @tr
toolkit definition: Filme alınmış bir performansın genel yönetimi ve denetimi için bir tüzel kişinin sorumluluğunu içeren bir eser. @tr
has subproperty: P50864

elokuvaohjaaja (suku) teoksessa
status: Published
label: is film director family of @en
lexical alias: filmDirectorFamilyOf.en
definition: Relates a family to a work that involves a responsibility of a family for the general management and supervision of a filmed performance. @en
toolkit label: film director family of @en
toolkit definition: A work that involves a responsibility of a family for the general management and supervision of a filmed performance. @en
type: Property
domain: C10008
has element type: 2
sub property of: ohjaaja (suku) teoksessa
sub property of: elokuvaohjaaja (yhteistoimija) teoksessa
definition: Liittää suvun teokseen, joka sisältää vastuun elokuvatun esityksen yleisestä johtamisesta ja valvonnasta.
toolkit label: elokuvaohjaaja (suku) teoksessa
toolkit definition: Teos, joka sisältää vastuun elokuvatun esityksen yleisestä johtamisesta ja valvonnasta.
label: er filmregissør for (familie) @no
definition: Relaterer en familie til et verk som involverer et ansvar for en familie for den generelle ledelsen og tilsyn med en filmet forestilling. @no
toolkit label: filmregissør for (familie) @no
toolkit definition: Et verk som involverer et ansvar for en familie for den generelle ledelsen og tilsyn med en filmet forestilling. @no
label: is filmregisseur-familie van @nl
definition: Relateert een familie aan een werk dat met zich meebrengt een verantwoordelijkheid van een familie voor het algemeen beheer en toezicht van een gefilmde uitvoering. @nl
toolkit label: filmregisseur-familie van @nl
toolkit definition: Een werk dat met zich meebrengt een verantwoordelijkheid van een familie voor het algemeen beheer en toezicht van een gefilmde uitvoering. @nl
label: هي عائلة مخرجة لفيلم لـ @ar
definition: يربط عائلة بعمل يترتب عليه مسئولية عائلة عن الإدارة العامة والإشراف على أداء مصور. @ar
toolkit label: عائلة مخرجة لفيلم @ar
toolkit definition: عمل يترتب عليه مسئولية عائلة عن الإدارة العامة والإشراف على أداء مصور. @ar
label: és família directora cinematogràfica de @ca
definition: Relaciona una família amb una obra que implica una responsabilitat d’una família en la gestió general i la supervisió d’una actuació filmada. @ca
toolkit label: família directora cinematogràfica de @ca
toolkit definition: Obra que implica una responsabilitat d’una família en la gestió general i la supervisió d’una actuació filmada. @ca
label: er familie, som er filminstruktør af @da
definition: Relaterer en familie til et værk, som involverer en families ansvar for den generelle ledelse af- og tilsyn med en filmoptagelse. @da
toolkit label: familie, som er filminstruktør af @da
toolkit definition: Værk, som involverer en families ansvar for den generelle ledelse af- og tilsyn med en filmoptagelse. @da
label: filmirežissöör (perekond) teoses @et
definition: Seostab perekonna teosega, mis sisaldab perekonna vastutust filmitava etenduse üldise juhtimise ja juhendamise eest. @et
toolkit label: filmirežissöör (perekond) teoses @et
toolkit definition: Teos, mis sisaldab perekonna vastutust filmitava etenduse üldise juhtimise ja juhendamise eest. @et
label: ist Familie als Filmregisseurin/Filmregisseur von @de
definition: Setzt eine Familie in Beziehung zu einem Werk, bei dem eine Familie für das allgemeine Management und die Leitung einer verfilmten Darbietung verantwortlich ist. @de
toolkit label: Familie als Filmregisseurin/Filmregisseur von @de
toolkit definition: Ein Werk, bei dem eine Familie für das allgemeine Management und die Leitung einer verfilmten Darbietung verantwortlich ist. @de
label: filmrendező családja a következőnek: @hu
definition: Hozzákapcsol egy családot egy műhöz, amelyhez hozzátartozik egy család felelőssége egy filmforgatás általános menedzseléséért és felügyeletéért. @hu
toolkit label: filmrendező családja: @hu
toolkit definition: Egy mű, amelyhez hozzátartozik egy család felelőssége egy filmforgatás általános menedzseléséért és felügyeletéért. @hu
label: è regista cinematografico famiglia di @it
definition: Correla una famiglia a un'opera che implica una responsabilità di una famiglia per la gestione e supervisione generale di un'interpretazione filmata. @it
toolkit label: regista cinematografico famiglia di @it
toolkit definition: Opera che implica una responsabilità di una famiglia per la gestione e supervisione generale di un'interpretazione filmata. @it
label: είναι σκηνοθέτης οικογένεια του @el
toolkit label: σκηνοθέτης οικογένεια του @el
label: est une famille réalisatrice de cinéma de @fr
definition: Met une famille en relation avec une œuvre qui comporte une responsabilité de la part d’une famille consistant à assurer la gestion et la supervision générales d’une prestation filmée. @fr
alternative label: famille réalisatrice de film de @fr
toolkit label: famille réalisatrice de cinéma de @fr
toolkit definition: Œuvre qui comporte une responsabilité de la part d’une famille consistant à assurer la gestion et la supervision générales d’une prestation filmée. @fr
label: ir kinorežisors (dzimta/ģimene) @lv
definition: Sasaista dzimtu/ģimeni ar darbu, kas ietver dzimtas/ģimenes atbildību par uzfilmētā pasākuma vispārējo vadību un uzraudzību. @lv
toolkit label: ir kinorežisors (dzimta/ģimene) @lv
toolkit definition: Darbs, kas ietver dzimtas/ģimenes atbildību par uzfilmētā pasākuma vispārējo vadību un uzraudzību @lv
label: 是……的电影导演家族 @zh-hans
definition: 将一个家族与涉及拍摄表演的总体管理和监督的一个家族的责任的一种作品关联起来。 @zh-hans
toolkit label: ……的电影导演家族 @zh-hans
toolkit definition: 涉及拍摄表演的总体管理和监督的一个家族的责任的一种作品 @zh-hans
label: film yönetmeni ailesidir @tr
definition: Bir aileyi, bir film performansının genel yönetim ve denetim sorumluluğunu içeren bir eserle ilişkilendirir. @tr
toolkit label: film yönetmeni ailesi @tr
toolkit definition: Filme alınmış bir performansın genel yönetimi ve denetimi için bir ailenin sorumluluğunu içeren bir eser. @tr
has subproperty: P51015

elokuvaohjaaja (henkilö) teoksessa
status: Published
label: is film director person of @en
lexical alias: filmDirectorPersonOf.en
definition: Relates a person to a work that involves a responsibility of a person for the general management and supervision of a filmed performance. @en
toolkit label: film director person of @en
toolkit definition: A work that involves a responsibility of a person for the general management and supervision of a filmed performance. @en
type: Property
domain: C10004
has element type: 2
sub property of: ohjaaja (henkilö) teoksessa
sub property of: elokuvaohjaaja (toimija) teoksessa
definition: Liittää henkilön teokseen, joka sisältää vastuun elokuvatun esityksen yleisestä johtamisesta ja valvonnasta.
toolkit label: elokuvaohjaaja (henkilö) teoksessa
toolkit definition: Teos, joka sisältää vastuun elokuvatun esityksen yleisestä johtamisesta ja valvonnasta.
label: er filmregissør for (person) @no
definition: Relaterer en person til et verk som involverer et ansvar for en person for den generelle ledelsen og tilsyn med en filmet forestilling. @no
toolkit label: filmregissør for (person) @no
toolkit definition: Et verk som involverer et ansvar for en person for den generelle ledelsen og tilsyn med en filmet forestilling. @no
label: is filmregisseur-persoon van @nl
definition: Relateert een persoon aan een werk dat met zich meebrengt een verantwoordelijkheid van een persoon voor het algemeen beheer en toezicht van een gefilmde uitvoering. @nl
toolkit label: filmregisseur-persoon van @nl
toolkit definition: Een werk dat met zich meebrengt een verantwoordelijkheid van een persoon voor het algemeen beheer en toezicht van een gefilmde uitvoering. @nl
label: هو شخص مخرج فيلم لـ @ar
definition: يربط شخصا بعمل يترتب عليه مسئولية شخص عن الإدارة العامة والإشراف على أداء مصور. @ar
toolkit label: شخص مخرج الفيلم @ar
toolkit definition: عمل يترتب عليه مسئولية شخص عن الإدارة العامة والإشراف على أداء مصور. @ar
label: és persona directora cinematogràfica de @ca
definition: Relaciona una persona amb una obra que implica una responsabilitat d’una persona en la gestió general i la supervisió d’una actuació filmada. @ca
toolkit label: persona directora cinematogràfica de @ca
toolkit definition: Obra que implica una responsabilitat d’una persona en la gestió general i la supervisió d’una actuació filmada. @ca
label: er person, som er filminstruktør af @da
definition: Relaterer en person til et værk, som involverer en persons ansvar for den generelle ledelse af- og tilsyn med en filmoptagelse. @da
toolkit label: person, som er filminstruktør af @da
toolkit definition: Værk, som involverer en persons ansvar for den generelle ledelse af- og tilsyn med en filmoptagelse. @da
label: filmirežissöör (isik) teoses @et
definition: Seostab isiku teosega, mis sisaldab isiku vastutust filmitava etenduse üldise juhtimise ja juhendamise eest. @et
toolkit label: filmirežissöör (isik) teoses @et
toolkit definition: Teos, mis sisaldab isiku vastutust filmitava etenduse üldise juhtimise ja juhendamise eest. @et
label: ist Person als Filmregisseurin/Filmregisseur von @de
definition: Setzt eine Person in Beziehung zu einem Werk, bei dem eine Person für das allgemeine Management und die Leitung einer verfilmten Darbietung verantwortlich ist. @de
toolkit label: Person als Filmregisseurin/Filmregisseur von @de
toolkit definition: Ein Werk, bei dem eine Person für das allgemeine Management und die Leitung einer verfilmten Darbietung verantwortlich ist. @de
label: filmrendező személye a következőnek: @hu
definition: Hozzákapcsol egy személyt egy műhöz, amelyhez hozzátartozik egy személy felelőssége egy filmforgatás általános menedzseléséért és felügyeletéért. @hu
toolkit label: filmrendező személye: @hu
toolkit definition: Egy mű, amelyhez hozzátartozik egy személy felelőssége egy filmforgatás általános menedzseléséért és felügyeletéért. @hu
label: è regista cinematografico persona di @it
definition: Correla una persona a un'opera che implica una responsabilità di una persona per la gestione e supervisione generale di un'interpretazione filmata. @it
toolkit label: regista cinematografico persona di @it
toolkit definition: Opera che implica una responsabilità di una persona per la gestione e supervisione generale di un'interpretazione filmata. @it
label: είναι σκηνοθέτης φυσικό πρόσωπο του @el
toolkit label: σκηνοθέτης φυσικό πρόσωπο του @el
label: est une personne réalisatrice de cinéma de @fr
definition: Met une personne en relation avec une œuvre qui comporte une responsabilité de la part d’une personne consistant à assurer la gestion et la supervision générales d’une prestation filmée. @fr
alternative label: personne réalisatrice de film de @fr
toolkit label: personne réalisatrice de cinéma de @fr
toolkit definition: Œuvre qui comporte une responsabilité de la part d’une personne consistant à assurer la gestion et la supervision générales d’une prestation filmée. @fr
label: ir kinorežisors (persona) @lv
definition: Sasaista personu ar darbu, kas ietver personas atbildību par uzfilmētā pasākuma vispārējo vadību un uzraudzību. @lv
toolkit label: ir kinorežisors (persona) @lv
toolkit definition: Darbs, kas ietver personas atbildību par uzfilmētā pasākuma vispārējo vadību un uzraudzību @lv
label: 是……的电影导演个人 @zh-hans
definition: 将一个个人与涉及拍摄表演的总体管理和监督的一个个人的责任的一种作品关联起来。 @zh-hans
toolkit label: ……的电影导演个人 @zh-hans
toolkit definition: 涉及拍摄表演的总体管理和监督的一个个人的责任的一种作品 @zh-hans
label: film yönetmeni kişisidir @tr
definition: Bir kişiyi, filme alınmış bir performansın genel yönetimi ve denetimi için bir kişinin sorumluluğunu içeren bir eserle ilişkilendirir. @tr
toolkit label: film yönetmeni @tr
toolkit definition: Filme alınmış bir performansın genel yönetimi ve denetimi için bir kişinin sorumluluğunu içeren bir eser. @tr
has subproperty: P50562

elokuvan jakelija (toimija) manifestaatiossa
status: Published
label: is film distributor agent of @en
definition: Relates an agent to a manifestation that involves a responsibility of an agent for distribution of a moving image to theaters or other channels. @en
type: Property
domain: C10002
sub property of: jakelija (toimija) manifestaatiossa
lexical alias: filmDistributorAgentOf.en
label: est un agent distributeur de cinéma de @fr
definition: Met un agent en relation avec une manifestation qui comporte une responsabilité de la part d’un agent en ce qui concerne la distribution d’images animées aux salles de cinéma ou aux autres réseaux de distribution. @fr
toolkit label: agent distributeur de cinéma de @fr
toolkit definition: Manifestation qui comporte une responsabilité de la part d’un agent en ce qui concerne la distribution d’images animées aux salles de cinéma ou aux autres réseaux de distribution. @fr
toolkit label: film distributor agent of @en
toolkit definition: A manifestation that involves a responsibility of an agent for distribution of a moving image to theaters or other channels. @en
instruction number: 18.5
label: είναι διανομέας ταινίας φορέας του @el
definition: Συνδέει έναν φορέα, ο οποίος εμπλέκεται στη διανομή μιας εκδήλωσης κινητής εικόνας στα θέατρα ή σε άλλα κανάλια διανομής, με μια εκδήλωση. @el
toolkit label: διανομέας ταινίας φορέας του @el
toolkit definition: Μια εκδήλωση κινητής εικόνας που διανέμεται στα θέατρα ή σε άλλα κανάλια διανομής. @el
definition: Setzt einen Akteur in Beziehung zu einer Manifestation, bei der ein Akteur für den Vertrieb eines Bewegtbilds an Kinos oder andere Vertriebskanäle verantwortlich ist. @de
toolkit label: Akteur als Filmvertrieb von @de
toolkit definition: Eine Manifestation, bei der ein Akteur für den Vertrieb eines Bewegtbilds an Kinos oder andere Vertriebskanäle verantwortlich ist. @de
label: er agent, som er filmdistributør af @da
definition: Relaterer en agent til en manifestation, som involverer en agents ansvar for distribution af et levende billede til biografer eller andre distributionskanaler. @da
toolkit label: agent, som er filmdistributør af @da
toolkit definition: Manifestation, som involverer en agents ansvar for distribution af et levende billede til biografer eller andre distributionskanaler. @da
label: és agent distribuïdor de pel·lícules de @ca
definition: Relaciona un agent amb una manifestació que implica una responsabilitat d’un agent en la distribució d’una imatge en moviment a cinemes o a altres canals de distribució. @ca
toolkit label: agent distribuïdor de pel·lícules de @ca
toolkit definition: Manifestació que implica una responsabilitat d’un agent en la distribució d’una imatge en moviment a cinemes o a altres canals de distribució. @ca
definition: Liittää toimijan manifestaatioon, jonka jakelusta elokuvateattereille tai muille jakelukanaville toimija on vastuussa.
toolkit label: elokuvan jakelija (toimija) manifestaatiossa
toolkit definition: Manifestaatio, jonka jakelusta elokuvateattereille tai muille jakelukanaville toimija on vastuussa.
toolkit label: filmdistributør av (agent) @no
toolkit definition: En manifestasjon som involverer ansvar for en agent i form av distribusjon av levende bilder til kinoer eller andre kanaler. @no
label: ist Akteur als Filmvertrieb von @de
has element type: 2
label: filmterjesztő ágense a következőnek: @hu
definition: Hozzákapcsol egy ágenst egy megjelenési formához, amelyhez hozzátartozik egy ágens felelőssége mozgóképszínházak vagy más csatornák útján történő terjesztéséért. @hu
toolkit label: filmterjesztő ágense: @hu
toolkit definition: Egy megjelenési forma, amelyhez hozzátartozik egy ágens felelőssége mozgóképszínházak vagy más csatornák útján történő terjesztéséért. @hu
alternative label: film distributor of @en
alternative label: jakelijana elokuvassa
label: er filmdistributør av (agent) @no
definition: Relaterer en agent til en manifestasjon som involverer ansvar for en agent i form av distribusjon av levende bilder til kinoer eller andre kanaler. @no
alternative label: filmdistributør av @no
label: is filmdistributeur-actor van @nl
definition: Relateert een actor aan een manifestatie die met zich meebrengt een verantwoordelijkheid van een actor voor distributie van een bewegend beeld naar theaters of andere kanalen. @nl
toolkit label: filmdistributeur-actor van @nl
toolkit definition: Een manifestatie die met zich meebrengt een verantwoordelijkheid van een actor voor distributie van een bewegend beeld naar theaters of andere kanalen. @nl
label: هو وكيل موزع أفلام لـ @ar
definition: يربط وكيلا بتجسيدة تنطوي على مسئولية وكيل عن توزيع فيلم على قاعات العرض أو عبر قنوات أخرى. @ar
alternative label: موزع أفلام @ar
toolkit label: وكيل موزع أفلام @ar
toolkit definition: تجسيدة تنطوي على مسئولية وكيل عن توزيع فيلم على قاعات العرض أو عبر قنوات أخرى. @ar
alternative label: distribuïdor de pel·lícules de @ca
alternative label: filmdistributør af @da
label: filmilevitaja (tegija) kehastuses @et
definition: Seostab tegija kehastusega, mis sisaldab tegija vastutust filmi levitamise eest kinodesse või muudesse levikanalitesse. @et
alternative label: filmilevitaja kehastuses @et
toolkit label: filmilevitaja (tegija) kehastuses @et
toolkit definition: Kehastus, mis sisaldab tegija vastutust filmi levitamise eest kinodesse või muudesse levikanalitesse. @et
alternative label: filmterjesztője: @hu
label: è distributore agente di film di @it
definition: Correla un agente a una manifestazione che che implica una responsabilità di un agente nella distribuzione di un'immagine in movimento a teatri o altri canali. @it
alternative label: distributore di film di @it
toolkit label: distributore di film agente di @it
toolkit definition: Manifestazione che implica una responsabilità di un agente nella distribuzione di un'immagine in movimento a teatri o altri canali. @it
alternative label: διανομέας ταινίας του @el
label: ir filmas izplatītājs (aģents) @lv
definition: Sasaista aģentu ar manifestāciju, kas ietver aģenta atbildību par filmas izplatīšanu kinoteātriem vai caur citiem izplatīšanas kanāliem. @lv
toolkit label: ir filmas izplatītājs (aģents) @lv
toolkit definition: Manifestācija, kas ietver aģenta atbildību par filmas izplatīšanu kinoteātriem vai caur citiem izplatīšanas kanāliem. @lv
alternative label: Filmvertrieb von @de
alternative label: ……的电影发行者 @zh-hans
label: 是……的电影发行者行为者 @zh-hans
toolkit label: ……的电影发行者行为者 @zh-hans
toolkit definition: 涉及向剧院或其他渠道发行动态图像的一个行为者的责任的一种载体表现 @zh-hans
toolkit label: film dağıtıcısı temsilcisi @tr
toolkit definition: Hareketli bir görüntünün sinemalara veya diğer kanallara dağıtılması için bir temsilcinin sorumluluğunu içeren bir gösterim. @tr
has subproperty: elokuvan jakelija (yhteistoimija) manifestaatiossa

elokuvan jakelija (yhteistoimija) manifestaatiossa
status: Published
label: is film distributor collective agent of @en
lexical alias: filmDistributorCollectiveAgentOf.en
definition: Relates a collective agent to a manifestation that involves a responsibility of a collective agent for distribution of a moving image to theaters or other channels. @en
toolkit label: film distributor collective agent of @en
toolkit definition: A manifestation that involves a responsibility of a collective agent for distribution of a moving image to theaters or other channels. @en
type: Property
domain: C10011
has element type: 2
sub property of: jakelija (yhteistoimija) manifestaatiossa
sub property of: elokuvan jakelija (toimija) manifestaatiossa
definition: Liittää yhteistoimijan manifestaatioon, jonka jakelusta elokuvateattereille tai muille jakelukanaville yhteistoimija on vastuussa.
toolkit label: elokuvan jakelija (yhteistoimija) manifestaatiossa
toolkit definition: Manifestaatio, jonka jakelusta elokuvateattereille tai muille jakelukanaville yhteistoimija on vastuussa.
label: er filmdistributør for (kollektiv agent) @no
definition: Relaterer en kollektiv agent til en manifestasjon som involverer et ansvar for en kollektiv agent i form av distribusjon av levende bilder til kinoer eller andre kanaler. @no
toolkit label: filmdistributør for (kollektiv agent) @no
toolkit definition: En manifestasjon som involverer et ansvar for en kollektiv agent i form av distribusjon av levende bilder til kinoer eller andre kanaler. @no
label: is filmdistributeur-collectieve actor van @nl
definition: Relateert een collectieve actor aan een manifestatie die met zich meebrengt een verantwoordelijkheid van een collectieve actor voor distributie van een bewegend beeld naar theaters of andere kanalen. @nl
toolkit label: filmdistributeur-collectieve actor van @nl
toolkit definition: Een manifestatie die met zich meebrengt een verantwoordelijkheid van een collectieve actor voor distributie van een bewegend beeld naar theaters of andere kanalen. @nl
label: هو وكيل جماعي موزع أفلام لـ @ar
definition: يربط وكيلا جماعيا بتجسيدة تنطوي على مسئولية وكيل جماعي عن توزيع فيلم على قاعات العرض أو عبر قنوات أخرى. @ar
toolkit label: وكيل جماعي موزع أفلام @ar
toolkit definition: تجسيدة تنطوي على مسئولية وكيل جماعي عن توزيع فيلم على قاعات العرض أو عبر قنوات أخرى. @ar
label: és agent col·lectiu distribuïdor de pel·lícules de @ca
definition: Relaciona un agent col·lectiu amb una manifestació que implica una responsabilitat d’un agent col·lectiu en la distribució d’una imatge en moviment a cinemes o a altres canals de distribució. @ca
toolkit label: agent col·lectiu distribuïdor de pel·lícules de @ca
toolkit definition: Manifestació que implica una responsabilitat d’un agent col·lectiu en la distribució d’una imatge en moviment a cinemes o a altres canals de distribució. @ca
label: er kollektiv agent, som er filmdistributør af @da
definition: Relaterer en kollektiv agent til en manifestation, som involverer en kollektiv agents ansvar for distribution af et levende billede til biografer eller andre distributionskanaler. @da
toolkit label: kollektiv agent, som er filmdistributør af @da
toolkit definition: Manifestation, som involverer en kollektiv agents ansvar for distribution af et levende billede til biografer eller andre distributionskanaler. @da
label: filmilevitaja (kollektiiv) kehastuses @et
definition: Seostab kollektiivi kehastusega, mis sisaldab kollektiivi vastutust filmi levitamise eest kinodesse või muudesse levikanalitesse. @et
toolkit label: filmilevitaja (kollektiiv) kehastuses @et
toolkit definition: Kehastus, mis sisaldab kollektiivi vastutust filmi levitamise eest kinodesse või muudesse levikanalitesse. @et
label: ist gemeinschaftlicher Akteur als Filmvertrieb von @de
definition: Setzt einen gemeinschaftlichen Akteur in Beziehung zu einer Manifestation, bei der ein gemeinschaftlicher Akteur für den Vertrieb eines Bewegtbilds an Kinos oder andere Vertriebskanäle verantwortlich ist. @de
toolkit label: Gemeinschaftlicher Akteur als Filmvertrieb von @de
toolkit definition: Ein Manifestation, bei der ein gemeinschaftlicher Akteur für den Vertrieb eines Bewegtbilds an Kinos oder andere Vertriebskanäle verantwortlich ist. @de
label: filmterjesztő kollektív ágense a következőnek: @hu
definition: Hozzákapcsol egy kollektív ágenst egy megjelenési formához, amelyhez hozzátartozik egy kollektív ágens felelőssége mozgókép filmszínházak vagy más csatornák útján történő terjesztéséért. @hu
toolkit label: filmterjesztő kollektív ágense: @hu
toolkit definition: Egy megjelenési forma, amelyhez hozzátartozik egy kollektív ágens felelőssége mozgókép filmszínházak vagy más csatornák útján történő terjesztéséért. @hu
label: è distributore cinematografico agente collettivo di @it
definition: Correla un agente collettivo a una manifestazione che implica una responsabilità di un agente collettivo nella distribuzione di un'immagine in movimento a teatri o altri canali. @it
toolkit label: distributore cinematografico agente collettivo di @it
toolkit definition: Manifestazione che implica una responsabilità di un agente collettivo nella distribuzione di un'immagine in movimento a teatri o altri canali. @it
label: είναι διανομέας ταινίας συλλογικός φορέας του @el
toolkit label: διανομέας ταινίας συλλογικός φορέας του @el
label: est un agent collectif distributeur de cinéma de @fr
definition: Met un agent collectif en relation avec une manifestation qui comporte une responsabilité de la part d’un agent collectif en ce qui concerne la distribution d’images animées aux salles de cinéma ou aux autres réseaux de distribution. @fr
alternative label: agent collectif distributeur de film de @fr
toolkit label: agent collectif distributeur de cinéma de @fr
toolkit definition: Manifestation qui comporte une responsabilité de la part d’un agent collectif en ce qui concerne la distribution d’images animées aux salles de cinéma ou aux autres réseaux de distribution. @fr
label: ir filmas izplatītājs (grupa) @lv
definition: Sasaista grupu ar manifestāciju, kas ietver grupas atbildību par filmas izplatīšanu kinoteātriem vai caur citiem izplatīšanas kanāliem. @lv
toolkit label: ir filmas izplatītājs (grupa) @lv
toolkit definition: Manifestācija, kas ietver grupas atbildību par filmas izplatīšanu kinoteātriem vai caur citiem izplatīšanas kanāliem. @lv
label: 是……的电影发行者集体行为者 @zh-hans
definition: 将一个集体行为者与涉及向剧院或其他渠道发行动态图像的一个集体行为者的责任的一种载体表现关联起来。 @zh-hans
toolkit label: ……的电影发行者集体行为者 @zh-hans
toolkit definition: 涉及向剧院或其他渠道发行动态图像的一个集体行为者的责任的一种载体表现 @zh-hans
label: film dağıtımcısı kolektif temsilcisidir @tr
definition: Kolektif bir temsilciyi, hareketli bir görüntünün tiyatrolara veya diğer kanallara dağıtılması için kolektif bir temsilcinin sorumluluğunu içeren bir gösterimle ilişkilendirir. @tr
toolkit label: film dağıtıcısı kolektif temsilcisi @tr
toolkit definition: Hareketli bir görüntünün sinemalara veya diğer kanallara dağıtılması için kolektif bir temsilcinin sorumluluğunu içeren bir gösterim. @tr
has subproperty: elokuvan jakelija (yhteisö) manifestaatiossa
has subproperty: elokuvan jakelijja (suku) manifestaatiossa
has subproperty: P50647

elokuvan jakelija (yhteisö) manifestaatiossa
status: Published
label: is film distributor corporate body of @en
lexical alias: filmDistributorCorporateBodyOf.en
definition: Relates a corporate body to a manifestation that involves a responsibility of a corporate body for distribution of a moving image to theaters or other channels. @en
toolkit label: film distributor corporate body of @en
toolkit definition: A manifestation that involves a responsibility of a corporate body for distribution of a moving image to theaters or other channels. @en
type: Property
domain: C10005
has element type: 2
sub property of: jakelija (yhteisö) manifestaatiossa
sub property of: elokuvan jakelija (yhteistoimija) manifestaatiossa
definition: Liittää yhteisön manifestaatioon, jonka jakelusta elokuvateattereille tai muille jakelukanaville yhteisö on vastuussa.
toolkit label: elokuvan jakelija (yhteisö) manifestaatiossa
toolkit definition: Manifestaatio, jonka jakelusta elokuvateattereille tai muille jakelukanaville yhteisö on vastuussa.
label: er filmdistributør for (korporasjon) @no
definition: Relaterer en korporasjon til en manifestasjon som involverer et ansvar for en korporasjon i form av distribusjon av levende bilder til kinoer eller andre kanaler. @no
toolkit label: filmdistributør for (korporasjon) @no
toolkit definition: En manifestasjon som involverer et ansvar for en korporasjon i form av distribusjon av levende bilder til kinoer eller andre kanaler. @no
label: is filmdistributeur-corporatie van @nl
definition: Relateert een corporatie aan een manifestatie die met zich meebrengt een verantwoordelijkheid van een corporatie voor distributie van een bewegend beeld naar theaters of andere kanalen. @nl
toolkit label: filmdistributeur-corporatie van @nl
toolkit definition: Een manifestatie die met zich meebrengt een verantwoordelijkheid van een corporatie voor distributie van een bewegend beeld naar theaters of andere kanalen. @nl
label: هي هيئة موزعة لأفلام لـ @ar
definition: يربط هيئة بتجسيدة تنطوي على مسئولية هيئة عن توزيع فيلم على قاعات العرض أو عبر قنوات أخرى. @ar
toolkit label: هيئة مسئولة عن توزيع أفلام @ar
toolkit definition: تجسيدة تنطوي على مسئولية هيئة عن توزيع فيلم على قاعات العرض أو عبر قنوات أخرى. @ar
label: és entitat corporativa distribuïdora de pel·lícules de @ca
definition: Relaciona una entitat corporativa amb una manifestació que implica una responsabilitat d’una entitat corporativa en la distribució d’una imatge en moviment a cinemes o a altres canals de distribució. @ca
toolkit label: entitat corporativa distribuïdora de pel·lícules de @ca
toolkit definition: Manifestació que implica una responsabilitat d’una entitat corporativa en la distribució d’una imatge en moviment a cinemes o a altres canals de distribució. @ca
label: er korporation, som er filmdistributør af @da
definition: Relaterer en korporation til en manifestation, som involverer en korporations ansvar for distribution af et levende billede til biografer eller andre distributionskanaler. @da
toolkit label: korporation, som er filmdistributør af @da
toolkit definition: Manifestation, som involverer en korporations ansvar for distribution af et levende billede til biografer eller andre distributionskanaler. @da
label: filmilevitaja (asutus) kehastuses @et
definition: Seostab asutuse kehastusega, mis sisaldab asutuse vastutust filmi levitamise eest kinodesse või muudesse levikanalitesse. @et
toolkit label: filmilevitaja (asutus) kehastuses @et
toolkit definition: Kehastus, mis sisaldab asutuse vastutust filmi levitamise eest kinodesse või muudesse levikanalitesse. @et
label: ist Körperschaft als Filmvertrieb von @de
definition: Setzt eine Körperschaft in Beziehung zu einer Manifestation, bei der eine Körperschaft für den Vertrieb eines Bewegtbilds an Kinos oder andere Vertriebskanäle verantwortlich ist. @de
toolkit label: Körperschaft als Filmvertrieb von @de
toolkit definition: Eine Manifestation, bei der eine Körperschaft für den Vertrieb eines Bewegtbilds an Kinos oder andere Vertriebskanäle verantwortlich ist. @de
label: filmterjesztő testülete a következőnek: @hu
definition: Hozzákapcsol egy testületet egy megjelenési formához, amelyhez hozzátartozik egy testület felelőssége mozgókép filmszínházak vagy más csatornák útján történő terjesztéséért. @hu
toolkit label: filmterjesztő testülete: @hu
toolkit definition: Egy megjelenési forma, amelyhez hozzátartozik egy testület felelőssége mozgókép filmszínházak vagy más csatornák útján történő terjesztéséért. @hu
label: è distributore cinematografico ente di @it
definition: Correla un ente a una manifestazione che implica una responsabilità di un ente per la distribuzione di un'immagine in movimento a teatri o altri canali. @it
toolkit label: distributore cinematografico ente di @it
toolkit definition: Manifestazione che implica una responsabilità di un ente per la distribuzione di un'immagine in movimento a teatri o altri canali. @it
label: είναι διανομέας ταινίας συλλογικό όργανο του @el
toolkit label: διανομέας ταινίας συλλογικό όργανο του @el
label: est une collectivité distributrice de cinéma de @fr
definition: Met une collectivité en relation avec une manifestation qui comporte une responsabilité de la part d’une collectivité en ce qui concerne la distribution d’images animées aux salles de cinéma ou aux autres réseaux de distribution. @fr
alternative label: collectivité distributrice de film de @fr
toolkit label: collectivité distributrice de cinéma de @fr
toolkit definition: Manifestation qui comporte une responsabilité de la part d’une collectivité en ce qui concerne la distribution d’images animées aux salles de cinéma ou aux autres réseaux de distribution. @fr
label: ir filmas izplatītājs (institūcija) @lv
definition: Sasaista institūciju ar manifestāciju, kas ietver institūcijas atbildību par filmas izplatīšanu kinoteātriem vai caur citiem izplatīšanas kanāliem. @lv
toolkit label: ir filmas izplatītājs (institūcija) @lv
toolkit definition: Manifestācija, kas ietver institūcijas atbildību par filmas izplatīšanu kinoteātriem vai caur citiem izplatīšanas kanāliem. @lv
label: 是……的电影发行者团体 @zh-hans
definition: 将一个团体与涉及向剧院或其他渠道发行动态图像的一个团体的责任的一种载体表现关联起来。 @zh-hans
toolkit label: ……的电影发行者团体 @zh-hans
toolkit definition: 涉及向剧院或其他渠道发行动态图像的一个团体的责任的一种载体表现 @zh-hans
label: film dağıtımcısı tüzel kişisidir @tr
definition: Bir tüzel kişiyi, hareketli bir görüntünün sinemalara veya diğer kanallara dağıtılmasına ilişkin bir tüzel kişiliğin sorumluluğunu içeren bir gösterimle ilişkilendirir. @tr
toolkit label: film dağıtıcısı tüzel kişisi @tr
toolkit definition: Hareketli bir görüntünün sinema salonlarına veya diğer kanallara dağıtılması için tüzel bir kişinin sorumluluğunu içeren bir gösterim. @tr
has subproperty: P50798

elokuvan jakelijja (suku) manifestaatiossa
status: Published
label: is film distributor family of @en
lexical alias: filmDistributorFamilyOf.en
definition: Relates a family to a manifestation that involves a responsibility of a family for distribution of a moving image to theaters or other channels. @en
toolkit label: film distributor family of @en
toolkit definition: A manifestation that involves a responsibility of a family for distribution of a moving image to theaters or other channels. @en
type: Property
domain: C10008
has element type: 2
sub property of: jakelija (suku) manifestaatiossa
sub property of: elokuvan jakelija (yhteistoimija) manifestaatiossa
definition: Liittää suvun manifestaatioon, jonka jakelusta elokuvateattereille tai muille jakelukanaville suku on vastuussa.
toolkit label: elokuvan jakelijja (suku) manifestaatiossa
toolkit definition: Manifestaatio, jonka jakelusta elokuvateattereille tai muille jakelukanaville suku on vastuussa.
label: er filmdistributør for (familie) @no
definition: Relaterer en familie til en manifestasjon som involverer et ansvar for en familie i form av distribusjon av levende bilder til kinoer eller andre kanaler. @no
toolkit label: filmdistributør for (familie) @no
toolkit definition: En manifestasjon som involverer et ansvar for en familie i form av distribusjon av levende bilder til kinoer eller andre kanaler. @no
label: is filmdistributeur-familie van @nl
definition: Relateert een familie aan een manifestatie die met zich meebrengt een verantwoordelijkheid van een familie voor distributie van een bewegend beeld naar theaters of andere kanalen. @nl
toolkit label: filmdistributeur-familie van @nl
toolkit definition: Een manifestatie die met zich meebrengt een verantwoordelijkheid van een familie voor distributie van een bewegend beeld naar theaters of andere kanalen. @nl
label: هي عائلة مسئولة عن توزيع أفلام لـ @ar
definition: يربط عائلة بتجسيدة تنطوي على مسئولية عائلة عن توزيع فيلم على قاعات العرض أو عبر قنوات أخرى. @ar
toolkit label: عائلة مسئولة عن توزيع أفلام @ar
toolkit definition: تجسيدة تنطوي على مسئولية عائلة عن توزيع فيلم على قاعات العرض أو عبر قنوات أخرى. @ar
label: és família distribuïdora de pel·lícules de @ca
definition: Relaciona una família amb una manifestació que implica una responsabilitat d’una família en la distribució d’una imatge en moviment a cinemes o a altres canals de distribució. @ca
toolkit label: família distribuïdora de pel·lícules de @ca
toolkit definition: Manifestació que implica una responsabilitat d’una família en la distribució d’una imatge en moviment a cinemes o a altres canals de distribució. @ca
label: er familie, som er filmdistributør af @da
definition: Relaterer en familie til en manifestation, som involverer en families ansvar for distribution af et levende billede til biografer eller andre distributionskanaler. @da
toolkit label: familie, som er filmdistributør af @da
toolkit definition: Manifestation, som involverer en families ansvar for distribution af et levende billede til biografer eller andre distributionskanaler. @da
label: filmilevitaja (perekond) kehastuses @et
definition: Seostab perekonna kehastusega, mis sisaldab perekonna vastutust filmi levitamise eest kinodesse või muudesse levikanalitesse. @et
toolkit label: filmilevitaja (perekond) kehastuses @et
toolkit definition: Kehastus, mis sisaldab perekonna vastutust filmi levitamise eest kinodesse või muudesse levikanalitesse. @et
label: ist Familie als Filmvertrieb von @de
definition: Setzt eine Familie in Beziehung zu einer Manifestation, bei der eine Familie für den Vertrieb eines Bewegtbilds an Kinos oder andere Vertriebskanäle verantwortlich ist. @de
toolkit label: Familie als Filmvertrieb von @de
toolkit definition: Eine Manifestation, bei der eine Familie für den Vertrieb eines Bewegtbilds an Kinos oder andere Vertriebskanäle verantwortlich ist. @de
label: filmterjesztő családja a következőnek: @hu
definition: Hozzákapcsol egy családot egy megjelenési formához, amelyhez hozzátartozik egy család felelőssége mozgókép filmszínházak vagy más csatornák útján történő terjesztéséért. @hu
toolkit label: filmterjesztő családja: @hu
toolkit definition: Egy megjelenési forma, amelyhez hozzátartozik egy család felelőssége mozgókép filmszínházak vagy más csatornák útján történő terjesztéséért. @hu
label: è distributore cinematografico famiglia di @it
definition: Correla una famiglia a una manifestazione che implica una responsabilità di una famiglia per la distribuzione di un'immagine in movimento a teatri o altri canali. @it
toolkit label: distributore cinematografico famiglia di @it
toolkit definition: Manifestazione che implica una responsabilità di una famiglia per la distribuzione di un'immagine in movimento a teatri o altri canali. @it
label: είναι διανομέας ταινίας οικογένεια του @el
toolkit label: διανομέας ταινίας οικογένεια του @el
label: est une famille distributrice de cinéma de @fr
definition: Met une famille en relation avec une manifestation qui comporte une responsabilité de la part d’une famille en ce qui concerne la distribution d’images animées aux salles de cinéma ou aux autres réseaux de distribution. @fr
alternative label: famille distributrice de film de @fr
toolkit label: famille distributrice de cinéma de @fr
toolkit definition: Manifestation qui comporte une responsabilité de la part d’une famille en ce qui concerne la distribution d’images animées aux salles de cinéma ou aux autres réseaux de distribution. @fr
label: ir filmas izplatītājs (dzimta/ģimene) @lv
definition: Sasaista dzimtu/ģimeni ar manifestāciju, kas ietver dzimtas/ģimenes atbildību par filmas izplatīšanu kinoteātriem vai caur citiem izplatīšanas kanāliem. @lv
toolkit label: ir filmas izplatītājs (dzimta/ģimene) @lv
toolkit definition: Manifestācija, kas ietver dzimtas/ģimenes atbildību par filmas izplatīšanu kinoteātriem vai caur citiem izplatīšanas kanāliem. @lv
label: 是……的电影发行者家族 @zh-hans
definition: 将一个家族与涉及向剧院或其他渠道发行动态图像的一个家族的责任的一种载体表现关联起来。 @zh-hans
toolkit label: ……的电影发行者家族 @zh-hans
toolkit definition: 涉及向剧院或其他渠道发行动态图像的一个家族的责任的一种载体表现 @zh-hans
label: film dağıtımcısı ailedir @tr
definition: Bir aileyi, hareketli bir görüntünün sinemalara veya diğer kanallara dağıtımı için bir ailenin sorumluluğunu içeren gösterimle ilişkilendirir. @tr
toolkit label: film dağıtıcısı ailesi @tr
toolkit definition: Hareketli bir görüntünün sinemalara veya diğer kanallara dağıtımı için bir ailenin sorumluluğunu içeren bir gösterim. @tr
has subproperty: P50949

elokuvan jakelija (henkilö) manifestaatiossa
status: Published
label: is film distributor person of @en
lexical alias: filmDistributorPersonOf.en
definition: Relates a person to a manifestation that involves a responsibility of a person for distribution of a moving image to theaters or other channels. @en
toolkit label: film distributor person of @en
toolkit definition: A manifestation that involves a responsibility of a person for distribution of a moving image to theaters or other channels. @en
type: Property
domain: C10004
has element type: 2
sub property of: jakelija (henkilö) manifestaatiossa
sub property of: elokuvan jakelija (toimija) manifestaatiossa
definition: Liittää henkilön manifestaatioon, jonka jakelusta elokuvateattereille tai muille jakelukanaville henkilö on vastuussa.
toolkit label: elokuvan jakelija (henkilö) manifestaatiossa
toolkit definition: Manifestaatio, jonka jakelusta elokuvateattereille tai muille jakelukanaville henkilö on vastuussa.
label: er filmdistributør for (person) @no
definition: Relaterer en person til en manifestasjon som involverer et ansvar for en person i form av distribusjon av levende bilder til kinoer eller andre kanaler. @no
toolkit label: filmdistributør for (person) @no
toolkit definition: En manifestasjon som involverer et ansvar for en person i form av distribusjon av levende bilder til kinoer eller andre kanaler. @no
label: is filmdistributeur-persoon van @nl
definition: Relateert een persoon aan een manifestatie die met zich meebrengt een verantwoordelijkheid van een persoon voor distributie van een bewegend beeld naar theaters of andere kanalen. @nl
toolkit label: filmdistributeur-persoon van @nl
toolkit definition: Een manifestatie die met zich meebrengt een verantwoordelijkheid van een persoon voor distributie van een bewegend beeld naar theaters of andere kanalen. @nl
label: هو شخص موزع أفلام لـ @ar
definition: يربط شخصا بتجسيدة تنطوي على مسئولية شخص عن توزيع فيلم على قاعات العرض أو عبر قنوات أخرى. @ar
toolkit label: شخص موزع أفلام @ar
toolkit definition: تجسيدة تنطوي على مسئولية شخص عن توزيع فيلم على قاعات العرض أو عبر قنوات أخرى. @ar
label: és persona distribuïdora de pel·lícules de @ca
definition: Relaciona una persona amb una manifestació que implica una responsabilitat d’una persona en la distribució d’una imatge en moviment a cinemes o a altres canals de distribució. @ca
toolkit label: persona distribuïdora de pel·lícules de @ca
toolkit definition: Manifestació que implica una responsabilitat d’una persona en la difusió d’una imatge en moviment a cinemes o a altres canals de distribució. @ca
label: er person, som er filmdistributør af @da
definition: Relaterer en person til en manifestation, som involverer en persons ansvar for distribution af et levende billede til biografer eller andre distributionskanaler. @da
toolkit label: person, som er filmdistributør af @da
toolkit definition: Manifestation, som involverer en persons ansvar for distribution af et levende billede til biografer eller andre distributionskanaler. @da
label: filmilevitaja (isik) kehastuses @et
definition: Seostab isiku kehastusega, mis sisaldab isiku vastutust filmi levitamise eest kinodesse või muudesse levikanalitesse. @et
toolkit label: filmilevitaja (isik) kehastuses @et
toolkit definition: Kehastus, mis sisaldab isiku vastutust filmi levitamise eest kinodesse või muudesse levikanalitesse. @et
label: ist Person als Filmvertrieb von @de
definition: Setzt eine Person in Beziehung zu einer Manifestation, bei der eine Person für den Vertrieb eines Bewegtbilds an Kinos oder andere Vertriebskanäle verantwortlich ist. @de
toolkit label: Person als Filmvertrieb von @de
toolkit definition: Eine Manifestation, bei der eine Person für den Vertrieb eines Bewegtbilds an Kinos oder andere Vertriebskanäle verantwortlich ist. @de
label: filmterjesztő személye a következőnek: @hu
definition: Hozzákapcsol egy személyt egy megjelenési formához, amelyhez hozzátartozik egy személy felelőssége mozgókép filmszínházak vagy más csatornák útján történő terjesztéséért. @hu
toolkit label: filmterjesztő személye: @hu
toolkit definition: Egy megjelenési forma, amelyhez hozzátartozik egy személy felelőssége mozgókép filmszínházak vagy más csatornák útján történő terjesztéséért. @hu
label: è distributore cinematografico persona di @it
definition: Correla una persona a una manifestazione che implica una responsabilità di una persona nella distribuzione di un'immagine in movimento a teatri o altri canali. @it
toolkit label: distributore cinematografico persona di @it
toolkit definition: Manifestazione che implica una responsabilità di una persona nella distribuzione di un'immagine in movimento a teatri o altri canali. @it
label: είναι διανομέας ταινίας φυσικό πρόσωπο του @el
toolkit label: διανομέας ταινίας φυσικό πρόσωπο του @el
label: est une personne distributrice de cinéma de @fr
definition: Met une personne en relation avec une manifestation qui comporte une responsabilité de la part d’une personne en ce qui concerne la distribution d’images animées aux salles de cinéma ou aux autres réseaux de distribution. @fr
alternative label: personne distributrice de film de @fr
toolkit label: personne distributrice de cinéma de @fr
toolkit definition: Manifestation qui comporte une responsabilité de la part d’une personne en ce qui concerne la distribution d’images animées aux salles de cinéma ou aux autres réseaux de distribution. @fr
label: ir filmas izplatītājs (persona) @lv
definition: Sasaista personu ar manifestāciju, kas ietver personas atbildību par filmas izplatīšanu kinoteātriem vai caur citiem izplatīšanas kanāliem. @lv
toolkit label: ir filmas izplatītājs (persona) @lv
toolkit definition: Manifestācija, kas ietver personas atbildību par filmas izplatīšanu kinoteātriem vai caur citiem izplatīšanas kanāliem. @lv
label: 是……的电影发行者个人 @zh-hans
definition: 将一个个人与涉及发行动态图像至剧院或其他渠道的一个个人的责任的一种载体表现关联起来。 @zh-hans
toolkit label: ……的电影发行者个人 @zh-hans
toolkit definition: 涉及发行动态图像至剧院或其他渠道的一个个人的责任的一种载体表现 @zh-hans
label: film dağıtımcısı kişisidir @tr
definition: Bir kişiyi, hareketli bir görüntünün sinemalara veya diğer kanallara dağıtılması sorumluluğunu içeren gösterimle ilişkilendirir. @tr
toolkit label: film dağıtıcısı @tr
toolkit definition: Hareketli bir görüntünün sinemalara veya diğer kanallara dağıtılması için bir kişinin sorumluluğunu içeren bir gösterim. @tr
has subproperty: P50496

elokuvantekijä (toimija) teoksessa
status: Published
label: is filmmaker agent of @en
definition: Relates an agent to a work that involves a responsibility of an agent for creating an independent or personal film. @en
type: Property
scope note: A filmmaker is individually responsible for the conception and execution of all aspects of the film. @en
domain: C10002
sub property of: teoksen tekijä (toimija) teoksessa
lexical alias: filmmakerAgentOf.en
label: est un agent cinéaste de @fr
definition: Met un agent en relation avec une œuvre qui comporte une responsabilité de la part d’un agent consistant à créer un film indépendant ou personnel. @fr
scope note: Un cinéaste est responsable à titre individuel de la conception et de l’exécution de tous les aspects du film. @fr
toolkit label: agent cinéaste de @fr
toolkit definition: Œuvre qui comporte une responsabilité de la part d’un agent consistant à créer un film indépendant ou personnel. @fr
toolkit label: filmmaker agent of @en
toolkit definition: A work that involves a responsibility of an agent for creating an independent or personal film. @en
instruction number: 18.5
label: είναι σκηνοθέτης φορέας του @el
definition: Συνδέει έναν φορέα υπεύθυνο για τη δημιουργία ενός ανεξάρτητου ή προσωπικού φιλμ, με ένα έργο. @el
scope note: Ένας σκηνοθέτης είναι ατομικά υπεύθυνος για τη σύλληψη και την εκτέλεση όλων των πτυχών μιας ταινίας. @el
toolkit label: σκηνοθέτης φορέας του @el
toolkit definition: Ένα έργο που περιλαμβάνει την ευθύνη της δημιουργίας ενός ανεξάρτητου ή προσωπικού φιλμ. @el
definition: Setzt einen Akteur in Beziehung zu einem Werk, bei dem ein Akteur für die Schaffung eines unabhängigen oder privaten Films verantwortlich ist. @de
scope note: Eine Filmemacherin/Ein Filmemacher ist persönlich für das Konzept und die Ausführung aller Aspekte des Films verantwortlich. @de
toolkit label: Akteur als Filmemacherin/Filmemacher von @de
toolkit definition: Ein Werk, bei dem ein Akteur für die Schaffung eines unabhängigen oder privaten Films verantwortlich ist. @de
label: er agent, som er filmskaber af @da
definition: Relaterer en agent til et værk, som involverer en agents ansvar for at skabe en indiefilm eller personlig film. @da
scope note: Filmskaberen er individuelt ansvarlig for udtænkning og udførelse af alle filmens aspekter. @da
toolkit label: agent, som er filmskaber af @da
toolkit definition: Værk, som involverer en agents ansvar for en indiefilm eller personlig film. @da
label: és agent cineasta de @ca
definition: Relaciona un agent amb una obra que implica una responsabilitat d’un agent en la creació d’una pel·lícula cinematogràfica independent o personal. @ca
toolkit label: agent cineasta de @ca
toolkit definition: Obra que implica una responsabilitat d’un agent en la creació d’una pel·lícula cinematogràfica independent o personal. @ca
definition: Liittää toimijan teokseen, jossa toimija on vastuussa riippumattoman tai henkilökohtaisen elokuvan luomisesta.
scope note: Tekijä vastaa itse kaikilta osin elokuvan ideoinnista ja toteuttamisesta.
toolkit label: elokuvantekijä (toimija) teoksessa
toolkit definition: Teos, jossa toimija on vastuussa riippumattoman tai henkilökohtaisen elokuvan luomisesta.
toolkit label: filmskaper av (agent) @no
toolkit definition: Et verk som involverer ansvar for en agent i form av å skape en uavhengig eller personlig film. @no
label: ist Akteur als Filmemacherin/Filmemacher von @de
has element type: 2
label: filmkészítő ágense a következőnek: @hu
definition: Hozzákapcsol egy ágenst egy műhöz, amelyhez hozzátartozik egy ágens felelőssége egy független- vagy magánfilm létrehozásáért. @hu
scope note: filmkészítő ágense: @hu
toolkit label: Egy mű, amelyhez hozzátartozik egy ágens felelőssége egy független- vagy magánfilm létrehozásáért. @hu
toolkit definition: filmkészítője: @hu
alternative label: filmmaker of @en
alternative label: elokuvantekijänä teoksessa
label: er filmskaper av (agent) @no
definition: Relaterer en agent til et verk som involverer ansvar for en agent i form av å skape en uavhengig eller personlig film. @no
scope note: En filmskaper er personlig ansvarlig for idéen og gjennomføringen av alle aspektene ved en film. @no
alternative label: filmskaper av @no
label: is filmmaker-actor van @nl
definition: Relateert een actor aan een werk dat met zich meebrengt een verantwoordelijkheid van een actor voor het creëren van een zelfstandige of persoonlijke film. @nl
scope note: Een filmmaker is zelf verantwoordelijk voor het idee en de uitvoering van alle aspecten van de film. @nl
toolkit label: filmmaker-actor van @nl
toolkit definition: Een werk dat met zich meebrengt een verantwoordelijkheid van een actor voor het creëren van een zelfstandige of persoonlijke film. @nl
label: هو وكيل صانع أفلام لـ @ar
definition: يربط وكيلا بعمل يترتب عليه مسئولية وكيل عن فيلم مستقل أو شخصي. @ar
scope note: صانع الفيلم هو المسئول مسئولية فردية عن تصور جميع جوانب الفيلم وتنفيذها. @ar
alternative label: صانع أفلام @ar
toolkit label: وكيل صانع أفلام @ar
toolkit definition: عمل يترتب عليه مسئولية وكيل عن فيلم مستقل أو شخصي. @ar
scope note: Un cineasta és responsable a títol individual de la concepció i l’execució de tots els aspectes de la pel·lícula. @ca
alternative label: cineasta de @ca
alternative label: filmskaber af @da
label: filmitegija (tegija) teoses @et
definition: Seostab tegija teosega, mis sisaldab tegija vastutust sõltumatu või autorifilmi eest. @et
scope note: Filmitegija vastutab üksinda kõigi filmi aspektide kontseptsiooni ja teostamise eest. @et
alternative label: filmitegija teoses @et
toolkit label: filmitegija (tegija) teoses @et
toolkit definition: Teos, mis sisaldab tegija vastutust sõltumatu või autorifilmi eest. @et
alternative label: Egy filmkészítő egyénileg felelős egy film koncepciójáért és összes aspektusának végrehajtásáért. @hu
label: è regista cinematografico agente di @it
definition: Correla un agente a un'opera che implica la responsabilità di un agente per un film indipendente o personale. @it
scope note: Un regista è individualmente responsabile del concepimento e dell'esecuzione di tutti gli aspetti del film. @it
alternative label: regista cinematografico di @it
toolkit label: regista cinematografico agente di @it

elokuvantekijä (yhteistoimija) teoksessa
status: Published
label: is filmmaker collective agent of @en
lexical alias: filmmakerCollectiveAgentOf.en
definition: Relates a collective agent to a work that involves a responsibility of a collective agent for creating an independent or personal film. @en
toolkit label: filmmaker collective agent of @en
toolkit definition: A work that involves a responsibility of a collective agent for creating an independent or personal film. @en
type: Property
domain: C10011
has element type: 2
sub property of: teoksen tekijä (yhteistoimija) teoksessa
sub property of: elokuvantekijä (toimija) teoksessa
scope note: A filmmaker is individually responsible for the conception and execution of all aspects of the film. @en
definition: Liittää yhteistoimijan teokseen, jossa yhteistoimija on vastuussa riippumattoman tai henkilökohtaisen elokuvan luomisesta.
scope note: Tekijä vastaa itse kaikilta osin elokuvan ideoinnista ja toteuttamisesta.
toolkit label: elokuvantekijä (yhteistoimija) teoksessa
toolkit definition: Teos, jossa yhteistoimija on vastuussa riippumattoman tai henkilökohtaisen elokuvan luomisesta.
label: er filmskaper av (kollektiv agent) @no
definition: Relaterer en kollektiv agent til et verk som involverer et ansvar for en kollektiv agent for en uavhengig eller personlig film. @no
scope note: En filmskaper har personlig ansvar for planen med og gjennomføringen av alle aspektene ved filmen. @no
toolkit label: filmskaper av (kollektiv agent) @no
toolkit definition: Et verk som involverer et ansvar for en kollektiv agent for en uavhengig eller personlig film. @no
label: is filmmaker-collectieve actor van @nl
definition: Relateert een collectieve actor aan een werk met zich meebrengt een verantwoordelijkheid van een collectieve actor voor het creëren van een zelfstandige of persoonlijke film. @nl
scope note: Een filmmaker is zelf verantwoordelijk voor het idee en de uitvoering van alle aspecten van de film. @nl
toolkit label: filmmaker-collectieve actor van @nl
toolkit definition: Een werk met zich meebrengt een verantwoordelijkheid van een collectieve actor voor het creëren van een zelfstandige of persoonlijke film. @nl
label: هو وكيل جماعي صانع أفلام لـ @ar
definition: يربط وكيلا جماعيا بعمل يترتب عليه مسئولية وكيل جماعي عن فيلم مستقل أو شخصي. @ar
scope note: صانع الفيلم هو المسئول بصورة فردية عن تصور جميع جوانب الفيلم وتنفيذها. @ar
toolkit label: وكيل جماعي صانع أفلام @ar
toolkit definition: عمل يترتب عليه مسئولية وكيل جماعي عن فيلم مستقل أو شخصي. @ar
label: és agent col·lectiu cineasta de @ca
definition: Relaciona un agent col·lectiu amb una obra que implica una responsabilitat d’un agent col·lectiu en la creació d’una pel·lícula cinematogràfica independent o personal. @ca
scope note: Un cineasta és responsable a títol individual de la concepció i l’execució de tots els aspectes de la pel·lícula. @ca
toolkit label: agent col·lectiu cineasta de @ca
toolkit definition: Obra que implica una responsabilitat d’un agent col·lectiu en una pel·lícula cinematogràfica independent o personal. @ca
label: er kollektiv agent, som er filmskaber af @da
definition: Relaterer en kollektiv agent til et værk, som involverer en kollektiv agents ansvar for at skabe en indiefilm eller personlig film. @da
scope note: Filmskaberen er individuelt ansvarlig for udtænkning og udførelse af alle filmens aspekter. @da
toolkit label: kollektiv agent, som er filmskaber af @da
toolkit definition: Værk, som involverer en kollektiv agents ansvar for at skabe en indiefilm eller personlig film. @da
label: filmitegija (kollektiiv) teoses @et
definition: Seostab kollektiivi teosega, mis sisaldab kollektiivi vastutust sõltumatu või autorifilmi eest. @et
scope note: Filmitegija vastutab üksinda kõigi filmi aspektide kontseptsiooni ja teostamise eest. @et
toolkit label: filmitegija (kollektiiv) teoses @et
toolkit definition: Teos, mis sisaldab kollektiivi vastutust sõltumatu või autorifilmi eest. @et
label: ist gemeinschaftlicher Akteur als Filmemacherin/Filmemacher von @de
definition: Setzt einen gemeinschaftlichen Akteur in Beziehung zu einem Werk, bei dem ein gemeinschaftlicher Akteur für die Schaffung eines unabhängigen oder privaten Films verantwortlich ist. @de
scope note: Eine Filmemacherin/Ein Filmemacher ist persönlich für das Konzept und die Ausführung aller Aspekte des Films verantwortlich. @de
toolkit label: Gemeinschaftlicher Akteur als Filmemacherin/Filmemacher von @de
toolkit definition: Ein Werk, bei dem ein gemeinschaftlicher Akteur für die Schaffung eines unabhängigen oder privaten Films verantwortlich ist. @de
label: filmgyártó kollektív ágense a következőnek: @hu
definition: Hozzákapcsol egy kollektív ágenst egy műhöz, amelyhez hozzátartozik egy kollektív ágens felelőssége egy független- vagy magánfilm létrehozásáért. @hu
scope note: Egy filmkészítő egyénileg felelős egy film koncepciójáért és összes aspektusának végrehajtásáért. @hu
toolkit label: filmgyártó kollektív ágense: @hu
toolkit definition: Egy mű, amelyhez hozzátartozik egy kollektív ágens felelőssége egy független- vagy magánfilm létrehozásáért. @hu
label: è regista cinematografico agente collettivo di @it
definition: Correla un agente collettivo a un'opera che implica una responsabilità di un agente collettivo in un film indipendente o personale. @it
scope note: Un regista è individualmente responsabile dell'ideazione ed esecuzione di tutti gli aspetti del film. @it
toolkit label: regista cinematografico agente collettivo di @it
toolkit definition: Opera che implica una responsabilità di un agente collettivo in un film indipendente o personale. @it
label: είναι σκηνοθέτης συλλογικός φορέας του @el
toolkit label: σκηνοθέτης συλλογικός φορέας του @el
label: est un agent collectif cinéaste de @fr
definition: Met un agent collectif en relation avec une œuvre qui comporte une responsabilité de la part d’un agent collectif consistant à créer un film indépendant ou personnel. @fr
scope note: Un cinéaste est responsable à titre individuel de la conception et de l’exécution de tous les aspects du film. @fr
toolkit label: agent collectif cinéaste de @fr
toolkit definition: Œuvre qui comporte une responsabilité de la part d’un agent collectif consistant à créer un film indépendant ou personnel. @fr
label: ir filmas veidotājs (grupa) @lv
definition: Sasaista grupu ar darbu, kas ietver grupas atbildību par neatkarīgas vai privātas filmas veidošanu un izpildi visos aspektos. @lv
toolkit label: ir filmas veidotājs (grupa) @lv
toolkit definition: Darbs, kas ietver grupas atbildību par neatkarīgas vai privātas filmas veidošanu un izpildi visos aspektos. @lv
scope note: Filmas veidotājs ir pilnībā atbildīgs par visiem filmas koncepcijas un realizācijas aspektiem. @lv
label: 是……的制片人集体行为者 @zh-hans
definition: 将一个行为者与涉及创作一部独立或个人电影的一个集体行为者的责任的一种作品关联起来。 @zh-hans
toolkit label: ……的制片人集体行为者 @zh-hans
toolkit definition: 涉及创作一部独立或个人电影的一个集体行为者的责任的一种作品 @zh-hans
scope note: 制片人对电影所有方面的构思和执行负有个人责任 @zh-hans
label: film üreticisi kolektif temsilcisidir @tr

elokuvantekijä (yhteisö) teoksessa
status: Published
label: is filmmaker corporate body of @en
lexical alias: filmmakerCorporateBodyOf.en
definition: Relates a corporate body to a work that involves a responsibility of a corporate body for creating an independent or personal film. @en
toolkit label: filmmaker corporate body of @en
toolkit definition: A work that involves a responsibility of a corporate body for creating an independent or personal film. @en
type: Property
domain: C10005
has element type: 2
sub property of: teoksen tekijä (yhteisö) teoksessa
sub property of: elokuvantekijä (yhteistoimija) teoksessa
scope note: A filmmaker is individually responsible for the conception and execution of all aspects of the film. @en
definition: Liittää yhteisön teokseen, jossa yhteisö on vastuussa riippumattoman tai henkilökohtaisen elokuvan luomisesta.
scope note: Tekijä vastaa itse kaikilta osin elokuvan ideoinnista ja toteuttamisesta.
toolkit label: elokuvantekijä (yhteisö) teoksessa
toolkit definition: Teos, jossa yhteisö on vastuussa riippumattoman tai henkilökohtaisen elokuvan luomisesta.
label: er filmskaper av (korporasjon) @no
definition: Relaterer en korporasjon til et verk som involverer et ansvar for en korporasjon for en uavhengig eller personlig film. @no
scope note: En filmskaper har personlig ansvar for planen med og gjennomføringen av alle aspektene ved filmen. @no
toolkit label: filmskaper av (korporasjon) @no
toolkit definition: Et verk som involverer et ansvar for en korporasjon for en uavhengig eller personlig film. @no
label: is filmmaker-corporatie van @nl
definition: Relateert een corporatie aan een werk met zich meebrengt een verantwoordelijkheid van een corporatie voor het creëren van een zelfstandige of persoonlijke film. @nl
scope note: Een filmmaker is zelf verantwoordelijk voor het idee en de uitvoering van alle aspecten van de film. @nl
toolkit label: filmmaker-corporatie van @nl
toolkit definition: Een werk met zich meebrengt een verantwoordelijkheid van een corporatie voor het creëren van een zelfstandige of persoonlijke film. @nl
label: هي هيئة مسئولة عن صناعة الأفلام لـ @ar
definition: يربط هيئة بعمل يترتب عليه مسئولية هيئة عن فيلم مستقل أو شخصي. @ar
scope note: صانع الفيلم هو المسئول بصورة فردية عن تصور جميع جوانب الفيلم وتنفيذها. @ar
toolkit label: هيئة مسئولة عن صناعة الأفلام @ar
toolkit definition: عمل يترتب عليه مسئولية هيئة عن فيلم مستقل أو شخصي. @ar
label: és entitat corporativa cineasta de @ca
definition: Relaciona una entitat corporativa amb una obra que implica una responsabilitat d’una entitat corporativa en la creació d’una pel·lícula cinematogràfica independent o personal. @ca
scope note: Un cineasta és responsable a títol individual de la concepció i l’execució de tots els aspectes de la pel·lícula. @ca
toolkit label: entitat corporativa cineasta de @ca
toolkit definition: Obra que implica una responsabilitat d’una entitat corporativa en la creació d’una pel·lícula cinematogràfica independent o personal. @ca
label: er korporation, som er filmskaber af @da
definition: Relaterer en korporation til et værk, som involverer en korporations ansvar for at skabe en indiefilm eller personlig film. @da
scope note: Filmskaberen er individuelt ansvarlig for udtænkning og udførelse af alle filmens aspekter. @da
toolkit label: korporation, som er filmskaber af @da
toolkit definition: Værk, som involverer en korporations ansvar for at skabe en indiefilm eller personlig film. @da
label: filmitegija (asutus) teoses @et
definition: Seostab asutuse teosega, mis sisaldab asutuse vastutust sõltumatu või autorifilmi eest. @et
scope note: Filmitegija vastutab üksinda kõigi filmi aspektide kontseptsiooni ja teostamise eest. @et
toolkit label: filmitegija (asutus) teoses @et
toolkit definition: Teos, mis sisaldab asutuse vastutust sõltumatu või autorifilmi eest. @et
label: ist Körperschaft als Filmemacherin/Filmemacher von @de
definition: Setzt eine Körperschaft in Beziehung zu einem Werk, bei dem eine Körperschaft für die Schaffung eines unabhängigen oder privaten Films verantwortlich ist. @de
scope note: Eine Filmemacherin/Ein Filmemacher ist persönlich für das Konzept und die Ausführung aller Aspekte des Films verantwortlich. @de
toolkit label: Körperschaft als Filmemacherin/Filmemacher von @de
toolkit definition: Ein Werk, bei dem eine Körperschaft für die Schaffung eines unabhängigen oder privaten Films verantwortlich ist. @de
label: filmkészítő testülete a következőnek. @hu
definition: Hozzákapcsol egy testületet egy műhöz, amelyhez hozzátartozik egy testület felelőssége egy független- vagy magánfilm létrehozásáért. @hu
scope note: Egy filmkészítő egyénileg felelős egy film koncepciójáért és összes aspektusának végrehajtásáért. @hu
toolkit label: filmkészítő testülete: @hu
toolkit definition: Egy mű, amelyhez hozzátartozik egy testület felelőssége egy független- vagy magánfilm létrehozásáért. @hu
label: è regista cinematografico ente di @it
definition: Correla un ente a un'opera che implica una responsabilità di un ente per un film indipendente o personale. @it
scope note: Un regista è individualmente responsabile dell'ideazione ed esecuzione di tutti gli aspetti del film. @it
toolkit label: regista cinematografico ente di @it
toolkit definition: Opera che implica una responsabilità di un ente per un film indipendente o personale. @it
label: είναι σκηνοθέτης συλλογικό όργανο του @el
scope note: Ένας σκηνοθέτης είναι ατομικά υπεύθυνος για τη σύλληψη και την εκτέλεση όλων των πτυχών μιας ταινίας. @el
toolkit label: σκηνοθέτης συλλογικό όργανο του @el
label: est une collectivité cinéaste de @fr
definition: Met une collectivité en relation avec une œuvre qui comporte une responsabilité de la part d’une collectivité consistant à créer un film indépendant ou personnel. @fr
scope note: Un cinéaste est responsable à titre individuel de la conception et de l’exécution de tous les aspects du film. @fr
toolkit label: collectivité cinéaste de @fr
toolkit definition: Œuvre qui comporte une responsabilité de la part d’une collectivité consistant à créer un film indépendant ou personnel. @fr
label: ir filmas veidotājs (institūcija) @lv
definition: Sasaista institūciju ar darbu, kas ietver institūcijas atbildību par neatkarīgas vai privātas filmas veidošanu un izpildi visos aspektos. @lv
toolkit label: ir filmas veidotājs (institūcija) @lv
toolkit definition: Darbs, kas ietver institūcijas atbildību par neatkarīgas vai privātas filmas veidošanu un izpildi visos aspektos. @lv
scope note: Filmas veidotājs ir pilnībā atbildīgs par visiem filmas koncepcijas un realizācijas aspektiem. @lv
label: 是……的制片人团体 @zh-hans
definition: 将一个团体与涉及创作一部独立或个人电影的一个团体的责任的一种作品关联起来。 @zh-hans
toolkit label: ……的制片人团体 @zh-hans
toolkit definition: 涉及创作一部独立或个人电影的一个团体的责任的一种作品 @zh-hans
scope note: 制片人对电影所有方面的构思和执行负有个人责任 @zh-hans

elokuvantekijä (suku) teoksessa
status: Published
label: is filmmaker family of @en
lexical alias: filmmakerFamilyOf.en
definition: Relates a family to a work that involves a responsibility of a family for creating an independent or personal film. @en
toolkit label: filmmaker family of @en
toolkit definition: A work that involves a responsibility of a family for creating an independent or personal film. @en
type: Property
domain: C10008
has element type: 2
sub property of: teoksen tekijä (suku) teoksessa
sub property of: elokuvantekijä (yhteistoimija) teoksessa
scope note: A filmmaker is individually responsible for the conception and execution of all aspects of the film. @en
definition: Liittää suvun teokseen, jossa suku on vastuussa riippumattoman tai henkilökohtaisen elokuvan luomisesta.
scope note: Tekijä vastaa itse kaikilta osin elokuvan ideoinnista ja toteuttamisesta.
toolkit label: elokuvantekijä (suku) teoksessa
toolkit definition: Teos, jossa suku on vastuussa riippumattoman tai henkilökohtaisen elokuvan luomisesta.
label: er filmskaper av (familie) @no
definition: Relaterer en familie til et verk som involverer et ansvar for en familie for en uavhengig eller personlig film. @no
scope note: En filmskaper har personlig ansvar for planen med og gjennomføringen av alle aspektene ved filmen. @no
toolkit label: filmskaper av (familie) @no
toolkit definition: Et verk som involverer et ansvar for en familie for en uavhengig eller personlig film. @no
label: is filmmaker-familie van @nl
definition: Relateert een familie aan een werk met zich meebrengt een verantwoordelijkheid van een familie voor het creëren van een zelfstandige of persoonlijke film. @nl
scope note: Een filmmaker is zelf verantwoordelijk voor het idee en de uitvoering van alle aspecten van de film. @nl
toolkit label: filmmaker-familie van @nl
toolkit definition: Een werk met zich meebrengt een verantwoordelijkheid van een familie voor het creëren van een zelfstandige of persoonlijke film. @nl
label: هي عائلة مسئولة عن صناعة الأفلام لـ @ar
definition: يربط عائلة بعمل يترتب عليه مسئولية عائلة عن فيلم مستقل أو شخصي. @ar
scope note: صانع الفيلم هو المسئول بصورة فردية عن تصور جميع جوانب الفيلم وتنفيذها. @ar
toolkit label: عائلة مسئولة عن صناعة الأفلام @ar
toolkit definition: عمل يترتب عليه مسئولية عائلة عن فيلم مستقل أو شخصي. @ar
label: és família cineasta de @ca
definition: Relaciona una família amb una obra que implica una responsabilitat d’una família en la creació d’una pel·lícula cinematogràfica independent o personal. @ca
scope note: Un cineasta és responsable a títol individual de la concepció i l’execució de tots els aspectes de la pel·lícula. @ca
toolkit label: família cineasta de @ca
toolkit definition: Obra que implica una responsabilitat d’una família en una pel·lícula cinematogràfica independent o personal. @ca
label: er familie, som er filmskaber af @da
definition: Relaterer en familie til et værk, som involverer en families ansvar for at skabe en indiefilm eller personlig film. @da
scope note: Filmskaberen er individuelt ansvarlig for udtænkning og udførelse af alle filmens aspekter. @da
toolkit label: familie, som er filmskaber af @da
toolkit definition: Værk, som involverer en families ansvar for at skabe en indiefilm eller personlig film. @da
label: filmitegija (perekond) teoses @et
definition: Seostab perekonna teosega, mis sisaldab perekonna vastutust sõltumatu või autorifilmi eest. @et
scope note: Filmitegija vastutab üksinda kõigi filmi aspektide kontseptsiooni ja teostamise eest. @et
toolkit label: filmitegija (perekond) teoses @et
toolkit definition: Teos, mis sisaldab perekonna vastutust sõltumatu või autorifilmi eest. @et
label: ist Familie als Filmemacherin/Filmemacher von @de
definition: Setzt eine Familie in Beziehung zu einem Werk, bei dem eine Familie für die Schaffung eines unabhängigen oder privaten Films verantwortlich ist. @de
scope note: Eine Filmemacherin/Ein Filmemacher ist persönlich für das Konzept und die Ausführung aller Aspekte des Films verantwortlich. @de
toolkit label: Familie als Filmemacherin/Filmemacher von @de
toolkit definition: Ein Werk, bei dem eine Familie für die Schaffung eines unabhängigen oder privaten Films verantwortlich ist. @de
label: filmkészítő családja a következőnek: @hu
definition: Hozzákapcsol egy családot egy műhöz, amelyhez hozzátartozik egy család felelőssége egy független- vagy magánfilm létrehozásáért. @hu
scope note: Egy filmkészítő egyénileg felelős egy film koncepciójáért és összes aspektusának végrehajtásáért. @hu
toolkit label: filmkészítő családja: @hu
toolkit definition: Egy mű, amelyhez hozzátartozik egy család felelőssége egy független- vagy magánfilm létrehozásáért. @hu
label: è regista cinematografico famiglia di @it
definition: Correla una famiglia a un'opera che implica una responsabilità di una famiglia per un film indipendente o personale. @it
scope note: Un regista è individualmente responsabile dell'ideazione ed esecuzione di tutti gli aspetti del film. @it
toolkit label: regista cinematografico famiglia di @it
toolkit definition: Opera che implica una responsabilità di una famiglia per un film indipendente o personale. @it
label: είναι σκηνοθέτης οικογένεια του @el
scope note: Ένας σκηνοθέτης είναι ατομικά υπεύθυνος για τη σύλληψη και την εκτέλεση όλων των πτυχών μιας ταινίας. @el
toolkit label: σκηνοθέτης οικογένεια του @el
label: est une famille cinéaste de @fr
definition: Met une famille en relation avec une œuvre qui comporte une responsabilité de la part d’une famille consistant à créer un film indépendant ou personnel. @fr
scope note: Un cinéaste est responsable à titre individuel de la conception et de l’exécution de tous les aspects du film. @fr
toolkit label: famille cinéaste de @fr
toolkit definition: Œuvre qui comporte une responsabilité de la part d’une famille consistant à créer un film indépendant ou personnel. @fr
label: ir filmas veidotājs (dzimta/ģimene) @lv
definition: Sasaista dzimtu/ģimeni ar darbu, kas ietver dzimtas/ģimenes atbildību par neatkarīgas vai privātas filmas veidošanu un izpildi visos aspektos. @lv
toolkit label: ir filmas veidotājs (dzimta/ģimene) @lv
toolkit definition: Darbs, kas ietver dzimtas/ģimenes atbildību par neatkarīgas vai privātas filmas veidošanu un izpildi visos aspektos. @lv
scope note: Filmas veidotājs ir pilnībā atbildīgs par visiem filmas koncepcijas un realizācijas aspektiem. @lv
label: 是……的制片人家族 @zh-hans
definition: 将一个家族与涉及创作一部独立或个人电影的一个家族的责任的一种作品关联起来。 @zh-hans
toolkit label: ……的制片人家族 @zh-hans
toolkit definition: 涉及创作一部独立或个人电影的一个家族的责任的一种作品 @zh-hans
scope note: 制片人对电影所有方面的构思和执行负有个人责任 @zh-hans

elokuvantekijä (henkilö) teoksessa
status: Published
label: is filmmaker person of @en
lexical alias: filmmakerPersonOf.en
definition: Relates a person to a work that involves a responsibility of a person for creating an independent or personal film. @en
toolkit label: filmmaker person of @en
toolkit definition: A work that involves a responsibility of a person for creating an independent or personal film. @en
type: Property
domain: C10004
has element type: 2
sub property of: teoksen tekijä (henkilö) teoksessa
sub property of: elokuvantekijä (toimija) teoksessa
scope note: A filmmaker is individually responsible for the conception and execution of all aspects of the film. @en
definition: Liittää henkilön teokseen, jossa hennkilö on vastuussa riippumattoman tai henkilökohtaisen elokuvan luomisesta.
scope note: Tekijä vastaa itse kaikilta osin elokuvan ideoinnista ja toteuttamisesta.
toolkit label: elokuvantekijä (henkilö) teoksessa
toolkit definition: Teos, jossa hennkilö on vastuussa riippumattoman tai henkilökohtaisen elokuvan luomisesta.
label: er filmskaper av (person) @no
definition: Relaterer en person til et verk som involverer et ansvar for en person for en uavhengig eller personlig film. @no
scope note: En filmskaper har personlig ansvar for planen med og gjennomføringen av alle aspektene ved filmen. @no
toolkit label: filmskaper av (person) @no
toolkit definition: Et verk som involverer et ansvar for en person for en uavhengig eller personlig film. @no
label: is filmmaker-persoon van @nl
definition: Relateert een persoon aan een werk met zich meebrengt een verantwoordelijkheid van een persoon voor het creëren van een zelfstandige of persoonlijke film. @nl
scope note: Een filmmaker is zelf verantwoordelijk voor het idee en de uitvoering van alle aspecten van de film. @nl
toolkit label: filmmaker-persoon van @nl
toolkit definition: Een werk met zich meebrengt een verantwoordelijkheid van een persoon voor het creëren van een zelfstandige of persoonlijke film. @nl
label: هو شخص صانع أفلام لـ @ar
definition: يربط شخصا بعمل يترتب عليه مسئولية شخص عن فيلم مستقل أو شخصي. @ar
scope note: صانع الفيلم هو المسئول بصورة فردية عن تصور جميع جوانب الفيلم وتنفيذها. @ar
toolkit label: شخص صانع أفلام @ar
toolkit definition: عمل يترتب عليه مسئولية شخص عن فيلم مستقل أو شخصي. @ar
label: és persona cineasta de @ca
definition: Relaciona una persona amb una obra que implica una responsabilitat d’una persona en la creació d’una pel·lícula cinematogràfica independent o personal. @ca
scope note: Un cineasta és responsable a títol individual de la concepció i l’execució de tots els aspectes de la pel·lícula. @ca
toolkit label: persona cineasta de @ca
toolkit definition: Obra que implica una responsabilitat d’una persona en la creació d’una pel·lícula cinematogràfica independent o personal. @ca
label: er person, som er filmskaber af @da
definition: Relaterer en person til et værk, som involverer en persons ansvar for at skabe en indiefilm eller personlig film. @da
scope note: Filmskaberen er individuelt ansvarlig for udtænkning og udførelse af alle filmens aspekter. @da
toolkit label: person, som er filmskaber af @da
toolkit definition: Værk, som involverer en persons ansvar for at skabe en indiefilm eller personlig film. @da
label: filmitegija (isik) teoses @et
definition: Seostab isiku teosega, mis sisaldab isiku vastutust sõltumatu või autorifilmi eest. @et
scope note: Filmitegija vastutab üksinda kõigi filmi aspektide kontseptsiooni ja teostamise eest. @et
toolkit label: filmitegija (isik) teoses @et
toolkit definition: Teos, mis sisaldab isiku vastutust sõltumatu või autorifilmi eest. @et
label: ist Person als Filmemacherin/Filmemacher von @de
definition: Setzt eine Person in Beziehung zu einem Werk, bei dem eine Person für die Schaffung eines unabhängigen oder privaten Films verantwortlich ist. @de
scope note: Eine Filmemacherin/Ein Filmemacher ist persönlich für das Konzept und die Ausführung aller Aspekte des Films verantwortlich. @de
toolkit label: ist Person als Filmemacherin/Filmemacher von @de
toolkit definition: Ein Werk, bei dem eine Person für die Schaffung eines unabhängigen oder privaten Films verantwortlich ist. @de
label: filmkészítő személye a következőnek: @hu
definition: Hozzákapcsol egy személyt egy műhöz, amelyhez hozzátartozik egy személy felelőssége egy független- vagy magánfilm létrehozásáért. @hu
scope note: Egy filmkészítő egyénileg felelős egy film koncepciójáért és összes aspektusának végrehajtásáért. @hu
toolkit label: filmkészítő személye: @hu
toolkit definition: Egy mű, amelyhez hozzátartozik egy személy felelőssége egy független- vagy magánfilm létrehozásáért. @hu
label: è regista cinematografico persona di @it
definition: Correla una persona a un'opera che implica una responsabilità di una persona per un film indipendente o personale. @it
scope note: Un regista è individualmente responsabile dell'ideazione ed esecuzione di tutti gli aspetti del film. @it
toolkit label: regista cinematografico persona di @it
toolkit definition: Opera che implica una responsabilità di una persona per un film indipendente o personale. @it
label: είναι σκηνοθέτης φυσικό πρόσωπο του @el
toolkit label: σκηνοθέτης φυσικό πρόσωπο του @el
label: est une personne cinéaste de @fr
definition: Met une personne en relation avec une œuvre qui comporte une responsabilité de la part d’une personne consistant à créer un film indépendant ou personnel. @fr
scope note: Un cinéaste est responsable à titre individuel de la conception et de l’exécution de tous les aspects du film. @fr
toolkit label: personne cinéaste de @fr
toolkit definition: Œuvre qui comporte une responsabilité de la part d’une personne consistant à créer un film indépendant ou personnel. @fr
label: ir filmas veidotājs (persona) @lv
definition: Sasaista personu ar darbu, kas ietver personas atbildību par neatkarīgas vai privātas filmas veidošanu un izpildi visos aspektos. @lv
toolkit label: ir filmas veidotājs (persona) @lv
toolkit definition: Darbs, kas ietver personas atbildību par neatkarīgas vai privātas filmas veidošanu un izpildi visos aspektos. @lv
scope note: Filmas veidotājs ir pilnībā atbildīgs par visiem filmas koncepcijas un realizācijas aspektiem. @lv
label: 是……的制片人个人 @zh-hans
definition: 将一个个人与涉及创作一部独立或个人电影的一个个人的责任的一种作品关联起来。 @zh-hans
toolkit label: ……的制片人个人 @zh-hans
toolkit definition: 涉及创作一部独立或个人电影的一个个人的责任的一种作品 @zh-hans
scope note: 制片人对电影所有方面的构思和执行负有个人责任 @zh-hans
label: film üreticisi kişisidir @tr

elokuvatuottaja (toimija) teoksessa
status: Published
label: is film producer agent of @en
definition: Relates an agent to a work that involves a responsibility of an agent for most of the business aspects of the production of a film. @en
type: Property
domain: C10002
sub property of: tuottaja (toimija) teoksessa
lexical alias: filmProducerAgentOf.en
label: est un agent producteur de cinéma de @fr
definition: Met un agent en relation avec une œuvre qui comporte une responsabilité de la part d’un agent en ce qui concerne la majeure partie des aspects commerciaux de la production d’un film. @fr
toolkit label: agent producteur de cinéma de @fr
toolkit definition: Œuvre qui comporte une responsabilité de la part d’un agent en ce qui concerne la majeure partie des aspects commerciaux de la production d’un film. @fr
toolkit label: film producer agent of @en
toolkit definition: A work that involves a responsibility of an agent for most of the business aspects of the production of a film. @en
instruction number: 18.5
label: είναι παραγωγός ταινίας φορέας του @el
definition: Συνδέει έναν παραγωγό υπεύθυνο για τις περισσότερες επιχειρηματικές πτυχές ενός φιλμ, με ένα έργο. @el
toolkit label: παραγωγός ταινίας φορέας του @el
toolkit definition: Ένα έργο που περιλαμβάνει την ευθύνη της παραγωγής για τις περισσότερες επιχειρηματικές πτυχές ενός φιλμ. @el
definition: Setzt einen Akteur in Beziehung zu einem Werk, bei dem ein Akteur für die meisten geschäftlichen Aspekte bei der Produktion eines Films verantwortlich ist. @de
toolkit label: Akteur als Filmproduzentin/Filmproduzent von @de
toolkit definition: Ein Werk, bei dem ein Akteur für die meisten geschäftlichen Aspekte bei der Produktion eines Films verantwortlich ist. @de
label: er agent, som er filmproducer af @da
definition: Relaterer en agent til et værk, som involverer en agents ansvar for størstedelen af de forretningsmæssige aspekter ved en film. @da
toolkit label: agent, som er filmproducer af @da
toolkit definition: Værk, som involverer en agents ansvar for størstedelen af de forretningsmæssige aspekter ved en film. @da
label: és agent productor cinematogràfic de @ca
definition: Relaciona un agent amb una obra que implica una responsabilitat d’un agent en la majoria dels aspectes comercials de la producció d’una pel·lícula. @ca
toolkit label: agent productor cinematogràfic de @ca
toolkit definition: Obra que implica una responsabilitat d’un agent en la majoria dels aspectes comercials de la producció d’una pel·lícula. @ca
definition: Liittää toimijan teokseen, jossa toimija on vastuussa suurimmasta osasta elokuvan liiketoimintaa.
toolkit label: elokuvatuottaja (toimija) teoksessa
toolkit definition: Teos, jossa toimija on vastuussa suurimmasta osasta elokuvan liiketoimintaa.
toolkit label: filmprodusent av (agent) @no
toolkit definition: Et verk som involverer ansvar for en agent i form av de fleste forretningsmessige aspektene ved produksjon av en film. @no
label: ist Akteur als Filmproduzentin/Filmproduzent von @de
has element type: 2
label: filmproducer ágense a következőnek: @hu
definition: Hozzákapcsol egy ágenst egy műhöz, amelyhez hozzátartozik egy ágens felelőssége egy filmprodukció legtöbb üzleti vonatkozásáért. @hu
toolkit label: filmproducer ágense: @hu
toolkit definition: Egy mű, amelyhez hozzátartozik egy ágens felelőssége egy filmprodukció legtöbb üzleti vonatkozásáért. @hu
alternative label: film producer of @en
alternative label: tuottajana elokuvassa
label: er filmprodusent av (agent) @no
definition: Relaterer en agent til et verk som involverer ansvar for en agent i form av de fleste forretningsmessige aspektene ved produksjon av en film. @no
alternative label: filmprodusent av @no
label: is filmproducent-actor van @nl
definition: Relateert een actor aan een werk dat met zich meebrengt een verantwoordelijkheid van een actor voor het merendeel van de zakelijke aspecten van de productie van een film. @nl
toolkit label: filmproducent-actor van @nl
toolkit definition: Een werk dat met zich meebrengt een verantwoordelijkheid van een actor voor het merendeel van de zakelijke aspecten van de productie van een film. @nl
label: هو وكيل منتج لفيلم لـ @ar
definition: يربط وكيلا بعمل يترتب عليه مسئولية وكيل عن معظم الجوانب التجارية لإنتاج فيلم. @ar
alternative label: منتج الفيلم @ar
toolkit label: وكيل منتج لفيلم لـ @ar
toolkit definition: عمل يترتب عليه مسئولية وكيل عن معظم الجوانب التجارية لإنتاج فيلم. @ar
alternative label: productor cinematogràfic de @ca
alternative label: filmproducer af @da
label: filmiprodutsent (tegija) teoses @et
definition: Seostab tegija teosega, mis sisaldab tegija vastutust enamiku äriliste aspektide eest filmi tootmisel. @et
alternative label: filmiprodutsent teoses @et
toolkit label: filmiprodutsent (tegija) teoses @et
toolkit definition: Teos, mis sisaldab tegija vastutust enamiku äriliste aspektide eest filmi tootmisel. @et
alternative label: filmproducere: @hu
label: è produttore cinematografico agente di @it
definition: Correla un agente a un'opera che implica la responsabilità di un agente per la maggior parte degli aspetti commerciali della produzione di un film. @it
alternative label: produttore cinematografico di @it
toolkit label: produttore cinematografico agente di @it
toolkit definition: Opera che implica la responsabilità di un agente per la maggior parte degli aspetti commerciali della produzione di un film. @it
alternative label: παραγωγός ταινίας του @el
label: ir filmas producents (aģents) @lv
definition: Sasaista aģentu ar darbu, kas ietver aģenta atbildību par filmas uzņemšanas finansiālajiem aspektiem. @lv
toolkit label: ir filmas producents (aģents) @lv
toolkit definition: Darbs, kas ietver aģenta atbildību par filmas uzņemšanas finansiālajiem aspektiem. @lv
alternative label: Filmproduzent von @de
alternative label: ……的电影制作人 @zh-hans
label: 是……的电影制作人行为者 @zh-hans
toolkit label: ……的电影制作人行为者 @zh-hans
toolkit definition: 涉及电影制作的大部分商业运作的一个行为者的责任的一种作品 @zh-hans
toolkit label: film yapımcısı temsilcisi @tr
toolkit definition: Bir filmin yapımının ticari yönlerinin çoğu için bir temsilcinin sorumluluğunu içeren bir eser. @tr
has subproperty: elokuvatuottaja (yhteistoimija) teoksessa

elokuvatuottaja (yhteistoimija) teoksessa
status: Published
label: is film producer collective agent of @en
lexical alias: filmProducerCollectiveAgentOf.en
definition: Relates a collective agent to a work that involves a responsibility of a collective agent for most of the business aspects of the production of a film. @en
toolkit label: film producer collective agent of @en
toolkit definition: A work that involves a responsibility of a collective agent for most of the business aspects of the production of a film. @en
type: Property
domain: C10011
has element type: 2
sub property of: tuottaja (yhteistoimija) teoksessa
sub property of: elokuvatuottaja (toimija) teoksessa
definition: Liittää yhteistoimijan teokseen, jossa yhteistoimija on vastuussa suurimmasta osasta elokuvan liiketoimintaa.
toolkit label: elokuvatuottaja (yhteistoimija) teoksessa
toolkit definition: Teos, jossa yhteistoimija on vastuussa suurimmasta osasta elokuvan liiketoimintaa.
label: er filmprodusent for (kollektiv agent) @no
definition: Relaterer en kollektiv agent til et verk som involverer et ansvar for en kollektiv agent i form av de fleste forretningsmessige aspektene ved produksjon av en film. @no
toolkit label: filmprodusent for (kollektiv agent) @no
toolkit definition: Et verk som involverer et ansvar for en kollektiv agent i form av de fleste forretningsmessige aspektene ved produksjon av en film. @no
label: is filmproducent-collectieve actor van @nl
definition: Relateert een collectieve actor aan een werk dat met zich meebrengt een verantwoordelijkheid van een collectieve actor voor het merendeel van de zakelijke aspecten van de productie van een film. @nl
toolkit label: filmproducent-collectieve actor van @nl
toolkit definition: Een werk dat met zich meebrengt een verantwoordelijkheid van een collectieve actor voor het merendeel van de zakelijke aspecten van de productie van een film. @nl
label: هو وكيل جماعي منتج فيلم لـ @ar
definition: يربط وكيلا جماعيا بعمل يترتب عليه مسئولية وكيل جماعي عن معظم الجوانب التجارية لإنتاج فيلم. @ar
toolkit label: وكيل جماعي منتج لفيلم لـ @ar
toolkit definition: عمل يترتب عليه مسئولية وكيل جماعي عن معظم الجوانب التجارية لإنتاج فيلم. @ar
label: és agent col·lectiu productor cinematogràfic de @ca
definition: Relaciona un agent col·lectiu amb una obra que implica una responsabilitat d’un agent col·lectiu en la majoria dels aspectes comercials de la producció d’una pel·lícula. @ca
toolkit label: agent col·lectiu productor cinematogràfic de @ca
toolkit definition: Obra que implica una responsabilitat d’un agent col·lectiu en la majoria dels aspectes comercials de la producció d’una pel·lícula. @ca
label: er kollektiv agent, som er filmproducer af @da
definition: Relaterer en kollektiv agent til et værk, som involverer en kollektiv agents ansvar for størstedelen af de forretningsmæssige aspekter ved en film. @da
toolkit label: kollektiv agent, som er filmproducer af @da
toolkit definition: Værk, som involverer en kollektiv agents ansvar for størstedelen af de forretningsmæssige aspekter ved en film. @da
label: filmiprodutsent (kollektiiv) teoses @et
definition: Seostab kollektiivi teosega, mis sisaldab kollektiivi vastutust enamiku äriliste aspektide eest filmi tootmisel. @et
toolkit label: filmiprodutsent (kollektiiv) teoses @et
toolkit definition: Teos, mis sisaldab kollektiivi vastutust enamiku äriliste aspektide eest filmi tootmisel. @et
label: ist gemeinschaftlicher Akteur als Filmproduzentin/Filmproduzent von @de
definition: Setzt einen gemeinschaftlichen Akteur in Beziehung zu einem Werk, bei dem ein gemeinschaftlicher Akteur für die meisten geschäftlichen Aspekte bei der Produktion eines Films verantwortlich ist. @de
toolkit label: Gemeinschaftlicher Akteur als Filmproduzentin/Filmproduzent von @de
toolkit definition: Ein Werk, bei dem ein gemeinschaftlicher Akteur für die meisten geschäftlichen Aspekte bei der Produktion eines Films verantwortlich ist. @de
label: filmproducer kollektív ágense a következőnek: @hu
definition: Hozzákapcsol egy kollektív ágenst egy műhöz, amelyhez hozzátartozik egy kollektív ágens felelőssége egy filmprodukció legtöbb üzleti vonatkozásáért. @hu
toolkit label: filmproducer kollektív ágense: @hu
toolkit definition: Egy mű, amelyhez hozzátartozik egy kollektív ágens felelőssége egy filmprodukció legtöbb üzleti vonatkozásáért. @hu
label: è produttore cinematografico agente collettivo di @it
definition: Correla un agente collettivo a un'opera che implica una responsabilità di un agente collettivoper la maggior parte degli aspetti commerciali della produzione di un film. @it
toolkit label: produttore cinematografico agente collettivo di @it
toolkit definition: Opera che implica una responsabilità di un agente collettivo per la maggior parte degli aspetti commerciali della produzione di un film. @it
label: είναι παραγωγός ταινίας συλλογικός φορέας του @el
toolkit label: παραγωγός ταινίας συλλογικός φορέας του @el
label: est un agent collectif producteur de cinéma de @fr
definition: Met un agent collectif en relation avec une œuvre qui comporte une responsabilité de la part d’un agent collectif en ce qui concerne la majeure partie des aspects commerciaux de la production d’un film. @fr
alternative label: agent collectif producteur de film de @fr
toolkit label: agent collectif producteur de cinéma de @fr
toolkit definition: Œuvre qui comporte une responsabilité de la part d’un agent collectif en ce qui concerne la majeure partie des aspects commerciaux de la production d’un film. @fr
label: ir filmas producents (grupa) @lv
definition: Sasaista grupu ar darbu, kas ietver grupas atbildību par filmas uzņemšanas finansiālajiem aspektiem. @lv
toolkit label: ir filmas producents (grupa) @lv
toolkit definition: Darbs, kas ietver grupas atbildību par filmas uzņemšanas finansiālajiem aspektiem. @lv
label: 是……的电影制作人集体行为者 @zh-hans
definition: 将一个集体行为者与涉及电影制作的大部分商业运作的一个集体行为者的责任的一种作品关联起来。 @zh-hans
toolkit label: ……的电影制作人集体行为者 @zh-hans
toolkit definition: 涉及电影制作的大部分商业运作的一个集体行为者的责任的一种作品 @zh-hans
label: film yapımcısı kolektif temsilcisidir @tr
definition: Kolektif bir temsilciyi, bir filmin yapımının ticari yönlerinin çoğu için kolektif bir temsilcinin sorumluluğunu içeren bir eserle ilişkilendirir. @tr
toolkit label: film yapımcısı kolektif temsilcisi @tr
toolkit definition: Bir filmin yapımının ticari yönlerinin çoğu için kollektif bir temsilcinin sorumluluğunu içeren bir eser. @tr
has subproperty: elokuvatuottaja (yhteisö) teoksessa
has subproperty: elokuvatuottaja (suku) teoksessa
has subproperty: P50702

elokuvatuottaja (yhteisö) teoksessa
status: Published
label: is film producer corporate body of @en
lexical alias: filmProducerCorporateBodyOf.en
definition: Relates a corporate body to a work that involves a responsibility of a corporate body for most of the business aspects of the production of a film. @en
toolkit label: film producer corporate body of @en
toolkit definition: A work that involves a responsibility of a corporate body for most of the business aspects of the production of a film. @en
type: Property
domain: C10005
has element type: 2
sub property of: tuottaja (yhteisö) teoksessa
sub property of: elokuvatuottaja (yhteistoimija) teoksessa
definition: Liittää yhteisön teokseen, jossa yhteisö on vastuussa suurimmasta osasta elokuvan liiketoimintaa.
toolkit label: elokuvatuottaja (yhteisö) teoksessa
toolkit definition: Teos, jossa yhteisö on vastuussa suurimmasta osasta elokuvan liiketoimintaa.
label: er filmprodusent for (korporasjon) @no
definition: Relaterer en korporasjon til et verk som involverer et ansvar for en korporasjon i form av de fleste forretningsmessige aspektene ved produksjon av en film. @no
toolkit label: filmprodusent for (korporasjon) @no
toolkit definition: Et verk som involverer et ansvar for en korporasjon i form av de fleste forretningsmessige aspektene ved produksjon av en film. @no
label: is filmproducent-corporatie van @nl
definition: Relateert een corporatie aan een werk dat met zich meebrengt een verantwoordelijkheid van een corporatie voor het merendeel van de zakelijke aspecten van de productie van een film. @nl
toolkit label: filmproducent-corporatie van @nl
toolkit definition: Een werk dat met zich meebrengt een verantwoordelijkheid van een corporatie voor het merendeel van de zakelijke aspecten van de productie van een film. @nl
label: هي هيئة منتجة لفيلم لـ @ar
definition: يربط هيئة بعمل يترتب عليه مسئولية هيئة عن معظم الجوانب التجارية لإنتاج فيلم. @ar
toolkit label: هيئة منتجة لفيلم @ar
toolkit definition: عمل يترتب عليه مسئولية هيئة عن معظم الجوانب التجارية لإنتاج فيلم. @ar
label: és entitat corporativa productora cinematogràfica de @ca
definition: Relaciona una entitat corporativa amb una obra que implica una responsabilitat d’una entitat corporativa en la majoria dels aspectes comercials de la producció d’una pel·lícula. @ca
toolkit label: entitat corporativa productora cinematogràfica de @ca
toolkit definition: Obra que implica una responsabilitat d’una entitat corporativa en la majoria dels aspectes comercials de la producció d’una pel·lícula. @ca
label: er korporation, som er filmproducer af @da
definition: Relaterer en korporation til et værk, som involverer en korporations ansvar for størstedelen af de forretningsmæssige aspekter ved en film. @da
toolkit label: korporation, som er filmproducer af @da
toolkit definition: Værk, som involverer en korporations ansvar for størstedelen af de forretningsmæssige aspekter ved en film. @da
label: filmiprodutsent (asutus) teoses @et
definition: Seostab asutuse teosega, mis sisaldab asutuse vastutust enamiku äriliste aspektide eest filmi tootmisel. @et
toolkit label: filmiprodutsent (asutus) teoses @et
toolkit definition: Teos, mis sisaldab asutuse vastutust enamiku äriliste aspektide eest filmi tootmisel. @et
label: ist Körperschaft als Filmproduzentin/Filmproduzent von @de
definition: Setzt eine Körperschaft in Beziehung zu einem Werk, bei dem eine Körperschaft für die meisten geschäftlichen Aspekte bei der Produktion eines Films verantwortlich ist. @de
toolkit label: Körperschaft als Filmproduzentin/Filmproduzent von @de
toolkit definition: Ein Werk, bei dem eine Körperschaft für die meisten geschäftlichen Aspekte bei der Produktion eines Films verantwortlich ist. @de
label: filmproducer testülete a következőnek: @hu
definition: Hozzákapcsol egy testületet egy műhöz, amelyhez hozzátartozik egy testület felelőssége egy filmprodukció legtöbb üzleti vonatkozásáért. @hu
toolkit label: filmproducer testülete: @hu
toolkit definition: Egy mű, amelyhez hozzátartozik egy testület felelőssége egy filmprodukció legtöbb üzleti vonatkozásáért. @hu
label: è produttore cinematografico ente di @it
definition: Correla un ente a un'opera che implica una responsabilità di un ente per la maggior parte degli aspetti commerciali della produzione di un film. @it
toolkit label: produttore cinematografico ente di @it
toolkit definition: Opera che implica una responsabilità di un ente per la maggior parte degli aspetti commerciali della produzione di un film. @it
label: είναι παραγωγός ταινίας συλλογικό όργανο του @el
toolkit label: παραγωγός ταινίας συλλογικό όργανο του @el
label: est une collectivité productrice de cinéma de @fr
definition: Met une collectivité en relation avec une œuvre qui comporte une responsabilité de la part d’une collectivité en ce qui concerne la majeure partie des aspects commerciaux de la production d’un film. @fr
alternative label: collectivité productrice de film de @fr
toolkit label: collectivité productrice de cinéma de @fr
toolkit definition: Œuvre qui comporte une responsabilité de la part d’une collectivité en ce qui concerne la majeure partie des aspects commerciaux de la production d’un film. @fr
label: ir filmas producents (institūcija) @lv
definition: Sasaista institūciju ar darbu, kas ietver institūcijas atbildību par filmas uzņemšanas finansiālajiem aspektiem. @lv
toolkit label: ir filmas producents (institūcija) @lv
toolkit definition: Darbs, kas ietver institūcijas atbildību par filmas uzņemšanas finansiālajiem aspektiem. @lv
label: 是……的电影制作人团体 @zh-hans
definition: 将一个团体与涉及电影制作的大部分商业运作的一个团体的责任的一种作品关联起来。 @zh-hans
toolkit label: ……的电影制作人团体 @zh-hans
toolkit definition: 涉及电影制作的大部分商业运作的一个团体的责任的一种作品 @zh-hans
label: film yapımcısı tüzel kişisidir @tr
definition: Bir tüzel kişiyi, bir filmin yapımına ilişkin ticari yönlerin çoğu için bir tüzel kişinin sorumluluğunu içeren bir eserle ilişkilendirir. @tr
toolkit label: film yapımcısı tüzel kişisi @tr
toolkit definition: Bir filmin yapımının ticari yönlerinin çoğu için bir tüzel kişinin sorumluluğunu içeren bir çalışma. @tr
has subproperty: P50853

elokuvatuottaja (suku) teoksessa
status: Published
label: is film producer family of @en
lexical alias: filmProducerFamilyOf.en
definition: Relates a family to a work that involves a responsibility of a family for most of the business aspects of the production of a film. @en
toolkit label: film producer family of @en
toolkit definition: A work that involves a responsibility of a family for most of the business aspects of the production of a film. @en
type: Property
domain: C10008
has element type: 2
sub property of: tuottaja (suku) teoksessa
sub property of: elokuvatuottaja (yhteistoimija) teoksessa
definition: Liittää suvun teokseen, jossa suku on vastuussa suurimmasta osasta elokuvan liiketoimintaa.
toolkit label: elokuvatuottaja (suku) teoksessa
toolkit definition: Teos, jossa suku on vastuussa suurimmasta osasta elokuvan liiketoimintaa.
label: er filmprodusent for (familie) @no
definition: Relaterer en familie til et verk som involverer et ansvar for en familie i form av de fleste forretningsmessige aspektene ved produksjon av en film. @no
toolkit label: filmprodusent for (familie) @no
toolkit definition: Et verk som involverer et ansvar for en familie i form av de fleste forretningsmessige aspektene ved produksjon av en film. @no
label: is filmproducent-familie van @nl
definition: Relateert een familie aan een werk dat met zich meebrengt een verantwoordelijkheid van een familie voor het merendeel van de zakelijke aspecten van de productie van een film. @nl
toolkit label: filmproducent-familie van @nl
toolkit definition: Een werk dat met zich meebrengt een verantwoordelijkheid van een familie voor het merendeel van de zakelijke aspecten van de productie van een film. @nl
label: هي عائلة مُنتجة لفيلم لـ @ar
definition: يربط عائلة بعمل يترتب عليه مسئولية عائلة عن معظم الجوانب التجارية لإنتاج فيلم. @ar
toolkit label: عائلة منتجة لفيلم لـ @ar
toolkit definition: عمل يترتب عليه مسئولية عائلة عن معظم الجوانب التجارية لإنتاج فيلم. @ar
label: és família productora cinematogràfica de @ca
definition: Relaciona una família amb una obra que implica una responsabilitat d’una família en la majoria dels aspectes comercials de la producció d’una pel·lícula. @ca
toolkit label: família productora cinematogràfica de @ca
toolkit definition: Obra que implica una responsabilitat d’una família en la majoria dels aspectes comercials de la producció d’una pel·lícula. @ca
label: er familie, som er filmproducer af @da
definition: Relaterer en familie til et værk, som involverer en families ansvar for størstedelen af de forretningsmæssige aspekter ved en film. @da
toolkit label: familie, som er filmproducer af @da
toolkit definition: Værk, som involverer en families ansvar for størstedelen af de forretningsmæssige aspekter ved en film. @da
label: filmiprodutsent (perekond) teoses @et
definition: Seostab perekonna teosega, mis sisaldab perekonna vastutust enamiku äriliste aspektide eest filmi tootmisel. @et
toolkit label: filmiprodutsent (perekond) teoses @et
toolkit definition: Teos, mis sisaldab perekonna vastutust enamiku äriliste aspektide eest filmi tootmisel. @et
label: ist Familie als Filmproduzentin/Filmproduzent von @de
definition: Setzt eine Familie in Beziehung zu einem Werk, bei dem eine Familie für die meisten geschäftlichen Aspekte bei der Produktion eines Films verantwortlich ist. @de
toolkit label: Familie als Filmproduzentin/Filmproduzent von @de
toolkit definition: Ein Werk, bei dem eine Familie für die meisten geschäftlichen Aspekte bei der Produktion eines Films verantwortlich ist. @de
label: filmproducer családja a következőnek: @hu
definition: Hozzákapcsol egy családot egy műhöz, amelyhez hozzátartozik egy család felelőssége egy filmprodukció legtöbb üzleti vonatkozásáért. @hu
toolkit label: filmproducer családja: @hu
toolkit definition: Egy mű, amelyhez hozzátartozik egy család felelőssége egy filmprodukció legtöbb üzleti vonatkozásáért. @hu
label: è produttore cinematografico famiglia di @it
definition: Correla una famiglia a un'opera che implica una responsabilità di una famiglia per la maggior parte degli aspetti commerciali della produzione di un film. @it
toolkit label: produttore cinematografico famiglia di @it
toolkit definition: Opera che implica una responsabilità di una famiglia per la maggior parte degli aspetti commerciali della produzione di un film. @it
label: είναι παραγωγός ταινίας οικογένεια του @el
toolkit label: παραγωγός ταινίας οικογένεια του @el
label: est une famille productrice de cinéma de @fr
definition: Met une famille en relation avec une œuvre qui comporte une responsabilité de la part d’une famille en ce qui concerne la majeure partie des aspects commerciaux de la production d’un film. @fr
alternative label: famille productrice de film de @fr
toolkit label: famille productrice de cinéma de @fr
toolkit definition: Œuvre qui comporte une responsabilité de la part d’une famille en ce qui concerne la majeure partie des aspects commerciaux de la production d’un film. @fr
label: ir filmas producents (dzimta/ģimene) @lv
definition: Sasaista dzimtu/ģimeni ar darbu, kas ietver dzimtas/ģimenes atbildību par filmas uzņemšanas finansiālajiem aspektiem. @lv
toolkit label: ir filmas producents (dzimta/ģimene) @lv
toolkit definition: Darbs, kas ietver dzimtas/ģimenes atbildību par filmas uzņemšanas finansiālajiem aspektiem. @lv
label: 是……的电影制作人家族 @zh-hans
definition: 将一个家族与涉及电影制作的大部分商业运作的一个家族的责任的一种作品关联起来。 @zh-hans
toolkit label: ……的电影制作人家族 @zh-hans
toolkit definition: 涉及电影制作的大部分商业运作的一个家族的责任的一种作品 @zh-hans
label: film yapımcısı ailesidir @tr
definition: Bir aileyi, bir film yapımının çoğu iş yönünden sorumluluğunu içeren bir eserle ilişkilendirir. @tr
toolkit label: film yapımcısı ailesi @tr
toolkit definition: Bir filmin yapımının ticari yönlerinin çoğu için bir ailenin sorumluluğunu içeren bir eser. @tr
has subproperty: P51004

elokuvatuottaja (henkilö) teoksessa
status: Published
label: is film producer person of @en
lexical alias: filmProducerPersonOf.en
definition: Relates a person to a work that involves a responsibility of a person for most of the business aspects of the production of a film. @en
toolkit label: film producer person of @en
toolkit definition: A work that involves a responsibility of a person for most of the business aspects of the production of a film. @en
type: Property
domain: C10004
has element type: 2
sub property of: tuottaja (henkilö) teoksessa
sub property of: elokuvatuottaja (toimija) teoksessa
definition: Liittää henkilön teokseen, jossa henkilö on vastuussa suurimmasta osasta elokuvan liiketoimintaa.
toolkit label: elokuvatuottaja (henkilö) teoksessa
toolkit definition: Teos, jossa henkilö on vastuussa suurimmasta osasta elokuvan liiketoimintaa.
label: er filmprodusent for (person) @no
definition: Relaterer en person til et verk som involverer et ansvar for en person i form av de fleste forretningsmessige aspektene ved produksjon av en film. @no
toolkit label: filmprodusent for (person) @no
toolkit definition: Et verk som involverer et ansvar for en person i form av de fleste forretningsmessige aspektene ved produksjon av en film. @no
label: is filmproducent-persoon van @nl
definition: Relateert een persoon aan een werk dat met zich meebrengt een verantwoordelijkheid van een persoon voor het merendeel van de zakelijke aspecten van de productie van een film. @nl
toolkit label: filmproducent-persoon van @nl
toolkit definition: Een werk dat met zich meebrengt een verantwoordelijkheid van een persoon voor het merendeel van de zakelijke aspecten van de productie van een film. @nl
label: هو شخص منتج لفيلم لـ @ar
definition: يربط شخصا بعمل يترتب عليه مسئولية وكيل عن معظم الجوانب التجارية لإنتاج فيلم. @ar
toolkit label: شخص منتج الفيلم @ar
toolkit definition: عمل يترتب عليه مسئولية شخص عن معظم الجوانب التجارية لإنتاج فيلم. @ar
label: és persona productora cinematogràfica de @ca
definition: Relaciona una persona amb una obra que implica una responsabilitat d’una persona en la majoria dels aspectes comercials de la producció d’una pel·lícula. @ca
toolkit label: persona productora cinematogràfica de @ca
toolkit definition: Obra que implica una responsabilitat d’una persona en la majoria dels aspectes comercials de la producció d’una pel·lícula. @ca
label: er person, som er filmproducer af @da
definition: Relaterer en person til et værk, som involverer en persons ansvar for størstedelen af de forretningsmæssige aspekter ved en film. @da
toolkit label: person, som er filmproducer af @da
toolkit definition: Værk, som involverer en persons ansvar for størstedelen af de forretningsmæssige aspekter ved en film. @da
label: filmiprodutsent (isik) teoses @et
definition: Seostab isiku teosega, mis sisaldab isiku vastutust enamiku äriliste aspektide eest filmi tootmisel. @et
toolkit label: filmiprodutsent (isik) teoses @et
toolkit definition: Teos, mis sisaldab isiku vastutust enamiku äriliste aspektide eest filmi tootmisel. @et
label: ist Person als Filmproduzentin/Filmproduzent von @de
definition: Setzt eine Person in Beziehung zu einem Werk, bei dem eine Person für die meisten geschäftlichen Aspekte bei der Produktion eines Films verantwortlich ist. @de
toolkit label: Person als Filmproduzentin/Filmproduzent von @de
toolkit definition: Ein Werk, bei dem eine Person für die meisten geschäftlichen Aspekte bei der Produktion eines Films verantwortlich ist. @de
label: filmproducer személye a következőnek: @hu
definition: Hozzákapcsol egy személyt egy műhöz, amelyhez hozzátartozik egy személy felelőssége egy filmprodukció legtöbb üzleti vonatkozásáért. @hu
toolkit label: filmproducer személye: @hu
toolkit definition: Egy mű, amelyhez hozzátartozik egy személy felelőssége egy filmprodukció legtöbb üzleti vonatkozásáért. @hu
label: è produttore cinematografico persona di @it
definition: Correla una persona a un'opera che implica una responsabilità di una persona per la maggior parte degli aspetti commerciali della produzione di un film. @it
toolkit label: produttore cinematografico persona di @it
toolkit definition: Opera che implica una responsabilità di una persona per la maggior parte degli aspetti commerciali della produzione di un film. @it
label: είναι παραγωγός ταινίας φυσικό πρόσωπο του @el
toolkit label: παραγωγός ταινίας φυσικό πρόσωπο του @el
label: est une personne productrice de cinéma de @fr
definition: Met une personne en relation avec une œuvre qui comporte une responsabilité de la part d’une personne en ce qui concerne la majeure partie des aspects commerciaux de la production d’un film. @fr
alternative label: personne productrice de film de @fr
toolkit label: personne productrice de cinéma de @fr
toolkit definition: Œuvre qui comporte une responsabilité de la part d’une personne en ce qui concerne la majeure partie des aspects commerciaux de la production d’un film. @fr
label: ir filmas producents (persona) @lv
definition: Sasaista personu ar darbu, kas ietver personas atbildību par filmas uzņemšanas finansiālajiem aspektiem. @lv
toolkit label: ir filmas producents (persona) @lv
toolkit definition: Darbs, kas ietver personas atbildību par filmas uzņemšanas finansiālajiem aspektiem. @lv
label: 是……的电影制作人个人 @zh-hans
definition: 将一个个人与涉及电影制作的大部分商业运作的一个个人的责任的一种作品关联起来。 @zh-hans
toolkit label: ……的电影制作人个人 @zh-hans
toolkit definition: 涉及电影制作的大部分商业运作的一个个人的责任的一种作品 @zh-hans
label: film yapımcısı kişisidir @tr
definition: Bir kişiyi, bir filmin yapımının ticari yönlerinin çoğundan bir kişinin sorumluluğunu içeren bir eserle ilişkilendirir. @tr
toolkit label: film yapımcısı @tr
toolkit definition: Bir filmin yapımının ticari yönlerinin çoğu için bir kişinin sorumluluğunu içeren bir eser. @tr
has subproperty: P50551

henkilön ammatti tai tehtävä
status: Published
label: has profession or occupation @en
definition: Relates a person to a vocation or avocation. @en
type: Property
domain: C10004
lexical alias: professionOrOccupation.en
instruction number: 9.16
toolkit label: profession or occupation @en
toolkit definition: A vocation or avocation. @en
label: a pour profession ou occupation @fr
definition: Met une personne en relation avec une profession ou un passe-temps. @fr
toolkit label: profession ou occupation @fr
toolkit definition: Profession ou passe-temps. @fr
toolkit label: profesión u ocupación @es
toolkit definition: Vocación o pasatiempo de una persona. @es
label: har yrke eller sysselsättning @sv
toolkit label: yrke eller sysselsättning @sv
label: έχει επάγγελμα ή απασχόληση @el
definition: Συνδέει ένα φυσικό πρόσωπο με το επάγγελμα ή την ενασχόληση ενός φυσικού προσώπου. @el
toolkit label: επάγγελμα ή απασχόληση @el
toolkit definition: Το επάγγελμα ή η ενασχόληση ενός φυσικού προσώπου. @el
definition: Setzt eine Person in Beziehung zu einer Berufung oder Nebenbeschäftigung. @de
toolkit label: Beruf oder Tätigkeit @de
toolkit definition: Eine Berufung oder Nebenbeschäftigung. @de
label: har profession eller beskæftigelse @da
definition: Relaterer en person til et erhverv eller bibeskæftigelse. @da
toolkit label: profession eller beskæftigelse @da
toolkit definition: Erhverv eller bibeskæftigelse. @da
label: té com a professió o ocupació @ca
definition: Relaciona una persona amb una vocació o dedicació. @ca
toolkit label: professió o ocupació @ca
toolkit definition: Vocació o dedicació. @ca
definition: Liittää henkilön henkilön ammattiin tai harrastukseen.
toolkit label: henkilön ammatti tai tehtävä
toolkit definition: Henkilön ammatti tai harrastus.
toolkit label: profesjon eller yrke @no
toolkit definition: En levevei eller et arbeid. @no
label: hat Beruf oder Tätigkeit @de
has element type: 5
label: szakterülete vagy foglalkozása a következő: @hu
definition: Hozzákapcsol egy ágenst egy hivatáshoz vagy kiegészítő tevékenységhez. @hu
toolkit label: szakterülete vagy foglalkozása: @hu
toolkit definition: Egy hivatás vagy kiegészítő tevékenység. @hu
label: har profesjon eller yrke @no
definition: Relaterer en person til en levevei eller et arbeid. @no
label: heeft beroep of bezigheid @nl
definition: Relateert een persoon aan een roeping of nevenwerkzaamheden. @nl
toolkit label: beroep of bezigheid @nl
toolkit definition: Een roeping of nevenwerkzaamheden. @nl
label: له مهنة أو وظيفة @ar
definition: يربط شخصا بصنعة أو بحرفة. @ar
toolkit label: مهنة أو وظيفة @ar
toolkit definition: صنعة أو بحرفة. @ar
label: elukutse või amet @et
definition: Seostab isiku kutseala või kõrvaltegevusega. @et
toolkit label: elukutse või amet @et
toolkit definition: Kutseala või kõrvaltegevus. @et
label: ha come professione o occupazione @it
definition: Correla una persona a una professione o occupazione @it
toolkit label: professione o occupazione @it
toolkit definition: Professione o occupazione. @it
label: profesija vai nodarbošanās @lv
definition: Sasaista personu ar personas profesiju vai nodarbošanos. @lv
toolkit label: profesija vai nodarbošanās @lv
toolkit definition: Personas profesija vai nodarbošanās. @lv
label: 有职业和工作 @zh-hans
definition: 将一个个人与一个职业或爱好关联起来。 @zh-hans
toolkit label: 职业或工作 @zh-hans
toolkit definition: 职业或爱好 @zh-hans
label: iş veya meslek ile ilişkilidir @tr
definition: Bir kişiyi, kişinin mesleği ya da hobisiyle ilişkilendirir. @tr
toolkit label: uzmanlığı veya mesleği @tr
toolkit definition: Bir meslek veya uğraşı. @tr
has subproperty: P50104

maanmittaus
status: Deprecated
label: is surveyor of (Deprecated) @en
definition: Relates an agent to an expression that includes a contribution of providing measurements or dimensional relationships for a geographic area that is represented in a cartographic work. (Deprecated) @en
type: Property
domain: C10002
sub property of: is contributor to aggregated content of (Deprecated)
lexical alias: surveyorOf.en
label: est un arpenteur de @fr
definition: Met un agent qui contribue à une expression d’une œuvre cartographique en fournissant les mesures ou les relations dimensionnelles pour l’aire géographique représentée en relation avec une expression. @fr
toolkit label: arpenteur de @fr
toolkit definition: Expression d’une œuvre cartographique qui intègre une contribution consistant à fournir des mesures ou des relations dimensionnelles pour une aire géographique représentée. @fr
toolkit label: surveyor of (Deprecated) @en
toolkit definition: An expression that includes a contribution of providing measurements or dimensional relationships for a geographic area that is represented in a cartographic work. (Deprecated) @en
instruction number: 18.5
label: είναι τοπογράφος μηχανικός του @el
definition: Συνδέει έναν φορέα, ο οποίος συνεισφέρει σε μια έκφραση ενός χαρτογραφικού έργου παρέχοντας μετρήσεις ή σχέσεις διαστάσεων για τη γεωγραφική περιοχή που παρουσιάζεται, με μια έκφραση. @el
toolkit label: τοπογράφος μηχανικός του @el
toolkit definition: Μια έκφραση ενός χαρτογραφικού έργου που ενσωματώνει τη συνεισφορά της παροχής μετρήσεων ή σχέσεων διαστάσεων για τη γεωγραφική περιοχή που παρουσιάζεται με μια έκφραση. @el
definition: Setzt einen Akteur, der an der Expression eines kartografischen Werks mitwirkt, indem er Messwerte oder Abmessungsverhältnisse für den dargestellten geografischen Bereich zur Verfügung stellt, mit einer Expression in Beziehung. @de
toolkit label: Landvermesser von @de
toolkit definition: Eine Expression eines kartografischen Werks, bei der ein Akteur Messwerte oder Abmessungsverhältnisse für den dargestellten geografischen Bereich zur Verfügung stellt. @de
label: er landmåler i @da
definition: Relaterer en agent, der har bidraget til et udtryk af et kartografisk værk ved at sørge for opmålinger eller målestoksforhold til et repræsenteret geografisk område til et udtryk. @da
toolkit label: landmåler i @da
toolkit definition: Udtryk af et kartografisk værk, der inkorporerer et bidrag der sørger for opmålinger eller målestoksforhold til et repræsenteret geografisk område. @da
label: és agrimensor de @ca
definition: Relaciona un agent, que contribueix a una expressió d’una obra cartogràfica proporcionant mesuraments o relacions dimensionals d’una àrea geogràfica representada, amb una expressió. @ca
toolkit label: agrimensor de @ca
toolkit definition: Expressió d’una obra cartogràfica que incorpora una contribució que proporciona mesuraments o relacions dimensionals d’una àrea geogràfica representada. @ca
definition: Liittää toimijan kartografisen teoksen ekspressioon, johon sisältyy maantieteellisen alueen mittojen tai mittasuhteiden kuvaaminen.
toolkit label: maanmittaus
toolkit definition: Kartografisen teoksen ekspressio, johon sisältyy maantieteellisen alueen mittojen tai mittasuhteiden kuvaaminen.
toolkit label: landmåler for @no
toolkit definition: Et uttrykk av et kartografisk verk som omfatter et bidrag i form av å tilføre målinger eller størrelsesforhold for et geografisk område som gjengis. @no
label: ist Landvermesser von @de
has element type: 2
label: földmérője @hu
definition: Egy ágenst (személyt, családot vagy testületet), aki/amely egy kartográfiai mű kifejezési formájához hozzájárul azzal, hogy megadja egy ábrázolt földrajzi terület méreteit vagy dimenzionális kapcsolatait, hozzákapcsolja egy kifejezési formához. @hu
toolkit label: földmérője @hu
toolkit definition: Egy kartográfiai mű, amely hozzájárulást jelent azzal, hogy mérési értékeket vagy dimenzionális kapcsolatokat közöl a megjelenített földrajzi területre vonatkozóan. @hu
has subproperty: P50135

entinen omistaja (toimija) kappaleessa
status: Published
label: is former owner agent of @en
definition: Relates an agent to an item that involves a responsibility of an agent for former legal possession. @en
type: Property
domain: C10002
sub property of: omistaja (toimija) kappaleessa
lexical alias: formerOwnerAgentOf.en
label: est un ancien agent propriétaire de @fr
definition: Met un agent en relation avec un item qui comporte une responsabilité de la part d’un agent en ce qui concerne la propriété légale antérieure. @fr
toolkit label: ancien agent propriétaire de @fr
toolkit definition: Item qui comporte une responsabilité de la part d’un agent en ce qui concerne la propriété légale antérieure. @fr
toolkit label: former owner agent of @en
toolkit definition: An item that involves a responsibility of an agent for former legal possession. @en
instruction number: 18.5
label: είναι προηγούμενος κάτοχος φορέας του @el
definition: Συνδέει έναν φορέα, ο οποίος είχε προηγούμενα τη νόμιμη κατοχή ενός αντιτύπου, με ένα αντίτυπο. @el
toolkit label: προηγούμενος ιδιοκτήτης φορέας του @el
toolkit definition: Ένα αντίτυπο το οποίο προηγούμενα βρισκόταν υπό τη νόμιμη κατοχή ενός φορέα. @el
definition: Setzt einen Akteur in Beziehung zu einem Exemplar, das früher im rechtmäßigen Besitz eines Akteurs war. @de
toolkit label: Akteur als frühere Eigentümerin/früherer Eigentümer von @de
toolkit definition: Ein Exemplar, das früher im rechtmäßigen Besitz eines Akteurs war. @de
label: er agent, som er tidligere ejer af @da
definition: Relaterer en agent til et eksemplar, som involverer en agents ansvar for tidligere at have haft lovlig besiddelse. @da
toolkit label: agent, som er tidligere ejer af @da
toolkit definition: Eksemplar, som involverer en agents ansvar for tidligere at have haft lovlig besiddelse. @da
label: és agent propietari anterior de @ca
definition: Relaciona un agent amb un ítem que implica una responsabilitat d’un agent en la possessió legal anterior. @ca
toolkit label: agent propietari anterior de @ca
toolkit definition: Ítem que implica una responsabilitat d’un agent en la possessió legal anterior. @ca
definition: Liittää toimijan kappaleeseen, jonka toimija on aiemmin laillisesti omistanut.
toolkit label: entinen omistaja (toimija) kappaleessa
toolkit definition: Kappale, jonka toimija on aiemmin laillisesti omistanut.
toolkit label: tidligere eier av (agent) @no
toolkit definition: Et eksemplar som involverer ansvar for en agen i form av å være en tidligere rettmessig eier. @no
label: Ist Akteur als frühere Eigentümerin/früherer Eigentümer von @de
has element type: 2
label: korábbi tulajdonos ágense a következőnek: @hu
definition: Hozzákapcsol egy ágenst egy példányhoz, amelyhez hozzátartozik egy ágens korábbi tulajdonjog iránti felelőssége. @hu
toolkit label: korábbi tulajdonosa: @hu
toolkit definition: Egy példány, amelyhez hozzátartozik egy ágens korábbi tulajdonjog iránti felelőssége. @hu
alternative label: former owner of @en
alternative label: aiempana omistajana kappaleelle
label: er tidligere eier av (agent) @no
definition: Relaterer en agent til et eksemplar som involverer ansvar for en agen i form av å være en tidligere rettmessig eier. @no
alternative label: tidligere eier av @no
label: is voormalige eigenaar-actor van @nl
definition: Relateert een actor aan een item dat met zich meebrengt een verantwoordelijkheid van een actor betreffende voormalig wettelijk bezit. @nl
toolkit label: voormalige eigenaar-actor van @nl
toolkit definition: Een item dat met zich meebrengt een verantwoordelijkheid van een actor betreffende voormalig wettelijk bezit. @nl
label: هو وكيل مالك سابقا @ar
definition: يربط وكيلا بمفردة تنطوي على مسئولية وكيل عن الملكية القانونية السابقة. @ar
alternative label: مالك سابقا @ar
toolkit label: وكيل مالك سابقا @ar
toolkit definition: مفردة تنطوي على مسئولية وكيل عن الملكية القانونية السابقة. @ar
alternative label: propietari anterior de @ca
alternative label: tidligere ejer af @da
label: endine omanik (tegija) eksemplarile @et
definition: Seostab tegija eksemplariga, mis kuulus varem õiguspäraselt tegijale. @et
alternative label: endine omanik eksemplarile @et
toolkit label: endine omanik (tegija) eksemplarile @et
toolkit definition: Eksemplar, mis kuulus varem õiguspäraselt tegijale. @et
alternative label: korábbi tulajdonosa: @hu
label: è precedente proprietario agente di @it
definition: Correla un agente con itemche implica la responsabilità di un agente nel possesso legale precedente. @it
alternative label: proprietario precedente di @it
toolkit label: proprietario precedente agente di @it
toolkit definition: Item che implica la responsabilità di un agente del possesso legale precedente. @it
alternative label: προηγούμενος ιδιοκτήτης του @el
alternative label: ancien propriétaire de @fr
label: ir agrākais īpašnieks (aģents) @lv
definition: Sasaista aģentu ar vienību, kas ietver aģenta atbildību par bijušo likumīgo īpašumu. @lv
toolkit label: ir agrākais īpašnieks (aģents) @lv
toolkit definition: Vienība, kas ietver aģenta atbildību par bijušo likumīgo īpašumu. @lv
alternative label: Früherer Eigentümer von @de
alternative label: ……的先前拥有者 @zh-hans
toolkit label: ……的先前拥有者行为者 @zh-hans
toolkit definition: 涉及一个先前法定所有权的一个行为者的责任的一个单件 @zh-hans
toolkit label: önceki sahibi olan temsilci @tr
toolkit definition: Eski yasal mülkiyet için bir temsilcinin sorumluluğunu içeren bir kopya. @tr
has subproperty: lahjoittaja (toimija) kappaleelle

aiempi omistaja (yhteistoimija) kappaleessa
status: Published
label: is former owner collective agent of @en
lexical alias: formerOwnerCollectiveAgentOf.en
definition: Relates a collective agent to an item that involves a responsibility of a collective agent for former legal possession. @en
toolkit label: former owner collective agent of @en
toolkit definition: An item that involves a responsibility of a collective agent for former legal possession. @en
type: Property
domain: C10011
has element type: 2
sub property of: omistaja (yhteistoimija) kappaleessa
sub property of: entinen omistaja (toimija) kappaleessa
definition: Liittää yhteistoimijan kappaleeseen, jonka yhteistoimija on aiemmin laillisesti omistanut.
toolkit label: aiempi omistaja (yhteistoimija) kappaleessa
toolkit definition: Kappale, jonka yhteistoimija on aiemmin laillisesti omistanut.
label: er tidligere eier av (kollektiv agent) @no
definition: Relaterer en kollektiv agent til et eksemplar som involverer et ansvar for en kollektiv agent i form av å være en tidligere rettmessig eier. @no
toolkit label: tidligere eier av (kollektiv agent) @no
toolkit definition: Et eksemplar som involverer et ansvar for en kollektiv agent i form av å være en tidligere rettmessig eier. @no
label: is voormalige eigenaar-collectieve actor van @nl
definition: Relateert een collectieve actor aan een item dat met zich meebrengt een verantwoordelijkheid van een collectieve actor betreffende voormalig wettelijk bezit. @nl
toolkit label: voormalige eigenaar-collectieve actor van @nl
toolkit definition: Een item dat met zich meebrengt een verantwoordelijkheid van een collectieve actor betreffende voormalig wettelijk bezit. @nl
label: هو وكيل جماعي مالك سابقا لـ @ar
definition: يربط وكيلا جماعيا بمفردة تنطوي على مسئولية وكيل جماعي عن الحيازة القانونية السابقة @ar
toolkit label: وكيل جماعي مالك سابقا @ar
toolkit definition: مفردة تنطوي على مسئولية وكيل جماعي عن الحيازة القانونية السابقة. @ar
label: és agent col·lectiu propietari anterior de @ca
definition: Relaciona un agent col·lectiu amb un ítem que implica una responsabilitat d’un agent col·lectiu en la possessió legal anterior. @ca
toolkit label: agent col·lectiu propietari anterior de @ca
toolkit definition: Ítem que implica una responsabilitat d’un agent col·lectiu en la possessió legal anterior. @ca
label: er kollektiv agent, som er tidligere ejer af @da
definition: Relaterer en kollektiv agent til et eksemplar, som involverer en kollektiv agents ansvar for tidligere at have haft lovlig besiddelse. @da
toolkit label: kollektiv agent, som er tidligere ejer af @da
toolkit definition: Eksemplar, som involverer en kollektiv agents ansvar for tidligere at have haft lovlig besiddelse. @da
label: endine omanik (kollektiiv) eksemplarile @et
definition: Seostab kollektiivi eksemplariga, mis kuulus varem õiguspäraselt kollektiivile. @et
toolkit label: endine omanik (kollektiiv) eksemplarile @et
toolkit definition: Eksemplar, mis kuulus varem õiguspäraselt kollektiivile. @et
label: ist gemeinschaftlicher Akteur als frühere Eigentümerin/früherer Eigentümer von @de
definition: Setzt einen gemeinschaftlichen Akteur in Beziehung zu einem Exemplar, das früher im rechtmäßigen Besitz eines gemeinschaftlichen Akteurs war. @de
toolkit label: Gemeinschaftlicher Akteur als frühere Eigentümerin/früherer Eigentümer von @de
toolkit definition: Ein Exemplar, das früher im rechtmäßigen Besitz eines gemeinschaftlichen Akteurs war. @de
label: korábbi tulajdonos kollektív ágense a következőnek: @hu
definition: Hozzákapcsol egy kollektív ágenst egy példányhoz, amelyhez hozzátartozik egy kollektív ágens korábbi tulajdonjog iránti felelőssége. @hu
toolkit label: korábbi tulajdonos kollektív ágense: @hu
toolkit definition: Egy példány, amelyhez hozzátartozik egy kollektív ágens korábbi tulajdonjog iránti felelőssége. @hu
label: è proprietario precedente agente collettivo di @it
definition: Correla un agente collettivo a un item che implica la responsabilità di un agente collettivo per il possesso legale precedente. @it
toolkit label: proprietario precedente agente collettivo di @it
toolkit definition: Item che implica una responsabilità di un agente collettivo per il possesso legale precedente. @it
label: είναι προηγούμενος κάτοχος συλλογικός φορέας του @el
toolkit label: προηγούμενος κάτοχος συλλογικός φορέας του @el
label: est un ancien agent collectif propriétaire de @fr
definition: Met un agent collectif en relation avec un item qui comporte une responsabilité de la part d’un agent collectif en ce qui concerne la propriété légale antérieure. @fr
toolkit label: ancien agent collectif propriétaire de @fr
toolkit definition: Item qui comporte une responsabilité de la part d’un agent collectif en ce qui concerne la propriété légale antérieure. @fr
label: ir agrākais īpašnieks (grupa) @lv
definition: Sasaista grupu ar vienību, kas ietver grupas atbildību par bijušo likumīgo īpašumu. @lv
toolkit label: ir agrākais īpašnieks (grupa) @lv
toolkit definition: Vienība, kas ietver grupas atbildību par bijušo likumīgo īpašumu. @lv
label: 是……的先前拥有者集体行为者 @zh-hans
definition: 将一个集体行为者与涉及一个先前法定所有权的一个集体行为者的责任的一个单件关联起来。 @zh-hans
toolkit label: ……的先前拥有者集体行为者 @zh-hans
toolkit definition: 涉及一个先前法定所有权的一个集体行为者的责任的一个单件 @zh-hans
label: eski sahip kolektif temsilcisidir @tr
definition: Kollektif bir temsilciyi, eski yasal mülkiyeti için bir kollektif temsilcinin sorumluluğunu içeren bir kopya ile ilgilidir. @tr
toolkit label: önceki sahibi olan kolektif temsilci @tr
toolkit definition: Eski yasal mülkiyet için kolektif bir temsilcinin sorumluluğunu içeren bir kopya. @tr
has subproperty: lahjoittaja (yhteistoimija) kappaleelle
has subproperty: aiempi omistaja (yhteisö) kappaleessa
has subproperty: aiempi omistaja (suku) kappaleessa
has subproperty: myyjä (yhteistoimija) kappaleelle
has subproperty: P50783

aiempi omistaja (yhteisö) kappaleessa
status: Published
label: is former owner corporate body of @en
lexical alias: formerOwnerCorporateBodyOf.en
definition: Relates a corporate body to an item that involves a responsibility of a corporate body for former legal possession. @en
toolkit label: former owner corporate body of @en
toolkit definition: An item that involves a responsibility of a corporate body for former legal possession. @en
type: Property
domain: C10005
has element type: 2
sub property of: omistaja (yhteisö) kappaleessa
sub property of: aiempi omistaja (yhteistoimija) kappaleessa
definition: Liittää yhteisön kappaleeseen, jonka yhteisö on aiemmin laillisesti omistanut.
toolkit label: aiempi omistaja (yhteisö) kappaleessa
toolkit definition: Kappale, jonka yhteisö on aiemmin laillisesti omistanut.
label: er tidligere eier av (korporasjon) @no
definition: Relaterer en korporasjon til et eksemplar som involverer et ansvar for en korporasjon i form av å være en tidligere rettmessig eier. @no
toolkit label: tidligere eier av (korporasjon) @no
toolkit definition: Et eksemplar som involverer et ansvar for en korporasjon i form av å være en tidligere rettmessig eier. @no
label: is voormalige eigenaar-corporatie van @nl
definition: Relateert een corporatie aan een item dat met zich meebrengt een verantwoordelijkheid van een corporatie betreffende voormalig wettelijk bezit. @nl
toolkit label: voormalige eigenaar-corporatie van @nl
toolkit definition: Een item dat met zich meebrengt een verantwoordelijkheid van een corporatie betreffende voormalig wettelijk bezit. @nl
label: هي هيئة مالكة سابقا لـ @ar
definition: يربط هيئة بمفردة تنطوي على مسئولية هيئة عن الحيازة القانونية السابقة. @ar
toolkit label: هيئة مالكة سابقا لـ @ar
toolkit definition: مفردة تنطوي على مسئولية هيئة عن الحيازة القانونية السابقة. @ar
label: és entitat corporativa propietària anterior de @ca
definition: Relaciona una entitat corporativa amb un ítem que implica una responsabilitat d’una entitat corporativa en la possessió legal anterior. @ca
toolkit label: entitat corporativa propietària anterior de @ca
toolkit definition: Ítem que implica una responsabilitat d’una entitat corporativa en la possessió legal anterior. @ca
label: er korporation, som er tidligere ejer af @da
definition: Relaterer en korporation til et eksemplar, som involverer en korporations ansvar for tidligere at have haft lovlig besiddelse. @da
toolkit label: korporation, som er tidligere ejer af @da
toolkit definition: Eksemplar, som involverer en korporations ansvar for tidligere at have haft lovlig besiddelse. @da
label: endine omanik (asutus) eksemplarile @et
definition: Seostab asutuse eksemplariga, mis kuulus varem õiguspäraselt asutusele. @et
toolkit label: endine omanik (asutus) eksemplarile @et
toolkit definition: Eksemplar, mis kuulus varem õiguspäraselt asutusele. @et
label: ist Körperschaft als frühere Eigentümerin/früherer Eigentümer von @de
definition: Setzt eine Körperschaft in Beziehung zu einem Exemplar, das früher im rechtmäßigen Besitz einer Körperschaft war. @de
toolkit label: Körperschaft als frühere Eigentümerin/früherer Eigentümer von @de
toolkit definition: Ein Exemplar, das früher im rechtmäßigen Besitz einer Körperschaft war. @de
label: korábbi tulajdonos testülete a következőnek: @hu
definition: Hozzákapcsol egy testületet egy példányhoz, amelyhez hozzátartozik egy testület korábbi tulajdonjog iránti felelőssége. @hu
toolkit label: korábbi tulajdonos testülete: @hu
toolkit definition: Egy példány, amelyhez hozzátartozik egy testület korábbi tulajdonjog iránti felelőssége. @hu
label: è proprietario precedente ente di @it
definition: Correla un ente a un item che implica la responsabilità di un ente per il possesso legale precedente. @it
toolkit label: proprietario precedente ente di @it
toolkit definition: Item che implica la responsabilità di un ente per il possesso legale precedente. @it
label: είναι προηγούμενος κάτοχος συλλογικό όργανο του @el
toolkit label: προηγούμενος κάτοχος συλλογικό όργανο του @el
label: est une ancienne collectivité propriétaire de @fr
definition: Met une collectivité en relation avec un item qui comporte une responsabilité de la part d’une collectivité en ce qui concerne la propriété légale antérieure. @fr
toolkit label: ancienne collectivité propriétaire de @fr
toolkit definition: Item qui comporte une responsabilité de la part d’une collectivité en ce qui concerne la propriété légale antérieure. @fr
label: ir agrākais īpašnieks (institūcija) @lv
definition: Sasaista institūciju ar vienību, kas ietver institūcijas atbildību par bijušo likumīgo īpašumu. @lv
toolkit label: ir agrākais īpašnieks (institūcija) @lv
toolkit definition: Vienība, kas ietver institūcijas atbildību par bijušo likumīgo īpašumu. @lv
label: 是……的先前拥有者团体 @zh-hans
definition: 将一个团体与涉及一个先前法定所有权的一个团体的责任的一个单件关联起来。 @zh-hans
toolkit label: ……的先前拥有者团体 @zh-hans
toolkit definition: 涉及一个先前法定所有权的一个团体的责任的一个单件 @zh-hans
label: eski sahip tüzel kişisidir @tr
definition: Bir tüzel kişiyi, bir tüzel kişiliğin eski yasal mülkiyetine ilişkin sorumluluğunu içeren bir kopyayla ilişkilendirir. @tr
toolkit label: önceki sahibi olan tüzel kişi @tr
toolkit definition: Eski yasal mülkiyet için tüzel bir kişinin sorumluluğunu içeren bir kopya. @tr
has subproperty: lahjoittaja (yhteisö) kappaleelle
has subproperty: myyjä (yhteisö) kappaleelle
has subproperty: P50934

aiempi omistaja (suku) kappaleessa
status: Published
label: is former owner family of @en
lexical alias: formerOwnerFamilyOf.en
definition: Relates a family to an item that involves a responsibility of a family for former legal possession. @en
toolkit label: former owner family of @en
toolkit definition: An item that involves a responsibility of a family for former legal possession. @en
type: Property
domain: C10008
has element type: 2
sub property of: omistaja (suku) kappaleessa
sub property of: aiempi omistaja (yhteistoimija) kappaleessa
definition: Liittää suvun kappaleeseen, jonka suku on aiemmin laillisesti omistanut.
toolkit label: aiempi omistaja (suku) kappaleessa
toolkit definition: Kappale, jonka suku on aiemmin laillisesti omistanut.
label: er tidligere eier av (familie) @no
definition: Relaterer en familie til et eksemplar som involverer et ansvar for en familie i form av å være en tidligere rettmessig eier. @no
toolkit label: tidligere eier av (familie) @no
toolkit definition: Et eksemplar som involverer et ansvar for en familie i form av å være en tidligere rettmessig eier. @no
label: is voormalige eigenaar-familie van @nl
definition: Relateert een familie aan een item dat met zich meebrengt een verantwoordelijkheid van een familie betreffende voormalig wettelijk bezit. @nl
toolkit label: voormalige eigenaar-familie van @nl
toolkit definition: Een item dat met zich meebrengt een verantwoordelijkheid van een familie betreffende voormalig wettelijk bezit. @nl
label: هي عائلة مالكة سابقا ل @ar
definition: يربط عائلة بمفردة تنطوي على مسئولية عائلة عن الحيازة القانونية السابقة. @ar
toolkit label: عائلة مالكة سابقا @ar
toolkit definition: مفردة تنطوي على مسئولية عائلة عن الحيازة القانونية السابقة. @ar
label: és família propietària anterior de @ca
definition: Relaciona una família amb un ítem que implica una responsabilitat d’una família en la possessió legal anterior. @ca
toolkit label: família propietària anterior de @ca
toolkit definition: Ítem que implica una responsabilitat d’una família en la possessió legal anterior. @ca
label: er familie, som er tidligere ejer af @da
definition: Relaterer en familie til et eksemplar, som involverer en families ansvar for tidligere at have haft lovlig besiddelse. @da
toolkit label: familie, som er tidligere ejer af @da
toolkit definition: Eksemplar, som involverer en families ansvar for tidligere at have haft lovlig besiddelse. @da
label: endine omanik (perekond) eksemplarile @et
definition: Seostab perekonna eksemplariga, mis kuulus varem õiguspäraselt perekonnale. @et
toolkit label: endine omanik (perekond) eksemplarile @et
toolkit definition: Eksemplar, mis kuulus varem õiguspäraselt perekonnale. @et
label: ist Familie als frühere Eigentümerin/früherer Eigentümer von @de
definition: Setzt eine Familie in Beziehung zu einem Exemplar, das früher im rechtmäßigen Besitz einer Familie war. @de
toolkit label: Familie als frühere Eigentümerin/früherer Eigentümer von @de
toolkit definition: Ein Exemplar, das früher im rechtmäßigen Besitz einer Familie war. @de
label: korábbi tulajdonos családja a következőnek: @hu
definition: Hozzákapcsol egy családot egy példányhoz, amelyhez hozzátartozik egy család korábbi tulajdonjog iránti felelőssége. @hu
toolkit label: korábbi tulajdonos családja: @hu
toolkit definition: Egy példány, amelyhez hozzátartozik egy család korábbi tulajdonjog iránti felelőssége. @hu
label: è proprietario precedente famiglia di @it
definition: Correla una famiglia a un item che implica una responsabilità di una famiglia per il possesso legale precedente. @it
toolkit label: proprietario precedente famiglia di @it
toolkit definition: Item che implica una responsabilità di una famiglia per il possesso legale precedente. @it
label: είναι προηγούμενος κάτοχος οικογένεια του @el
definition: Συνδέει μια οικογένεια με ένα αντίτυπο που περιλαμβάνει την ευθύνη μιας οικογένειας για προηγούμενη νομική κατοχή. @el
toolkit label: προηγούμενος κάτοχος οικογένεια του @el
label: est une ancienne famille propriétaire de @fr
definition: Met une famille en relation avec un item qui comporte une responsabilité de la part d’une famille en ce qui concerne la propriété légale antérieure. @fr
toolkit label: ancienne famille propriétaire de @fr
toolkit definition: Item qui comporte une responsabilité de la part d’une famille en ce qui concerne la propriété légale antérieure. @fr
label: ir agrākais īpašnieks (dzimta/ģimene) @lv
definition: Sasaista dzimtu/ģimeni ar vienību, kas ietver dzimtas/ģimenes atbildību par bijušo likumīgo īpašumu. @lv
toolkit label: ir agrākais īpašnieks (dzimta/ģimene) @lv
toolkit definition: Vienība, kas ietver dzimtas/ģimenes atbildību par bijušo likumīgo īpašumu. @lv
label: 是……的先前拥有者家族 @zh-hans
definition: 将一个家族与涉及一个先前法定所有权的一个家族的责任的一个单件关联起来。 @zh-hans
toolkit label: ……的先前拥有者家族 @zh-hans
toolkit definition: 涉及一个先前法定所有权的一个家族的责任的一个单件 @zh-hans
label: eski sahip ailesidir @tr
definition: Bir aileyi, bir ailenin eski yasal mülkiyet sorumluluğunu içeren bir kopyayla ilişkilendirir. @tr
toolkit label: önceki sahibi olan aile @tr
toolkit definition: Eski yasal mülkiyet için bir ailenin sorumluluğunu içeren bir kopya. @tr
has subproperty: lahjoittaja (suku) kappaleelle
has subproperty: myyjä (suku) kappaleelle
has subproperty: P51085

aiempi omistaja (henkilö) kappaleessa
status: Published
label: is former owner person of @en
lexical alias: formerOwnerPersonOf.en
definition: Relates a person to an item that involves a responsibility of a person for former legal possession. @en
toolkit label: former owner person of @en
toolkit definition: An item that involves a responsibility of a person for former legal possession. @en
type: Property
domain: C10004
has element type: 2
sub property of: omistaja (henkilö) kappaleessa
sub property of: entinen omistaja (toimija) kappaleessa
definition: Liittää henkilön kappaleeseen, jonka henkilö on aiemmin laillisesti omistanut.
toolkit label: aiempi omistaja (henkilö) kappaleessa
toolkit definition: Kappale, jonka henkilö on aiemmin laillisesti omistanut.
label: er tidligere eier av (person) @no
definition: Relaterer en person til et eksemplar som involverer et ansvar for en person i form av å være en tidligere rettmessig eier. @no
toolkit label: tidligere eier av (person) @no
toolkit definition: Et eksemplar som involverer et ansvar for en person i form av å være en tidligere rettmessig eier. @no
label: is voormalige eigenaar-persoon van @nl
definition: Relateert een persoon aan een item dat met zich meebrengt een verantwoordelijkheid van een persoon betreffende voormalig wettelijk bezit. @nl
toolkit label: voormalige eigenaar-persoon van @nl
toolkit definition: Een item dat met zich meebrengt een verantwoordelijkheid van een persoon betreffende voormalig wettelijk bezit. @nl
label: هو شخص مالك سابقا لـ @ar
definition: يربط شخصا بمفردة تنطوي على مسئولية شخص عن الملكية القانونية السابقة. @ar
toolkit label: شخص مالك سابقا @ar
toolkit definition: مفردة تنطوي على مسئولية شخص عن الملكية القانونية السابقة. @ar
label: és persona propietària anterior de @ca
definition: Relaciona una persona amb un ítem que implica una responsabilitat d’una persona en la possessió legal anterior. @ca
toolkit label: persona propietària anterior de @ca
toolkit definition: Ítem que implica una responsabilitat d’una persona en la possessió legal anterior. @ca
label: er person, som er tidligere ejer af @da
definition: Relaterer en person til et eksemplar, som involverer en persons ansvar for tidligere at have haft lovlig besiddelse. @da
toolkit label: person, som er tidligere ejer af @da
toolkit definition: Eksemplar, som involverer en persons ansvar for tidligere at have haft lovlig besiddelse. @da
label: endine omanik (isik) eksemplarile @et
definition: Seostab isiku eksemplariga, mis kuulus varem õiguspäraselt isikule. @et
toolkit label: endine omanik (isik) eksemplarile @et
toolkit definition: Eksemplar, mis kuulus varem õiguspäraselt isikule. @et
label: ist Person als frühere Eigentümerin/früherer Eigentümer von @de
definition: Setzt eine Person in Beziehung zu einem Exemplar, das früher im rechtmäßigen Besitz einer Person war. @de
toolkit label: Person als frühere Eigentümerin/früherer Eigentümer von @de
toolkit definition: Ein Exemplar, das früher im rechtmäßigen Besitz einer Person war. @de
label: korábbi tulajdonos személye a következőnek: @hu
definition: Hozzákapcsol egy személyt egy példányhoz, amelyhez hozzátartozik egy személy korábbi tulajdonjog iránti felelőssége. @hu
toolkit label: korábbi tulajdonos személye: @hu
toolkit definition: Egy példány, amelyhez hozzátartozik egy személy korábbi tulajdonjog iránti felelőssége. @hu
label: è proprietario precedente persona di @it
definition: Correla una persona a un item che implica una responsabilità di una persona nel possesso legale precedente. @it
toolkit label: proprietario precedente persona di @it
toolkit definition: Item che implica una responsabilità di una persona nel possesso legale precedente. @it
label: είναι προηγούμενος κάτοχος φυσικό πρόσωπο του @el
toolkit label: προηγούμενος κάτοχος φυσικό πρόσωπο του @el
label: est une ancienne personne propriétaire de @fr
definition: Met une personne en relation avec un item qui comporte une responsabilité de la part d’une personne en ce qui concerne la propriété légale antérieure. @fr
toolkit label: ancienne personne propriétaire de @fr
toolkit definition: Item qui comporte une responsabilité de la part d’une personne en ce qui concerne la propriété légale antérieure. @fr
label: ir agrākais īpašnieks (persona) @lv
definition: Sasaista personu ar vienību, kas ietver personas atbildību par bijušo likumīgo īpašumu. @lv
toolkit label: ir agrākais īpašnieks (persona) @lv
toolkit definition: Vienība, kas ietver personas atbildību par bijušo likumīgo īpašumu. @lv
label: 是……的先前拥有者个人 @zh-hans
definition: 将一个个人与涉及先前法定所有权的一个个人的责任的一个单件关联起来。 @zh-hans
toolkit label: ……的先前拥有者个人 @zh-hans
toolkit definition: 涉及先前法定所有权的一个个人的责任的一个单件 @zh-hans
label: eski sahip kişisidir @tr
definition: Bir kişiyi, kişinin eski yasal mülkiyeti için sorumluluğunu içeren bir kopyayla ilişkilendirir. @tr
toolkit label: önceki sahibi olan kişi @tr
toolkit definition: Eski yasal mülkiyet için bir kişinin sorumluluğunu içeren bir kopya. @tr
has subproperty: lahjoittaja (henkilö) kappaleelle
has subproperty: myyjä (henkilö) kappaleelle
has subproperty: P50632

toimijan perustama yhteisö
status: Published
label: has founded corporate body of agent @en
lexical alias: foundedCorporateBodyOfAgent.en
definition: Relates an agent to a corporate body who is initiated by an agent. @en
toolkit label: founded corporate body of agent @en
toolkit definition: A corporate body who is initiated by an agent. @en
type: Property
domain: C10002
sub property of: toimijaan liittyvä yhteisö
has element type: 2
definition: Liittää toimijan yhteisöön, jonka toimija on perustanut.
toolkit label: toimijan perustama yhteisö
toolkit definition: Yhteisö, joka on toimijan perustama.
label: har korporasjon etablert av agent @no
definition: Relaterer en agent til en korporasjon som er opprettet av en agent. @no
toolkit label: korporasjon etablert av agent @no
toolkit definition: En korporasjon som er opprettet av en agent. @no
label: heeft opgerichte corporatie van actor @nl
definition: Relateert een actor aan een corporatie die is gesticht door een actor. @nl
toolkit label: opgerichte corporatie van actor @nl
toolkit definition: Een corporatie die is gesticht door een actor. @nl
label: أسست هيئة لوكيل @ar
definition: يربط وكيلا بهيئة التي دشنها وكيل. @ar
toolkit label: هيئة مؤسسة لوكيل @ar
toolkit definition: هيئة دشنها وكيل. @ar
label: té com a entitat corporativa fundada per un agent @ca
definition: Relaciona un agent amb una entitat corporativa que és iniciada per un agent. @ca
toolkit label: entitat corporativa fundada per un agent @ca
toolkit definition: Entitat corporativa que és iniciada per un agent. @ca
label: har korporation grundlagt af agent @da
definition: Relaterer en agent til en korporation, som er igangsat af en agent. @da
toolkit label: korporation grundlagt af agent @da
toolkit definition: Korporation, som er igangsat af en agent. @da
label: tegija asutatud asutus @et
definition: Seostab tegija asutusega, millele tegija on aluse pannud. @et
toolkit label: tegija asutatud asutus @et
toolkit definition: Asutus, millele tegija on aluse pannud. @et
label: hat von einem Akteur gegründete Körperschaft @de
definition: Setzt einen Akteur in Beziehung zu einer Körperschaft, die von einem Akteur gegründet wurde. @de
toolkit label: von einem Akteur gegründete Körperschaft @de
toolkit definition: Eine Körperschaft, die von einem Akteur gegründet wurde. @de
label: ágens által alapított testület a következő: @hu
definition: Hozzákapcsol egy ágenst egy testülethez, amelynek létrehozását egy ágens kezdeményezte. @hu
toolkit label: ágens által alapított testület: @hu
toolkit definition: Egy testület, amelynek létrehozását egy ágens kezdeményezte. @hu
label: ha come ente fondato di agente @it
definition: Correla un agente a un ente istituito da un agente. @it
toolkit label: ente fondato di agente @it
toolkit definition: Ente istituito da un agente. @it
label: έχει ιδρυμένο συλλογικό όργανο του φορέα @el
definition: Συνδέει έναν φορέα με ένα συλλογικό όργανο που ιδρύθηκε από έναν φορέα. @el
toolkit label: ιδρυμένο συλλογικό όργανο του φορέα @el
label: a pour collectivité fondée d’un agent @fr
definition: Met un agent en relation avec une collectivité qui est établie par un agent. @fr
toolkit label: collectivité fondée d’un agent @fr
toolkit definition: Collectivité qui est établie par un agent. @fr
label: aģenta dibinātā institūcija @lv
definition: Sasaista aģentu ar institūciju, ko ir dibinājis aģents. @lv
toolkit label: aģenta dibinātā institūcija @lv
toolkit definition: Institūcija, ko ir dibinājis aģents. @lv
label: 有行为者的被创办团体 @zh-hans
definition: 将一个行为者与被一个行为者发起的一个团体关联起来。 @zh-hans
toolkit label: 行为者的被创办团体 @zh-hans
toolkit definition: 被一个行为者发起的一个团体 @zh-hans
label: temsilcinin kurduğu tüzel kişi ile ilişkilidir @tr
definition: Bir temsilciyi başka bir temsilci tarafından başlatılan bir tüzel kişiyle ilişkilendirir. @tr
toolkit label: temsilci tarafından kurulan tüzel kişi @tr
toolkit definition: Bir temsilci tarafından başlatılan bir tüzel kişilik. @tr
has subproperty: yhteistoimijan perustama yhteisö
has subproperty: henkilön perustama yhteisö
has subproperty: P51104

yhteistoimijan perustama yhteisö
status: Published
label: has founded corporate body of collective agent @en
lexical alias: foundedCorporateBodyOfCollectiveAgent.en
definition: Relates a collective agent to a corporate body who is initiated by a collective agent. @en
toolkit label: founded corporate body of collective agent @en
toolkit definition: A corporate body who is initiated by a collective agent. @en
type: Property
domain: C10011
sub property of: yhteistoimijaan liittyvä yhteisö
has element type: 2
sub property of: toimijan perustama yhteisö
definition: Liittää yhteistoimijan yhteisöön, jonka yhteistoimija on perustanut.
toolkit label: yhteistoimijan perustama yhteisö
toolkit definition: Yhteisö, joka on yhteistoimijan perustama.
label: har korporasjon etablert av kollektiv agent @no
definition: Relaterer en kollektiv agent til en korporasjon som er opprettet av en kollektiv agent. @no
toolkit label: korporasjon etablert av kollektiv agent @no
toolkit definition: En korporasjon som er opprettet av en kollektiv agent. @no
label: heeft opgerichte corporatie van collectieve actor @nl
definition: Relateert een collectieve actor aan een corporatie die is gesticht door een collectieve actor. @nl
toolkit label: opgerichte corporatie van collectieve actor @nl
toolkit definition: Een corporatie die is gesticht door een collectieve actor. @nl
label: أسست هيئة لوكيل جماعي @ar
definition: يربط وكيلا جماعيا بهيئة التي دشنها وكيل جماعي. @ar
toolkit label: هيئة مؤسسة لوكيل جماعي @ar
toolkit definition: هيئة التي دشنها وكيل جماعي. @ar
label: té com a entitat corporativa fundada per un agent col·lectiu @ca
definition: Relaciona un agent col·lectiu amb una entitat corporativa que és iniciada per un agent col·lectiu. @ca
toolkit label: entitat corporativa fundada per un agent col·lectiu @ca
toolkit definition: Entitat corporativa que és iniciada per un agent col·lectiu. @ca
label: har korporation grundlagt af kollektiv agent @da
definition: Relaterer en kollektiv agent til en korporation, som er igangsat af en kollektiv agent. @da
toolkit label: korporation grundlagt af kollektiv agent @da
toolkit definition: Korporation, som er igangsat af en kollektiv agent. @da
label: kollektiivi asutatud asutus @et
definition: Seostab kollektiivi asutusega, millele kollektiiv on aluse pannud. @et
toolkit label: kollektiivi asutatud asutus @et
toolkit definition: Asutus, millele kollektiiv on aluse pannud. @et
label: hat von einem gemeinschaftlichen Akteur gegründete Körperschaft @de
definition: Setzt einen gemeinschaftlichen Akteur in Beziehung zu einer Körperschaft, die von einem gemeinschaftlichen Akteur gegründet wurde. @de
toolkit label: von einem gemeinschaftlichen Akteur gegründete Körperschaft @de
toolkit definition: Eine Körperschaft, die von einem gemeinschaftlichen Akteur gegründet wurde. @de
label: kollektív ágens által alapított testület a következő: @hu
definition: Hozzákapcsol egy kollektív ágenst egy testülethez, amelynek létrehozását egy kollektív ágens kezdeményezte. @hu
toolkit label: kollektív ágens által alapított testület: @hu
toolkit definition: Egy testület, amelynek létrehozását egy kollektív ágens kezdeményezte. @hu
label: ha come ente fondato di agente collettivo @it
definition: Correla un agente collettivo a un ente istituito da un agente collettivo. @it
toolkit label: ente fondato di agente collettivo @it
toolkit definition: Ente istituito da un agente collettivo. @it
label: έχει ιδρυμένο συλλογικό όργανο του συλλογικού φορέα @el
definition: Συνδέει έναν συλλογικό φορέα με ένα συλλογικό όργανο που ιδρύθηκε από έναν συλλογικό φορέα. @el
toolkit label: έχει ιδρυμένο συλλογικό όργανο του συλλογικού φορέα @el
label: a pour collectivité fondée d’un agent collectif @fr
definition: Met un agent collectif en relation avec une collectivité qui est établie par un agent collectif. @fr
toolkit label: collectivité fondée d’un agent collectif @fr
toolkit definition: Collectivité qui est établie par un agent collectif. @fr
label: grupas dibinātā institūcija @lv
definition: Sasaista grupu ar institūciju, ko dibinājusi grupa. @lv
toolkit label: grupas dibinātā institūcija @lv
toolkit definition: Institūcija, ko dibinājusi grupa. @lv
label: 有集体行为者的被创办团体 @zh-hans
definition: 将一个集体行为者与被一个集体行为者发起的一个团体关联起来。 @zh-hans
toolkit label: 集体行为者的被创办团体 @zh-hans
toolkit definition: 被一个集体行为者发起的一个团体 @zh-hans
label: kolektif temsilcinin kurduğu tüzel kişi ile ilişkilidir @tr
definition: Kolektif bir temsilciyi, kolektif bir temsilci tarafından işe başlatılan bir tüzel kişilikle ilişkilendirir. @tr
toolkit label: kolektif temsilci tarafından kurulan tüzel kişi @tr
toolkit definition: Kolektif bir temsilci tarafından kurulan bir tüzel kişilik. @tr
has subproperty: suvun perustama yhteisö
has subproperty: yhteisön perustama yhteisö
has subproperty: P51105

teoksen perustaja (toimija) teoksessa
status: Published
type: Property
label: is founder agent of work of @en
lexical alias: founderAgentOfWorkOf.en
definition: Relates an agent to a work that involves a responsibility of an agent for initiating a diachronic work. @en
domain: C10002
toolkit label: founder agent of work of @en
toolkit definition: A work that involves a responsibility of an agent for initiating a diachronic work. @en
instruction number: 18.5
sub property of: toimijaan liittyvä teos
label: είναι ιδρυτικός φορέας του έργου του @el
definition: Συνδέει έναν φορέα υπεύθυνο για την ίδρυση ενός περιοδικού, ενσωματωμένου πόρου ή πολυμερούς μονογραφίας με ένα έργο. @el
toolkit label: ιδρυτικός φορέας του έργου του @el
toolkit definition: Ένα έργο που περιλαμβάνει την ευθύνη για την ίδρυση ενός περιοδικού, ενσωματωμένου πόρου ή πολυμερούς μονογραφίας. @el
definition: Setzt einen Akteur in Beziehung zu einem Werk, bei dem ein Akteur für das Begründen eines diachronen Werks verantwortlich ist. @de
toolkit label: Akteur als Begründerin/Begründer eines Werks von @de
toolkit definition: Ein Werk, bei dem ein Akteur für das Begründen eines diachronen Werks verantwortlich ist. @de
label: er agent, som er stifter af værk af @da
definition: Relaterer en agent til et værk, som involverer en agents ansvar for at igangsætte et diakronisk værk. @da
toolkit label: agent, som er stifter af værk af @da
toolkit definition: Værk, som involverer en agents ansvar for at igangsætte et diakronisk værk. @da
label: és agent fundador d’una obra de @ca
definition: Relaciona un agent amb una obra que implica una responsabilitat d’un agent d’iniciar una obra diacrònica. @ca
toolkit label: agent fundador d’una obra de @ca
toolkit definition: Obra que implica una responsabilitat d’un agent d’iniciar una obra diacrònica. @ca
definition: Liittää toimijan teokseen, jossa toimija on vastuussa diakronisen teoksen alullepanosta.
toolkit label: teoksen perustaja (toimija) teoksessa
toolkit definition: Teos, jossa toimija on vastuussa diakronisen teoksen alullepanosta.
toolkit label: grunnlegger av verk av (agent) @no
toolkit definition: Et verk som involverer et ansvar for en agent for å etablere et diakronisk verk. @no
label: ist Akteur als Begründerin/Begründer eines Werks von @de
label: est un agent fondateur d’une œuvre de @fr
definition: Met un agent en relation avec une œuvre qui comporte une responsabilité de la part d’un agent consistant à lancer une œuvre diachronique. @fr
toolkit label: agent fondateur d’une œuvre de @fr
toolkit definition: Œuvre qui comporte une responsabilité de la part d’un agent consistant à lancer une œuvre diachronique. @fr
has element type: 2
label: alapító ágense a következő műnek: @hu
definition: Hozzákapcsol egy ágenst egy műhöz, amelyhez hozzátartozik egy ágens felelőssége egy diakronikus mű elindításáért. @hu
toolkit label: alapító ágense a következő műnek: @hu
toolkit definition: Egy mű, amelyhez hozzátartozik egy ágens felelőssége egy diakronikus mű elindításáért. @hu
alternative label: founder of work of @en
alternative label: perustajana teoksessa
label: er grunnlegger av verk av (agent) @no
definition: Relaterer en agent til et verk som involverer et ansvar for en agent for å etablere et diakronisk verk. @no
alternative label: grunnlegger av verk av @no
label: is oprichter-actor van werk van @nl
definition: Relateert een actor aan een werk dat met zich meebrengt een verantwoordelijkheid van een actor voor het initiëren van een diachronisch werk. @nl
toolkit label: oprichter-actor van werk van @nl
toolkit definition: Een werk dat met zich meebrengt een verantwoordelijkheid van een actor voor het initiëren van een diachronisch werk. @nl
label: هو وكيل مؤسس لعمل @ar
definition: يربط وكيلا بعمل يترتب عليه مسئولية وكيل عن البدء في عمل تزامني. @ar
alternative label: مؤسس عمل @ar
toolkit label: وكيل مؤسس عمل @ar
toolkit definition: عمل يترتب عليه مسئولية وكيل عن البدء في عمل تزامني. @ar
alternative label: fundador d’una obra de @ca
alternative label: stifter af værk af @da
label: teose asutaja (tegija) teoses @et
definition: Seostab tegija teosega, mis sisaldab tegija vastutust diakroonilise teose ellukutsumise eest. @et
alternative label: teose asutaja teoses @et
toolkit label: teose asutaja (tegija) teoses @et
toolkit definition: Teos, mis sisaldab tegija vastutust diakroonilise teose ellukutsumise eest. @et
alternative label: alapítója a következő műnek: @hu
label: è fondatore agente di opera agente di @it
definition: Correla un agente a un'opera che implica una responsabilità di un agente nell'iniziare un'opera diacronica. @it
alternative label: fondatore di opera di @it
toolkit label: agente fondatore di opera di @it
toolkit definition: Opera che implica una responsabilità di un agente nell'iniziare un'opera diacronica. @it
alternative label: ιδρυτής του έργου του @el
alternative label: fondateur d’œuvre de @fr
label: ir dibinātājs (aģents) darbam @lv
definition: Sasaista aģentu ar darbu, kas ietver aģenta atbildību par tā (seriālizdevuma, integrētā resursa vai vairākdaļu monogrāfijas) izveidošanu. @lv
toolkit label: ir dibinātājs (aģents) darbam @lv
toolkit definition: Darbs, kas ietver aģenta atbildību par tā (seriālizdevuma, integrētā resursa vai vairākdaļu monogrāfijas) izveidošanu. @lv
alternative label: Begründer eines Werks von @de
alternative label: ……的作品的创办者 @zh-hans
toolkit label: ……的作品的创办者行为者 @zh-hans
toolkit definition: 涉及发起一种历时作品的一个行为者的责任的一种作品 @zh-hans
toolkit label: eserin kurucu temsilcisi @tr
toolkit definition: Artzamanlı bir çalışmayı başlatmak için bir temsilcinin sorumluluğunu içeren bir eser. @tr
has subproperty: teoksen perustaja (yhteistoimija) teoksessa

teoksen perustaja (yhteistoimija) teoksessa
status: Published
label: is founder collective agent of work of @en
lexical alias: founderCollectiveAgentOfWorkOf.en
definition: Relates a collective agent to a work that involves a responsibility of a collective agent for initiating a diachronic work. @en
toolkit label: founder collective agent of work of @en
toolkit definition: A work that involves a responsibility of a collective agent for initiating a diachronic work. @en
type: Property
domain: C10011
has element type: 2
sub property of: yhteistoimijaan liittyvä teos
sub property of: teoksen perustaja (toimija) teoksessa
definition: Liittää yhteistoimijan teokseen, jossa yhteistoimija on vastuussa diakronisen teoksen alullepanosta.
toolkit label: teoksen perustaja (yhteistoimija) teoksessa
toolkit definition: Teos, jossa yhteistoimija on vastuussa diakronisen teoksen alullepanosta.
label: er grunnlegger av verk for (kollektiv agent) @no
definition: Relaterer en kollektiv agent til et verk som involverer et ansvar for en kollektiv agent i form av å etablere et diakronisk verk. @no
toolkit label: grunnlegger av verk for (kollektiv agent) @no
toolkit definition: Et verk som involverer et ansvar for en kollektiv agent i form av å etablere et diakronisk verk. @no
label: is oprichter-collectieve actor van werk van @nl
definition: Relateert een collectieve actor aan een werk dat met zich meebrengt een verantwoordelijkheid van een collectieve actor voor het initiëren van een diachronisch werk. @nl
toolkit label: oprichter-collectieve actor van werk van @nl
toolkit definition: Een werk dat met zich meebrengt een verantwoordelijkheid van een collectieve actor voor het initiëren van een diachronisch werk. @nl
label: هو وكيل جماعي مؤسس عمل لـ @ar
definition: يربط وكيلا جماعيا بعمل يترتب عليه مسئولية وكيل جماعي عن البدء في عمل تزامني. @ar
toolkit label: وكيل جماعي مؤسس عمل @ar
toolkit definition: عمل يترتب عليه مسئولية وكيل جماعي عن البدء في عمل تزامني. @ar
label: és agent col·lectiu fundador d’una obra de @ca
definition: Relaciona un agent col·lectiu amb una obra que implica una responsabilitat d’un agent col·lectiu d’iniciar una obra diacrònica. @ca
toolkit label: agent col·lectiu fundador d’una obra de @ca
toolkit definition: Obra que implica una responsabilitat d’un agent col·lectiu d’iniciar una obra diacrònica. @ca
label: er kollektiv agent, som er stifter af værk af @da
definition: Relaterer en kollektiv agent til et værk, som involverer en kollektiv agents ansvar for at igangsætte et diakronisk værk. @da
toolkit label: kollektiv agent, som er stifter af værk af @da
toolkit definition: Værk, som involverer en kollektiv agents ansvar for at igangsætte et diakronisk værk. @da
label: teose asutaja (kollektiiv) teoses @et
definition: Seostab kollektiivi teosega, mis sisaldab kollektiivi vastutust diakroonilise teose ellukutsumise eest. @et
toolkit label: teose asutaja (kollektiiv) teoses @et
toolkit definition: Teos, mis sisaldab kollektiivi vastutust diakroonilise teose ellukutsumise eest. @et
label: ist gemeinschaftlicher Akteur als Begründerin/Begründer eines Werks von @de
definition: Setzt einen gemeinschaftlicher Akteur in Beziehung zu einem Werk, bei dem ein gemeinschaftlicher Akteur für das Begründen eines diachronen Werks verantwortlich ist. @de
toolkit label: Gemeinschaftlicher Akteur als Begründerin/Begründer eines Werks von @de
toolkit definition: Ein Werk, bei dem ein gemeinschaftlicher Akteur für das Begründen eines diachronen Werks verantwortlich ist. @de
label: alapító kollektív ágense a következő műnek: @hu
definition: Hozzákapcsol egy kollektív ágenst egy műhöz, amelyhez hozzátartozik egy kollektív ágens felelőssége egy diakronikus mű elindításáért. @hu
toolkit label: alapító kollektív ágense a következő műnek: @hu
toolkit definition: Egy mű, amelyhez hozzátartozik egy kollektív ágens felelőssége egy diakronikus mű elindításáért. @hu
label: è fondatore agente collettivo di opera di @it
definition: Correla un agente collettivo a un'opera che implica una responsabilità di un agente collettivo nell'avvio di un'opera diacronica. @it
toolkit label: fondatore agente collettivo di opera di @it
toolkit definition: Opera che implica una responsabilità di un agente collettivo nell'avvio di un'opera diacronica. @it
label: είναι ιδρυτής συλλογικός φορέας του έργου του @el
toolkit label: ιδρυτής συλλογικός φορέας του έργου του @el
label: est un agent collectif fondateur d’une œuvre de @fr
definition: Met un agent collectif en relation avec une œuvre qui comporte une responsabilité de la part d’un agent collectif consistant à lancer une œuvre diachronique. @fr
toolkit label: agent collectif fondateur d’une œuvre de @fr
toolkit definition: Œuvre qui comporte une responsabilité de la part d’un agent collectif consistant à lancer une œuvre diachronique. @fr
label: ir dibinātājs (grupa) darbam @lv
definition: Sasaista grupu ar darbu, kas ietver grupas atbildību par tā (seriālizdevuma, integrētā resursa vai vairākdaļu monogrāfijas) izveidošanu. @lv
toolkit label: ir dibinātājs (grupa) darbam @lv
toolkit definition: Darbs, kas ietver grupas atbildību par tā (seriālizdevuma, integrētā resursa vai vairākdaļu monogrāfijas) izveidošanu. @lv
label: 是……的作品的创办者集体行为者 @zh-hans
definition: 将一个集体行为者与涉及发起一种历时作品的一个集体行为者的责任的一种作品关联起来。 @zh-hans
toolkit label: ……的作品的创办者集体行为者 @zh-hans
toolkit definition: 涉及发起一种历时作品的一个集体行为者的责任的一种作品 @zh-hans
label: eserinin kurucu kolektif temsilcisidir @tr
definition: Kollektif bir temsilciyi, tarihi bir çalışmayı başlatmak için kolektif bir temsilcinin sorumluluğunu içeren bir eseri ilişkilendirir. @tr
toolkit label: eserin kurucu kolektif temsilcisi @tr
toolkit definition: Artzamanlı bir eserin başlatılması için kollektif bir temsilcinin sorumluluğunu içeren bir eser. @tr
has subproperty: teoksen perustaja (yhteisö) teoksessa
has subproperty: teoksen perustaja (suku) teoksessa
has subproperty: P50696

teoksen perustaja (yhteisö) teoksessa
status: Published
label: is founder corporate body of work of @en
lexical alias: founderCorporateBodyOfWorkOf.en
definition: Relates a corporate body to a work that involves a responsibility of a corporate body for initiating a diachronic work. @en
toolkit label: founder corporate body of work of @en
toolkit definition: A work that involves a responsibility of a corporate body for initiating a diachronic work. @en
type: Property
domain: C10005
has element type: 2
sub property of: teoksen tekijä (yhteisö) teoksessa
sub property of: teoksen perustaja (yhteistoimija) teoksessa
definition: Liittää yhteisön teokseen, jossa yhteisö on vastuussa diakronisen teoksen alullepanosta.
toolkit label: teoksen perustaja (yhteisö) teoksessa
toolkit definition: Teos, jossa yhteisö on vastuussa diakronisen teoksen alullepanosta.
label: er grunnlegger av verk for (korporasjon) @no
definition: Relaterer en korporasjon til et verk som involverer et ansvar for en korporasjon i form av å etablere et diakronisk verk. @no
toolkit label: grunnlegger av verk for (korporasjon) @no
toolkit definition: Et verk som involverer et ansvar for en korporasjon i form av å etablere et diakronisk verk. @no
label: is oprichter-corporatie van werk van @nl
definition: Relateert een corporatie aan een werk dat met zich meebrengt een verantwoordelijkheid van een corporatie voor het initiëren van een diachronisch werk. @nl
toolkit label: oprichter-corporatie van werk van @nl
toolkit definition: Een werk dat met zich meebrengt een verantwoordelijkheid van een corporatie voor het initiëren van een diachronisch werk. @nl
label: هي هيئة مؤسسة لعمل لـ @ar
definition: يربط هيئة بعمل يترتب عليه مسئولية هيئة عن البدء في عمل تزامني. @ar
toolkit label: هيئة مؤسسة لعمل @ar
toolkit definition: عمل يترتب عليه مسئولية هيئة عن البدء في عمل تزامني. @ar
label: és entitat corporativa fundadora d’una obra de @ca
definition: Relaciona una entitat corporativa amb una obra que implica una responsabilitat d’una entitat corporativa d’iniciar una obra diacrònica. @ca
toolkit label: entitat corporativa fundadora d’una obra de @ca
toolkit definition: Obra que implica una responsabilitat d’una entitat corporativa d’iniciar d’una obra diacrònica. @ca
label: er korporation, som er stifter af værk af @da
definition: Relaterer en korporation til et værk, som involverer en korporations ansvar for at igangsætte et diakronisk værk. @da
toolkit label: korporation, som er stifter af værk af @da
toolkit definition: Værk, som involverer en korporations ansvar for at igangsætte et diakronisk værk. @da
label: teose asutaja (asutus) teoses @et
definition: Seostab asutuse teosega, mis sisaldab asutuse vastutust diakroonilise teose ellukutsumise eest. @et
toolkit label: teose asutaja (asutus) teoses @et
toolkit definition: Teos, mis sisaldab asutuse vastutust diakroonilise teose ellukutsumise eest. @et
label: ist Körperschaft als Begründerin/Begründer eines Werks von @de
definition: Setzt eine Körperschaft in Beziehung zu einem Werk, bei dem eine Körperschaft für das Begründen eines diachronen Werks verantwortlich ist. @de
toolkit label: Körperschaft als Begründerin/Begründer eines Werks von @de
toolkit definition: Ein Werk, bei dem eine Körperschaft für das Begründen eines diachronen Werks verantwortlich ist. @de
label: alapító testülete a következő műnek: @hu
definition: Hozzákapcsol egy testületet egy műhöz, amelyhez hozzátartozik egy testület felelőssége egy diakronikus mű elindításáért. @hu
toolkit label: alapító testülete a következő műnek: @hu
toolkit definition: Egy mű, amelyhez hozzátartozik egy testület felelőssége egy diakronikus mű elindításáért. @hu
label: è fondatore ente di opera di @it
definition: Correla un ente a un'opera che implica una responsabilità di un ente per l'avvio di un'opera diacronica. @it
toolkit label: fondatore ente di opera di @it
toolkit definition: Opera che implica una responsabilità di un ente per l'avvio di un'opera diacronica. @it
label: είναι ιδρυτής συλλογικό όργανο του έργου του @el
toolkit label: ιδρυτής συλλογικό όργανο του έργου του @el
label: est une collectivité fondatrice d’une œuvre de @fr
definition: Met une collectivité en relation avec une œuvre qui comporte une responsabilité de la part d’une collectivité consistant à lancer une œuvre diachronique. @fr
toolkit label: collectivité fondatrice d’une œuvre de @fr
toolkit definition: Œuvre qui comporte une responsabilité de la part d’une collectivité consistant à lancer une œuvre diachronique. @fr
label: ir dibinātājs (institūcija) darbam @lv
definition: Sasaista institūciju ar darbu, kas ietver institūcijas atbildību par tā (seriālizdevuma, integrētā resursa vai vairākdaļu monogrāfijas) izveidošanu. @lv
toolkit label: ir dibinātājs (institūcija) darbam @lv
toolkit definition: Darbs, kas ietver institūcijas atbildību par tā (seriālizdevuma, integrētā resursa vai vairākdaļu monogrāfijas) izveidošanu. @lv
label: 是……的作品的创办者团体 @zh-hans
definition: 将一个团体与涉及发起一种历时作品的一个团体的责任的一种作品关联起来。 @zh-hans
toolkit label: ……的作品的创办者团体 @zh-hans
toolkit definition: 涉及发起一种历时作品的一个团体的责任的一种作品 @zh-hans
label: eserinin kurucu tüzel kişisidir @tr
definition: Bir tüzel kişiyi, art zamanlı bir çalışmayı başlatma sorumluluğunu içeren bir eserle ilişkilendirir. @tr
toolkit label: eserin kurucu tüzel kişisi @tr
toolkit definition: Art zamanlı bir çalışmayı başlatmak için bir tüzel kişinin sorumluluğunu içeren bir eser. @tr
has subproperty: P50847

teoksen perustaja (suku) teoksessa
status: Published
label: is founder family of work of @en
lexical alias: founderFamilyOfWorkOf.en
definition: Relates a family to a work that involves a responsibility of a family for initiating a diachronic work. @en
toolkit label: founder family of work of @en
toolkit definition: A work that involves a responsibility of a family for initiating a diachronic work. @en
type: Property
domain: C10008
has element type: 2
sub property of: sukuun liittyvä teos
sub property of: teoksen perustaja (yhteistoimija) teoksessa
definition: Liittää suvun teokseen, jossa suku on vastuussa diakronisen teoksen alullepanosta.
toolkit label: teoksen perustaja (suku) teoksessa
toolkit definition: Teos, jossa suku on vastuussa diakronisen teoksen alullepanosta.
label: er grunnlegger av verk for (familie) @no
definition: Relaterer en familie til et verk som involverer et ansvar for en familie i form av å etablere et diakronisk verk. @no
toolkit label: grunnlegger av verk for (familie) @no
toolkit definition: Et verk som involverer et ansvar for en familie i form av å etablere et diakronisk verk. @no
label: is oprichter-familie van werk van @nl
definition: Relateert een familie aan een werk dat met zich meebrengt een verantwoordelijkheid van een familie voor het initiëren van een diachronisch werk. @nl
toolkit label: oprichter-familie van werk van @nl
toolkit definition: Een werk dat met zich meebrengt een verantwoordelijkheid van een familie voor het initiëren van een diachronisch werk. @nl
label: هي عائلة مؤسسة لعمل لـ @ar
definition: يربط عائلة بعمل يترتب عليه مسئولية عائلة عن البدء في عمل تزامني. @ar
toolkit label: عائلة مؤسسة لعمل @ar
toolkit definition: عمل يترتب عليه مسئولية عائلة عن البدء في عمل تزامني. @ar
label: és família fundadora d’una obra de @ca
definition: Relaciona una família amb una obra que implica una responsabilitat d’una família d’iniciar una obra diacrònica. @ca
toolkit label: família fundadora d’una obra de @ca
toolkit definition: Obra que implica una responsabilitat d’una família d’iniciar una obra diacrònica. @ca
label: er familie, som er stifter af værk af @da
definition: Relaterer en familie til et værk, som involverer en families ansvar for at igangsætte et diakronisk værk. @da
toolkit label: familie, som er stifter af værk af @da
toolkit definition: Værk, som involverer en families ansvar for at igangsætte et diakronisk værk. @da
label: teose asutaja (perekond) teoses @et
definition: Seostab perekonna teosega, mis sisaldab perekonna vastutust diakroonilise teose ellukutsumise eest. @et
toolkit label: teose asutaja (perekond) teoses @et
toolkit definition: Teos, mis sisaldab perekonna vastutust diakroonilise teose ellukutsumise eest. @et
label: ist Familie als Begründerin/Begründer eines Werks von @de
definition: Setzt eine Familie in Beziehung zu einem Werk, bei dem eine Familie für das Begründen eines diachronen Werks verantwortlich ist. @de
toolkit label: Familie als Begründerin/Begründer eines Werks von @de
toolkit definition: Ein Werk, bei dem eine Familie für das Begründen eines diachronen Werks verantwortlich ist. @de
label: alapító családja a következő műnek: @hu
definition: Hozzákapcsol egy családot egy műhöz, amelyhez hozzátartozik egy család felelőssége egy diakronikus mű elindításáért. @hu
toolkit label: alapító családja a következő műnek: @hu
toolkit definition: Egy mű, amelyhez hozzátartozik egy család felelőssége egy diakronikus mű elindításáért. @hu
label: è fondatore famiglia di opera di @it
definition: Correla una famiglia a un'opera che implica una responsabilità di una famiglia per l'avvio di un'opera diacronica. @it
toolkit label: fondatore famiglia di opera di @it
toolkit definition: Opera che implica una responsabilità di una famiglia per l'avvio di un'opera diacronica. @it
label: είναι ιδρυτής οικογένεια του έργου του @el
toolkit label: ιδρυτής οικογένεια του έργου του @el
label: est une famille fondatrice d’une œuvre de @fr
definition: Met une famille en relation avec une œuvre qui comporte une responsabilité de la part d’une famille consistant à lancer une œuvre diachronique. @fr
toolkit label: famille fondatrice d’une œuvre de @fr
toolkit definition: Œuvre qui comporte une responsabilité de la part d’une famille consistant à lancer une œuvre diachronique. @fr
label: ir dibinātājs (dzimta/ģimene) darbam @lv
definition: Sasaista dzimtu/ģimeni ar darbu, kas ietver dzimtas/ģimenes atbildību par tā (seriālizdevuma, integrētā resursa vai vairākdaļu monogrāfijas) izveidošanu. @lv
toolkit label: ir dibinātājs (dzimta/ģimene) darbam @lv
toolkit definition: Darbs, kas ietver dzimtas/ģimenes atbildību par tā (seriālizdevuma, integrētā resursa vai vairākdaļu monogrāfijas) izveidošanu. @lv
label: 是……的作品的创办者家族 @zh-hans
definition: 将一个家族与涉及发起一种历时作品的一个家族的责任的一种作品关联起来。 @zh-hans
toolkit label: ……的作品的创办者家族 @zh-hans
toolkit definition: 涉及发起一种历时作品的一个家族的责任的一种作品 @zh-hans
label: eserinin kurucu ailesidir @tr
definition: Bir aileyi, zaman içinde zamansal bir işin başlatılması için bir ailenin sorumluluğunu içeren bir eserle ilişkilendirir. @tr
toolkit label: eserin kurucu ailesi @tr
toolkit definition: Art zamanlı bir çalışmayı başlatmak için bir ailenin sorumluluğunu içeren bir eser. @tr
has subproperty: P50998

teoksen perustaja (henkilö) teoksessa
status: Published
label: is founder person of work of @en
lexical alias: founderPersonOfWorkOf.en
definition: Relates a person to a work that involves a responsibility of a person for initiating a diachronic work. @en
toolkit label: founder person of work of @en
toolkit definition: A work that involves a responsibility of a person for initiating a diachronic work. @en
type: Property
domain: C10004
has element type: 2
sub property of: henkilöön liittyvä teos
sub property of: teoksen perustaja (toimija) teoksessa
definition: Liittää henkilön teokseen, jossa henkilö on vastuussa diakronisen teoksen alullepanosta.
toolkit label: teoksen perustaja (henkilö) teoksessa
toolkit definition: Teos, jossa henkilö on vastuussa diakronisen teoksen alullepanosta.
label: er grunnlegger av verk for (person) @no
definition: Relaterer en person til et verk som involverer et ansvar for en person i form av å etablere et diakronisk verk. @no
toolkit label: grunnlegger av verk for (person) @no
toolkit definition: Et verk som involverer et ansvar for en person i form av å etablere et diakronisk verk. @no
label: is oprichter-persoon van werk van @nl
definition: Relateert een persoon aan een werk dat met zich meebrengt een verantwoordelijkheid van een persoon voor het initiëren van een diachronisch werk. @nl
toolkit label: oprichter-persoon van werk van @nl
toolkit definition: Een werk dat met zich meebrengt een verantwoordelijkheid van een persoon voor het initiëren van een diachronisch werk. @nl
label: هو شخص مؤسس عمل لـ @ar
definition: يربط شخصا بعمل يترتب عليه مسئولية شخص عن البدء في عمل تزامني. @ar
toolkit label: شخص مؤسس عمل @ar
toolkit definition: عمل يترتب عليه مسئولية شخص عن البدء في عمل تزامني. @ar
label: és persona fundadora d’una obra de @ca
definition: Relaciona una persona amb una obra que implica una responsabilitat d’una persona d’iniciar una obra diacrònica. @ca
toolkit label: persona fundadora d’una obra de @ca
toolkit definition: Obra que implica una responsabilitat d’una persona d’iniciar una obra diacrònica. @ca
label: er person, som er stifter af værk af @da
definition: Relaterer en person til et værk, som involverer en persons ansvar for at igangsætte et diakronisk værk. @da
toolkit label: person, som er stifter af værk af @da
toolkit definition: Værk, som involverer en persons ansvar for at igangsætte et diakronisk værk. @da
label: teose asutaja (isik) teoses @et
definition: Seostab isiku teosega, mis sisaldab isiku vastutust diakroonilise teose ellukutsumise eest. @et
toolkit label: teose asutaja (isik) teoses @et
toolkit definition: Teos, mis sisaldab isiku vastutust diakroonilise teose ellukutsumise eest. @et
label: ist Person als Begründerin/Begründer eines Werks @de
definition: Setzt eine Person in Beziehung zu einem Werk, bei dem eine Person für das Begründen eines diachronen Werks verantwortlich ist. @de
toolkit label: Person als Begründerin/Begründer eines Werks @de
toolkit definition: Ein Werk, bei dem eine Person für das Begründen eines diachronen Werks verantwortlich ist. @de
label: alapító személye a következő műnek: @hu
definition: Hozzákapcsol egy személyt egy műhöz, amelyhez hozzátartozik egy személy felelőssége egy diakronikus mű elindításáért. @hu
toolkit label: alapító személye a következő műnek: @hu
toolkit definition: Egy mű, amelyhez hozzátartozik egy személy felelőssége egy diakronikus mű elindításáért. @hu
label: è fondatore persona di opera di @it
definition: Correla una persona a un'opera che implica una responsabilità di una persona nell'avvio di un'opera diacronica. @it
toolkit label: fondatore persona di opera di @it
toolkit definition: Opera che implica una responsabilità di una persona nell'avvio di un'opera diacronica. @it
label: είναι ιδρυτής φυσικό πρόσωπο του έργου του @el
toolkit label: ιδρυτής φυσικό πρόσωπο του έργου του @el
label: est une personne fondatrice d’une œuvre de @fr
definition: Met une personne en relation avec une œuvre qui comporte une responsabilité de la part d’une personne consistant à lancer une œuvre diachronique. @fr
toolkit label: personne fondatrice d’une œuvre de @fr
toolkit definition: Œuvre qui comporte une responsabilité de la part d’une personne consistant à lancer une œuvre diachronique. @fr
label: ir dibinātājs (persona) darbam @lv
definition: Sasaista personu ar darbu, kas ietver personas atbildību par tā (seriālizdevuma, integrētā resursa vai vairākdaļu monogrāfijas) izveidošanu. @lv
toolkit label: ir dibinātājs (persona) darbam @lv
toolkit definition: Darbs, kas ietver personas atbildību par tā (seriālizdevuma, integrētā resursa vai vairākdaļu monogrāfijas) izveidošanu. @lv
label: 是……作品的创办者个人 @zh-hans
definition: 将一个个人与涉及发起一种历时作品的一个个人的责任的一种作品关联起来。 @zh-hans
toolkit label: ……作品的创办者个人 @zh-hans
toolkit definition: 涉及发起一种历时作品的一个个人的责任的一种作品 @zh-hans
label: eserinin kurucu kişisidir @tr
definition: Bir kişiyi, artzamanlı bir çalışmayı başlatma sorumluluğunu içeren bir eserle ilişkilendirir. @tr
toolkit label: eserin kurucusu @tr
toolkit definition: Artzamanlı bir çalışmayı başlatmak için bir kişinin sorumluluğunu içeren bir eser. @tr
has subproperty: P50545

yhteisön perustanut toimija
status: Published
label: has founding agent of corporate body @en
lexical alias: foundingAgentOfCorporateBody.en
definition: Relates a corporate body to an agent who initiates a corporate body. @en
toolkit label: founding agent of corporate body @en
toolkit definition: An agent who initiates a corporate body. @en
type: Property
domain: C10005
sub property of: yhteisöön liittyvä toimija
has element type: 2
definition: Liittää yhteisön toimijaan, joka perusti yhteisön.
toolkit label: yhteisön perustanut toimija
toolkit definition: Toimija, joka perusti yhteisön.
label: har agent som etablerer en korporasjon @no
definition: Relaterer en korporasjon til en agent som oppretter en korporasjon. @no
toolkit label: agent som etablerer en korporasjon @no
toolkit definition: En agent som oppretter en korporasjon. @no
label: heeft oprichter-actor van corporatie @nl
definition: Relateert een corporatie aan een actor die een corporatie opricht. @nl
toolkit label: oprichter-actor van corporatie @nl
toolkit definition: Een actor die een corporatie opricht. @nl
label: لها وكيل مؤسس لهيئة @ar
definition: يربط هيئة بوكيل يشرع في إنشاء هيئة @ar
toolkit label: وكيل مؤسس لهيئة @ar
toolkit definition: وكيل يشرع في إنشاء هيئة. @ar
label: té com a agent fundador d’una entitat corporativa @ca
definition: Relaciona una entitat corporativa amb un agent que inicia una entitat corporativa. @ca
toolkit label: agent fundador d’una entitat corporativa @ca
toolkit definition: Agent que inicia una entitat corporativa. @ca
label: har agent, som er grundlægger af korporation @da
definition: Relaterer en korporation til en agent, som igangsætter en korporation. @da
toolkit label: agent, som er grundlægger af korporation @da
toolkit definition: Agent, som igangsætter en korporation. @da
label: asutuse asutanud tegija @et
definition: Seostab asutuse tegijaga, kes on pannud asutusele aluse. @et
alternative label: asutaja (tegija) @et
toolkit label: asutuse asutanud tegija @et
toolkit definition: Tegija, kes on pannud asutusele aluse. @et
label: hat Gründerin/Gründer einer Körperschaft (Akteur) @de
definition: Setzt eine Körperschaft in Beziehung zu einem Akteur, der eine Körperschaft gegründet hat. @de
toolkit label: Gründerin/Gründer einer Körperschaft (Akteur) @de
toolkit definition: Ein Akteur, der eine Körperschaft gegründet hat. @de
label: testület alapító ágense a következő: @hu
definition: Hozzákapcsol egy testületet egy ágenshez, amely kezdeményezi egy testület létrehozását. @hu
toolkit label: testület alapító ágense: @hu
toolkit definition: Egy ágens, amely egy testület létrehozását kezdeményezi. @hu
label: ha come fondatore agente di ente @it
definition: Correla un ente a un agente che istituisce un ente. @it
toolkit label: fondatore agente di ente @it
toolkit definition: Agente che istituisce un ente. @it
label: έχει ιδρυτή φορέα του συλλογικού οργάνου @el
definition: Συνδέει ένα συλλογικό όργανο με έναν φορέα που ιδρύει ένα συλλογικό όργανο. @el
toolkit label: ιδρυτής φορέας του συλλογικού οργάνου @el
label: a pour agent fondateur d’une collectivité @fr
definition: Met une collectivité en relation avec un agent qui établit une collectivité. @fr
toolkit label: agent fondateur d’une collectivité @fr
toolkit definition: Agent qui établit une collectivité. @fr
label: institūcijas dibinātājs (aģents) @lv
definition: Sasaista institūciju ar arģentu, kurš dibinājis institūciju. @lv
toolkit label: institūcijas dibinātājs (aģents) @lv
toolkit definition: Aģents, kas dibinājis institūciju. @lv
label: 有团体的创办行为者 @zh-hans
definition: 将一个团体与发起一个团体的一个行为者关联起来。 @zh-hans
toolkit label: 团体的创办行为者 @zh-hans
toolkit definition: 发起一个团体的一个行为者 @zh-hans
label: tüzel kişiyi kuran temsilci ile ilişkilidir @tr
definition: Bir tüzel kişiyi, bir tüzel kişiliği kuran bir aracıyla ilişkilendirir. @tr
toolkit label: tüzel kişinin kurucu temsilcisi @tr
toolkit definition: Bir tüzel kişiliği başlatan bir temsilci. @tr
has subproperty: yhteisön perustanut yhteistoimija
has subproperty: yhteisön perustanut henkilö
has subproperty: P51106

yhteisön perustanut yhteistoimija
status: Published
label: has founding collective agent of corporate body @en
lexical alias: foundingCollectiveAgentOfCorporateBody.en
definition: Relates a corporate body to a collective agent who initiates a corporate body. @en
toolkit label: founding collective agent of corporate body @en
toolkit definition: A collective agent who initiates a corporate body. @en
type: Property
domain: C10005
sub property of: yhteisöön liittyvä yhteistoimija
has element type: 2
sub property of: yhteisön perustanut toimija
definition: Liittää yhteisön yhteistoimijaan, joka perusti yhteisön.
toolkit label: yhteisön perustanut yhteistoimija
toolkit definition: Yhteistoimija, joka perusti yhteisön.
label: har kollektiv agent som etablerer en korporasjon @no
definition: Relaterer en korporasjon til en kollektiv agent som oppretter en korporasjon. @no
toolkit label: kollektiv agent som etablerer en korporasjon @no
toolkit definition: En kollektiv agent som oppretter en korporasjon. @no
label: heeft oprichter-collectieve actor van corporatie @nl
definition: Relateert een corporatie aan een collectieve actor die een corporatie opricht. @nl
toolkit label: oprichter-collectieve actor van corporatie @nl
toolkit definition: Een collectieve actor die een corporatie opricht. @nl
label: لها وكيل جماعي مؤسس لهيئة @ar
definition: يربط هيئة بوكيل جماعي يشرع في إنشاء هيئة @ar
toolkit label: وكيل مؤسس لهيئة @ar
toolkit definition: وكيل مؤسس لهيئة @ar
label: té com a agent col·lectiu fundador d’una entitat corporativa @ca
definition: Relaciona una entitat corporativa amb un agent col·lectiu que inicia una entitat corporativa. @ca
toolkit label: agent col·lectiu fundador d’una entitat corporativa @ca
toolkit definition: Agent col·lectiu que inicia una entitat corporativa. @ca
label: har kollektiv agent, som er grundlægger af korporation @da
definition: Relaterer en korporation til en kollektiv agent, som igangsætter en korporation. @da
toolkit label: kollektiv agent, som er grundlægger af korporation @da
toolkit definition: Kollektiv agent, som igangsætter en korporation. @da
label: asutuse asutanud kollektiiv @et
definition: Seostab asutuse kollektiiviga, kes on pannud asutusele aluse. @et
alternative label: asutaja (kollektiiv) @et
toolkit label: asutuse asutanud kollektiiv @et
toolkit definition: Kollektiiv, kes on pannud asutusele aluse. @et
label: hat Gründerin/Gründer einer Körperschaft (Gemeinschaftlicher Akteur) @de
definition: Setzt eine Körperschaft in Beziehung zu einem gemeinschaftlichen Akteur, der eine Körperschaft gegründet hat. @de
toolkit label: Gründerin/Gründer einer Körperschaft (Gemeinschaftlicher Akteur) @de
toolkit definition: Ein gemeinschaftlicher Akteur, der eine Körperschaft gegründet hat. @de
label: testület alapító kollektív ágense a következő: @hu
definition: Hozzákapcsol egy testületet egy kollektív ágenshez, amely kezdeményezi egy testület létrehozását. @hu
toolkit label: testület alapító kollektív ágense: @hu
toolkit definition: Egy kollektív ágens, amely egy testület létrehozását kezdeményezi. @hu
label: ha come fondatore agente collettivo di ente @it
definition: Correla un ente a un agente collettivo che istituisce un ente. @it
toolkit label: fondatore agente collettivo di ente @it
toolkit definition: Agente collettivo che istituisce un ente. @it
label: έχει ιδρυτή συλλογικό φορέα του συλλογικού οργάνου @el
definition: Συνδέει ένα συλλογικό όργανο με έναν συλλογικό φορέα που ιδρύει ένα συλλογικό όργανο. @el
toolkit label: ιδρυτής συλλογικός φορέας του συλλογικού οργάνου @el
label: a pour agent collectif fondateur d’une collectivité @fr
definition: Met une collectivité en relation avec un agent collectif qui établit une collectivité. @fr
toolkit label: agent collectif fondateur d’une collectivité @fr
toolkit definition: Agent collectif qui établit une collectivité. @fr
label: institūcijas dibinātājs (grupa) @lv
definition: Sasaista institūciju ar grupu, kas dibinājusi institūciju. @lv
toolkit label: institūcijas dibinātājs (grupa) @lv
toolkit definition: Grupa, kas dibinājusi institūciju. @lv
label: 有团体的创办集体行为者 @zh-hans
definition: 将一个团体与发起一个团体的一个集体行为者关联起来。 @zh-hans
toolkit label: 团体的创办集体行为者 @zh-hans
toolkit definition: 发起一个团体的一个集体行为者 @zh-hans
label: tüzel kişiyi kuran kolektif temsilci ile ilişkilidir @tr
definition: Bir tüzel kişiyi, kurucu bir kolektif temsilci ile ilişkilendirir. @tr
toolkit label: tüzel kişinin kurucu kolektif temsilcisi @tr
toolkit definition: Bir tüzel kişiliği başlatan kolektif temsilci. @tr
has subproperty: yhteisön perustanut yhteisö
has subproperty: yhteisön perustanut suku
has subproperty: P51107

yhteisön perustanut yhteisö
status: Published
label: has founding corporate body of corporate body @en
definition: Relates a corporate body to a corporate body who initiates a corporate body. @en
type: Property
domain: C10005
lexical alias: foundingCorporateBodyOfCorporateBody.en
toolkit label: founding corporate body of corporate body @en
toolkit definition: A corporate body who initiates a corporate body. @en
label: a pour collectivité fondatrice d’une collectivité @fr
definition: Met une collectivité en relation avec une collectivité qui établit une collectivité. @fr
toolkit label: collectivité fondatrice d’une collectivité @fr
toolkit definition: Collectivité qui établit une collectivité. @fr
toolkit label: entidad corporativa fundadora @es
toolkit definition: Una entidad corporativa que fundó a otra entidad corporativa. @es
instruction number: 29.5
label: έχει ιδρυτή συλλογικό όργανο του συλλογικού οργάνου @el
definition: Συνδέει ένα συλλογικό όργανο με ένα συλλογικό όργανο το οποίο ίδρυσε κάποιο άλλο συλλογικό όργανο. @el
toolkit label: ιδρυτής συλλογικό όργανο του συλλογικού οργάνου @el
toolkit definition: Ένα συλλογικό όργανο το οποίο ίδρυσε κάποιο άλλο συλλογικό όργανο. @el
definition: Setzt eine Körperschaft in Beziehung zu einer Körperschaft, die eine Körperschaft gegründet hat. @de
toolkit label: Gründerin/Gründer einer Körperschaft (Körperschaft) @de
toolkit definition: Eine Körperschaft, die eine Körperschaft gegründet hat. @de
label: har korporation, som er grundlægger af korporation @da
definition: Relaterer en korporation til en korporation, som igangsætter en korporation. @da
toolkit label: korporation, som er grundlægger af korporation @da
toolkit definition: Korporation, som igangsætter en korporation. @da
label: té com a entitat corporativa fundadora d’una entitat corporativa @ca
definition: Relaciona una entitat corporativa amb una entitat corporativa que inicia una entitat corporativa. @ca
toolkit label: entitat corporativa fundadora d’una entitat corporativa @ca
toolkit definition: Entitat corporativa que inicia una entitat corporativa. @ca
definition: Liittää yhteisön yhteisöön, joka perusti toisen yhteisön.
toolkit label: yhteisön perustanut yhteisö
toolkit definition: Yhteisö, joka perusti toisen yhteisön.
toolkit label: grunnleggerkorporasjon for korporasjon @no
toolkit definition: En korporasjon som oppretter en annen korporasjon. @no
label: hat Gründerin/Gründer einer Körperschaft (Körperschaft) @de
has element type: 2
sub property of: yhteisöön liittyvä yhteisö
label: testület alapító testülete a következő: @hu
definition: Hozzákapcsol egy testületet egy testülethez, amely kezdeményezi egy testület létrehozását. @hu
toolkit label: testület alapító testülete: @hu
toolkit definition: Egy testület, amely kezdeményezi egy testület létrehozását. @hu
alternative label: founding corporate body @en
sub property of: yhteisön perustanut yhteistoimija
alternative label: perustajayhteisö
label: har grunnleggerkorporasjon for korporasjon @no
definition: Relaterer en korporasjon til en korporasjon som oppretter en annen korporasjon. @no
alternative label: grunnleggerkorporasjon @no
label: heeft oprichter-corporatie van corporatie @nl
definition: Relateert een corporatie aan een corporatie die een corporatie opricht. @nl
toolkit label: oprichter-corporatie van corporatie @nl
toolkit definition: Een corporatie die een corporatie opricht. @nl
label: له هيئة مؤسِّسة لهيئة @ar
definition: يربط هيئة بهيئة تبادر بإنشاء هيئة. @ar
alternative label: هيئة مؤسِّسة @ar
toolkit label: هيئة مؤسسة لهيئة @ar
toolkit definition: هيئة تبادر بإنشاء هيئة. @ar
alternative label: entitat corporativa fundadora @ca
alternative label: oprettende korporation @da
label: asutuse asutanud asutus @et
definition: Seostab asutuse asutusega, kes on pannud asutusele aluse. @et
alternative label: asutaja (asutus) @et
toolkit label: asutuse asutanud asutus @et
toolkit definition: Asutus, kes on pannud asutusele aluse. @et
alternative label: alapító testület @hu
label: ha come ente fondatore di ente @it
definition: Correla un ente a un ente che istituisce un ente. @it
alternative label: ente fondatore @it
toolkit label: ente fondatore di ente @it
toolkit definition: Ente che istituisce un ente. @it
alternative label: ιδρυτής συλλογικό όργανο @el
alternative label: collectivité fondatrice @fr
label: institūcijas dibinātājs (institūcija) @lv
definition: Sasaista institūciju ar institūciju, kas ir dibinājusi citu institūciju. @lv
toolkit label: institūcijas dibinātājs (institūcija) @lv
toolkit definition: Institūcija, kas ir dibinājusi citu institūciju. @lv
alternative label: Gründende Körperschaft @de
alternative label: 创办团体 @zh-hans
toolkit label: 团体的创办团体 @zh-hans
toolkit definition: 发起一个团体的一个团体 @zh-hans

yhteisön perustanut suku
status: Published
label: has founding family of corporate body @en
definition: Relates a corporate body to a family who initiates a corporate body. @en
type: Property
domain: C10005
lexical alias: foundingFamilyOfCorporateBody.en
toolkit label: founding family of corporate body @en
toolkit definition: A family who initiates a corporate body. @en
label: a pour famille fondatrice d’une collectivité @fr
definition: Met une collectivité en relation avec une famille qui établit une collectivité. @fr
toolkit label: famille fondatrice d’une collectivité @fr
toolkit definition: Famille qui établit une collectivité. @fr
toolkit label: familia fundadora @es
toolkit definition: Una familia que fundó la entidad corporativa. @es
instruction number: 29.5
label: έχει ιδρύτρια οικογένεια του συλλογικού οργάνου @el
definition: Συνδέει ένα συλλογικό όργανο με μια οικογένεια που ίδρυσε ένα συλλογικό όργανο. @el
toolkit label: ιδρύτρια οικογένεια του συλλογικού οργάνου @el
toolkit definition: Μια οικογένεια η οποία ίδρυσε ένα συλλογικό όργανο. @el
definition: Setzt eine Körperschaft in Beziehung zu einer Familie, die eine Körperschaft gegründet hat. @de
toolkit label: Gründerin/Gründer einer Körperschaft (Familie) @de
toolkit definition: Eine Familie, die eine Körperschaft gegründet hat. @de
label: har familie, som er grundlæggere af korporation @da
definition: Relaterer en korporation til en familie, som igangsætter en korporation. @da
toolkit label: familie, som er grundlæggere af korporation @da
toolkit definition: Familie, som igangsætter en korporation. @da
label: té com a família fundadora d’una entitat corporativa @ca
definition: Relaciona una entitat corporativa amb una família que inicia una entitat corporativa. @ca
toolkit label: família fundadora d’una entitat corporativa @ca
toolkit definition: Família que inicia una entitat corporativa. @ca
definition: Liittää yhteisön sukuun, joka perusti yhteisön.
toolkit label: yhteisön perustanut suku
toolkit definition: Suku, joka perusti yhteisön.
toolkit label: grunnleggerfamilie for korporasjon @no
toolkit definition: En familie som oppretter en korporasjon. @no
label: hat Gründerin/Gründer einer Körperschaft (Familie) @de
has element type: 2
sub property of: yhteisöön liittyvä suku
label: testület alapító családja a következő: @hu
definition: Hozzákapcsol egy testületet egy családhoz, amely egy testület létrehozását kezdeményezi. @hu
toolkit label: testületet alapító család: @hu
toolkit definition: Egy család, amely egy testület létrehozását kezdeményezi. @hu
alternative label: founding family @en
sub property of: yhteisön perustanut yhteistoimija
alternative label: perustajasuku
label: har grunnleggerfamilie for korporasjon @no
definition: Relaterer en korporasjon til en familie som oppretter en korporasjon. @no
alternative label: grunnleggerfamilie @no
label: heeft oprichter-familie van corporatie @nl
definition: Relateert een corporatie aan een familie die een corporatie opricht. @nl
toolkit label: oprichter-familie van corporatie @nl
toolkit definition: Een familie die een corporatie opricht. @nl
label: لها عائلة مؤسِّسة لهيئة @ar
definition: يربط هيئة بعائلة تبادر بإنشاء هيئة. @ar
alternative label: عائلة مؤسِّسة @ar
toolkit label: عائلة مؤسَّسة لهيئة @ar
toolkit definition: عائلة تبادر بإنشاء هيئة. @ar
alternative label: família fundadora @ca
alternative label: stiftende familie @da
label: asutuse asutanud perekond @et
definition: Seostab asutuse perekonnaga, kes on pannud asutusele aluse. @et
alternative label: asutaja (perekond) @et
toolkit label: asutuse asutanud perekond @et
toolkit definition: Perekond, kes on pannud asutusele aluse. @et
alternative label: alapító család: @hu
label: ha come famiglia fondatrice di ente @it
definition: Correla un ente a una famiglia che istituisce un ente. @it
alternative label: famiglia fondatrice @it
toolkit label: famiglia fondatrice di ente @it
toolkit definition: Famiglia che istituisce un ente. @it
alternative label: ιδρύτρια οικογένεια @el
alternative label: famille fondatrice @fr
label: institūcijas dibinātājs (dzimta/ģimene) @lv
definition: Sasaista institūciju ar dzimtu/ģimeni, kas dibinājusi institūciju. @lv
toolkit label: institūcijas dibinātājs (dzimta/ģimene) @lv
toolkit definition: Dzimta/ģimene, kas dibinājusi institūciju. @lv
alternative label: Gründerfamilie @de
alternative label: 创办家族 @zh-hans
toolkit label: 团体的创办家族 @zh-hans
toolkit definition: 发起一个团体的家族 @zh-hans

yhteisön perustanut henkilö
status: Published
label: has founding person of corporate body @en
definition: Relates a corporate body to a person who initiates a corporate body. @en
type: Property
domain: C10005
lexical alias: foundingPersonOfCorporateBody.en
toolkit label: founding person of corporate body @en
toolkit definition: A person who initiates a corporate body. @en
label: a pour personne fondatrice d’une collectivité @fr
definition: Met une collectivité en relation avec une personne qui établit une collectivité. @fr
toolkit label: personne fondatrice d’une collectivité @fr
toolkit definition: Personne qui établit une collectivité. @fr
toolkit label: fundador @es
toolkit definition: Una persona que fundó la entidad corporativa. @es
instruction number: 29.5
label: έχει ιδρυτή φυσικό πρόσωπο του συλλογικού οργάνου @el
definition: Συνδέει ένα συλλογικό όργανο με ένα φυσικό πρόσωπο το οποίο εκκινεί ένα συλλογικό όργανο. @el
toolkit label: ιδρυτής φυσικό πρόσωπο του συλλογικού οργάνου @el
toolkit definition: Ένα φυσικό πρόσωπο που εκκινεί ένα συλλογικό όργανο. @el
definition: Setzt eine Körperschaft in Beziehung zu einer Person, die eine Körperschaft gründet. @de
toolkit label: Gründerin/Gründer einer Körperschaft (Person) @de
toolkit definition: Eine Person, die eine Körperschaft gründet. @de
label: har person, som er grundlægger af korporation @da
definition: Relaterer en korporation til en person, som igangsætter en korporation. @da
toolkit label: person, som er grundlægger af korporation @da
toolkit definition: Person, som igangsætter en korporation. @da
label: té com a persona fundadora d’una entitat corporativa @ca
definition: Relaciona una entitat corporativa amb una persona que inicia una entitat corporativa. @ca
toolkit label: persona fundadora d’una entitat corporativa @ca
toolkit definition: Persona que inicia una entitat corporativa. @ca
definition: Liittää yhteisön henkilöön, joka perusti yhteisön.
toolkit label: yhteisön perustanut henkilö
toolkit definition: Henkilö, joka perusti yhteisön.
toolkit label: grunnlegger for korporasjon (person) @no
toolkit definition: En person som grunnla en korporasjon. @no
label: hat Gründerin/Gründer einer Körperschaft (Person) @de
has element type: 2
sub property of: yhteisöön liittyvä henkilö
label: testület alapító személye a következő: @hu
definition: Hozzákapcsol egy testületet egy személyhez, aki kezdeményezi egy testület létrehozását. @hu
toolkit label: testületet alapító személy: @hu
toolkit definition: Egy személy, aki kezdeményezi egy testület létrehozását. @hu
alternative label: founder @en
sub property of: yhteisön perustanut toimija
alternative label: perustaja
label: har grunnlegger for korporasjon (person) @no
definition: Relaterer en korporasjon til en person som grunnla en korporasjon. @no
alternative label: grunnlegger @no
label: heeft oprichter-persoon van corporatie @nl
definition: Relateert een corporatie aan een persoon die een corporatie opricht. @nl
toolkit label: oprichter-persoon van corporatie @nl
toolkit definition: Een persoon die een corporatie opricht. @nl
label: لها شخص مؤسس لهيئة @ar
definition: يربط هيئة بشخص يشرع في إنشاء هيئة. @ar
alternative label: مؤسس @ar
toolkit label: شخص مؤسس لهيئة @ar
toolkit definition: شخص يشرع في إنشاء هيئة. @ar
alternative label: fundador @ca
alternative label: grundlægger @da
label: asutuse asutanud isik @et
definition: Seostab asutuse isikuga, kes on pannud asutusele aluse. @et
alternative label: asutaja (isik) @et
toolkit label: asutuse asutanud isik @et
toolkit definition: Isik, kes on pannud asutusele aluse. @et
alternative label: alapító: @hu
label: ha come fondatore persona di ente @it
definition: Correla un ente a una persona che istituisce un ente. @it
alternative label: fondatore @it
toolkit label: fondatore persona di ente @it
toolkit definition: Persona che istituisce un ente. @it
alternative label: ιδρυτής @el
alternative label: fondateur @fr
label: institūcijas dibinātājs (persona) @lv
definition: Sasaista institūciju ar personu, kura dibinājusi institūciju. @lv
toolkit label: institūcijas dibinātājs (persona) @lv
toolkit definition: Persona, kura dibinājusi institūciju. @lv
alternative label: Begründerin/Begründer @de
alternative label: 创办者 @zh-hans
toolkit label: 团体的创办个人 @zh-hans
toolkit definition: 发起一个团体的一个个人 @zh-hans

tuotantoyhtiö teoksessa
status: Published
label: is production company of @en
definition: Relates a corporate body to a work that involves a responsibility for managing the financial, technical, and organizational aspects of a production for stage, screen, sound recording, television, webcast, etc. @en
type: Property
domain: C10005
sub property of: teoksen tekijä (yhteisö) teoksessa
lexical alias: productionCompanyOf.en
label: est une société de production de @fr
definition: Met une collectivité en relation avec une œuvre qui comporte une responsabilité consistant à gérer les aspects financiers, techniques et organisationnels de la production d’un spectacle, d’un film, d’un enregistrement audio, d’une émission de télévision, d’une webémission, etc. @fr
toolkit label: société de production de @fr
toolkit definition: Œuvre qui comporte une responsabilité consistant à gérer les aspects financiers, techniques et organisationnels de la production d’un spectacle, d’un film, d’un enregistrement audio, d’une émission de télévision, d’une webémission, etc. @fr
toolkit label: production company of @en
toolkit definition: A work that involves a responsibility for managing the financial, technical, and organizational aspects of a production for stage, screen, sound recording, television, webcast, etc. @en
instruction number: 18.5
label: είναι εταιρία παραγωγής του @el
definition: Συνδέει ένα συλλογικό όργανο, το οποίο είναι υπεύθυνο για την οικονομική, τεχνική και οργανωτική διαχείριση μιας παραγωγής που προορίζεται για τη σκηνή, την οθόνη, μια ηχογράφηση, την τηλεόραση, μια διαδικτυακή μετάδοση κ.λπ., με ένα έργο. @el
toolkit label: εταιρία παραγωγής του @el
toolkit definition: Ένα έργο που περιλαμβάνει την οικονομική, τεχνική και οργανωτική διαχείριση μιας παραγωγής που προορίζεται για τη σκηνή, την οθόνη, μια ηχογράφηση, την τηλεόραση, μια διαδικτυακή μετάδοση κ.λπ. @el
definition: Setzt eine Körperschaft in Beziehung zu einem Werk, das mit einer Verantwortung verbunden ist, das Management für die finanziellen, technischen und organisatorischen Aspekte einer Produktion für die Bühne, die Leinwand, die Tonaufnahme, das Fernsehen, für einen Webcast und so weiter zu verwalten. @de
toolkit label: Produktionsfirma von @de
toolkit definition: Ein Werk, das mit einer Verantwortung verbunden ist, das Management für die finanziellen, technischen und organisatorischen Aspekte einer Produktion für die Bühne, die Leinwand, die Tonaufnahme, das Fernsehen, für einen Webcast und so weiter zu verwalten. @de
label: er produktionsselskab af @da
definition: Relaterer en korporation til et værk, som involverer et ansvar for økonomisk, teknisk og organisatorisk ledelse af en produktion beregnet til scene, lærred, lydoptagelse, tv, webcast etc. @da
toolkit label: produktionsselskab af @da
toolkit definition: Værk, som involverer et ansvar for økonomisk, teknisk og organisatorisk ledelse af en produktion beregnet til scene, lærred lydoptagelse, tv, webcast etc. @da
label: és empresa de producció de @ca
definition: Relaciona una entitat corporativa amb una obra que implica una responsabilitat en la gestió dels aspectes financers, tècnics i organitzatius d’una producció d’un espectacle, d’una pel·lícula, d’un enregistrament àudio, d’un programa de televisió, d’una emissió web, etc. @ca
toolkit label: empresa de producció de @ca
toolkit definition: Obra que implica una responsabilitat en la gestió dels aspectes financers, tècnics i organitzatius d’una producció d’un espectacle, d’una pel·lícula, d’un enregistrament àudio, d’un programa de televisió, d’una emissió web, etc. @ca
definition: Liittää yhteisön teokseen, jossa yhteisö on vastuussa näyttämö-, elokuva-, äänite-, televisio-, suoratoistolähetys- tms. tuotannon taloudellisesta, teknisestä ja organisatorisesta johtamisesta.
toolkit label: tuotantoyhtiö teoksessa
toolkit definition: Teos, jossa yhteisö on vastuussa näyttämö-, elokuva-, äänite-, televisio-, suoratoistolähetys- tms. tuotannon taloudellisesta, teknisestä ja organisatorisesta johtamisesta.
toolkit label: produksjonsselskap for @no
toolkit definition: Et verk som involverer ansvar for administrasjon av de økonomiske, tekniske og organisatoriske aspektene ved en produksjon for scene, film eller fjernsyn, lydinnspilling, webcast, etc. @no
label: ist Produktionsfirma von @de
has element type: 2
label: produkciós cége a következőnek: @hu
definition: Hozzákapcsol egy testületet egy műhöz, amelyhez hozzátartozik a testület felelőssége egy színpadi produkció, film, hangfelvétel, televíziós, webes közvetítés, stb. pénzügyi, technikai és szervezeti vonatkozásának irányításáért. @hu
toolkit label: produkciós cége a következőnek: @hu
toolkit definition: Egy mű felelőssége egy színpadi produkció, film, hangfelvétel, televíziós, webes közvetítés, stb. pénzügyi, technikai és szervezeti vonatkozásának irányításáért. @hu
alternative label: tuotantoyhtiönä teoksessa
label: er produksjonsselskap for @no
definition: Relaterer en korporasjon til et verk som involverer ansvar for administrasjon av de økonomiske, tekniske og organisatoriske aspektene ved en produksjon for scene, film eller fjernsyn, lydinnspilling, webcast, etc. @no
label: is productiebedrijf van @nl
definition: Relateert een corporatie aan een werk dat met zich meebrengt een verantwoordelijkheid voor het beheer van de financiële, technische en organisatorische aspecten van een productie voor toneel, scherm, geluidsopname, televisie, webcast etc. @nl
toolkit label: productiebedrijf van @nl
toolkit definition: Een werk dat met zich meebrengt een verantwoordelijkheid voor het beheer van de financiële, technische en organisatorische aspecten van een productie voor toneel, scherm, geluidsopname, televisie, webcast etc. @nl
label: هي شركة إنتاج لـ @ar
definition: يربط هيئة بعمل يترتب عليه تحملها مسئولية إدارة الجوانب المالية والتقنية والتنظيمية لإنتاج أُعد لمسرح، أو لشاشة عرض، أو لتسجيل صوتي، أو لتلفزيون، أو لبث عبر الإنترنت، إلخ. @ar
toolkit label: شركة إنتاج لـ @ar
toolkit definition: عمل يترتب عليه تحمل مسئولية إدارة الجوانب المالية والتقنية والتنظيمية لإنتاج أُعد لمسرح، أو لشاشة عرض، أو لتسجيل صوتي، أو لتلفزيون، أو لبث عبر الإنترنت، إلخ. @ar
label: produktsioonifirma teoses @et
definition: Seostab asutuse teosega, mis sisaldab vastutust lavastuste, filmide, helisalvestiste, telesaadete, veebiülekannete jms tootmise finantsilise, tehnilise ja korraldusliku juhtimise eest. @et
toolkit label: produktsioonifirma teoses @et
toolkit definition: Teos, mis sisaldab vastutust lavastuste, filmide, helisalvestiste, telesaadete, veebiülekannete jms tootmise finantsilise, tehnilise ja korraldusliku juhtimise eest. @et
label: è società di produzione di @it
definition: Correla un ente a un'opera che implica la responsabilità di gestione di aspetti finanziari, tecnici e organizzativi di una produzione di una messa in scena, proiezione, registrazione del suono, televisione, trasmissione via web, etc. @it
toolkit label: società di produzione di @it
toolkit definition: Opera che implica la responsabilità di gestione di aspetti finanziari, tecnici e organizzativi di una produzione di una messa in scena, proiezione, registrazione del suono, televisione, trasmissione via web, etc. @it
label: ir producentu kompānija @lv
definition: Sasaista institūciju ar darbu, kas ietver institūcijas atbildību par teātra, filmas, mūzikas ierakstu televīzijas, tīmekļa pārraides u.tml. finansiālu, tehnisku un organizatorisku vadību. @lv
toolkit label: ir producentu kompānija @lv
toolkit definition: Darbs, kas ietver institūcijas atbildību par teātra, filmas, mūzikas ierakstu televīzijas, tīmekļa pārraides u.tml. finansiālu, tehnisku un organizatorisku vadību. @lv
label: 是……的制作公司 @zh-hans
definition: 将一个团体与一种涉及舞台、播放、录音、网络直播等制作的资金、技术和组织方面管理责任的作品关联起来。 @zh-hans
toolkit label: ……的制作公司 @zh-hans
toolkit definition: 一种涉及舞台、播放、录音、网络直播等制作的资金、技术和组织方面管理责任的作品 @zh-hans
label: yapım şirketidir @tr
definition: Bir tüzel kişiyi, sahne, ekran, ses kaydı, televizyon, web yayını vb. için bir prodüksi̇yonun finansal, teknik ve organizasyonel yönlerini yönetme sorumluluğunu içeren bir eserle ilişkilendirir. @tr
toolkit label: Üretim şi̇rketi̇ @tr
toolkit definition: Sahne, ekran, ses kaydı, televizyon, web yayını vb. için bir prodüksiyonun finansal, teknik ve organizasyonel yönlerini yönetme sorumluluğunu içeren bir eser @tr
has subproperty: P50005

kuolinpaikka
status: Published
label: has place of death @en
definition: Relates a person to a place where a person dies. @en
type: Property
domain: C10004
lexical alias: placeOfDeath.en
instruction number: 9.9
toolkit label: place of death @en
toolkit definition: A place where a person dies. @en
label: a pour lieu de décès @fr
definition: Met une personne en relation avec un lieu où une personne meurt. @fr
toolkit label: lieu de décès @fr
toolkit definition: Lieu où une personne meurt. @fr
toolkit label: lugar de fallecimiento @es
toolkit definition: El poblado, ciudad, provincia, estado y/o país en el que murió la persona. @es
label: har dödsort @sv
toolkit label: dödsort @sv
label: έχει τόπο θανάτου @el
definition: Συνδέει ένα φυσικό πρόσωπο με μια πόλη, επαρχία, πολιτεία/κράτος ή και χώρα, όπου απεβίωσε ένα φυσικό πρόσωπο. @el
toolkit label: τόπος θανάτου @el
toolkit definition: Μια πόλη, επαρχία, πολιτεία/κράτος ή/και χώρα, όπου απεβίωσε ένα φυσικό πρόσωπο. @el
definition: Setzt eine Person in Beziehung zu einem Geografikum, in dem eine Person stirbt. @de
toolkit label: Sterbeort @de
toolkit definition: Ein Geografikum, in dem eine Person stirbt. @de
label: har dødssted @da
definition: Relaterer en person til et sted, hvor en person dør. @da
toolkit label: dødssted @da
toolkit definition: Sted, hvor en person dør. @da
label: té com a lloc de defunció @ca
definition: Relaciona una persona amb un lloc on mor una persona. @ca
toolkit label: lloc de defunció @ca
toolkit definition: Lloc on mor una persona. @ca
definition: Liittää henkilön paikkaan, jossa henkilö kuoli.
toolkit label: kuolinpaikka
toolkit definition: Paikka, jossa henkilö kuoli.
toolkit definition: Et sted hvor en person døde. @no
label: hat Sterbeort @de
sub property of: henkilöön liittyvä paikka
has element type: 3
label: halálozásának helye a következő: @hu
definition: Hozzákapcsol egy személyt egy helyhez, ahol egy személy elhunyt. @hu
toolkit label: halálozási hely: @hu
toolkit definition: Egy hely, ahol egy személy elhunyt. @hu
definition: Relaterer en person til et sted hvor en person døde. @no
label: heeft plaats van overlijden @nl
definition: Relateert een persoon aan een plaats waar een persoon sterft. @nl
toolkit label: plaats van overlijden @nl
toolkit definition: Een plaats waar een persoon sterft. @nl
label: له مكان وفاة @ar
definition: يربط شخصا بمكان توفي فيه شخص. @ar
toolkit label: مكان الوفاة @ar
toolkit definition: مكان يتوفى فيه شخص. @ar
label: surmakoht @et
definition: Seostab isiku kohaga, kus isik suri. @et
toolkit label: surmakoht @et
toolkit definition: Koht, kus isik suri. @et
label: ha come luogo di morte @it
definition: Correla una persona a un luogo dove una persona è morta. @it
toolkit label: luogo di morte @it
toolkit definition: Luogo dove una persona è morta. @it
label: miršanas vieta @lv
definition: Sasaista personu ar vietu, kur persona mirusi. @lv
toolkit label: miršanas vieta @lv
toolkit definition: Personas miršanas vieta. @lv
label: 有去世地点 @zh-hans
definition: 将一个个人与一个个人去世的地点关联起来。 @zh-hans
toolkit label: 去世地点 @zh-hans
toolkit definition: 一个个人去世的地点 @zh-hans
label: ölüm yeri ile ilişkilidir @tr
definition: Bir kişiyi, kişinin öldüğü yer ile ilişkilendirir. @tr
toolkit label: ölüm yeri @tr
toolkit definition: Bir kişinin öldüğü yer. @tr
has subproperty: P50118

kuolinaika
status: Published
label: has date of death @en
definition: Relates a person to a timespan during which a person died. @en
type: Property
domain: C10004
sub property of: henkilöön liittyvä ajanjakso
lexical alias: dateOfDeath.en
instruction number: 9.3.3
toolkit label: date of death @en
toolkit definition: A timespan during which a person died. @en
label: a pour date de décès @fr
definition: Met une personne en relation avec un laps de temps pendant lequel une personne est morte. @fr
scope note: Une date de décès peut aussi inclure le mois ou le mois et le jour de la mort de la personne. @fr
toolkit label: date de décès @fr
toolkit definition: Laps de temps pendant lequel une personne est morte. @fr
toolkit label: fecha de fallecimiento @es
toolkit definition: El año en que murió la persona. @es
label: har dödstid @sv
toolkit label: dödstid @sv
label: έχει χρονολογία θανάτου @el
definition: Συνδέει ένα φυσικό πρόσωπο με τη χρονολογία θανάτου ενός φυσικού προσώπου. @el
toolkit label: χρονολογία θανάτου @el
toolkit definition: Μια χρονολογία θανάτου ενός φυσικού προσώπου. @el
definition: Setzt eine Person in Beziehung zu einem Zeitraum, in dem eine Person gestorben ist. @de
scope note: Zum Sterbedatum können auch der Monat oder der Monat und der Tag des Todes der Person gehören. @de
toolkit label: Sterbedatum @de
toolkit definition: Ein Zeitraum, in dem eine Person gestorben ist. @de
label: har dødsdato @da
definition: Relaterer en person til en tidsperiode, hvorunder en person døde. @da
scope note: Dødsår kan også inkludere den måned, eller måned og dag, personen døde. @da
toolkit label: dødsdato @da
toolkit definition: Tidsperiode, hvorunder en person døde. @da
label: té com a data de defunció @ca
definition: Relaciona una persona amb un interval de temps durant el qual va morir una persona. @ca
toolkit label: data de defunció @ca
toolkit definition: Interval de temps durant el qual va morir una persona. @ca
definition: Liittää henkilön ajanjaksoon, jolloin henkilö kuoli.
scope note: Kuolinaika voi sisältää myös kuukauden tai kuukauden ja päivän.
toolkit label: kuolinaika
toolkit definition: Ajanjakso, jolloin henkilö kuoli.
toolkit definition: Et tidrom hvor en person døde. @no
label: hat Sterbedatum @de
scope note: Η χρονολογία του θανάτου μπορεί επίσης να περιλαμβάνει τον μήνα ή τον μήνα και την ημέρα του θανάτου του φυσικού προσώπου. @el
has element type: 3
label: halálozásának időpontja a következő: @hu
definition: Hozzákapcsol egy személyt egy időszakhoz, amelynek folyamán egy személy meghalt. @hu
toolkit label: halálozás időpontja: @hu
toolkit definition: Egy időtartam, amely folyamán egy személy meghalt. @hu
definition: Relaterer en person til et tidrom hvor en person døde. @no
label: heeft datum van overlijden @nl
definition: Relateert een persoon aan een tijdspanne gedurende welke een persoon stierf. @nl
toolkit label: datum van overlijden @nl
toolkit definition: Een tijdspanne gedurende welke een persoon stierf. @nl
label: له تاريخ وفاة @ar
definition: يربط شخصا بفترة زمنية توفي خلالها شخص. @ar
toolkit label: تاريخ الوفاة @ar
toolkit definition: الفترة الزمنية التي توفي خلالها الشخص. @ar
label: surmadaatum @et
definition: Seostab isiku ajavahemikuga, millal isik suri. @et
toolkit label: surmadaatum @et
toolkit definition: Ajavahemik, millal isik suri. @et
label: ha come data di morte @it
definition: Correla una persona a un arco di tempo nel quale una persona è morta. @it
toolkit label: data di morte @it
toolkit definition: Arco di tempo nel quale una persona è morta. @it
label: miršanas datējums @lv
definition: Sasaista personu ar laikposmu, kurā persona nomira. @lv
toolkit label: miršanas datējums @lv
toolkit definition: Laikposms, kurā persona nomira. @lv
label: 有去世日期 @zh-hans
definition: 将一个个人与一个个人去世的时间段关联起来。 @zh-hans
toolkit label: 去世日期 @zh-hans
toolkit definition: 一个个人去世的时间段 @zh-hans
label: ölüm tarihi ile ilişkilidir @tr
definition: Bir kişiyi, kişinin öldüğü zaman aralığı ile ilişkilendirir. @tr
toolkit label: ölüm tarihi @tr
toolkit definition: Kişinin öldüğü zaman aralığı. @tr
has subproperty: P50120

paikallinen tytäryhtiö
status: Published
type: Property
label: has local affiliate @en
lexical alias: localAffiliate.en
definition: Relates a corporate body to a corporate body that is local who is affiliated with a broader body which acts for it and others at a broader organizational level. @en
domain: C10005
toolkit label: local affiliate @en
toolkit definition: A corporate body that is local who is affiliated with a broader body which acts for it and others at a broader organizational level. @en
label: a pour collectivité affiliée locale @fr
definition: Met une collectivité en relation avec une collectivité locale qui est affiliée à une collectivité plus vaste agissant pour elle et pour d’autres à un niveau organisationnel plus vaste. @fr
toolkit label: collectivité affiliée locale @fr
toolkit definition: Collectivité locale qui est affiliée à une collectivité plus vaste agissant pour elle et pour d’autres à un niveau organisationnel plus vaste. @fr
toolkit label: afiliado local @es
toolkit definition: Una entidad corporativa afiliada a otra más amplia que actúa para ella y para otras en un nivel organizacional más amplio. @es
instruction number: 29.5
label: έχει τοπική σύνδεση @el
definition: Συνδέει ένα συλλογικό όργανο με ένα τοπικό συλλογικό όργανο συνδεδεμένο με ένα ευρύτερο όργανο, το οποίο ενεργεί εκ μέρους του και άλλων σε ένα ευρύτερο οργανωτικό επίπεδο. @el
toolkit label: τοπική σύνδεση @el
toolkit definition: Ένα τοπικό συλλογικό όργανο συνδεδεμένο με ένα ευρύτερο όργανο, το οποίο ενεργεί εκ μέρους του και άλλων σε ένα ευρύτερο οργανωτικό επίπεδο. @el
definition: Setzt eine Körperschaft in Beziehung zu einer lokalen Körperschaft, die mit einem Dachverband verbunden ist, der für sie und andere auf einer größeren organisatorischen Ebene handelt. @de
toolkit label: Lokaler Partner @de
toolkit definition: Eine lokale Körperschaft, die mit einem Dachverband verbunden ist, der für sie und andere auf einer größeren organisatorischen Ebene handelt. @de
label: har lokal filial @da
definition: Relaterer en korporation til en lokal korporation, som er tilknyttet et bredere organ, som agerer for den og andre på et bredere organisatorisk niveau. @da
toolkit label: lokal filial @da
toolkit definition: Lokal korporation, som er tilknyttet et bredere organ, som agerer for den og andre på et bredere organisatorisk niveau. @da
label: té com a entitat afiliada local @ca
definition: Relaciona una entitat corporativa amb una entitat corporativa que és local que està afiliada amb una entitat més àmplia que actua per a aquella i per a altres entitats en un nivell organitzatiu més ampli. @ca
toolkit label: entitat afiliada local @ca
toolkit definition: Entitat corporativa que és local que està afiliada amb una entitat més àmplia que actua per a aquella i per a altres entitats en un nivell organitzatiu més ampli. @ca
definition: Liittää yhteisön paikalliseen yhteisöön, jolla on yhteys emoyhtiön edustamaan laajempaan organisaatioon.
toolkit label: paikallinen tytäryhtiö
toolkit definition: Paikallinen yhteisö, jolla on yhteys emoyhtiön edustamaan laajempaan organisaatioon.
toolkit label: lokal tilknyttet korporasjon @no
toolkit definition: En lokal korporasjon tilknyttet en overordnet korporasjon som handler på dens og andres vegne på et høyere organisasjonsnivå. @no
label: hat lokalen Partner @de
has element type: 2
sub property of: yhteisöön liittyvä yhteisö
label: helyi tagszervezete a következő: @hu
definition: Hozzákapcsol egy testületet egy helyi testülethez, amely része egy felettes testületnek, amely annak és másoknak az érdekében cselekszik szélesebb szervezeti szinten. @hu
toolkit label: helyi tagszervezet: @hu
toolkit definition: Egy helyi testület, amely része egy felettes testületnek, amely annak és másoknak az érdekében cselekszik szélesebb szervezeti szinten. @hu
label: har lokal tilknyttet korporasjon @no
definition: Relaterer en korporasjon til en lokal korporasjon tilknyttet en overordnet korporasjon som handler på dens og andres vegne på et høyere organisasjonsnivå. @no
label: heeft lokaal aangeslotene @nl
definition: Relateert een corporatie aan een lokale corporatie die aangesloten is bij een breder orgaan dat optreedt voor zichzelf en anderen op een breder organisatorisch niveau. @nl
toolkit label: lokaal aangeslotene @nl
toolkit definition: Een lokale corporatie die aangesloten is bij een breder orgaan dat optreedt voor zichzelf en anderen op een breder organisatorisch niveau. @nl
label: لها تابع محلي @ar
definition: يربط هيئة بهيئة محلية تابعة لهيئة أوسع نطاقا، تعمل لصالحها ولهيئات أخرى على مستوى تنظيمي أوسع. @ar
toolkit label: تابع محلي @ar
toolkit definition: هيئة محلية تابعة لهيئة أوسع نطاقا، تعمل لصالحها ولهيئات أخرى على مستوى تنظيمي أوسع. @ar
label: kohalik sidusasutus @et
definition: Seostab asutuse kohaliku asutusega, mis on seotud suurema asutusega, mis tegutseb kohaliku sidusasutuse ja teiste jaoks laiemal organisatsioonilisel tasandil. @et
toolkit label: kohalik sidusasutus @et
toolkit definition: Kohalik asutus, mis on seotud suurema asutusega, mis tegutseb kohaliku sidusasutuse ja teiste jaoks laiemal organisatsioonilisel tasandil. @et
label: ha come affiliato locale @it
definition: Correla un ente a un ente locale che è affiliato con un ente più ampio che agisce per esso e altri a un livello organizzativo più ampio. @it
toolkit label: affiliato locale @it
toolkit definition: Ente locale affiliato con un ente più ampio che agisce per esso e altri a un livello organizzativo più ampio. @it
label: institūcijas filiāle @lv
definition: Sasaista institūciju ar lokālas nozīmes institūciju, kas ir filiāle plašākai institūcijai. @lv
toolkit label: institūcijas filiāle @lv
toolkit definition: Lokālas nozīmes institūcija, kas ir filiāle plašākai institūcijai. @lv
label: 有本地隶属 @zh-hans
definition: 将一个团体与作为本地的并隶属于一个更广泛的团体、为其并为一个更广泛的组织层次其他团体行为的一个团体关联起来。 @zh-hans
toolkit label: 本地隶属 @zh-hans
toolkit definition: 作为本地的并隶属于一个更广泛的团体、为其并为一个更广泛的组织层次其他团体行为的一个团体 @zh-hans
label: yerel bağlı kuruluş ile ilişkilidir @tr
definition: Bir tüzel kişiyi, kendisi ve daha geniş bir organizasyonel düzeyde diğerleri için hareket eden daha geniş bir kuruluşa bağlı olan yerel bir tüzel kuruluşla ilişkilendirir. @tr
toolkit label: Yerel bağlı kuruluş @tr
toolkit definition: Kendisi ve diğerleri için daha geniş bir örgütsel düzeyde hareket eden daha geniş bir kuruma bağlı yerel bir tüzel kişilik. @tr
has subproperty: P50241

periytyvä arvonimi
status: Published
label: has hereditary term of honour @en
definition: Relates a family to a word or phrase indicative of royalty, nobility, etc., associated with a family. @en
type: Property
domain: C10008
lexical alias: hereditaryTermOfHonour.en
instruction number: 10.7
toolkit label: hereditary term of honour @en
toolkit definition: A word or phrase indicative of royalty, nobility, etc., associated with a family. @en
label: a pour terme d’honneur héréditaire @fr
definition: Met une famille en relation avec un mot ou une locution qui indique la royauté, la noblesse, etc. et qui est associé à une famille. @fr
toolkit label: terme d’honneur héréditaire @fr
toolkit definition: Mot ou locution qui indique la royauté, la noblesse, etc. et qui est associé à une famille. @fr
toolkit label: título hereditario @es
toolkit definition: Un título de nobleza, etc., asociado con una familia. @es
label: har ärvd titel @sv
toolkit label: ärvd titel @sv
label: έχει κληρονομικό όρο τιμής @el
definition: Συνδέει μια οικογένεια με έναν τίτλο ευγενείας κ.λπ. συνδεδεμένο με μια οικογένεια. @el
toolkit label: κληρονομικός όρος τιμής @el
toolkit definition: Ένας τίτλος ευγενείας κ.λπ. συνδεδεμένος με μια οικογένεια. @el
definition: Setzt eine Familie in Beziehung zu einem Wort oder einer Phrase, das/die mit einer Familie in Verbindung steht und auf die Zugehörigkeit zu einem Fürstentum, zum Adel und so weiter hinweist. @de
toolkit label: Erbtitel @de
toolkit definition: Ein Wort oder eine Phrase, das/die mit einer Familie in Verbindung steht und auf die Zugehörigkeit zu einem Fürstentum, zum Adel und so weiter hinweist. @de
label: har nedarvet æresbevisning @da
definition: Relaterer en familie til et ord eller udtryk, som indikerer kongeslægt, adelslægt etc., som er knyttet til en familie. @da
toolkit label: nedarvet æresbevisning @da
toolkit definition: Ord eller udtryk, som indikerer kongeslægt, adelslægt etc., som er knyttet til en familie. @da
label: té com a terme honorífic hereditari @ca
definition: Relaciona una família amb una paraula o frase indicativa de reialesa, noblesa, etc., associada amb una família. @ca
toolkit label: terme honorífic hereditari @ca
toolkit definition: Paraula o frase indicativa de reialesa, noblesa, etc., associada amb una família. @ca
definition: Liittää suvun sanaan tai ilmaukseen, joka osoittaa suvun kuninkaallista, aatelis- tms. arvoa.
toolkit label: periytyvä arvonimi
toolkit definition: Sana tai ilmaus, joka osoittaa suvun kuninkaallista, aatelis- tms. arvoa.
toolkit label: arvet hedersbetegnelse @no
toolkit definition: Et ord eller en frase som antyder tilknytning til kongehus, adel etc. som forbindes med en familie. @no
label: hat Erbtitel @de
has element type: 3
label: hódolat örökletes kifejezése a következő: @hu
definition: Hozzákapcsol egy családot egy szóhoz vagy kifejezéshez, amely társulva egy családdal, királyi, nemesi stb. címre utal. @hu
toolkit label: hódolat örökletes kifejezése: @hu
toolkit definition: Egy szó vagy kifejezés, amely társulva egy családdal, királyi, nemesi stb. címre utal. @hu
alternative label: hereditary title @en
alternative label: hereditary term of honor @en
label: har arvet hedersbetegnelse @no
definition: Relaterer en familie til et ord eller en frase som antyder tilknytning til kongehus, adel etc. som forbindes med en familie. @no
label: heeft erfelijke term van eer @nl
definition: Relateert een familie aan een woord of uitdrukking wijzend op koningschap, adel etc, geassocieerd met een familie. @nl
toolkit label: erfelijke term van eer @nl
toolkit definition: Een woord of uitdrukking wijzend op koningschap, adel etc, geassocieerd met een familie. @nl
label: له لقب شرف متوارث @ar
definition: يربط عائلة بكلمة أو عبارة تدل على الملكية والنبالة الخ، مرتبطة بعائلة. @ar
toolkit label: لقب شرف متوارث @ar
toolkit definition: كلمة أو عبارة تدل على الملكية والنبالة الخ، مرتبطة بعائلة. @ar
label: pärilik tiitel @et
definition: Seostab perekonna sõna või väljendiga, mis näitab perekonna kuninglikku seisust, aadliseisust vms. @et
toolkit label: pärilik tiitel @et
toolkit definition: Sõna või väljend, mis näitab perekonna kuninglikku seisust, aadliseisust vms. @et
label: ha come titolo ereditario d'onore @it
definition: Correla una famiglia a una parola o frase indicativa di regalità, nobiltà, etc. associata a una famiglia. @it
toolkit label: titolo ereditario d'onore @it
toolkit definition: Parola o frase indicativa di regalità, nobiltà, etc. associata a una famiglia. @it
label: pārmantotais tituls @lv
definition: Sasaista dzimtu/ģimeni ar vārdu vai frāzi, kas norāda uz aristokrātiju u.tml., kas saistīts ar dzimtu/ģimeni. @lv
toolkit label: pārmantotais tituls @lv
toolkit definition: Vārds vai frāze, kas norāda uz aristokrātiju u.tml., kas saistīts ar dzimtu/ģimeni. @lv
alternative label: لقب شرف متوارث @ar
alternative label: arvelig æresperiode @da
label: 有世袭头衔 @zh-hans
definition: 将一个家族与表示皇室、贵族等与家族相关的一个单词或短语关联起来。 @zh-hans
toolkit label: 世袭荣誉称号 @zh-hans
toolkit definition: 表示皇室、贵族等与家族相关的一个单词或短语 @zh-hans
alternative label: título hereditario @es
alternative label: término honorífico hereditario @es
alternative label: 世袭头衔 @zh-hans
alternative label: 世袭荣誉称号 @zh-hans
alternative label: terme honorifique héréditaire @fr
alternative label: titre héréditaire @fr
toolkit label: soyluluk unvanı ile ilişkilidir @tr

alayhteisö
status: Published
label: has hierarchical subordinate @en
definition: Relates a corporate body to a corporate body who is subordinate to another corporate body. @en
type: Property
domain: C10005
lexical alias: hierarchicalSubordinate.en
toolkit label: hierarchical subordinate @en
toolkit definition: A corporate body who is subordinate to another corporate body. @en
label: a pour subordonné hiérarchique @fr
definition: Met une collectivité en relation avec une collectivité qui est subordonnée à une autre collectivité. @fr
toolkit label: subordonné hiérarchique @fr
toolkit definition: Collectivité qui est subordonnée à une autre collectivité. @fr
toolkit label: subordinada jerárquica @es
toolkit definition: Una entidad corporativa que es subordinada a otra entidad corporativa. @es
instruction number: 29.5
label: έχει ιεραρχικά υποτασσόμενο @el
definition: Συνδέει ένα συλλογικό όργανο με ένα συλλογικό όργανο το οποίο υπόκειται σε κάποιο άλλο συλλογικό όργανο. @el
toolkit label: ιεραρχικά υποτασσόμενο @el
toolkit definition: Ένα συλλογικό όργανο το οποίο υπόκειται κάποιο άλλο συλλογικό όργανο. @el
definition: Setzt eine Körperschaft in Beziehung zu einer Körperschaft, die einer anderen Körperschaft untergeordnet ist. @de
toolkit label: Untergeordnete Körperschaft @de
toolkit definition: Eine Körperschaft, die einer anderen Körperschaft untergeordnet ist. @de
label: har hierarkisk underordnet @da
definition: Relaterer en korporation til en korporation, som er underordnet en anden korporation. @da
toolkit label: hierarkisk underordnet @da
toolkit definition: Korporation, som er underordnet en anden korporation. @da
label: té com a subordinat jeràrquic @ca
definition: Relaciona una entitat corporativa amb una entitat corporativa que està subordinada a una altra entitat corporativa. @ca
toolkit label: subordinat jeràrquic @ca
toolkit definition: Entitat corporativa que està subordinada a una altra entitat corporativa. @ca
definition: Liittää yhteisön yhteisöön, joka on hierarkkisesti toisen yhteisön alainen.
toolkit label: alayhteisö
toolkit definition: Yhteisö, joka on hierarkkisesti toisen yhteisön alainen.
toolkit definition: En korporasjon som er underordnet en annen korporasjon. @no
label: hat untergeordnete Körperschaft @de
has element type: 2
sub property of: yhteisöön liittyvä yhteisö
label: hierarchikus alárendeltje a következő: @hu
definition: Hozzákapcsol egy testületet, amely egy másik testület hierarchikus alárendeltje, egy testülethez. @hu
toolkit label: hierarchikus alárendeltje: @hu
toolkit definition: Egy testület, amely egy másik testület hierarchikus alárendeltje. @hu
definition: Relaterer en korporasjon til en korporasjon som er underordnet en annen korporasjon. @no
label: heeft dochteronderneming @nl
definition: Relateert een corporatie aan een corporatie die ondergeschikt is aan een andere corporatie. @nl
toolkit label: dochteronderneming @nl
toolkit definition: Een corporatie die ondergeschikt is aan een andere corporatie. @nl
label: لها هيئة أدنى في التسلسل الهرمي @ar
definition: يربط هيئة بهيئة هي أدنى من هيئة أخرى. @ar
toolkit label: أدنى رتبة في التسلسل الهرمي @ar
toolkit definition: هيئة أدنى من هيئة أخرى. @ar
label: allasutus @et
definition: Seostab asutuse asutusega, mis allub teisele asutusele. @et
toolkit label: allasutus @et
toolkit definition: Asutus, mis allub teisele asutusele. @et
label: ha come subordinato gerarchico @it
definition: Correla un ente a un ente subordinato un altro un ente. @it
toolkit label: subordinato gerarchico @it
toolkit definition: Ente subordinato a un altro ente. @it
label: pakļautības institūcija @lv
definition: Sasaista institūciju ar institūciju, kas ir pakļauta citai institūcijai. @lv
toolkit label: pakļautības institūcija @lv
toolkit definition: Institūcija, kas ir pakļauta citai institūcijai. @lv
label: 有下级团体 @zh-hans
definition: 将一个团体与另一个团体的下级团体关联起来。 @zh-hans
toolkit label: 下级团体 @zh-hans
toolkit definition: 另一个团体的下级团体 @zh-hans
label: hiyerarşik olarak bağlı alt kuruluş ile ilişkilidir @tr
definition: Bir tüzel kişiyi, başka bir tüzel kişiye bağlı olan bir tüzel kişiyle ilişkilendirir. @tr
toolkit label: hiyerarşik olarak bağlı alt kuruluş ile ilişkilidir @tr
toolkit definition: Başka bir tüzel kişiye bağlı olan bir tüzel kişi @tr
has subproperty: P50010

kattoyhteisö
status: Published
label: has hierarchical superior @en
definition: Relates a corporate body to a corporate body who is hierarchically superior to another corporate body. @en
type: Property
domain: C10005
lexical alias: hierarchicalSuperior.en
toolkit label: hierarchical superior @en
toolkit definition: A corporate body who is hierarchically superior to another corporate body. @en
label: a pour supérieur hiérarchique @fr
definition: Met une collectivité en relation avec une collectivité qui est hiérarchiquement supérieure à une autre collectivité. @fr
toolkit label: supérieur hiérarchique @fr
toolkit definition: Collectivité qui est hiérarchiquement supérieure à une autre collectivité. @fr
toolkit label: superior jerárquica @es
toolkit definition: Una entidad corporativa que es jerárquicamente superior a otra entidad corporativa. @es
instruction number: 29.5
label: έχει ιεραρχικά ανώτερο @el
definition: Συνδέει ένα συλλογικό όργανο με ένα συλλογικό όργανο το οποίο είναι ιεραρχικά ανώτερο από κάποιο άλλο συλλογικό όργανο. @el
toolkit label: ιεραρχικά ανώτερος @el
toolkit definition: Ένα συλλογικό όργανο το οποίο είναι ιεραρχικά ανώτερο από κάποιο άλλο συλλογικό όργανο. @el
definition: Setzt eine Körperschaft in Beziehung zu einer Körperschaft, die einer anderen Körperschaft übergeordnet ist. @de
toolkit label: Übergeordnete Körperschaft @de
toolkit definition: Eine Körperschaft, die einer anderen Körperschaft übergeordnet ist. @de
label: har hierarkisk overordnet @da
definition: Relaterer en korporation til en korporation, som er hierarkisk overordnet en anden korporation. @da
toolkit label: hierarkisk overordnet @da
toolkit definition: Korporation, som er hierarkisk overordnet en anden korporation. @da
label: té com a superior jeràrquic @ca
definition: Relaciona una entitat corporativa amb una entitat corporativa que és jeràrquicament superior a una altra entitat corporativa. @ca
toolkit label: superior jeràrquic @ca
toolkit definition: Entitat corporativa que és jeràrquicament superior a una altra entitat corporativa. @ca
definition: Liittää yhteisön yhteisöön, joka on hierarkkisesti ylempänä toista yhteisöä.
toolkit label: kattoyhteisö
toolkit definition: Yhteisö, joka on hierarkkisesti ylempänä toista yhteisöä.
toolkit definition: En korporasjon som er hierarkisk overordnet en annen korporasjon. @no
label: hat übergeordnete Körperschaft @de
has element type: 2
sub property of: yhteisöön liittyvä yhteisö
label: hierarchikus felettese a következő: @hu
definition: Hozzákapcsol egy testületet, amely egy másik testület hierarchikus felettese, egy testülethez. @hu
toolkit label: hierarchikus felettese: @hu
toolkit definition: Egy testület, amely egy másik testület hierarchikus felettese. @hu
definition: Relaterer en korporasjon til en korporasjon som er hierarkisk overordnet en annen korporasjon. @no
label: heeft moederonderneming @nl
definition: Relateert een corporatie aan een corporatie die hiërarchisch hoger staat ten opzichte van een andere corporatie. @nl
toolkit label: moederonderneming @nl
toolkit definition: Een corporatie die hiërarchisch hoger staat ten opzichte van een andere corporatie. @nl
label: لها هيئة أعلى في التسلسل الهرمي @ar
definition: يربط هيئة بهيئة أعلى من هيئة أخرى في التسلسل الهرمي. @ar
toolkit label: أعلى رتبة في التسلسل الهرمي @ar
toolkit definition: هيئة أعلى من هيئة أخرى في التسلسل الهرمي. @ar
label: kõrgem asutus @et
definition: Seostab asutuse asutusega, mis on teise asutuse suhtes ülem. @et
toolkit label: kõrgem asutus @et
toolkit definition: Asutus, mis on teise asutuse suhtes ülem. @et
label: ha come superiore gerarchico @it
definition: Correla un ente a un ente gerarchicamente superiore a un altro un ente. @it
toolkit label: superiore gerarchico @it
toolkit definition: Ente gerarchicamente superiore a un altro un ente. @it
label: augstākstāvoša institūcija @lv
definition: Sasaista institūciju ar institūciju, kas ir augstākstāvoša pār citu institūciju. @lv
toolkit label: augstākstāvoša institūcija @lv
toolkit definition: Institūcija, kas ir augstākstāvoša pār citu institūciju. @lv
label: 有上级团体 @zh-hans
definition: 将一个团体与另一个团体的上级团体关联起来。 @zh-hans
toolkit label: 上级团体 @zh-hans
toolkit definition: 另一个团体的上级团体 @zh-hans
label: hiyerarşik olarak bağlı üst kuruluş ile ilişkilidir @tr
definition: Bir tüzel kişiyi, hiyerarşik olarak başka bir tüzel kişilikden üstün olan bir tüzel kişilikle ilişkilendirir. @tr
toolkit label: hiyerarşik olarak bağlı üst kuruluş ile ilişkilidir @tr
toolkit definition: Başka bir tüzel kişiye hiyerarşik olarak üstün olan bir tüzel kişi. @tr
has subproperty: P50008

kappaleella kunnioitettu toimija kappaleessa
status: Published
label: is honouree agent of item of @en
definition: Relates an agent to an item that marks the esteem of and respect for an agent. @en
type: Property
domain: C10002
sub property of: toimijaan liittyvä kappale
lexical alias: honoureeAgentOfItemOf.en
alternative label: honoree (item) of @en
label: est un agent honoré d’un item de @fr
definition: Met un agent en relation avec un item qui marque l’estime et le respect pour un agent. @fr
toolkit label: agent honoré d’un item de @fr
toolkit definition: Item qui marque l’estime et le respect pour un agent. @fr
toolkit label: honouree agent of item of @en
toolkit definition: An item that marks the esteem of and respect for an agent. @en
instruction number: 18.5
label: είναι τιμώμενος φορέας του αντιτύπου του @el
definition: Συνδέει έναν φορέα, τιμώμενο από ένα αντίτυπο, με ένα αντίτυπο. @el
toolkit label: τιμώμενος φορέας του αντιτύπου του @el
toolkit definition: Ένα αντίτυπο που τιμά έναν φορέα. @el
definition: Setzt einen Akteur in Beziehung zu einem Exemplar, das einen Akteur ehrt. @de
toolkit label: Akteur als Gefeierte/Gefeierter eines Exemplars von @de
toolkit definition: Ein Exemplar, das einen Akteur ehrt. @de
label: er agent, som beæres af eksemplar af @da
definition: Relaterer en agent til et eksemplar, som markerer en hædring af en agent. @da
toolkit label: agent, som beæres af eksemplar af @da
toolkit definition: Eksemplar, som markerer en hædring af en agent. @da
label: és agent homenatjat d’un ítem de @ca
definition: Relaciona un agent amb un ítem que marca l’estima i el respecte per un agent. @ca
toolkit label: agent homenatjat d’un ítem de @ca
toolkit definition: Ítem que marca l’estima i el respecte per un agent. @ca
definition: Liittää toimijan kappaleeseen, joka osoittaa arvostusta ja kunnioitusta toimijalle.
toolkit label: kappaleella kunnioitettu toimija kappaleessa
toolkit definition: Kappale, joka osoittaa arvostusta ja kunnioitusta toimijalle.
toolkit label: beæret agent av eksemplar for @no
toolkit definition: Et eksemplar som markerer aktelse og repekt for en agent. @no
label: ist Akteur als Gefeierte/Gefeierter eines Exemplars von @de
has element type: 2
label: méltatott ágense a következő példánynak: @hu
definition: Hozzákapcsol egy ágenst egy példányhoz, amely jelzi egy ágens megbecsülését és tiszteletét. @hu
toolkit label: Egy példány, amely jelzi egy ágens megbecsülését és tiszteletét. @hu
toolkit definition: méltatottja (példány): @hu
alternative label: honouree (item) of @en
alternative label: honoree agent of item of @en
label: er beæret agent av eksemplar for @no
definition: Relaterer en agent til et eksemplar som markerer aktelse og repekt for en agent. @no
alternative label: beæret av eksemplar for @no
label: is geëerde actor van item van @nl
definition: Relateert een actor aan een item dat toont de waardering en respect voor een actor. @nl
toolkit label: geëerde actor van item van @nl
toolkit definition: Een item dat toont de waardering en respect voor een actor. @nl
label: وكيل مكرم بمفردة @ar
definition: يربط وكيلا بمفردة تدل على تقدير واحترام لوكيل. @ar
toolkit label: وكيل مكرم بمفردة @ar
toolkit definition: مفردة تدل على تقدير واحترام لوكيل. @ar
alternative label: agent, som beæres af eksemplar af @da
label: austusavalduse saaja (tegija) eksemplaris @et
definition: Seostab tegija eksemplariga, mis märgib lugupidamist ja austust tegija vastu. @et
alternative label: austusavalduse saaja eksemplaris @et
toolkit label: austusavalduse saaja (tegija) eksemplaris @et
toolkit definition: Eksemplar, mis märgib lugupidamist ja austust tegija vastu. @et
label: è onorato agente di item di @it
definition: Correla un agente a un item che esprime la stima e il rispetto per un agente. @it
alternative label: agente onorato di item di @it
toolkit label: agente onorato di item di @it
toolkit definition: Item che esprime la stima e il rispetto per un agente. @it
alternative label: τιμώμενος του αντιτύπου του @el
alternative label: agent honoré (item) de @fr
label: aģentu godinošā vienība @lv
definition: Sasaista aģentu ar vienību, ar kuru godināts aģents. @lv
toolkit label: aģentu godinošā vienība @lv
toolkit definition: Vienība, ar kuru godināts aģents. @lv
alternative label: Gefeierter (Exemplar) von @de
label: 是……的单件的被纪念者行为者 @zh-hans
definition: 将一个行为者与表示对一个行为者尊重或尊敬的一个单件关联起来。 @zh-hans
toolkit label: ……的单件的被纪念者行为者 @zh-hans
toolkit definition: 表示对一个行为者尊重或尊敬的一个单件 @zh-hans
alternative label: homenajeado (ítem) de @es
toolkit label: kopyasının onurlandırılan temsilcisidir @tr
toolkit definition: Bir temsilcinin itibarını ve ona duyulan saygıyı gösteren bir kopya. @tr
has subproperty: kappaleella kunnioitettu yhteistoimija kappaleessa

teoksella kunnioitettu toimija teoksessa
status: Published
label: is honouree agent of work of @en
definition: Relates an agent to a work that marks the esteem of and respect for an agent. @en
type: Property
domain: C10002
sub property of: toimijaan liittyvä teos
lexical alias: honoureeAgentOfWorkOf.en
alternative label: honoree of @en
label: est un agent honoré d’une œuvre de @fr
definition: Met un agent en relation avec une œuvre qui marque l’estime et le respect pour un agent. @fr
toolkit label: agent honoré d’une œuvre de @fr
toolkit definition: Œuvre qui marque l’estime et le respect pour un agent. @fr
toolkit label: honouree agent of work of @en
toolkit definition: A work that marks the esteem of and respect for an agent. @en
instruction number: 18.5
label: είναι τιμώμενος φορέας του έργου του @el
definition: Συνδέει έναν φορέα, τιμώμενο από ένα έργο, με ένα έργο. @el
toolkit label: τιμώμενος φορέας του έργου του @el
toolkit definition: Ένα έργο που τιμά έναν φορέα. @el
definition: Setzt einen Akteur in Beziehung zu einem Werk, das einen Akteur ehrt. @de
toolkit label: Akteur als Gefeierte/Gefeierter eines Werks von @de
toolkit definition: Ein Werk, das einen Akteur ehrt. @de
label: er agent, som beæres af værk af @da
definition: Relaterer en agent til et værk, som markerer en hædring af en agent. @da
toolkit label: agent, som beæres af værk af @da
toolkit definition: Værk, som markerer en hædring af en agent. @da
label: és agent homenatjat d’una obra de @ca
definition: Relaciona un agent amb una obra que marca l’estima i el respecte per un agent. @ca
toolkit label: agent homenatjat d’obra de @ca
toolkit definition: Obra que marca l’estima i el respecte per un agent. @ca
definition: Liittää toimijan teokseen, joka osoittaa arvostusta ja kunnioitusta toimijalle.
toolkit label: teoksella kunnioitettu toimija teoksessa
toolkit definition: Teos, joka osoittaa arvostusta ja kunnioitusta toimijalle.
toolkit label: beæret agent av verk for @no
toolkit definition: Et verk som markerer aktelse og respekt for en agent. @no
label: ist Akteur als Gefeierte/Gefeierter eines Werks von @de
has element type: 2
label: méltatott ágense a következő műnek: @hu
definition: Hozzákapcsol egy ágenst egy műhöz, amely jelzi egy ágens megbecsülését és tiszteletét. @hu
toolkit label: Egy mű, amely jelzi egy ágens megbecsülését és tiszteletét. @hu
toolkit definition: méltatottja: @hu
alternative label: honouree of work of @en
alternative label: honoree agent of work of @en
label: er beæret agent av verk for @no
definition: Relaterer en agent til et verk som markerer aktelse og respekt for en agent. @no
alternative label: beæret for @no
label: is geëerde actor van werk van @nl
definition: Relateert een actor aan een werk dat toont de waardering en respect voor een actor. @nl
toolkit label: geëerde actor van werk van @nl
toolkit definition: Een werk dat toont de waardering en respect voor een actor. @nl
label: هو وكيل مكرم بعمل لـ @ar
definition: يربط وكيلا بعمل يدل على تقدير واحترام لوكيل. @ar
alternative label: وكيل مكرم بعمل @ar
toolkit label: وكيل مكرم بعمل @ar
toolkit definition: عمل يدل على تقدير واحترام لوكيل. @ar
alternative label: agent, som beæres af værk af @da
label: austusavalduse saaja (tegija) teoses @et
definition: Seostab tegija teosega, mis märgib lugupidamist ja austust tegija vastu. @et
alternative label: austusavalduse saaja teoses @et
toolkit label: austusavalduse saaja (tegija) teoses @et
toolkit definition: Teos, mis märgib lugupidamist ja austust tegija vastu. @et
label: è onorato agente di opera di @it
definition: Correla un agente a un'opera che esprime la stima e il rispetto per un agente. @it
alternative label: agente onorato di opera di @it
toolkit label: agente onorato di opera di @it
toolkit definition: Opera che esprime la stima e il rispetto per un agente. @it
alternative label: τιμώμενος του @el
alternative label: τιμώμενος του έργου του @el
alternative label: agent honoré de @fr
label: aģentu godinošais darbs @lv
definition: Sasaista aģentu ar darbu, ar kuru godināts aģents. @lv
toolkit label: aģentu godinošais darbs @lv
toolkit definition: Darbs, ar kuru godināts aģents. @lv
alternative label: Gefeierter von @de
label: 是……的作品的被纪念者行为者 @zh-hans
toolkit label: ……的作品的被纪念者行为者 @zh-hans
toolkit definition: 表示对一个行为者尊重或尊敬的一种作品 @zh-hans
toolkit label: eserinin onurlandırılan temsilcisidir @tr
toolkit definition: Bir temsilcinin itibarını ve saygısını simgeleyen bir eser. @tr
has subproperty: teoksella kunnioitettu yhteistoimija teoksessa

kappaleella kunnioitettu yhteistoimija kappaleessa
status: Published
label: is honouree collective agent of item of @en
lexical alias: honoureeCollectiveAgentOfItemOf.en
definition: Relates a collective agent to an item that marks the esteem of and respect for a collective agent. @en
toolkit label: honouree collective agent of item of @en
toolkit definition: An item that marks the esteem of and respect for a collective agent. @en
type: Property
domain: C10011
has element type: 2
alternative label: honoree collective agent of item of @en
sub property of: yhteistoimijaan liittyvä kappale
sub property of: kappaleella kunnioitettu toimija kappaleessa
definition: Liittää yhteistoimijan kappaleeseen, joka osoittaa arvostusta ja kunnioitusta yhteistoimijalle.
toolkit label: kappaleella kunnioitettu yhteistoimija kappaleessa
toolkit definition: Kappale, joka osoittaa arvostusta ja kunnioitusta yhteistoimijalle.
label: er kollektiv agent beæret av eksemplar av @no
definition: Relaterer en kollektiv agent til et eksemplar som markerer aktelse og repekt for en kollektiv agent. @no
toolkit label: kollektiv agent beæret av eksemplar av @no
toolkit definition: Et eksemplar som markerer aktelse og repekt for en kollektiv agent. @no
label: is geëerde collectieve actor van item van @nl
definition: Relateert een collectieve actor aan een item dat toont de waardering en respect voor een collectieve actor. @nl
toolkit label: geëerde collectieve actor van item van @nl
toolkit definition: Een item dat toont de waardering en respect voor een collectieve actor. @nl
label: هو وكيل جماعي مكرم بمفردة لـ @ar
definition: يربط وكيلا جماعيا بمفردة تدل على تقدير واحترام وكيل جماعي. @ar
toolkit label: وكيل جماعي مكرم بمفردة @ar
toolkit definition: مفردة تدل على تقدير واحترام وكيل جماعي. @ar
label: és agent col·lectiu homenatjat d’un ítem de @ca
definition: Relaciona un agent col·lectiu amb un ítem que marca l’estima i el respecte per un agent col·lectiu. @ca
toolkit label: agent col·lectiu homenatjat d’un ítem de @ca
toolkit definition: Ítem que marca l’estima i el respecte per un agent col·lectiu. @ca
label: er kollektiv agent, som beæres af eksemplar af @da
definition: Relaterer en kollektiv agent til et eksemplar, som markerer en hædring af en kollektiv agent. @da
alternative label: kollektiv agent, som er hædersperson i eksemplar af @da
toolkit label: kollektiv agent, som beæres af eksemplar af @da
toolkit definition: Eksemplar, som markerer en hædring af en kollektiv agent. @da
label: austusavalduse saaja (kollektiiv) eksemplaris @et
definition: Seostab kollektiivi eksemplariga, mis märgib lugupidamist ja austust kollektiivi vastu. @et
toolkit label: austusavalduse saaja (kollektiiv) eksemplaris @et
toolkit definition: Eksemplar, mis märgib lugupidamist ja austust kollektiivi vastu. @et
label: ist gemeinschaftlicher Akteur als Gefeierte/Gefeierter eines Exemplars von @de
definition: Setzt einen gemeinschaftlichen Akteur in Beziehung zu einem Exemplar, das einen gemeinschaftlichen Akteur ehrt. @de
toolkit label: Gemeinschaftlicher Akteur als Gefeierte/Gefeierter eines Exemplars von @de
toolkit definition: Ein Exemplar, das einen gemeinschaftlichen Akteur ehrt. @de
label: méltatott kollektív ágense a következő példánynak: @hu
definition: Hozzákapcsol egy kollektív ágenst egy példányhoz, amely jelzi egy kollektív ágens megbecsülését és tiszteletét. @hu
toolkit label: méltatott kollektív ágense a következő példánynak: @hu
toolkit definition: Egy példány, amely jelzi egy kollektív ágens megbecsülését és tiszteletét. @hu
label: è onorato agente collettivo di item di @it
definition: Correla un agente collettivo a un item che esprime la stima e il rispetto per un agente collettivo. @it
alternative label: onorato agente collettivo di item di @it
toolkit label: onorato agente collettivo di item di @it
toolkit definition: Item che esprime la stima e il rispetto per un agente collettivo. @it
label: είναι τιμώμενος συλλογικός φορέας του αντιτύπου του @el
alternative label: τιμώμενος συλλογικός φορέας του αντιτύπου του @el
toolkit label: τιμώμενος συλλογικός φορέας του αντιτύπου του @el
label: est un agent collectif honoré d’un item de @fr
definition: Met un agent collectif en relation avec un item qui marque l’estime et le respect pour un agent collectif. @fr
toolkit label: agent collectif honoré d’un item de @fr
toolkit definition: Item qui marque l’estime et le respect pour un agent collectif. @fr
label: grupu godinošā vienība @lv
definition: Sasaista grupu ar vienību, ar kuru godināta grupa. @lv
toolkit label: grupu godinošā vienība @lv
toolkit definition: Vienība, ar kuru godināta grupa. @lv
alternative label: kunnianosoituksena (kappale)
alternative label: وكيل جماعي مكرم بمفردة لـ @ar
alternative label: ……的单件的被纪念者集体行为者 @zh-hans
label: 是……的单件的被纪念者集体行为者 @zh-hans
definition: 将一个集体行为者与表示对一个集体行为者尊重或尊敬的一个单件关联起来。 @zh-hans
toolkit label: ……的单件的被纪念者集体行为者 @zh-hans
toolkit definition: 表示对一个集体行为者尊重或尊敬的一个单件 @zh-hans
alternative label: agente colectivo homenajeado de ítem de @es
label: kopyasının onurlandırılan kolektif temsilcisidir @tr
definition: Kolektif bir temsilciyi, kolektif bir temsilcinin saygınlığını ve ona duyulan saygıyı gösteren bir kopya ile ilişkilendirir. @tr
toolkit label: kopyasının onurlandırılan kolektif temsilcisidir @tr
toolkit definition: Kolektif bir temsilcinin itibarını ve ona duyulan saygıyı gösteren bir kopya. @tr
has subproperty: kappaleella kunnioitettu yhteisö kappaleessa
has subproperty: kappaleella kunnioitettu suku kappaleessa
has subproperty: P50793

teoksella kunnioitettu yhteistoimija teoksessa
status: Published
label: is honouree collective agent of work of @en
lexical alias: honoureeCollectiveAgentOfWorkOf.en
definition: Relates a collective agent to a work that marks the esteem of and respect for a collective agent. @en
toolkit label: honouree collective agent of work of @en
toolkit definition: A work that marks the esteem of and respect for a collective agent. @en
type: Property
domain: C10011
has element type: 2
alternative label: honoree collective agent of work of @en
sub property of: yhteistoimijaan liittyvä teos
sub property of: teoksella kunnioitettu toimija teoksessa
definition: Liittää yhteistoimijan teokseen, joka osoittaa arvostusta ja kunnioitusta yhteistoimijalle.
alternative label: kunnioitettu yhteistoimija teoksessa
toolkit label: teoksella kunnioitettu yhteistoimija teoksessa
toolkit definition: Teos, joka osoittaa arvostusta ja kunnioitusta yhteistoimijalle.
label: er beæret kollektiv agent av verk for @no
definition: Relaterer en kollektiv agent til et verk som markerer aktelsen og respekten for en kollektiv agent. @no
toolkit label: beæret kollektiv agent av verk for @no
toolkit definition: Et verk som markerer aktelsen og respekten for en kollektiv agent. @no
label: is geëerde collectieve actor van werk van @nl
definition: Relateert een collectieve actor aan een werk dat toont de waardering en respect voor een collectieve actor. @nl
toolkit label: geëerde collectieve actor van werk van @nl
toolkit definition: Een werk dat toont de waardering en respect voor een collectieve actor. @nl
label: هو وكيل جماعي مكرم بعمل لـ @ar
definition: يربط وكيلا جماعيا بعمل يدل على تقدير واحترام وكيل جماعي. @ar
toolkit label: وكيل جماعي مكرم بعمل @ar
toolkit definition: عمل يدل على تقدير واحترام وكيل جماعي. @ar
label: és agent col·lectiu homenatjat d’una obra de @ca
definition: Relaciona un agent col·lectiu amb una obra que marca l’estima i el respecte per un agent col·lectiu. @ca
toolkit label: agent col·lectiu homenatjat d’una obra de @ca
toolkit definition: Obra que marca l’estima i el respecte per un agent col·lectiu. @ca
label: er kollektiv agent, som beæres af værk af @da
definition: Relaterer en kollektiv agent til et værk, som markerer en hædring af en kollektiv agent. @da
alternative label: kollektiv agent, som er hædersperson i værk af @da
toolkit label: kollektiv agent, som beæres af værk af @da
toolkit definition: Værk, som markerer en hædring af en kollektiv agent. @da
label: austusavalduse saaja (kollektiiv) teoses @et
definition: Seostab kollektiivi teosega, mis märgib lugupidamist ja austust kollektiivi vastu. @et
toolkit label: austusavalduse saaja (kollektiiv) teoses @et
toolkit definition: Teos, mis märgib lugupidamist ja austust kollektiivi vastu. @et
label: ist gemeinschaftlicher Akteur als Gefeierte/Gefeierter eines Werks von @de
definition: Setzt einen gemeinschaftlichen Akteur in Beziehung zu einem Werk, das einen gemeinschaftlichen Akteur ehrt. @de
toolkit label: Gemeinschaftlicher Akteur als Gefeierte/Gefeierter eines Werks von @de
toolkit definition: Ein Werk, das einen gemeinschaftlichen Akteur ehrt. @de
label: méltatott kollektív ágense a következő műnek: @hu
definition: Hozzákapcsol egy kollektív ágenst egy műhöz, amely jelzi egy kollektív ágens megbecsülését és tiszteletét. @hu
toolkit label: méltatott kollektív ágense a következő műnek: @hu
toolkit definition: Egy mű, amely jelzi egy kollektív ágens megbecsülését és tiszteletét. @hu
label: è onorato agente collettivo di opera di @it
definition: Correla un agente collettivo a un'opera che esprime la stima e il rispetto per un agente collettivo. @it
alternative label: onorato agente collettivo di opera di @it
toolkit label: onorato agente collettivo di opera di @it
toolkit definition: Opera che esprime la stima e il rispetto per un agente collettivo. @it
label: είναι τιμώμενος συλλογικός φορέας του έργου του @el
alternative label: τιμώμενος συλλογικός φορέας του έργου του @el
toolkit label: τιμώμενος συλλογικός φορέας του έργου του @el
label: est un agent collectif honoré d’une œuvre de @fr
definition: Met un agent collectif en relation avec une œuvre qui marque l’estime et le respect pour un agent collectif. @fr
toolkit label: agent collectif honoré d’une œuvre de @fr
toolkit definition: Œuvre qui marque l’estime et le respect pour un agent collectif. @fr
label: grupu godinošais darbs @lv
definition: Sasaista grupu ar darbu, ar kuru godināta grupa. @lv
toolkit label: grupu godinošais darbs @lv
toolkit definition: Darbs, ar kuru godināta grupa. @lv
alternative label: وكيل جماعي مكرم بعمل @ar
alternative label: ……的作品的被纪念者集体行为者 @zh-hans
label: 是……的作品的被纪念者集体行为者 @zh-hans
definition: 将一个集体行为者与表示对一个集体行为者尊重或尊敬的一种作品关联起来。 @zh-hans
toolkit label: ……的作品的被纪念者集体行为者 @zh-hans
toolkit definition: 表示对一个集体行为者尊重或尊敬的一种作品 @zh-hans
alternative label: agente colectivo homenajeado de obra de @es
label: eserinin onurlandırılan kolektif temsilcisidir @tr
definition: Kollektif bir temsilciyi, kolektif bir temsilciye saygınlık kazandıran ve duyulan saygıyı gösteren bir eserle ilişkilendirir. @tr
toolkit label: eserinin onurlandırılan kolektif temsilcisidir @tr
toolkit definition: Kolektif bir temsilcinin itibarını ve saygısını simgeleyen bir eser. @tr
has subproperty: teoksella kunnioitettu yhteisö teoksessa
has subproperty: teoksella kunnioitettu suku teoksessa
has subproperty: P50718

kappaleella kunnioitettu yhteisö kappaleessa
status: Published
label: is honouree corporate body of item of @en
lexical alias: honoureeCorporateBodyOfItemOf.en
definition: Relates a corporate body to an item that marks the esteem of and respect for a corporate body. @en
toolkit label: honouree corporate body of item of @en
toolkit definition: An item that marks the esteem of and respect for a corporate body. @en
type: Property
domain: C10005
has element type: 2
alternative label: honoree corporate body of item of @en
sub property of: yhteisöön liittyvä kappale
sub property of: kappaleella kunnioitettu yhteistoimija kappaleessa
definition: Liittää yhteisön kappaleeseen, joka osoittaa arvostusta ja kunnioitusta yhteisölle.
alternative label: kunnioitettu yhteisö kappaleessa
toolkit label: kappaleella kunnioitettu yhteisö kappaleessa
toolkit definition: Kappale, joka osoittaa arvostusta ja kunnioitusta yhteisölle.
label: er korporasjon beæret av eksemplar av @no
definition: Relaterer en korporasjon til et eksemplar som markerer aktelse og repekt for en korporasjon. @no
toolkit label: korporasjon beæret av eksemplar av @no
toolkit definition: Et eksemplar som markerer aktelse og repekt for en korporasjon. @no
label: is geëerde corporatie van item van @nl
definition: Relateert een corporatie aan een item dat toont de waardering en respect voor een corporatie. @nl
toolkit label: geëerde corporatie van item van @nl
toolkit definition: Een item dat toont de waardering en respect voor een corporatie. @nl
label: هي هيئة مكرمة بمفردة لـ @ar
definition: يربط هيئة بمفردة تدل على تقدير واحترام هيئة. @ar
toolkit label: هيئة مكرمة بمفردة @ar
toolkit definition: مفردة تدل على تقدير واحتراما هيئة. @ar
label: és entitat corporativa homenatjada d’un ítem de @ca
definition: Relaciona una entitat corporativa amb un ítem que marca l’estima i el respecte per una entitat corporativa. @ca
toolkit label: entitat corporativa homenatjada d’un ítem de @ca
toolkit definition: Ítem que marca l’estima i el respecte per una entitat corporativa. @ca
label: er korporation, som beæres af eksemplar af @da
definition: Relaterer en korporation til et eksemplar, som markerer en hædring af en korporation. @da
alternative label: korporation, som er hædersperson i eksemplar af @da
toolkit label: korporation, som beæres af eksemplar af @da
toolkit definition: Eksemplar, som markerer en hædring af en korporation. @da
label: austusavalduse saaja (asutus) eksemplaris @et
definition: Seostab asutuse eksemplariga, mis märgib lugupidamist ja austust asutuse vastu. @et
toolkit label: austusavalduse saaja (asutus) eksemplaris @et
toolkit definition: Eksemplar, mis märgib lugupidamist ja austust asutuse vastu. @et
label: ist Körperschaft als Gefeierte/Gefeierter eines Exemplars von @de
definition: Setzt eine Körperschaft in Beziehung zu einem Exemplar, das eine Körperschaft ehrt. @de
toolkit label: Körperschaft als Gefeierte/Gefeierter eines Exemplars von @de
toolkit definition: Ein Exemplar, das eine Körperschaft ehrt. @de
label: méltatott testülete a következő példánynak: @hu
definition: Hozzákapcsol egy testületet egy példányhoz, amely jelzi egy testület megbecsülését és tiszteletét. @hu
alternative label: méltatottja testülete a következő példány: @hu
toolkit label: méltatott testülete a következő példánynak: @hu
toolkit definition: Egy példány, amely jelzi egy testület megbecsülését és tiszteletét. @hu
label: è onorato ente di item di @it
definition: Correla un ente a un item che esprime la stima e il rispetto per un ente. @it
alternative label: onorato ente di item di @it
toolkit label: onorato ente di item di @it
toolkit definition: Item che esprime la stima e il rispetto per un ente. @it
label: είναι τιμώμενο συλλογικό όργανο του αντιτύπου του @el
alternative label: τιμώμενο συλλογικό όργανο του αντιτύπου του @el
toolkit label: τιμώμενο συλλογικό όργανο του αντιτύπου του @el
label: est une collectivité honorée d’un item de @fr
definition: Met une collectivité en relation avec un item qui marque l’estime et le respect pour une collectivité. @fr
toolkit label: collectivité honorée d’un item de @fr
toolkit definition: Item qui marque l’estime et le respect pour une collectivité. @fr
label: institūciju godinošā vienība @lv
definition: Sasaista institūciju ar vienību, ar kuru godināta institūcija. @lv
toolkit label: institūciju godinošā vienība @lv
toolkit definition: Vienība, ar kuru godināta institūcija. @lv
alternative label: هيئة مكرم بمفردة لـ @ar
alternative label: ……的单件的被纪念者团体 @zh-hans
label: 是……的单件的被纪念者团体 @zh-hans
definition: 将一个团体与表示对一个团体尊重或尊敬的一个单件关联起来。 @zh-hans
toolkit label: ……的单件的被纪念者团体 @zh-hans
toolkit definition: 表示对一个团体尊重或尊敬的一个单件 @zh-hans
alternative label: organismo corporativo homenajeado de ítem de @es
label: kopyasının onurlandırılan tüzel kişisidir @tr
definition: Bir tüzel kişiyi, tüzel bir kişiliğe duyulan saygı ve hürmeti gösteren kopyayla ilişkilendirir. @tr
toolkit label: kopyasının onurlandırılan tüzel kişisidir @tr
toolkit definition: Tüzel bir kişinin itibarını ve ona duyulan saygıyı gösteren bir kopya. @tr
has subproperty: P50944

teoksella kunnioitettu yhteisö teoksessa
status: Published
label: is honouree corporate body of work of @en
lexical alias: honoureeCorporateBodyOfWorkOf.en
definition: Relates a corporate body to a work that marks the esteem of and respect for a corporate body. @en
toolkit label: honouree corporate body of work of @en
toolkit definition: A work that marks the esteem of and respect for a corporate body. @en
type: Property
domain: C10005
has element type: 2
alternative label: honoree corporate body of work of @en
sub property of: yhteisöön liittyvä teos
sub property of: teoksella kunnioitettu yhteistoimija teoksessa
definition: Liittää yhteisön teokseen, joka osoittaa arvostusta ja kunnioitusta yhteisölle.
alternative label: kunnioitettu yhteisö teoksessa
toolkit label: teoksella kunnioitettu yhteisö teoksessa
toolkit definition: Teos, joka osoittaa arvostusta ja kunnioitusta yhteisölle.
label: er beæret korporasjon av verk for @no
definition: Relaterer en korporasjon til et verk som markerer aktelsen og respekten for en korporasjon. @no
toolkit label: beæret korporasjon av verk for @no
toolkit definition: Et verk som markerer aktelsen og respekten for en korporasjon. @no
label: is geëerde corporatie van werk van @nl
definition: Relateert een corporatie aan een werk dat toont de waardering en respect voor een corporatie. @nl
toolkit label: geëerde corporatie van werk van @nl
toolkit definition: Een werk dat toont de waardering en respect voor een corporatie. @nl
label: هي هيئة مكرمة بعمل لـ @ar
definition: يربط هيئة بعمل يدل على تقدير واحترام هيئة. @ar
toolkit label: هيئة مكرمة بعمل @ar
toolkit definition: عمل يدل على تقدير واحترام هيئة. @ar
label: és entitat corporativa homenatjada d’una obra de @ca
definition: Relaciona una entitat corporativa amb una obra que marca l’estima i el respecte per una entitat corporativa. @ca
toolkit label: entitat corporativa homenatjada d’una obra de @ca
toolkit definition: Obra que marca l’estima i el respecte per una entitat corporativa. @ca
label: er korporation, som beæres af værk af @da
definition: Relaterer en korporation til et værk, som markerer en hædring af en korporation. @da
alternative label: korporation, som er hædersperson i værk af @da
toolkit label: korporation, som beæres af værk af @da
toolkit definition: Værk, som markerer en hædring af en korporation. @da
label: austusavalduse saaja (asutus) teoses @et
definition: Seostab asutuse teosega, mis märgib lugupidamist ja austust asutuse vastu. @et
toolkit label: austusavalduse saaja (asutus) teoses @et
toolkit definition: Teos, mis märgib lugupidamist ja austust asutuse vastu. @et
label: ist Körperschaft als Gefeierte/Gefeierter eines Werks von @de
definition: Setzt eine Körperschaft in Beziehung zu einem Werk, das eine Körperschaft ehrt. @de
toolkit label: Körperschaft als Gefeierte/Gefeierter eines Werks von @de
toolkit definition: Ein Werk, das eine Körperschaft ehrt. @de
label: méltatott testülete a következő műnek: @hu
definition: Hozzákapcsol egy testületet egy műhöz, amely jelzi egy testület megbecsülését és tiszteletét. @hu
toolkit label: méltatott testülete a következő műnek: @hu
toolkit definition: Egy mű, amely jelzi egy testület megbecsülését és tiszteletét. @hu
label: è onorato ente di opera di @it
definition: Correla un ente a un'opera che esprime la stima e il rispetto per un ente. @it
alternative label: onorato ente di opera di @it
toolkit label: onorato ente di opera di @it
toolkit definition: Opera che esprime la stima e il rispetto per un ente. @it
label: είναι τιμώμενο συλλογικό όργανο του έργου του @el
toolkit label: τιμώμενο συλλογικό όργανο του έργου του @el
label: est une collectivité honorée d’une œuvre de @fr
definition: Met une collectivité en relation avec une œuvre qui marque l’estime et le respect pour une collectivité. @fr
toolkit label: collectivité honorée d’une œuvre de @fr
toolkit definition: Œuvre qui marque l’estime et le respect pour une collectivité. @fr
label: institūciju godinošais darbs @lv
definition: Sasaista institūciju ar darbu, ar kuru godināta institūcija. @lv
toolkit label: institūciju godinošais darbs @lv
toolkit definition: Darbs, ar kuru godināta institūcija. @lv
alternative label: هيئة مكرم بعمل لـ @ar
alternative label: ……的作品的被纪念者团体 @zh-hans
label: 是……的作品的被纪念者团体 @zh-hans
definition: 将一个团体与表示对一个团体尊重或尊敬的一种作品关联起来。 @zh-hans
toolkit label: ……的作品的被纪念者团体 @zh-hans
toolkit definition: 表示对一个团体尊重或尊敬的一种作品 @zh-hans
alternative label: organismo corporativo homenajeado de obra de @es
label: eserinin onurlandırılan tüzel kişisidir @tr
definition: Bir tüzel kişiyi, bir tüzel kişiye duyulan saygıyı ve saygınlığı gösteren bir eserle ilişkilendirir. @tr
toolkit label: eserinin onurlandırılan tüzel kişisidir @tr
toolkit definition: Tüzel bir kişinin itibarını ve saygısını simgeleyen bir eser. @tr
has subproperty: P50869

kappaleella kunnioitettu suku kappaleessa
status: Published
label: is honouree family of item of @en
lexical alias: honoureeFamilyOfItemOf.en
definition: Relates a family to an item that marks the esteem of and respect for a family. @en
toolkit label: honouree family of item of @en
toolkit definition: An item that marks the esteem of and respect for a family. @en
type: Property
domain: C10008
has element type: 2
alternative label: honoree family of item of @en
sub property of: sukuun liittyvä kappale
sub property of: kappaleella kunnioitettu yhteistoimija kappaleessa
definition: Liittää suvun kappaleeseen, joka osoittaa arvostusta ja kunnioitusta suvulle.
toolkit label: kappaleella kunnioitettu suku kappaleessa
toolkit definition: Kappale, joka osoittaa arvostusta ja kunnioitusta suvulle.
label: er familie beæret av eksemplar av @no
definition: Relaterer en familie til et eksemplar som markerer aktelse og repekt for en familie. @no
toolkit label: familie beæret av eksemplar av @no
toolkit definition: Et eksemplar som markerer aktelse og repekt for en familie. @no
label: is geëerde familie van item van @nl
definition: Relateert een familie aan een item dat toont de waardering en respect voor een familie. @nl
toolkit label: geëerde familie van item van @nl
toolkit definition: Een item dat toont de waardering en respect voor een familie. @nl
label: هي عائلة مكرمة بمفردة لـ @ar
definition: يربط عائلة بمفردة تدل على تقدير واحترام عائلة. @ar
toolkit label: عائلة مكرمة بمفردة لـ @ar
toolkit definition: مفردة تدل على تقدير واحترام عائلة. @ar
label: és família homenatjada d’un ítem de @ca
definition: Relaciona una família amb un ítem que marca l’estima i el respecte per una família. @ca
toolkit label: família homenatjada d’un ítem de @ca
toolkit definition: Ítem que marca l’estima i el respecte per una família. @ca
label: er familie, som beæres af eksemplar af @da
definition: Relaterer en familie til et eksemplar, som markerer en hædring af en familie. @da
alternative label: familie, som er hædersperson i eksemplar af @da
toolkit label: familie, som beæres af eksemplar af @da
toolkit definition: Eksemplar, som markerer en hædring af en familie. @da
label: austusavalduse saaja (perekond) eksemplaris @et
definition: Seostab perekonna eksemplariga, mis märgib lugupidamist ja austust perekonna vastu. @et
toolkit label: austusavalduse saaja (perekond) eksemplaris @et
toolkit definition: Eksemplar, mis märgib lugupidamist ja austust perekonna vastu. @et
label: ist Familie als Gefeierte/Gefeierter eines Exemplars von @de
definition: Setzt eine Familie in Beziehung zu einem Exemplar, das eine Familie ehrt. @de
toolkit label: Gefeierte/Gefeierter eines Exemplars von @de
toolkit definition: Ein Exemplar, das eine Familie ehrt. @de
label: méltatott családja a következő példánynak: @hu
definition: Hozzákapcsol egy családot egy példányhoz, amely jelzi egy család megbecsülését és tiszteletét. @hu
toolkit label: méltatott családja a következő példánynak: @hu
toolkit definition: Egy példány, amely jelzi egy család megbecsülését és tiszteletét. @hu
label: è onorato famiglia di item di @it
definition: Correla una famiglia a un item che esprime la stima e il rispetto per una famiglia. @it
alternative label: onorato famiglia di item di @it
toolkit label: onorato famiglia di item di @it
toolkit definition: Item che esprime la stima e il rispetto per una famiglia. @it
label: είναι τιμώμενη οικογένεια του αντιτύπου του @el
definition: Συνδέει μια οικογένεια με ένα αντίτυπο που σημειώνει την υπόληψη της και τον σεβασμό προς μια οικογένεια. @el
alternative label: τιμώμενη οικογένεια του αντιτύπου του @el
toolkit label: τιμώμενη οικογένεια του αντιτύπου του @el
label: est une famille honorée d’un item de @fr
definition: Met une famille en relation avec un item qui marque l’estime et le respect pour une famille. @fr
toolkit label: famille honorée d’un item de @fr
toolkit definition: Item qui marque l’estime et le respect pour une famille. @fr
label: dzimtu/ģimeni godinošā vienība @lv
definition: Sasaista dzimtu/ģimeni ar vienību, ar kuru godināta dzimta/ģimene. @lv
toolkit label: vienību godinoša dzimta/ģimene @lv
toolkit definition: Vienība, ar kuru godināta dzimta/ģimene. @lv
alternative label: kunnianosoituksena (kappale)
alternative label: عائلة مكرم بمفردة لـ @ar
alternative label: ……的单件的被纪念者家族 @zh-hans
label: 是……的单件的被纪念者家族 @zh-hans
definition: 将一个家族与表示对一个家族尊重或尊敬的一个单件关联起来。 @zh-hans
toolkit label: ……的单件的被纪念者家族 @zh-hans
toolkit definition: 表示对一个家族尊重或尊敬的一个单件 @zh-hans
alternative label: familia homenajeada de ítem de @es
label: kopyasının onurlandırılan ailesidir @tr
definition: Bir aileyi, bir aileye duyulan saygıyı ve itibarı gösteren bir kopyayla ilişkilendirir. @tr
toolkit label: kopyasının onurlandırılan ailesidir @tr
toolkit definition: Bir ailenin itibarını ve ona duyulan saygıyı gösteren bir kopya. @tr
has subproperty: P51095

teoksella kunnioitettu suku teoksessa
status: Published
label: is honouree family of work of @en
lexical alias: honoureeFamilyOfWorkOf.en
definition: Relates a family to a work that marks the esteem of and respect for a family. @en
toolkit label: honouree family of work of @en
toolkit definition: A work that marks the esteem of and respect for a family. @en
type: Property
domain: C10008
has element type: 2
alternative label: honoree family of work of @en
sub property of: sukuun liittyvä teos
sub property of: teoksella kunnioitettu yhteistoimija teoksessa
definition: Liittää suvun teokseen, joka osoittaa arvostusta ja kunnioitusta suvulle.
alternative label: kunnioitettu suku teoksessa
toolkit label: teoksella kunnioitettu suku teoksessa
toolkit definition: Teos, joka osoittaa arvostusta ja kunnioitusta suvulle.
label: er beæret familie av verk for @no
definition: Relaterer en familie til et verk som markerer aktelsen og respekten for en familie. @no
toolkit label: beæret familie av verk for @no
toolkit definition: Et verk som markerer aktelsen og respekten for en familie. @no
label: is geëerde familie van werk van @nl
definition: Relateert een familie aan een werk dat toont de waardering en respect voor een familie. @nl
toolkit label: geëerde familie van werk van @nl
toolkit definition: Een werk dat toont de waardering en respect voor een familie. @nl
label: هي عائلة مكرمة بعمل لـ @ar
definition: يربط عائلة بعمل يدل على تقدير واحترام عائلة @ar
toolkit label: عائلة مكرمة بعمل @ar
toolkit definition: عمل يدل على تقدير واحترام عائلة. @ar
label: és família homenatjada d’una obra de @ca
definition: Relaciona una família amb una obra que marca l’estima i el respecte per una família. @ca
toolkit label: família homenatjada d’una obra de @ca
toolkit definition: Obra que marca l’estima i el respecte per una família. @ca
label: er familie, som beæres af værk af @da
definition: Relaterer en familie til et værk, som markerer en hædring af en familie. @da
alternative label: familie, som er hædersperson i værk af @da
toolkit label: familie, som beæres af værk af @da
toolkit definition: Værk, som markerer en hædring af en familie. @da
label: austusavalduse saaja (perekond) teoses @et
definition: Seostab perekonna teosega, mis märgib lugupidamist ja austust perekonna vastu. @et
toolkit label: austusavalduse saaja (perekond) teoses @et
toolkit definition: Teos, mis märgib lugupidamist ja austust perekonna vastu. @et
label: ist Familie als Gefeierte/Gefeierter eines Werks von @de
definition: Setzt eine Familie in Beziehung zu einem Werk, das eine Familie ehrt. @de
toolkit label: Familie als Gefeierte/Gefeierter eines Werks von @de
toolkit definition: Ein Werk, das eine Familie ehrt. @de
label: méltatott családja a következő műnek: @hu
definition: Hozzákapcsol egy családot egy műhöz, amely jelzi egy család megbecsülését és tiszteletét. @hu
toolkit label: méltatott családja a következő műnek: @hu
toolkit definition: Egy mű, amely jelzi egy család megbecsülését és tiszteletét. @hu
label: è onorato famiglia di opera di @it
definition: Correla una famiglia a un'opera che esprime la stima e il rispetto per una famiglia. @it
alternative label: onorato famiglia di opera di @it
toolkit label: onorato famiglia di opera di @it
toolkit definition: Opera che esprime la stima e il rispetto per una famiglia. @it
label: είναι τιμώμενη οικογένεια του έργου του @el
alternative label: τιμώμενη οικογένεια του έργου του @el
toolkit label: τιμώμενη οικογένεια του έργου του @el
label: est une famille honorée d’une œuvre de @fr
definition: Met une famille en relation avec une œuvre qui marque l’estime et le respect pour une famille. @fr
toolkit label: famille honorée d’une œuvre de @fr
toolkit definition: Œuvre qui marque l’estime et le respect pour une famille. @fr
label: dzimtu/ģimeni godinošais darbs @lv
definition: Sasaista dzimtu/ģimeni ar darbu, ar kuru godināta dzimta/ģimene. @lv
toolkit label: dzimtu/ģimeni godinošais darbs @lv
toolkit definition: Darbs, ar kuru godināta dzimta/ģimene. @lv
alternative label: عائلة مكرّم عمل لـ @ar
alternative label: ……的作品的被纪念者家族 @zh-hans
label: 是……的作品的被纪念者家族 @zh-hans
definition: 将一个家族与表示对一个家族尊重或尊敬的一种作品关联起来。 @zh-hans
toolkit label: ……的作品的被纪念者家族 @zh-hans
toolkit definition: 表示对一个家族尊重或尊敬的一种作品 @zh-hans
alternative label: familia homenajeada de obra de @es
label: eserinin onurlandırılan ailesidir @tr
definition: Bir aileyi, bir ailenin saygınlığını ve değerini işaret eden bir eserle ilişkilendirir. @tr
toolkit label: eserinin onurlandırılan ailesidir @tr
toolkit definition: Bir ailenin itibarını ve saygısını simgeleyen bir eser. @tr
has subproperty: P51020

kappaleella kunnioitettu henkilö kappaleessa
status: Published
label: is honouree person of item of @en
lexical alias: honoureePersonOfItemOf.en
definition: Relates a person to an item that marks the esteem of and respect for a person. @en
toolkit label: honouree person of item of @en
toolkit definition: An item that marks the esteem of and respect for a person. @en
type: Property
domain: C10004
has element type: 2
alternative label: honoree person of item of @en
sub property of: henkilöön liittyvä kappale
sub property of: kappaleella kunnioitettu toimija kappaleessa
definition: Liittää henkilön kappaleeseen, joka osoittaa arvostusta ja kunnioitusta henkilölle.
alternative label: kunnioitettu henkilö kappaleessa
toolkit label: kappaleella kunnioitettu henkilö kappaleessa
toolkit definition: Kappale, joka osoittaa arvostusta ja kunnioitusta henkilölle.
label: er person beæret av eksemplar av @no
definition: Relaterer en person til et eksemplar som markerer aktelse og repekt for en person. @no
toolkit label: person beæret av eksemplar av @no
toolkit definition: Et eksemplar som markerer aktelse og repekt for en person. @no
label: is geëerde persoon van item van @nl
definition: Relateert een persoon aan een item dat toont de waardering en respect voor een persoon. @nl
toolkit label: geëerde persoon van item van @nl
toolkit definition: Een item dat toont de waardering en respect voor een persoon. @nl
label: هو شخص مكرم بمفردة @ar
definition: يربط شخصا بمفردة تدل على تقدير واحترام شخص. @ar
toolkit label: شخص مكرم عن مفردة @ar
toolkit definition: مفردة تدل على تقدير واحترام شخص. @ar
label: és persona homenatjada d’un ítem de @ca
definition: Relaciona una persona amb un ítem que marca l’estima i el respecte per una persona. @ca
toolkit label: persona homenatjada d’un ítem de @ca
toolkit definition: Ítem que marca l’estima i el respecte per una persona. @ca
label: er person, som beæres af eksemplar af @da
definition: Relaterer en person til et eksemplar, som markerer en hædring af en person. @da
alternative label: person, som er hædersperson i eksemplar af @da
toolkit label: person, som beæres af eksemplar af @da
toolkit definition: Eksemplar, som markerer en hædring af en person. @da
label: austusavalduse saaja (isik) eksemplaris @et
definition: Seostab isiku eksemplariga, mis märgib lugupidamist ja austust isiku vastu. @et
toolkit label: austusavalduse saaja (isik) eksemplaris @et
toolkit definition: Eksemplar, mis märgib lugupidamist ja austust isiku vastu. @et
label: Person als Gefeierte/Gefeierter eines Exemplars von @de
definition: Setzt eine Person in Beziehung zu einem Exemplar, das eine Person ehrt. @de
toolkit label: Person als Gefeierte/Gefeierter eines Exemplars von @de
toolkit definition: Ein Exemplar, das eine Person ehrt. @de
label: méltatott személye a következő példánynak: @hu
definition: Hozzákapcsol egy személyt egy példányhoz, amely jelzi egy személy megbecsülését és tiszteletét. @hu
toolkit label: méltatott személye a következő példánynak: @hu
toolkit definition: Egy példány, amely jelzi egy személy megbecsülését és tiszteletét. @hu
label: è onorato persona di item di @it
definition: Correla una persona a un item che esprime la stima e il rispetto per una persona. @it
alternative label: onorato persona di item di @it
toolkit label: onorato persona di item di @it
toolkit definition: Item che esprime la stima e il rispetto per una persona. @it
label: είναι τιμώμενο φυσικό πρόσωπο του αντιτύπου του @el
alternative label: τιμώμενο φυσικό πρόσωπο του αντιτύπου του @el
toolkit label: τιμώμενο φυσικό πρόσωπο του αντιτύπου του @el
label: est une personne honorée d’un item de @fr
definition: Met une personne en relation avec un item qui marque l’estime et le respect pour une personne. @fr
toolkit label: personne honorée d’un item de @fr
toolkit definition: Item qui marque l’estime et le respect pour une personne. @fr
label: personu godinošā vienība @lv
definition: Sasaista personu ar vienību, ar kuru godināta persona. @lv
toolkit label: personu godinošā vienība @lv
toolkit definition: Vienība, ar kuru godināta persona. @lv
alternative label: شخص مكرم عن مفردة @ar
alternative label: ……的单件的被纪念者个人 @zh-hans
label: 是……的单件的被纪念者个人 @zh-hans
definition: 将一个个人与表示对一个个人尊重或尊敬的一个单件关联起来。 @zh-hans
toolkit label: ……的单件的被纪念者个人 @zh-hans
toolkit definition: 表示对一个个人尊重或尊敬的一个单件 @zh-hans
alternative label: persona homenajeada del item de @es
label: kopyasının onurlandırılan kişisidir @tr
definition: Bir kişiyi, bir kişinin saygınlığını ve saygısını gösteren bir kopyayla ilişkilendirir. @tr
toolkit label: kopyasının onurlandırılan kişisidir @tr
toolkit definition: Bir kişinin itibarını ve ona duyulan saygıyı gösteren bir kopya. @tr
has subproperty: P50642

teoksella kunnioitettu henkilö teoksessa
status: Published
label: is honouree person of work of @en
lexical alias: honoureePersonOfWorkOf.en
definition: Relates a person to a work that marks the esteem of and respect for a person. @en
toolkit label: honouree person of work of @en
toolkit definition: A work that marks the esteem of and respect for a person. @en
type: Property
domain: C10004
has element type: 2
alternative label: honoree person of work of @en
sub property of: henkilöön liittyvä teos
sub property of: teoksella kunnioitettu toimija teoksessa
definition: Liittää henkilön teokseen, joka osoittaa arvostusta ja kunnioitusta henkilölle.
alternative label: kunnioitettu henkilö teoksessa
toolkit label: teoksella kunnioitettu henkilö teoksessa
toolkit definition: Teos, joka osoittaa arvostusta ja kunnioitusta henkilölle.
label: er beæret person av verk for @no
definition: Relaterer en person til et verk som markerer aktelsen og respekten for en person. @no
toolkit label: beæret person av verk for @no
toolkit definition: Et verk som markerer aktelsen og respekten for en person. @no
label: is geëerde persoon van werk van @nl
definition: Relateert een persoon aan een werk dat toont de waardering en respect voor een persoon. @nl
toolkit label: geëerde persoon van werk van @nl
toolkit definition: Een werk dat toont de waardering en respect voor een persoon. @nl
label: هو شخص مكرم بعمل لـ @ar
definition: يربط شخصا بعمل يدل على تقدير واحترام شخص @ar
alternative label: شخص مكرم بعمل @ar
toolkit label: شخص مكرم عن عمل @ar
toolkit definition: عمل يدل على تقدير واحترام شخص. @ar
label: és persona homenatjada d’una obra de @ca
definition: Relaciona una persona amb una obra que marca l’estima i el respecte per una persona. @ca
toolkit label: persona homenatjada d’una obra de @ca
toolkit definition: Obra que marca l’estima i el respecte per una persona. @ca
label: er person, som beæres af værk af @da
definition: Relaterer en person til et værk, som markerer en hædring af en person. @da
alternative label: person, som er hædersperson i værk af @da
toolkit label: person, som beæres af værk af @da
toolkit definition: Værk, som markerer en hædring af en person. @da
label: austusavalduse saaja (isik) teoses @et
definition: Seostab isiku teosega, mis märgib lugupidamist ja austust isiku vastu. @et
toolkit label: austusavalduse saaja (isik) teoses @et
toolkit definition: Teos, mis märgib lugupidamist ja austust isiku vastu. @et
label: ist Person als Gefeierte/Gefeierter eines Werks von @de
definition: Setzt eine Person in Beziehung zu einem Werk, das eine Person ehrt. @de
toolkit label: Person als Gefeierte/Gefeierter eines Werks von @de
toolkit definition: Ein Werk, das eine Person ehrt. @de
label: méltatott személye a következő műnek: @hu
definition: Hozzákapcsol egy személyt egy műhöz, amely jelzi egy személy megbecsülését és tiszteletét. @hu
toolkit label: méltatott személye a következő műnek: @hu
toolkit definition: Egy mű, amely jelzi egy személy megbecsülését és tiszteletét. @hu
label: è onorato persona di opera di @it
definition: Correla una persona a un'opera che esprime la stima e il rispetto per una persona. @it
alternative label: onorato persona di opera di @it
toolkit label: onorato persona di opera di @it
toolkit definition: Opera che esprime la stima e il rispetto per una persona. @it
label: είναι τιμώμενο φυσικό πρόσωπο του έργου του @el
alternative label: τιμώμενο φυσικό πρόσωπο του έργου του @el
toolkit label: τιμώμενο φυσικό πρόσωπο του έργου του @el
label: est une personne honorée d’une œuvre de @fr
definition: Met une personne en relation avec une œuvre qui marque l’estime et le respect pour une personne. @fr
toolkit label: personne honorée d’une œuvre de @fr
toolkit definition: Œuvre qui marque l’estime et le respect pour une personne. @fr
label: personu godinošais darbs @lv
definition: Sasaista personu ar darbu, ar kuru godināta persona. @lv
toolkit label: personu godinošais darbs @lv
toolkit definition: Darbs, ar kuru godināta persona. @lv
alternative label: Person als Gefeierte/Gefeierter eines Werks von @de
alternative label: ……的作品的被纪念者个人 @zh-hans
label: 是……的作品的被纪念者个人 @zh-hans
definition: 将一个个人与表示对一个个人尊重或尊敬的一种作品关联起来。 @zh-hans
toolkit label: ……的作品的被纪念者个人 @zh-hans
toolkit definition: 表示对一个个人尊重或尊敬的一种作品 @zh-hans
alternative label: persona homenajeada por la obra de @es
label: eserinin onurlandırılan kişisidir @tr
definition: Bir kişiyi, bir kişiye duyulan saygıyı ve saygıyı gösteren bir eserle ilişkilendirir. @tr
toolkit label: eserinin onurlandırılan kişisidir @tr
toolkit definition: Bir kişinin temsilcinin itibarını ve saygısını simgeleyen bir eser. @tr
has subproperty: P50567

juontaja (toimija) ekspressiossa
status: Published
label: is host agent of @en
definition: Relates an agent to an expression that includes a contribution by an agent of leading a program, often broadcast, that includes other performers. @en
type: Property
domain: C10002
sub property of: esittäjä (toimija) ekspressiossa
lexical alias: hostAgentOf.en
label: est un agent hôte de @fr
definition: Met un agent en relation avec une expression qui intègre une contribution de la part d’un agent consistant à diriger une activité, souvent diffusée à la radio, à la télévision, etc., qui fait appel à d’autres interprètes. @fr
toolkit label: agent hôte de @fr
toolkit definition: Expression qui intègre une contribution de la part d’un agent consistant à diriger une activité, souvent diffusée à la radio, à la télévision, etc., qui fait appel à d’autres interprètes. @fr
toolkit label: host agent of @en
toolkit definition: An expression that includes a contribution by an agent of leading a program, often broadcast, that includes other performers. @en
instruction number: 18.5
label: είναι ξενιστής φορέας του @el
definition: Συνδέει έναν εκτελεστή, ο οποίος συνεισφέρει σε μια έκφραση ενός έργου ως επικεφαλής προγράμματος, συχνά εκπομπής, η οποία περιλαμβάνει άλλους καλεσμένους, εκτελεστές κ.λπ., με μια έκφραση. @el
toolkit label: ξενιστής φορέας του @el
toolkit definition: Μια έκφραση ενός έργου που ενσωματώνει τη συνεισφορά της παρουσίασης ενός προγράμματος, συχνά εκπομπής, που περιλαμβάνει συχνά καλεσμένους, εκτελεστές κ.λπ. @el
definition: Setzt einen Akteur in Beziehung zu einer Expression, zu der ein Akteur beiträgt, indem er eine Veranstaltung (meist eine Sendung) leitet, an der auch andere Ausführende teilnehmen. @de
toolkit label: Akteur als Gastgeberin/Gastgeber von @de
toolkit definition: Eine Expression, zu der ein Akteur beiträgt, indem er eine Veranstaltung (meist eine Sendung) leitet, an der auch andere Ausführende teilnehmen. @de
label: er agent, som er vært af @da
definition: Relaterer en agent til et udtryk, som omfatter en agents bidrag, der er en performer ved at lede et program, ofte transmitteret, som omfatter andre performers. @da
toolkit label: agent, som er vært af @da
toolkit definition: Udtryk, som omfatter et bidrag af en agent, der er en performer ved at lede et program, ofte transmitteret, som omfatter andre performers. @da
label: és agent amfitrió de @ca
definition: Relaciona un agent amb una expressió que inclou una contribució d’un agent dirigint un programa, sovint emès, que inclou altres intèrprets. @ca
toolkit label: agent amfitrió de @ca
toolkit definition: Expressió que inclou una contribució d’un agent dirigint un programa, sovint emès, que inclou altres intèrprets. @ca
definition: Liittää toimijan ekspressioon, jonka tekemiseen toimija osallistuu juontamalla (useimmiten lähetettyä) ohjelmaa, johon osallistuu muita esiintyjiä.
toolkit label: juontaja (toimija) ekspressiossa
toolkit definition: Ekspressio, jonka tekemiseen toimija osallistuu juontamalla (useimmiten lähetettyä) ohjelmaa, johon osallistuu muita esiintyjiä.
toolkit label: vert for (agent) @no
toolkit definition: Et uttrykk som inkluderer et bidrag fra en agent i form av å lede et program, ofte kringkastet, som inkluderer andre gjester, utøvere etc. @no
label: ist Akteur als Gastgeberin/Gastgeber von @de
has element type: 2
label: házigazda ágense a következőnek: @hu
definition: Hozzákapcsol egy ágenst egy kifejezési formához, amely magában foglalja egy ágens közreműködését egy program, gyakran sugárzott műsor, vezetésében, amelyen más előadók vesznek részt. @hu
toolkit label: házigazda ágense: @hu
toolkit definition: Egy kifejezési forma, amely magában foglalja egy ágens közreműködését egy program, gyakran sugárzott műsor, vezetésében, amelyen más előadók vesznek részt. @hu
alternative label: host of @en
alternative label: juontajana ohjelmassa
label: er vert for (agent) @no
definition: Relaterer en agent til et uttrykk som inkluderer et bidrag fra en agent i form av å lede et program, ofte kringkastet, som inkluderer andre gjester, utøvere etc. @no
alternative label: vert for @no
label: is gastgever-actor van @nl
definition: Relateert een actor aan een expressie die omvat een bijdrage van een actor die is een uitvoerder door het leiden van een programma, vaak uitgezonden, dat omvat andere gasten, artiesten en andere actoren. @nl
toolkit label: gastgever-actor van @nl
toolkit definition: Een expressie die omvat een bijdrage van een actor die is een uitvoerder door het leiden van een programma, vaak uitgezonden, dat omvat andere gasten, artiesten en andere actoren. @nl
label: هو وكيل مضيف لـ @ar
definition: يربط وكيلا بتعبيرة تتضمن إسهام وكيل مؤدي في برنامج يجري في الغالب بثه، ويستضيف فناني أداء آخرين. @ar
alternative label: مضيف @ar
toolkit label: وكيل مضيف @ar
toolkit definition: تعبيرة تتضمن إسهام وكيل مؤدي في برنامج يجري في الغالب بثه، ويستضيف فناني أداء آخرين. @ar
alternative label: amfitrió de @ca
alternative label: vært af @da
label: saatejuht (tegija) väljenduses @et
definition: Seostab tegija väljendusega, millesse tegija on andnud panuse, juhtides saadet (sageli ringhäälingus), kus osalevad külalised, esitajad ja teised tegijad. @et
alternative label: saatejuht väljenduses @et
toolkit label: saatejuht (tegija) väljenduses @et
toolkit definition: Väljendus, millesse tegija on andnud panuse, juhtides saadet (sageli ringhäälingus), kus osalevad külalised, esitajad ja teised tegijad. @et
alternative label: házigazdája: @hu
label: è ospite agente di @it
definition: Correla un agente a un'espressione che include un contributo da parte di un agente che conduce un programma, spesso una trasmissione, che include altri ospiti, attori e altri agenti. @it
alternative label: ospite di @it
toolkit label: ospite agente di @it
toolkit definition: Espressione che include un contributo da parte di un agente che conduce un programma, spesso una trasmissione, che include altri ospiti, attori e altri agenti. @it
alternative label: ξενιστής του @el
alternative label: hôte de @fr
label: ir programmas vadītājs (aģents) @lv
definition: Sasaista aģentu ar izteiksmi, kas ietver aģenta ieguldījumu, vadot programmu (parasti apraidi), kas ietver citu viesu, izpildītāju, citu aģentu piedalīšanos. @lv
toolkit label: ir programmas vadītājs (aģents) @lv
toolkit definition: Izteiksme, kas ietver aģenta ieguldījumu, vadot programmu (parasti apraidi), kas ietver citu viesu, izpildītāju, citu aģentu piedalīšanos. @lv
alternative label: Gastgeberin/Gastgeber von @de
alternative label: ……的主持人 @zh-hans
toolkit label: ……的主持人行为者 @zh-hans
toolkit definition: 包括有主导节目（经常是广播节目）的一个行为者并包括其他表演者的贡献的一种内容表达 @zh-hans
toolkit label: sunucu temsilcisidir @tr
toolkit definition: Genellikle yayınlanan ve diğer sanatçıları da içeren bir programa liderlik eden bir temsilcinin katkısını içeren bir anlatım. @tr
has subproperty: juontaja (yhteistoimija) ekspressiossa

juontaja (yhteistoimija) ekspressiossa
status: Published
label: is host collective agent of @en
lexical alias: hostCollectiveAgentOf.en
definition: Relates a collective agent to an expression that includes a contribution by a collective agent of leading a program, often broadcast, that includes other performers. @en
toolkit label: host collective agent of @en
toolkit definition: An expression that includes a contribution by a collective agent of leading a program, often broadcast, that includes other performers. @en
type: Property
domain: C10011
has element type: 2
sub property of: esittäjä (yhteistoimija) ekspressiossa
sub property of: juontaja (toimija) ekspressiossa
definition: Liittää yhteistoimijan ekspressioon, jonka tekemiseen yhteistoimija osallistuu juontamalla (useimmiten lähetettyä) ohjelmaa, johon osallistuu muita esiintyjiä.
toolkit label: juontaja (yhteistoimija) ekspressiossa
toolkit definition: Ekspressio, jonka tekemiseen yhteistoimija osallistuu juontamalla (useimmiten lähetettyä) ohjelmaa, johon osallistuu muita esiintyjiä.
label: er vert for (kollektiv agent) @no
definition: Relaterer en kollektiv agent til et uttrykk som inkluderer et bidrag fra en kollektiv agent i form av ledelse av et program, ofte kringkastet, som inkluderer andre gjester, utøvere eller andre agenter. @no
toolkit label: vert for (kollektiv agent) @no
toolkit definition: Et uttrykk som inkluderer et bidrag fra en kollektiv agent i form av ledelse av et program, ofte kringkastet, som inkluderer andre gjester, utøvere eller andre agenter. @no
label: is gastgever-collectieve actor van @nl
definition: Relateert een collectieve actor aan een expressie die omvat een bijdrage van een collectieve actor door het leiden van een programma, vaak uitgezonden, dat omvat andere uitvoerders. @nl
toolkit label: gastgever-collectieve actor van @nl
toolkit definition: Een expressie die omvat een bijdrage van een collectieve actor door het leiden van een programma, vaak uitgezonden, dat omvat andere uitvoerders. @nl
label: هو وكيل جماعي مضيف لـ @ar
definition: يربط وكيلا جماعيا بتعبيرة تتضمن إسهام وكيل جماعي مؤدي في برنامج يجري في الغالب بثه، ويستضيف فناني أداء آخرين. @ar
toolkit label: وكيل جماعي مضيف @ar
toolkit definition: تعبيرة تتضمن إسهام وكيل جماعي في إدارة برنامج، غالبًا ما يجري بثه، ويستضيف فناني أداء آخرين. @ar
label: és agent col·lectiu amfitrió de @ca
definition: Relaciona un agent col·lectiu amb una expressió que inclou una contribució d’un agent col·lectiu dirigint un programa, sovint emès, que inclou altres intèrprets. @ca
toolkit label: agent col·lectiu amfitrió de @ca
toolkit definition: Expressió que inclou una contribució d’un agent col·lectiu que és un intèrpret dirigint un programa, sovint emès, que inclou altres intèrprets. @ca
label: er kollektiv agent, som er vært af @da
definition: Relaterer en kollektiv agent til et udtryk, som omfatter en kollektiv agents bidrag ved at lede et program, ofte transmitteret, som omfatter andre optrædende. @da
toolkit label: kollektiv agent, som er vært af @da
toolkit definition: Udtryk, som omfatter en kollektiv agents bidrag ved at lede et program, ofte transmitteret, som omfatter andre optrædende. @da
label: saatejuht (kollektiiv) väljenduses @et
definition: Seostab kollektiivi väljendusega, millesse kollektiiv on andnud panuse, juhtides saadet (sageli ringhäälingus), kus osalevad külalised, esitajad ja teised tegijad. @et
toolkit label: saatejuht (kollektiiv) väljenduses @et
toolkit definition: Väljendus, millesse kollektiiv on andnud panuse, juhtides saadet (sageli ringhäälingus), kus osalevad külalised, esitajad ja teised tegijad. @et
label: ist gemeinschaftlicher Akteur als Gastgeberin/Gastgeber von @de
definition: Setzt einen gemeinschaftlichen Akteur in Beziehung zu einer Expression, zu der ein gemeinschaftlicher Akteur beiträgt, indem er eine Veranstaltung (meist eine Sendung) leitet, an der auch andere Ausführende teilnehmen. @de
toolkit label: Gemeinschaftlicher Akteur als Gastgeberin/Gastgeber von @de
toolkit definition: Eine Expression, zu der ein gemeinschaftlicher Akteur beiträgt, indem er eine Veranstaltung (meist eine Sendung) leitet, an der auch andere Ausführende teilnehmen. @de
label: házigazda kollektív ágense a következőnek: @hu
definition: Hozzákapcsol egy kollektív ágenst egy kifejezési formához, amely magában foglalja egy kollektív ágens közreműködését program, gyakran sugárzott műsor vezetésében, amelyen más előadók vesznek részt. @hu
toolkit label: házigazda kollektív ágense: @hu
toolkit definition: Egy kifejezési forma, amely magában foglalja egy kollektív ágens közreműködését program, gyakran sugárzott műsor vezetésében, amelyen más előadók vesznek részt. @hu
label: è ospite agente collettivo di @it
definition: Correla un agente collettivo a un'espressione che comprende un contributo di un agente collettivo nella conduzione di un programma, spesso una trasmissione, che comprende altri ospiti, artisti e altri agenti. @it
toolkit label: ospite agente collettivo di @it
toolkit definition: Espressione che comprende un contributo di un agente collettivo nella conduzione di un programma, spesso una trasmissione, che comprende altri ospiti, artisti e altri agenti. @it
label: είναι ξενιστής συλλογικός φορέας του @el
toolkit label: ξενιστής συλλογικός φορέας του @el
label: est un agent collectif hôte de @fr
definition: Met un agent collectif en relation avec une expression qui intègre une contribution de la part d’un agent collectif consistant à diriger une activité, souvent diffusée à la radio, à la télévision, etc., qui fait appel à d’autres interprètes. @fr
toolkit label: agent collectif hôte de @fr
toolkit definition: Expression qui intègre une contribution de la part d’un agent collectif consistant à diriger une activité, souvent diffusée à la radio, à la télévision, etc., qui fait appel à d’autres interprètes. @fr
label: ir programmas vadītājs (grupa) @lv
definition: Sasaista grupu ar izteiksmi, kas ietver grupas ieguldījumu, vadot programmu (parasti apraidi), kas ietver citu viesu, izpildītāju, citu aģentu piedalīšanos. @lv
toolkit label: ir programmas vadītājs (grupa) @lv
toolkit definition: Izteiksme, kas ietver grupas ieguldījumu, vadot programmu (parasti apraidi), kas ietver citu viesu, izpildītāju, citu aģentu piedalīšanos. @lv
label: 是……的主持人集体行为者 @zh-hans
definition: 将一个集体行为者与包括有主导节目（经常是广播节目）的一个集体行为者并包括其他表演者的贡献的一种内容表达关联起来。 @zh-hans
toolkit label: ……的主持人集体行为者 @zh-hans
toolkit definition: 包括有主导节目（经常是广播节目）的一个集体行为者并包括其他表演者的贡献的一种内容表达 @zh-hans
label: sunucu kolektif temsilcisidir @tr
definition: Kolektif bir temsilciyi, diğer sanatçıları da içeren, genellikle yayınlanan bir programa liderlik eden kolektif bir temsilcinin katkısını içeren bir anlatımla ilişkilendirir. @tr
toolkit label: sunucu kolektif temsilcisidir @tr
toolkit definition: Genellikle yayınlanan ve diğer sanatçıları içeren bir programı yöneten kolektif bir temsilcinin katkısını içeren bir anlatım. @tr
has subproperty: juontaja (yhteisö) ekspressiossa
has subproperty: juontaja (suku) ekspressiossa
has subproperty: P50741

juontaja (yhteisö) ekspressiossa
status: Published
label: is host corporate body of @en
lexical alias: hostCorporateBodyOf.en
definition: Relates a corporate body to an expression that includes a contribution by a corporate body of leading a program, often broadcast, that includes other performers. @en
toolkit label: host corporate body of @en
toolkit definition: An expression that includes a contribution by a corporate body of leading a program, often broadcast, that includes other performers. @en
type: Property
domain: C10005
has element type: 2
sub property of: esittäjä (yhteisö) ekspressiossa
sub property of: juontaja (yhteistoimija) ekspressiossa
definition: Liittää yhteisön ekspressioon, jonka tekemiseen yhteisö osallistuu juontamalla (useimmiten lähetettyyä) ohjelmaa, johon osallistuu muita esiintyjiä.
toolkit label: juontaja (yhteisö) ekspressiossa
toolkit definition: Ekspressio, jonka tekemiseen yhteisö osallistuu juontamalla (useimmiten lähetettyä) ohjelmaa, johon osallistuu muita esiintyjiä.
label: er vert for (korporasjon) @no
definition: Relaterer en korporasjon til et uttrykk som inkluderer et bidrag fra en korporasjon i form av ledelse av et program, ofte kringkastet, som inkluderer andre gjester, utøvere eller andre agenter. @no
toolkit label: vert for (korporasjon) @no
toolkit definition: Et uttrykk som inkluderer et bidrag fra en korporasjon i form av ledelse av et program, ofte kringkastet, som inkluderer andre gjester, utøvere eller andre agenter. @no
label: is gastgever-corporatie van @nl
definition: Relateert een corporatie aan een expressie die omvat een bijdrage van een corporatie door het leiden van een programma, vaak uitgezonden, dat omvat andere uitvoerders. @nl
toolkit label: gastgever-corporatie van @nl
toolkit definition: Een expressie die omvat een bijdrage van een corporatie door het leiden van een programma, vaak uitgezonden, dat omvat andere uitvoerders. @nl
label: هي هيئة مضيفة لـ @ar
definition: يربط هيئة بتعبيرة تتضمن إسهام هيئة لقيادة برنامج، غالبًا ما يتم بث، ويتضمن ضيوفا آخرين وفناني الأداء ووكيلين آخرين. @ar
toolkit label: هيئة مضيفة @ar
toolkit definition: تعبيرة تتضمن إسهام هيئة لقيادة برنامج، غالبًا ما يتم بث، ويتضمن ضيوفا آخرين وفناني الأداء ووكيلين آخرين. @ar
label: és entitat corporativa amfitriona de @ca
definition: Relaciona una entitat corporativa amb una expressió que inclou una contribució d’una entitat corporativa dirigint un programa, sovint emès, que inclou altres intèrprets. @ca
toolkit label: entitat corporativa amfitriona de @ca
toolkit definition: Expressió que inclou una contribució d’una entitat corporativa dirigint un programa, sovint emès, que inclou altres intèrprets. @ca
label: er korporation, som er vært af @da
definition: Relaterer en korporation til et udtryk, som omfatter en korporations bidrag ved at lede et program, ofte transmitteret, som omfatter andre optrædende. @da
toolkit label: korporation, som er vært af @da
toolkit definition: Udtryk, som omfatter en korporations bidrag ved at lede et program, ofte transmitteret, som omfatter andre optrædende. @da
label: saatejuht (asutus) väljenduses @et
definition: Seostab asutuse väljendusega, millesse asutus on andnud panuse, juhtides saadet (sageli ringhäälingus), kus osalevad külalised, esitajad ja teised tegijad. @et
toolkit label: saatejuht (asutus) väljenduses @et
toolkit definition: Väljendus, millesse asutus on andnud panuse, juhtides saadet (sageli ringhäälingus), kus osalevad külalised, esitajad ja teised tegijad. @et
label: ist Körperschaft als Gastgeberin/Gastgeber von @de
definition: Setzt eine Körperschaft in Beziehung zu einer Expression, zu der eine Körperschaft beiträgt, indem sie eine Veranstaltung (meist eine Sendung) leitet, an der auch andere Ausführende teilnehmen. @de
toolkit label: Körperschaft als Gastgeberin/Gastgeber von @de
toolkit definition: Eine Expression, zu der eine Körperschaft beiträgt, indem sie eine Veranstaltung (meist eine Sendung) leitet, an der auch andere Ausführende teilnehmen. @de
label: házigazda testülete a következőnek: @hu
definition: Hozzákapcsol egy testületet egy kifejezési formához, amely magában foglalja egy testület közreműködését egy program, gyakran sugárzott műsor, vezetésében, amelyen más előadók vesznek részt. @hu
toolkit label: házigazda testülete: @hu
toolkit definition: Egy kifejezési forma, amely magában foglalja egy testület közreműködését egy program, gyakran sugárzott műsor, vezetésében, amelyen más előadók vesznek részt. @hu
label: è ospite ente di @it
definition: Correla un ente a un'espressione che include un contributo di un ente nella conduzione di un programma, spesso una trasmissione, che comprende altri ospiti, artisti e altri agenti. @it
toolkit label: ospite ente di @it
toolkit definition: Espressione che include un contributo di un ente nella conduzione di un programma, spesso una trasmissione, che comprende altri ospiti, artisti e altri agenti. @it
label: είναι ξενιστής συλλογικό όργανο του @el
toolkit label: ξενιστής συλλογικό όργανο του @el
label: est une collectivité hôtesse de @fr
definition: Met une collectivité en relation avec une expression qui intègre une contribution de la part d’une collectivité consistant à diriger une activité, souvent diffusée à la radio, à la télévision, etc., qui fait appel à d’autres interprètes. @fr
toolkit label: collectivité hôtesse de @fr
toolkit definition: Expression qui intègre une contribution de la part d’une collectivité consistant à diriger une activité, souvent diffusée à la radio, à la télévision, etc., qui fait appel à d’autres interprètes. @fr
label: ir programmas vadītājs (institūcija) @lv
definition: Sasaista institūciju ar izteiksmi, kas ietver institūcijas ieguldījumu, vadot programmu (parasti apraidi), kas ietver citu viesu, izpildītāju, citu aģentu piedalīšanos. @lv
toolkit label: ir programmas vadītājs (institūcija) @lv
toolkit definition: Izteiksme, kas ietver institūcijas ieguldījumu, vadot programmu (parasti apraidi), kas ietver citu viesu, izpildītāju, citu aģentu piedalīšanos. @lv
label: 是……的主持人团体 @zh-hans
definition: 将一个团体与包括有主导节目（经常是广播节目）的一个团体并包括其他表演者的贡献的一种内容表达关联起来。 @zh-hans
toolkit label: ……的主持人团体 @zh-hans
toolkit definition: 包括有主导节目（经常是广播节目）的一个团体并包括其他表演者的贡献的一种内容表达 @zh-hans
label: sunucu tüzel kişisidir @tr
definition: Bir tüzel kişiyi, genellikle yayınlanan ve diğer sanatçıları da içeren bir programa liderlik eden bir tüzel kişinin katkısını içeren bir anlatımla ilişkilendirir. @tr
toolkit label: sunucu tüzel kişisidir @tr
toolkit definition: Genellikle yayınlanan ve diğer sanatçıları içeren bir programa liderlik eden tüzel bir kişinin katkısını içeren bir anlatım. @tr
has subproperty: P50892

juontaja (suku) ekspressiossa
status: Published
label: is host family of @en
lexical alias: hostFamilyOf.en
definition: Relates a family to an expression that includes a contribution by a family of leading a program, often broadcast, that includes other performers. @en
toolkit label: host family of @en
toolkit definition: An expression that includes a contribution by a family of leading a program, often broadcast, that includes other performers. @en
type: Property
domain: C10008
has element type: 2
sub property of: esittäjä (suku) ekspressiossa
sub property of: juontaja (yhteistoimija) ekspressiossa
definition: Liittää suvun ekspressioon, jonka tekemiseen suku osallistuu juontamalla (useimmiten lähetettyä) ohjelmaa, johon osallistuu muita esiintyjiä.
toolkit label: juontaja (suku) ekspressiossa
toolkit definition: Ekspressio, jonka tekemiseen suku osallistuu juontamalla (useimmiten lähetettyä) ohjelmaa, johon osallistuu muita esiintyjiä.
label: er vert for (familie) @no
definition: Relaterer en familie til et uttrykk som inkluderer et bidrag fra en familie i form av ledelse av et program, ofte kringkastet, som inkluderer andre gjester, utøvere eller andre agenter. @no
toolkit label: vert for (familie) @no
toolkit definition: Et uttrykk som inkluderer et bidrag fra en familie i form av ledelse av et program, ofte kringkastet, som inkluderer andre gjester, utøvere eller andre agenter. @no
label: is gastgever-familie van @nl
definition: Relateert een familie aan een expressie die omvat een bijdrage van een familie door het leiden van een programma, vaak uitgezonden, dat omvat andere uitvoerders. @nl
toolkit label: gastgever-familie van @nl
toolkit definition: Een expressie die omvat een bijdrage van een familie door het leiden van een programma, vaak uitgezonden, dat omvat andere uitvoerders. @nl
label: هي عائلة مضيفة لـ @ar
definition: يربط عائلة بتعبيرة تتضمن إسهام عائلة في إدارة برنامج، غالبًا ما يجري بثه، ويستضيف فناني أداء آخرين. @ar
toolkit label: عائلة مضيفة @ar
toolkit definition: تعبيرة تتضمن إسهام عائلة لقيادة برنامج، غالبًا ما يجري بثه، ويستضيف فناني أداء آخرين. @ar
label: és família amfitriona de @ca
definition: Relaciona una família amb una expressió que inclou una contribució d’una família dirigint un programa, sovint emès, que inclou altres intèrprets. @ca
toolkit label: família amfitriona de @ca
toolkit definition: Expressió que inclou una contribució d’una família dirigint un programa, sovint emès, que inclou altres intèrprets. @ca
label: er familie, som er vært af @da
definition: Relaterer en familie til et udtryk, som omfatter en families bidrag ved at lede et program, ofte transmitteret, som omfatter andre optrædende. @da
toolkit label: familie, som er vært af @da
toolkit definition: Udtryk, som omfatter en families bidrag ved at lede et program, ofte transmitteret, som omfatter andre optrædende. @da
label: saatejuht (perekond) väljenduses @et
definition: Seostab perekonna väljendusega, millesse perekond on andnud panuse, juhtides saadet (sageli ringhäälingus), kus osalevad külalised, esitajad ja teised tegijad. @et
toolkit label: saatejuht (perekond) väljenduses @et
toolkit definition: Väljendus, millesse perekond on andnud panuse, juhtides saadet (sageli ringhäälingus), kus osalevad külalised, esitajad ja teised tegijad. @et
label: ist Familie als Gastgeberin/Gastgeber von @de
definition: Setzt eine Person in Beziehung zu einer Expression, zu der eine Person beiträgt, indem sie eine Veranstaltung (meist eine Sendung) leitet, an der auch andere Ausführende teilnehmen. @de
toolkit label: Familie als Gastgeberin/Gastgeber von @de
toolkit definition: Eine Expression, zu der eine Person beiträgt, indem sie eine Veranstaltung (meist eine Sendung) leitet, an der auch andere Ausführende teilnehmen. @de
label: házigazda családja a következőnek: @hu
definition: Hozzákapcsol egy családot egy kifejezési formához, amely magában foglalja egy család közreműködését egy program, gyakran sugárzott műsor, vezetésében, amelyen más előadók vesznek részt. @hu
toolkit label: házigazda családja: @hu
toolkit definition: Egy kifejezési forma, amely magában foglalja egy család közreműködését egy program, gyakran sugárzott műsor, vezetésében, amelyen más előadók vesznek részt. @hu
label: è ospite famiglia di @it
definition: Correla una famiglia a un'espressione che comprende un contributo di una famiglia nella conduzione di un programma, spesso una trasmissione, che comprende altri ospiti, artisti e altri agenti. @it
toolkit label: ospite famiglia di @it
toolkit definition: Espressione che comprende un contributo di una famiglia nella conduzione di un programma, spesso una trasmissione, che comprende altri ospiti, artisti e altri agenti. @it
label: είναι ξενιστής οικογένεια του @el
toolkit label: ξενιστής οικογένεια του @el
label: est une famille hôtesse de @fr
definition: Met une famille en relation avec une expression qui intègre une contribution de la part d’une famille consistant à diriger une activité, souvent diffusée à la radio, à la télévision, etc., qui fait appel à d’autres interprètes. @fr
toolkit label: famille hôtesse de @fr
toolkit definition: Expression qui intègre une contribution de la part d’une famille consistant à diriger une activité, souvent diffusée à la radio, à la télévision, etc., qui fait appel à d’autres interprètes. @fr
label: ir programmas vadītājs (dzimta/ģimene) @lv
definition: Sasaista dzimtu/ģimeni ar izteiksmi, kas ietver dzimtas/ģimenes ieguldījumu, vadot programmu (parasti apraidi), kas ietver citu viesu, izpildītāju, citu aģentu piedalīšanos. @lv
toolkit label: ir programmas vadītājs (dzimta/ģimene) @lv
toolkit definition: Izteiksme, kas ietver dzimtas/ģimenes ieguldījumu, vadot programmu (parasti apraidi), kas ietver citu viesu, izpildītāju, citu aģentu piedalīšanos. @lv
label: 是……的主持人家族 @zh-hans
definition: 将一个家族与包括有主导节目（经常是广播节目）的一个家族并包括其他表演者的贡献的一种内容表达关联起来。 @zh-hans
toolkit label: ……的主持人家族 @zh-hans
toolkit definition: 包括有主导节目（经常是广播节目）的一个家族并包括其他表演者的贡献的一种内容表达 @zh-hans
label: sunucu ailesidir @tr
definition: Bir aileyi, genellikle yayınlanan ve diğer sanatçıları da içeren bir programa liderlik eden bir ailenin katkısını içeren bir anlatımla ilişkilendirir. @tr
toolkit label: sunucu ailesidir @tr
toolkit definition: Genellikle yayınlanan ve diğer sanatçıları da içeren bir programa liderlik eden bir ailenin katkısını içeren bir anlatım. @tr
has subproperty: P51043

isäntäorganisaatio teoksessa
status: Published
label: is hosting institution of @en
definition: Relates a corporate body to a work that arises from a conference, exhibition, or other event that is hosted by a corporate body with little or no responsibility for the content. @en
type: Property
domain: C10005
sub property of: yhteisöön liittyvä teos
lexical alias: hostingInstitutionOf.en
label: est une institution hôte de @fr
definition: Met une collectivité en relation avec une œuvre issue d’un congrès, d’une exposition ou d’un autre événement qui est accueilli par une collectivité qui a peu ou pas du tout de responsabilité quant à son contenu. @fr
toolkit label: institution hôte de @fr
toolkit definition: Œuvre issue d’un congrès, d’une exposition ou d’un autre événement qui est accueilli par une collectivité qui a peu ou pas du tout de responsabilité quant à son contenu. @fr
toolkit label: hosting institution of @en
toolkit definition: A work that arises from a conference, exhibition, or other event that is hosted by a corporate body with little or no responsibility for the content. @en
instruction number: 18.5
label: είναι ίδρυμα υποδοχής του @el
definition: Συνδέει ένα συλλογικό όργανο που φιλοξενεί ένα συμβάν, μια έκθεση, ένα συνέδριο κ.λπ., εκ των οποίων προκλήθηκε η δημιουργία ενός έργου, με ένα έργο. @el
toolkit label: ίδρυμα υποδοχής του @el
toolkit definition: Ένα συμβάν, μια έκθεση, ένα συνέδριο κ.λπ., εκ των οποίων προέκυψε ένα έργο, το οποίο (συμβάν) φιλοξενήθηκε από ένα συλλογικό όργανο, με μερική ή καμία ευθύνη για το περιεχόμενο του έργου. @el
definition: Setzt eine Körperschaft in Beziehung zu einem Werk, das aus einer Konferenz, einer Ausstellung oder einer anderen Veranstaltung hervorgeht, die von einer Körperschaft ausgerichtet wird, die aber für den Inhalt wenig oder gar keine Verantwortung trägt. @de
toolkit label: Gastgebende Institution von @de
toolkit definition: Ein Werk, das aus einer Konferenz, einer Ausstellung oder einer anderen Veranstaltung hervorgeht, die von einer Körperschaft ausgerichtet wird, die aber für den Inhalt wenig oder gar keine Verantwortung trägt. @de
label: er værtsinstitution af @da
definition: Relaterer en korporation til et værk, som opstår efter en konference, udstilling, konference eller anden begivenhed, som er afholdt af en korporation med ringe eller intet ansvar for værkets indhold. @da
toolkit label: værtsinstitution af @da
toolkit definition: Værk, som opstår efter en konference, udstilling, konference eller anden begivenhed, som er afholdt af en korporation med ringe eller intet ansvar for værkets indhold. @da
label: és institució d’acollida de @ca
definition: Relaciona una entitat corporativa amb una obra que sorgeix a partir d’un congrés, una exposició o qualsevol altre esdeveniment que és acollit per una entitat corporativa amb poca o cap responsabilitat pel contingut. @ca
toolkit label: institució d’acollida de @ca
toolkit definition: Obra que sorgeix a partir d’un congrés, una exposició o qualsevol altre esdeveniment que és acollit per una entitat corporativa amb poca o cap responsabilitat pel contingut. @ca
definition: Liittää yhteisön teokseen, jolle alun antavan konferenssin, näyttelyn tai muun tapahtuman yhteisö isännöi, mutta jonka sisällöstä yhteisöllä on vähän tai ei lainkaan vastuuta.
toolkit label: isäntäorganisaatio teoksessa
toolkit definition: Teos, jolle alun antavan konferenssin, näyttelyn tai muun tapahtuman yhteisö isännöi, mutta jonka sisällöstä yhteisöllä on vähän tai ei lainkaan vastuuta.
toolkit label: vertsinstitusjon for @no
toolkit definition: Et verk som inspireres av en konferanse, en utstilling eller et annet arrangement som en korporasjon er vert for, men som har lite eller intet ansvar for verkets innhold. @no
label: ist gastgebende Institution von @de
has element type: 2
label: rendező intézménye a következőnek: @hu
definition: Egy testületet, amely egy esemény, kiállítás, konferencia stb. rendezésével elősegíti egy mű keletkezését, hozzákapcsol egy műhöz. @hu
toolkit label: rendező intézménye a következőnek: @hu
toolkit definition: Egy mű keletkezésében szerepet játszó esemény, kiállítás, konferencia stb., amelyet egy olyan testület rendezett, amely kevés vagy semmilyen felelősséget nem visel a mű tartalmáért. @hu
alternative label: host institution of @en
alternative label: isäntäorganisaationa tapahtumassa
label: er vertsinstitusjon for @no
definition: Relaterer en korporasjon til et verk som inspireres av en konferanse, en utstilling eller et annet arrangement som en korporasjon er vert for, men som har lite eller intet ansvar for verkets innhold. @no
label: is hostorganisatie van @nl
definition: Relateert een corporatie aan een werk dat voortkomt uit een conferentie, tentoonstelling of andere gebeurtenis die is gehouden door een corporatie met weinig of geen verantwoordelijkheid voor de content. @nl
toolkit label: hostorganisatie van @nl
toolkit definition: Een werk dat voortkomt uit een conferentie, tentoonstelling of andere gebeurtenis die is gehouden door een corporatie met weinig of geen verantwoordelijkheid voor de content. @nl
label: هي مؤسسة مضيفة لـ @ar
definition: يربط هيئة بعمل نتج عن مؤتمر أو عن معرض أو عن أي فعالية أخرى تستضيفها هيئة، وتقل أو تنعدم مسئوليتها عن محتوى العمل. @ar
toolkit label: مؤسسة مضيفة لـ @ar
toolkit definition: عمل نتج عن مؤتمر أو عن معرض أو عن أي فاعلية أخرى تستضيفها هيئة، وتقل أو تنعدم مسئوليتها عن محتوى العمل. @ar
label: võõrustav asutus teoses @et
definition: Seostab asutuse teosega, millele on aluse pannud konverents, näitus või muu üritus, mille asutus on korraldanud, kuid ei vastuta või vastutab vähe selle sisu eest. @et
toolkit label: võõrustav asutus teoses @et
toolkit definition: Teos, millele on aluse pannud konverents, näitus või muu üritus, mille asutus on korraldanud, kuid ei vastuta või vastutab vähe selle sisu eest. @et
label: è istituzione ospitante di @it
definition: Correla un ente a un'opera che nasce da una conferenza, mostra o altro evento ospitato da un ente con poca o nessuna responsabilità per il contenuto. @it
toolkit label: istituzione ospitante di @it
toolkit definition: Opera che nasce da una conferenza, mostra o altro evento ospitato da un ente con poca o nessuna responsabilità per il contenuto. @it
label: ir uzņemošā institūcija @lv
definition: Sasaista institūciju ar darbu, kas radies konferences, izstādes vai cita pasākuma rezultātā, ko izmitināja institūcija, kurai par darba saturu ir neliela vai pat nekāda atbildība. @lv
toolkit label: ir uzņemošā institūcija @lv
toolkit definition: Darbs, kas radies konferences, izstādes vai cita pasākuma rezultātā, ko izmitināja institūcija, kam par darba saturu ir neliela vai pat nekāda atbildība. @lv
alternative label: مؤسسة مضيفة لـ @ar
alternative label: ……的承办机构 @zh-hans
label: 是……的承办机构 @zh-hans
definition: 将一个团体与一个团体承办但对内容没有或很少责任的会议、展览或其他活动所产生的作品关联起来。 @zh-hans
toolkit label: ……的承办机构 @zh-hans
toolkit definition: 一个团体承办但对内容没有或很少责任的会议、展览或其他活动所产生的作品 @zh-hans
alternative label: institución anfitriona de @es
alternative label: institution hôtesse de @fr
label: ev sahibi kurumudur @tr
definition: Bir tüzel kişiyi, içerikten çok az sorumlu olan veya hiç sorumluluğu olmayan bir tüzel kişilik tarafından ev sahipliği yapılan bir konferans, sergi veya başka bir etkinlikten kaynaklanan bir eserle ilişkilendirir. @tr
toolkit label: ev sahibi kurumudur @tr
toolkit definition: İçerik konusunda çok az sorumluluğu olan veya hiç sorumluluğu olmayan kurumsal bir tüzel kişilik tarafından düzenlenen bir konferans, sergi veya başka bir etkinlikten ortaya çıkan bir eser @tr
has subproperty: P50004

juontaja (henkilö) ekspressiossa
status: Published
label: is host person of @en
lexical alias: hostPersonOf.en
definition: Relates a person to an expression that includes a contribution by a person of leading a program, often broadcast, that includes other performers. @en
toolkit label: host person of @en
toolkit definition: An expression that includes a contribution by a person of leading a program, often broadcast, that includes other performers. @en
type: Property
domain: C10004
has element type: 2
sub property of: esittäjä (henkilö) ekspressiossa
sub property of: juontaja (toimija) ekspressiossa
definition: Liittää henkilön ekspressioon, jonka tekemiseen henkilö osallistuu juontamalla (useimmiten lähetettyä) ohjelmaa, johon osallistuu muita esiintyjiä.
toolkit label: juontaja (henkilö) ekspressiossa
toolkit definition: Ekspressio, jonka tekemiseen henkilö osallistuu juontamalla (useimmiten lähetettyä) ohjelmaa, johon osallistuu muita esiintyjiä.
label: er vert for (person) @no
definition: Relaterer en person til et uttrykk som inkluderer et bidrag fra en person i form av ledelse av et program, ofte kringkastet, som inkluderer andre gjester, utøvere eller andre agenter. @no
toolkit label: vert for (person) @no
toolkit definition: Et uttrykk som inkluderer et bidrag fra en person i form av ledelse av et program, ofte kringkastet, som inkluderer andre gjester, utøvere eller andre agenter. @no
label: is gastgever-persoon van @nl
definition: Relateert een persoon aan een expressie die omvat een bijdrage van een persoon door het leiden van een programma, vaak uitgezonden, dat omvat andere uitvoerders. @nl
toolkit label: gastgever-persoon van @nl
toolkit definition: Een expressie die omvat een bijdrage van een persoon door het leiden van een programma, vaak uitgezonden, dat omvat andere uitvoerders. @nl
label: هو شخص مضيف لـ @ar
definition: يربط شخصا بتعبيرة تتضمن إسهام شخص في إدارة برنامج، غالبا مُذاع، يستضيف ضيوفا وفنانين ووكلاء آخرين. @ar
toolkit label: شخص مضيف @ar
toolkit definition: تعبيرة تتضمن إسهام شخص في إدارة برنامج، غالبًا مُذاع، ويستضيف ضيوفا وفنانين ووكلاء آخرين. @ar
label: és persona amfitriona de @ca
definition: Relaciona una persona amb una expressió que inclou una contribució d’una persona que és un intèrpret dirigint un programa, sovint emès, que inclou altres intèrprets. @ca
toolkit label: persona amfitriona de @ca
toolkit definition: Expressió que inclou una contribució d’una persona que és un intèrpret dirigint un programa, sovint emès, que inclou altres intèrprets. @ca
label: er person, som er vært af @da
definition: Relaterer en person til et udtryk, som omfatter en persons bidrag ved at lede et program, ofte transmitteret, som omfatter andre optrædende. @da
toolkit label: person, som er vært af @da
toolkit definition: Udtryk, som omfatter en persons bidrag ved at lede et program, ofte transmitteret, som omfatter optrædende. @da
label: saatejuht (isik) väljenduses @et
definition: Seostab isiku väljendusega, millesse isik on andnud panuse, juhtides saadet (sageli ringhäälingus), kus osalevad külalised, esitajad ja teised tegijad. @et
toolkit label: saatejuht (isik) väljenduses @et
toolkit definition: Väljendus, millesse isik on andnud panuse, juhtides saadet (sageli ringhäälingus), kus osalevad külalised, esitajad ja teised tegijad. @et
label: ist Person als Gastgeberin/Gastgeber von @de
definition: Setzt eine Person in Beziehung zu einer Expression, zu der eine Person beiträgt, indem sie eine Veranstaltung (meist eine Sendung) leitet, an der auch andere Ausführende teilnehmen. @de
toolkit label: Person als Gastgeberin/Gastgeber von @de
toolkit definition: Eine Expression, zu der eine Person beiträgt, indem sie ein Veranstaltung (meist eine Sendung) leitet, an der auch andere Ausführende teilnehmen. @de
label: házigazda személye a következőnek: @hu
definition: Hozzákapcsol egy személyt egy kifejezési formához, amely magában foglalja egy személy közreműködését egy program, gyakran sugárzott műsor, vezetésében, amelyen más előadók vesznek részt. @hu
toolkit label: házigazda személye: @hu
toolkit definition: Egy kifejezési forma, amely magában foglalja egy személy közreműködését egy program, gyakran sugárzott műsor, vezetésében, amelyen más előadók vesznek részt. @hu
label: è ospite persona di @it
definition: Correla una persona a un'espressione che comprende un contributo di una persona nella conduzione di un programma, spesso una trasmissione, che comprende altri ospiti, artisti e altri agenti. @it
toolkit label: ospite persona di @it
toolkit definition: Espressione che comprende un contributo di una persona nella conduzione di un programma, spesso una trasmissione, che comprende altri ospiti, artisti e altri agenti. @it
label: είναι ξενιστής φυσικό πρόσωπο του @el
toolkit label: ξενιστής φυσικό πρόσωπο του @el
label: est une personne hôtesse de @fr
definition: Met une personne en relation avec une expression qui intègre une contribution de la part d’une personne consistant à diriger une activité, souvent diffusée à la radio, à la télévision, etc., qui fait appel à d’autres interprètes. @fr
toolkit label: personne hôtesse de @fr
toolkit definition: Expression qui intègre une contribution de la part d’une personne consistant à diriger une activité, souvent diffusée à la radio, à la télévision, etc., qui fait appel à d’autres interprètes. @fr
label: ir programmas vadītājs (persona) @lv
definition: Sasaista personu ar izteiksmi, kas ietver personas ieguldījumu, vadot programmu (parasti apraidi), kas ietver citu viesu, izpildītāju, citu aģentu piedalīšanos. @lv
toolkit label: ir programmas vadītājs (persona) @lv
toolkit definition: Izteiksme, kas ietver personas ieguldījumu, vadot programmu (parasti apraidi), kas ietver citu viesu, izpildītāju, citu aģentu piedalīšanos. @lv
label: 是……的主持人个人 @zh-hans
definition: 将一个个人与包括有主导节目（经常是广播节目）的一个个人并包括其他表演者的贡献的一种内容表达关联起来。 @zh-hans
toolkit label: ……的主持人个人 @zh-hans
toolkit definition: 包括有主导节目（经常是广播节目）的一个个人并包括其他表演者的贡献的一种内容表达 @zh-hans
label: sunucu kişisidir @tr
definition: Bir kişiyi, yayınlanan ve diğer sanatçıları içeren bir programa, liderlik eden bir kişinin katkısını içeren bir anlatımla ilişkilendirir. @tr
toolkit label: sunucu kişisidir @tr
toolkit definition: Genellikle yayınlanan ve diğer sanatçıları da içeren bir programa liderlik eden bir kişinin katkısını içeren bir anlatım. @tr
has subproperty: P50590

kirjoittajana lisätylle sanoitukselle
status: Deprecated
label: is writer of added lyrics of (Deprecated) @en
definition: Relates an agent to an expression that includes a contribution of adding written words to music. (Deprecated) @en
type: Property
domain: C10002
sub property of: kirjoittajana lisätyssä tekstissä
lexical alias: writerOfAddedLyricsOf.en
label: est un auteur de paroles ajoutées de @fr
definition: Met un auteur de paroles ajoutées à une expression d’une œuvre musicale en relation avec une expression. @fr
toolkit label: auteur de paroles ajoutées de @fr
toolkit definition: Expression d’une œuvre musicale qui intègre une contribution consistant à écrire des paroles ajoutées à une expression. @fr
toolkit label: writer of added lyrics of (Deprecated) @en
toolkit definition: An expression that includes a contribution of adding written words to music. (Deprecated) @en
see also: sanoittaja (toimija) teoksessa
instruction number: 18.5
label: είναι συγγραφέας των πρόσθετων στίχων του @el
definition: Συνδέει έναν συγγραφέα στίχων, οι οποίοι προστίθενται σε μια έκφραση ενός μουσικού έργου, με μια έκφραση. @el
toolkit label: συγγραφέας των πρόσθετων στίχων του @el
toolkit definition: Μια έκφραση ενός μουσικού έργου που ενσωματώνει τη συνεισφορά της συγγραφής και της προσθήκης στίχων σε μια έκφραση. @el
definition: Setzt einen Verfasser eines Texts, der einer Expression eines Musikwerks beigefügt wird, mit einer Expression in Beziehung. @de
toolkit label: Verfasser von zusätzlichen Lyrics von @de
toolkit definition: Eine Expression eines Musikwerks, bei der ein Akteur für das Verfassen von Texten, das dem Musikwerk beigefügt wird, verantwortlich ist. @de
label: er forfatter af tilføjede sangtekster til @da
definition: Relaterer en forfatter af ord, der er tilføjet til et udtryk af et musikværk til et udtryk. @da
toolkit label: forfatter af tilføjede sangtekster til @da
toolkit definition: Udtryk af et musikværk der inkorporerer et bidrag ved at skrive ord, der er tilføjet til et udtryk. @da
label: és escriptor de lletres de cançons afegides de @ca
definition: Relaciona un escriptor de paraules afegides amb una expressió d’una obra musical amb una expressió. @ca
toolkit label: escriptor de lletres de cançons afegides de @ca
toolkit definition: Expressió d’una obra musical que incorpora una contribució que escriu paraules afegides a una expressió. @ca
definition: Liittää toimijan musiikkiteoksen ekspressioon, joka sisältää lisätyn sanoituksen.
toolkit label: kirjoittajana lisätylle sanoitukselle
toolkit definition: Musiikkiteoksen ekspressio, joka sisältää lisätyn sanoituksen.
toolkit label: forfatter av tilføyd sangtekst til @no
toolkit definition: Et uttrykk av et musikalsk verk som omfatter et bidrag i form av å skrive ord som tilføyes til et uttrykk. @no
label: ist Verfasser von zusätzlichen Lyrics von @de
has element type: 2
label: hozzáadott dalszövegének írója @hu
definition: Egy zenemű kifejezési formájához hozzáadott szavak íróját hozzákapcsolja egy kifejezési formához. @hu
toolkit label: hozzáadott szöveg írója @hu
toolkit definition: Egy zenemű kifejezési formája, amely hozzájárulást testesít meg azzal, hogy egy kifejezési formához szavakat ír. @hu
has subproperty: P50216

lisätty kommentaari
status: Deprecated
label: is writer of added commentary of (Deprecated) @en
definition: Relates an agent to an expression that includes a contribution of providing an interpretation or critical explanation. (Deprecated) @en
type: Property
domain: C10002
sub property of: oheisteksti
lexical alias: writerOfAddedCommentaryOf.en
label: est un auteur de commentaire ajouté de @fr
definition: Met un agent qui contribue à une expression d’une œuvre en fournissant une interprétation ou une critique d’une œuvre originale en relation avec une expression. @fr
toolkit label: auteur de commentaire ajouté de @fr
toolkit definition: Expression d’une œuvre qui intègre une contribution consistant à fournir une interprétation ou une critique d’une œuvre originale. @fr
toolkit label: writer of added commentary of (Deprecated) @en
toolkit definition: An expression that includes a contribution of providing an interpretation or critical explanation. (Deprecated) @en
instruction number: 18.5
label: είναι συγγραφέας των πρόσθετων σχολίων του @el
definition: Συνδέει έναν φορέα, ο οποίος συνεισφέρει σε μια έκφραση ενός έργου παρέχοντας μια ερμηνεία ή κριτική επεξήγηση του πρωτότυπου έργου, με μια έκφραση. @el
toolkit label: συγγραφέας των πρόσθετων σχολίων του @el
toolkit definition: Μια έκφραση ενός έργου που ενσωματώνει τη συνεισφορά της ερμηνείας ή της κριτικής επεξήγησης ενός πρωτότυπου έργου. @el
definition: Setzt einen Akteur, der an einer Expression eines Werks mitwirkt, indem er eine Interpretation oder eine kritische Erläuterung des Originalwerks verfasst, mit einer Expression in Beziehung. @de
toolkit label: Kommentarverfasser von @de
toolkit definition: Eine Expression eines Werks, bei der ein Akteur eine Interpretation oder eine kritische Erläuterung des Originalwerks verfasst. @de
label: er forfatter til tilføjet kommentar til @da
definition: Relaterer en agent, der har bidraget til et udtryk af et værk ved at sørge for en fortolkning eller kritisk forklaring af et oprindeligt værk til et udtryk. @da
toolkit label: forfatter til tilføjet kommentar til @da
toolkit definition: Udtryk af et værk der inkorporerer et bidrag ved at sørge for en fortolkning eller en kritisk forklaring til et oprindeligt værk. @da
label: és escriptor d’un comentari afegit de @ca
definition: Relaciona un agent, que contribueix a una expressió d’una obra proporcionant una interpretació o una explicació crítica d’un obra original, amb una expressió. @ca
toolkit label: escriptor d’un comentari afegit de @ca
toolkit definition: Expressió d’una obra que incorpora una contribució que proporciona una interpretació o una explicació crítica d’un obra original. @ca
definition: Liittää toimija teoksen ekspressioon, joka sisältää teoksen tulkinnan tai kriittisen selityksen.
toolkit label: lisätty kommentaari
toolkit definition: Teoksen ekspressio, joka sisältää teoksen tulkinnan tai kriittisen selityksen.
toolkit label: forfatter av tilføyd kommentar til @no
toolkit definition: Et uttrykk av et verk som omfatter et bidrag i form av å gi en tilkning eller kritisk forklaring av et originalverk. @no
label: ist Kommentarverfasser von @de
has element type: 2
label: hozzáadott kommentár írója @hu
definition: Egy ágenst (személyt, családot vagy testületet), aki/amely egy mű kifejezési formájához hozzájárul azzal, hogy egy eredeti mű értelmezését vagy kritikai magyarázatát adja, hozzákapcsol egy kifejezési formához. @hu
toolkit label: hozáadott kommentár írója @hu
toolkit definition: Egy mű kifejezési formája, amely hozzájárulást testesít meg azzal, hogy egy eredeti művet értelmezéssel vagy kritikai magyarázattal lát el. @hu
has subproperty: P50152

kirjoittajana lisätyssä tekstissä
status: Deprecated
label: is writer of added text of (Deprecated) @en
definition: Relates an agent to an expression that includes a contribution of adding text, such as captions for photographs or descriptions of maps. (Deprecated) @en
type: Property
domain: C10002
sub property of: oheisteksti
lexical alias: writerOfAddedTextOf.en
label: est un auteur de texte ajouté de @fr
definition: Met un agent qui contribue à une expression d’une œuvre essentiellement non textuelle en fournissant du texte tel que des légendes de photographies ou des descriptions de cartes géographiques en relation avec une expression. @fr
toolkit label: auteur de texte ajouté de @fr
toolkit definition: Expression d’une œuvre essentiellement non textuelle qui intègre une contribution consistant à fournir du texte, par exemple en écrivant des légendes pour des photographies ou des descriptions de cartes géographiques. @fr
toolkit label: writer of added text of (Deprecated) @en
toolkit definition: An expression that includes a contribution of adding text, such as captions for photographs or descriptions of maps. (Deprecated) @en
instruction number: 18.5
label: είναι συγγραφέας του πρόσθετου κειμένου του @el
definition: Συνδέει έναν φορέα, ο οποίος συνεισφέρει σε μια έκφραση ενός μη κειμενικού αρχικά έργου παρέχοντας κείμενο, όπως επικεφαλίδες για φωτογραφίες ή περιγραφές για χάρτες, με μια έκφραση. @el
toolkit label: συγγραφέας του πρόσθετου κειμένου του @el
toolkit definition: Μια έκφραση ενός μη κειμενικού αρχικά έργου το οποίο ενσωματώνει τη συνεισφορά της παροχής κείμενου, όπως επικεφαλίδες για φωτογραφίες ή περιγραφές για χάρτες. @el
definition: Setzt einen Akteur, der an einer Expression eines primär nicht textlichen Werks mitwirkt, indem er Texte für das nicht textliche Werk verfasst, z. B. Bildunterschriften für Fotografien oder Beschreibungen von Karten, mit einer Expression in Beziehung. @de
toolkit label: Verfasser von Zusatztexten von @de
toolkit definition: Eine Expression, bei der ein Akteur Texte für das nicht textliche Werk verfasst, z. B. Bildunterschriften für Fotografien oder Beschreibungen von Karten. @de
label: er forfatter til tilføjet tekst til @da
definition: Relaterer en agent der har bidraget til et udtryk af et fortrinsvisikke-tekstligt værk ved at sørge for tekst til det ikke-tekstlige værk til et udtryk. @da
toolkit label: forfatter til tilføjet tekst til @da
toolkit definition: Udtryk af et fortrinsvis ikke-tekstligt værk, der inkorporerer et bidrag der sørger for tekst som fx billedtekster til fotos eller beskrivelser af kort. @da
label: és escriptor d’un text addicional de @ca
definition: Relaciona un agent, que contribueix a una expressió d’una obra principalment no textual proporcionant text per a l’obra no textual, com ara escrivint peus de fotografies o descripcions de mapes, amb una expressió. @ca
toolkit label: escriptor d’un text addicional de @ca
toolkit definition: Expressió d’una obra principalment no textual que incorpora una contribució que proporciona text, com ara escrivint peus de fotografies o descripcions de mapes. @ca
definition: Liittää toimijan alkuaan pääasiassa tekstittömän teoksen ekspressioon, johon on tuotettu tekstiä, kuten kuvatekstejä valokuviin tai karttojen kuvauksia.
toolkit label: kirjoittajana lisätyssä tekstissä
toolkit definition: Alkuaan pääasiassa tekstittömän teoksen ekspressio, johon on tuotettu tekstiä, kuten kuvatekstejä valokuviin tai karttojen kuvauksia.
toolkit label: forfatter av tilføyd tekst for @no
toolkit definition: Et uttrykk av et verk som ikke hovedsakelig består av tekst, som omfatter et bidrag i form av å tilføre tekst, for eksempel bildetekster eller kartbeskrivelser. @no
label: ist Verfasser von Zusatztexten von @de
has element type: 2
label: hozzáadott szöveg írója @hu
definition: Egy ágenst (személyt, családot vagy testületet), aki/amely egy elsősorban nem-szöveges mű kifejezési formájához hozzájárul azzal, hogy például fényképek képaláírását vagy térképek leírását tartalmazó szöveget csatol hozzá, hozzákapcsol egy kifejezési formához. @hu
toolkit label: hozzáadott szöveg írója @hu
toolkit definition: Egy elsődlegesen nem-szöveges mű kifejezési formája, amely hozzájárulást jelent azzal, hogy fényképaláírásokhoz vagy térképleírásokhoz hasonló szöveget ad hozzá. @hu
has subproperty: kirjoittajana lisätylle sanoitukselle
has subproperty: P50138

toimijan tunniste
status: Published
type: Property
label: has identifier for agent @en
lexical alias: identifierForAgent.en
definition: Relates an agent to a nomen that is an appellation of agent that consists of a code, number, or other string, usually independent of natural language and social naming conventions, used to identify an agent. @en
domain: C10002
toolkit label: identifier for agent @en
toolkit definition: A nomen that is an appellation of agent that consists of a code, number, or other string, usually independent of natural language and social naming conventions, used to identify an agent. @en
sub property of: toimijan nimitys
has element type: 3
sub property of: P00018
definition: Liittää toimijan nomeniin, joka on toimijan nimitys, joka koostuu koodista, luvusta tai muusta tavallisesti luonnollisesta kielestä ja yleisistä nimeämiskäytännöistä riippumattomasta merkkijonosta, jota käytetään toimijan identifiointiin.
toolkit label: toimijan tunniste
toolkit definition: Nomen, joka on toimijan nimitys, joka koostuu koodista, luvusta tai muusta tavallisesti luonnollisesta kielestä ja yleisistä nimeämiskäytännöistä riippumattomasta merkkijonosta, jota käytetään yhteistoimijan identifiointiin.
label: har identifikator for agent @no
definition: Relaterer en agent til en betegnelse for agent som består av en kode, et nummer eller annen streng, vanligvis uavhengig av naturlig språk og sosiale navnekonvensjoner, brukt for å identifisere en agent. @no
toolkit label: identifikator for agent @no
toolkit definition: En betegnelse for agent som består av en kode, et nummer eller annen streng, vanligvis uavhengig av naturlig språk og sosiale navnekonvensjoner, brukt for å identifisere en agent. @no
label: heeft identificatie voor actor @nl
definition: Relateert een actor aan een nomen dat is een benaming van actor die bestaat uit een code, nummer of andere tekenreeks, meestal onafhankelijk van natuurlijke taal en gewoonlijke naamgevingsconventies, gebruikt om een actor te identificeren. @nl
toolkit label: identificatie voor actor @nl
toolkit definition: Een nomen dat is een benaming van actor die bestaat uit een code, nummer of andere tekenreeks, meestal onafhankelijk van natuurlijke taal en gewoonlijke naamgevingsconventies, gebruikt om een actor te identificeren. @nl
label: له معرِّف لوكيل @ar
definition: يربط وكيلا بتسمية عبارة عن اسم وكيل يتكون من رمز، أو رقم، أو سلسلة تمثيلات أخرى، عادة ما تكون مختلفة عن اللغة الطبيعية وعن التسميات المتعارف عليها اجتماعيا المستخدمة في تعريف وكيل. @ar
toolkit label: معرِّف لوكيل @ar
toolkit definition: تسمية عبارة عن اسم وكيل يتكون من رمز، أو رقم، أو سلسلة تمثيلات أخرى، عادة ما تكون مختلفة عن اللغة الطبيعية وعن التسميات المتعارف عليها اجتماعيا، المستخدمة في تعريف وكيل. @ar
label: té com a identificador d’agent @ca
definition: Relaciona un agent amb un nomen que és una apel·lació d’agent que consisteix en un codi, un número o una altra cadena, normalment independent del llenguatge natural i de les convencions lingüístiques socials, usada per identificar un agent. @ca
toolkit label: identificador d’agent @ca
toolkit definition: Nomen que és una apel·lació d’agent que consisteix en un codi, un número o una altra cadena, normalment independent del llenguatge natural i de les convencions lingüístiques socials, usada per identificar un agent. @ca
definition: Relaterer en agent til et nomen, som er en benævnelse på agent, som består af en kode, nummer eller anden streng, ofte uafhængig af normalsprog og navngivningskonventioner, brugt til at identificere en agent. @da
toolkit definition: Nomen, som er en benævnelse på agent, som består af en kode, nummer eller anden streng, ofte uafhængig af normalsprog og navngivningskonventioner, brugt til at identificere en agent. @da
label: tegija identifikaator @et
definition: Seostab tegija tegija nimetusega, mis koosneb tegijat identifitseerivast koodist, numbrist või muust loomulikust keelest ja üldtuntud nimetamistavadest sõltumatust stringist. @et
toolkit label: tegija identifikaator @et
toolkit definition: Tegija nimetus, mis koosneb tegijat identifitseerivast koodist, numbrist või muust loomulikust keelest ja üldtuntud nimetamistavadest sõltumatust stringist. @et
label: hat Identifikator für einen Akteur @de
definition: Setzt einen Akteur in Beziehung zu einer Bezeichnung für einen Akteur, die aus einem Code, einer Nummer oder einer anderen Zeichenkette besteht, der/die normalerweise nicht in natürlicher Sprache und unabhängig von den sozialen Benennungskonventionen ist und zur Identifizierung eines Akteurs verwendet wird. @de
toolkit label: Identifikator für einen Akteur @de
toolkit definition: Eine Bezeichnung für einen Akteur, die aus einem Code, einer Nummer oder einer anderen Zeichenkette besteht, der/die normalerweise nicht in natürlicher Sprache und unabhängig von den sozialen Benennungskonventionen ist und zur Identifizierung eines Akteurs verwendet wird. @de
label: ágens azonosítója a következő: @hu
definition: Hozzákapcsol egy ágenst egy nomenhez, egy ágens megnevezéséhez, amely egy kód, szám, vagy más típusú karakterláncból áll, amely általában független a természetes nyelvektől és a társadalmi névkonvencióktól, és egyetlen ágens azonosítására használják. @hu
toolkit label: ágensazonosító: @hu
toolkit definition: Egy nomen, egy ágens megnevezése, amely egy kód, szám, vagy más típusú karakterláncból állból áll, amely általában független a természetes nyelvektől és a társadalmi névkonvencióktól, és egyetlen ágens azonosítására használják. @hu
label: ha come identificatore di agente @it
definition: Correla un agente con la denominazione di un agente in linguaggio naturale che consiste di un codice, numero, o stringa, solitamente indipendente dal linguaggio naturale e dalle convenzioni sociali di denominazione, usati per identificare un agente. @it
toolkit label: identificatore di agente @it
toolkit definition: Denominazione di un agente in linguaggio naturale che consiste di un codice, numero, o stringa, solitamente indipendente dal linguaggio naturale e dalle convenzioni sociali di denominazione, usati per identificare un agente. @it
label: έχει αναγνωριστικό για φορέα @el
toolkit label: αναγνωριστικό για φορέα @el
label: a pour identifiant d’agent @fr
definition: Met un agent en relation avec un nomen qui est une appellation d’agent consistant en un code, un nombre ou une autre chaîne, généralement indépendante du langage naturel et des conventions sociales de dénomination, utilisée pour identifier un agent. @fr
toolkit label: identifiant d’agent @fr
toolkit definition: Nomen qui est une appellation d’agent consistant en un code, un nombre ou une autre chaîne, généralement indépendante du langage naturel et des conventions sociales de dénomination, utilisée pour identifier un agent. @fr
label: aģenta identifikators @lv
definition: Sasaista aģentu ar nomenu, kas ir aģenta apzīmējums, kas sastāv no koda, skaitļa vai citas virknes, kas parasti ir neatkarīgs no dabiskas valodas vai sabiedrībā pieņemtām nosaukšanas tradīcijām, ko izmanto, lai identificētu aģentu. @lv
toolkit label: aģenta identifikators @lv
toolkit definition: Aģenta apzīmējums, kas sastāv no koda, skaitļa vai citas virknes, kas parasti ir neatkarīgs no dabiskas valodas vai sabiedrībā pieņemtām nosaukšanas tradīcijām, ko izmanto, lai identificētu aģentu. @lv
label: 有行为者的标识符 @zh-hans
definition: 将一个行为者与作为一个由代码、数字、或其他字符串构成、通常独立于自然语言和社会命名惯例、用以标识一个行为者的行为者的称谓的命名关联起来。 @zh-hans
toolkit label: 行为者的标识符 @zh-hans
toolkit definition: 作为一个由代码、数字、或其他字符串构成、通常独立于自然语言和社会命名惯例、用以标识一个行为者的行为者的称谓的命名 @zh-hans
label: temsilcinin tanımlayıcısı ile ilişkilidir @tr
definition: Bir temsilciyi, bir temsilciyi tanımlamak için kullanılan, genellikle doğal dilden ve sosyal adlandırma kurallarından bağımsız olan bir kod, sayı veya başka bir diziyi içeren bir temsilcinin unvanı olan bir isimle ilişkilendirir. @tr
toolkit label: temsilcinin tanımlayıcısı ile ilişkilidir @tr
toolkit definition: Bir temsilciyi tanımlamak için kullanılan, genellikle doğal dilden ve sosyal adlandırma kurallarından bağımsız olan bir kod, sayı veya başka bir dizeden oluşan bir temsilcinin unvanı olan bir isim. @tr
has subproperty: yhteistoimijan tunniste
has subproperty: henkilön tunniste
has subproperty: P50383

yhteistoimijan tunniste
status: Published
type: Property
label: has identifier for collective agent @en
lexical alias: identifierForCollectiveAgent.en
definition: Relates a collective agent to a nomen that is an appellation of collective agent that consists of a code, number, or other string, usually independent of natural language and social naming conventions, used to identify a collective agent. @en
domain: C10011
toolkit label: identifier for collective agent @en
toolkit definition: A nomen that is an appellation of collective agent that consists of a code, number, or other string, usually independent of natural language and social naming conventions, used to identify a collective agent. @en
sub property of: yhteistoimijan nimitys
sub property of: toimijan tunniste
has element type: 3
definition: Liittää yhteistoimijan nomeniin, joka on yhteistoimijan nimitys, joka koostuu koodista, luvusta tai muusta tavallisesti luonnollisesta kielestä ja yleisistä nimeämiskäytännöistä riippumattomasta merkkijonosta, jota käytetään yhteistoimijan identifiointiin.
toolkit label: yhteistoimijan tunniste
toolkit definition: Nomen, joka on yhteistoimijan nimitys, joka koostuu koodista, luvusta tai muusta tavallisesti luonnollisesta kielestä ja yleisistä nimeämiskäytännöistä riippumattomasta merkkijonosta, jota käytetään yhteistoimijan identifiointiin.
label: har identifikator for kollektiv agent @no
definition: Relaterer en kollektiv agent til en betegnelse for kollektiv agent som består av en kode, et nummer eller annen streng, vanligvis uavhengig av naturlig språk og sosiale navnekonvensjoner, brukt for å identifisere en kollektiv agent. @no
toolkit label: identifikator for kollektiv agent @no
toolkit definition: En betegnelse for kollektiv agent som består av en kode, et nummer eller annen streng, vanligvis uavhengig av naturlig språk og sosiale navnekonvensjoner, brukt for å identifisere en kollektiv agent. @no
label: heeft identificatie voor collectieve actor @nl
definition: Relateert een collectieve actor aan een nomen dat is een benaming van collectieve actor die bestaat uit een code, nummer of andere tekenreeks, meestal onafhankelijk van natuurlijke taal en gewoonlijke naamgevingsconventies, gebruikt om een collectieve actor te identificeren. @nl
toolkit label: identificatie voor collectieve actor @nl
toolkit definition: Een nomen dat is een benaming van collectieve actor die bestaat uit een code, nummer of andere tekenreeks, meestal onafhankelijk van natuurlijke taal en gewoonlijke naamgevingsconventies, gebruikt om een collectieve actor te identificeren. @nl
label: له معرِّف لوكيل جماعي @ar
definition: يربط وكيلا جماعيا بتسمية عبارة عن اسم وكيل جماعي يتكون من رمز، أو رقم، أو سلسلة تمثيلات أخرى، عادة ما تكون مختلفة عن اللغة الطبيعية وعن التسميات المتعارف عليها اجتماعيا، المستخدمة في تعريف وكيل جماعي. @ar
toolkit label: معرِّف لوكيل جماعي @ar
toolkit definition: تسمية هي اسم وكيل جماعي يتكون من رمز، أو رقم، أو سلسلة تمثيلات أخرى، عادة ما تكون مختلفة عن اللغة الطبيعية وعن التسميات المتعارف عليها اجتماعيا، المستخدمة في تعريف وكيل جماعي. @ar
label: té com a identificador d’agent col·lectiu @ca
definition: Relaciona un agent col·lectiu amb un nomen que és una apel·lació d’agent col·lectiu que consisteix en un codi, un número o una altra cadena, normalment independent del llenguatge natural i de les convencions lingüístiques socials, usada per identificar un agent col·lectiu. @ca
toolkit label: identificador d’agent col·lectiu @ca
toolkit definition: Nomen que és una apel·lació d’agent col·lectiu que consisteix en un codi, un número o una altra cadena, normalment independent del llenguatge natural i de les convencions lingüístiques socials, usada per identificar un agent col·lectiu. @ca
definition: Relaterer en kollektiv agent til et nomen, som er en benævnelse på kollektiv agent, som består af en kode, nummer eller anden streng, ofte uafhængig af normalsprog og navngivningskonventioner, brugt til at identificere en kollektiv agent. @da
toolkit definition: Nomen, som er en benævnelse på kollektiv agent, som består af en kode, nummer eller anden streng, ofte uafhængig af normalsprog og navngivningskonventioner, brugt til at identificere en kollektiv agent. @da
label: kollektiivi identifikaator @et
definition: Seostab kollektiivi kollektiivi nimetusega, mis koosneb kollektiivi identifitseerivast koodist, numbrist või muust loomulikust keelest ja üldtuntud nimetamistavadest sõltumatust stringist. @et
toolkit label: kollektiivi identifikaator @et
toolkit definition: Kollektiivi nimetus, mis koosneb kollektiivi identifitseerivast koodist, numbrist või muust loomulikust keelest ja üldtuntud nimetamistavadest sõltumatust stringist. @et
label: hat Identifikator für einen gemeinschaftlichen Akteur @de
definition: Setzt einen gemeinschaftlichen Akteur in Beziehung zu einer Bezeichnung für einen Akteur, die aus einem Code, einer Nummer oder einer anderen Zeichenkette besteht, der/die normalerweise nicht in natürlicher Sprache und unabhängig von den sozialen Benennungskonventionen ist und zur Identifizierung eines gemeinschaftlichen Akteurs verwendet wird. @de
toolkit label: Identifikator für einen gemeinschaftlichen Akteur @de
toolkit definition: Eine Bezeichnung für eine Akteur, die aus einem Code, einer Nummer oder einer anderen Zeichenkette besteht, der/die normalerweise nicht in natürlicher Sprache und unabhängig von den sozialen Benennungskonventionen ist und zur Identifizierung eines gemeinschaftlichen Akteurs verwendet wird. @de
label: kollektív ágens azonosítója a következő: @hu
definition: Hozzákapcsol egy kollektív ágenst egy nomenhez, egy kollektív ágens megnevezéséhez, amely egy kód, szám, vagy más típusú karakterláncból állból áll, amely általában független a természetes nyelvektől és a társadalmi névkonvencióktól, és egy kollektív ágens azonosítására használják. @hu
toolkit label: kollektívágens-azonosító: @hu
toolkit definition: Egy nomen, egy kollektív ágens megnevezése, amely egy kód, szám, vagy más típusú karakterláncból állból áll, amely általában független a természetes nyelvektől és a társadalmi névkonvencióktól, és egy kollektív ágens azonosítására használják. @hu
label: ha come identificatore di agente collettivo @it
definition: Correla un agente collettivo alla denominazione di un agente in linguaggio naturale che consiste di un codice, numero, o stringa, solitamente indipendente dal linguaggio naturale e dalle convenzioni sociali di denominazione, usati per identificare un agente collettivo. @it
toolkit label: identificatore di agente collettivo @it
toolkit definition: Denominazione di un agente in linguaggio naturale che consiste di un codice, numero, o stringa, solitamente indipendente dal linguaggio naturale e dalle convenzioni sociali di denominazione, usati per identificare un agente collettivo. @it
label: έχει αναγνωριστικό για συλλογικό φορέα @el
toolkit label: αναγνωριστικό για συλλογικό φορέα @el
label: a pour identifiant d’agent collectif @fr
definition: Met un agent collectif en relation avec un nomen qui est une appellation d’agent collectif consistant en un code, un nombre ou une autre chaîne, généralement indépendante du langage naturel et des conventions sociales de dénomination, utilisée pour identifier un agent collectif. @fr
toolkit label: identifiant d’agent collectif @fr
toolkit definition: Nomen qui est une appellation d’agent collectif consistant en un code, un nombre ou une autre chaîne, généralement indépendante du langage naturel et des conventions sociales de dénomination, utilisée pour identifier un agent collectif. @fr
label: grupas identifikators @lv
definition: Sasaista grupu ar nomenu, kas ir grupas apzīmējums, kas sastāv no koda, skaitļa vai citas virknes, kas parasti ir neatkarīgs no dabiskas valodas vai sabiedrībā pieņemtām nosaukšanas tradīcijām, ko izmanto, lai identificētu grupu. @lv
toolkit label: grupas identifikators @lv
toolkit definition: Grupas apzīmējums, kas sastāv no koda, skaitļa vai citas virknes, kas parasti ir neatkarīgs no dabiskas valodas vai sabiedrībā pieņemtām nosaukšanas tradīcijām, ko izmanto, lai identificētu grupu. @lv
label: 有集体行为者的标识符 @zh-hans
definition: 将一个集体行为者与作为一个由代码、数字、或其他字符串构成、通常独立于自然语言和社会命名惯例、用以标识一个集体行为者的集体行为者的称谓的命名关联起来。 @zh-hans
toolkit label: 集体行为者的标识符 @zh-hans
toolkit definition: 作为一个由代码、数字、或其他字符串构成、通常独立于自然语言和社会命名惯例、用以标识一个集体行为者的集体行为者的称谓的命名 @zh-hans
label: kolektif temsilcinin tanımlayıcısı ile ilişkilidir @tr
definition: Kolektif bir temsilciyi, bir kolektif temsilciyi tanımlamak için kullanılan, genellikle doğal dilden ve sosyal adlandırma kurallarından bağımsız olan bir kod, sayı veya başka bir dizeden oluşan bir kolektif temsilcinin tanımlayıcı adı olan bir isim ile ilişkilendirir. @tr
toolkit label: kolektif temsilcinin tanımlayıcısı ile ilişkilidir @tr
toolkit definition: Bir kolektif temsilciyi tanımlamak için kullanılan, genellikle doğal dilden ve sosyal adlandırma kurallarından bağımsız olan bir kod, sayı veya başka bir dizeden oluşan bir kolektif temsilcinin unvanı olan bir isim. @tr
has subproperty: suvun tunniste
has subproperty: yhteisön tunniste
has subproperty: P50384

yhteisöön liittyvä ajankohta
status: Deprecated
label: has date associated with corporate body (Deprecated) @en
definition: Relates a corporate body to a timespan that has a significant association with a corporate body. (Deprecated) @en
type: Property
domain: C10005
lexical alias: dateAssociatedWithCorporateBody.en
instruction number: 11.4
toolkit label: date associated with corporate body (Deprecated) @en
toolkit definition: A timespan that has a significant association with a corporate body. (Deprecated) @en
label: a pour date associée à une collectivité @fr
definition: Met une collectivité en relation avec une date importante associée à l’histoire d’une collectivité. @fr
toolkit label: date associée à une collectivité @fr
toolkit definition: Date importante associée à l’histoire d’une collectivité. @fr
toolkit label: fecha asociada con la entidad corporativa @es
toolkit definition: Una fecha significativa asociada con la historia de una entidad corporativa, incluyendo fechas de conferencia, fechas de terminación, y período de actividad. @es
label: har tid förknippad med institutionen @sv
toolkit label: tid förknippad med institutionen @sv
label: έχει χρονολογία συνδεδεμένη με το το συλλογικό όργανο @el
definition: Συνδέει ένα συλλογικό όργανο με μια σημαντική χρονολογία που σχετίζεται με την ιστορία ενός συλλογικού οργάνου. @el
toolkit label: χρονολογία συνδεδεμένη με το συλλογικό όργανο @el
toolkit definition: Μια σημαντική χρονολογία που συνδέεται με την ιστορία ενός συλλογικού οργάνου. @el
definition: Setzt eine Körperschaft mit einem wichtigen Datum, das mit der Geschichte einer Körperschaft in Verbindung steht, in Beziehung. @de
toolkit label: Datum, das mit einer Körperschaft in Verbindung steht @de
toolkit definition: Ein wichtiges Datum, das mit der Geschichte einer Körperschaft in Verbindung steht. @de
label: har dato knyttet til korporationen @da
definition: Relaterer en korporation til en væsentlig datering forbundet med en korporations historie. @da
toolkit label: dato knyttet til korporationen @da
toolkit definition: Væsentlig dato forbundet med en korporations historie. @da
label: té com a data associada amb una entitat corporativa @ca
definition: Relaciona una entitat corporativa amb una data significativa associada amb la història d’una entitat corporativa. @ca
toolkit label: data associada amb una entitat corporativa @ca
toolkit definition: Data significativa associada amb la història d’una entitat corporativa. @ca
definition: Liittää yhteisön yhteisön historian merkittävään ajankohtaan.
toolkit label: yhteisöön liittyvä ajankohta
toolkit definition: Yhteisön historiaan liittyvä merkittävä ajankohta.
toolkit label: tidspunkt som forbindes med korporasjon @no
toolkit definition: Et viktig tidspunkt som forbindes med en korporasjons historie. @no
label: hat Datum, das mit einer Körperschaft in Verbindung steht @de
sub property of: yhteisöön liittyvä ajanjakso
has element type: 3
label: van testülettel kapcsolatos időpontja @hu
definition: Egy testületet hozzákapcsol egy testület történetéhez kötődő fontos időponthoz. @hu
toolkit label: testülethez kötődő időpont @hu
toolkit definition: Egy testület történetével kapcsolatos jelentős időpont. @hu
has subproperty: P50040

illuminoinnin tekijä (toimija) kappaleessa
status: Published
label: is illuminator agent of @en
definition: Relates an agent to an item that is decorated by an agent using precious metals or colour, often with elaborate designs and motifs. @en
type: Property
domain: C10002
sub property of: toimijaan liittyvä kappale
lexical alias: illuminatorAgentOf.en
label: est un agent enlumineur de @fr
definition: Met un agent en relation avec un item qui est orné par un agent avec des métaux précieux ou de la couleur, souvent avec des dessins et des motifs élaborés. @fr
toolkit label: agent enlumineur de @fr
toolkit definition: Item qui est orné par un agent avec des métaux précieux ou de la couleur, souvent avec des dessins et des motifs élaborés. @fr
toolkit label: illuminator agent of @en
toolkit definition: An item that is decorated by an agent using precious metals or colour, often with elaborate designs and motifs. @en
instruction number: 18.5
label: είναι φωτιστής φορέας του @el
definition: Συνδέει ένα φυσικό πρόσωπο, που διακοσμεί ένα συγκεκριμένο αντίτυπο χρησιμοποιώντας πολύτιμα μέταλλα ή χρώματα, συχνά με περίτεχνα σχέδια και μοτίβα, με ένα αντίτυπο. @el
toolkit label: φωτιστής φορέας του @el
toolkit definition: Ένα αντίτυπο διακοσμημένο μέσω πολύτιμων μετάλλων ή χρώματος, συχνά με περίτεχνα σχέδια και μοτίβα. @el
definition: Setzt einen Akteur in Beziehung zu einem Exemplar, das von einem Akteur durch Edelmetalle oder Farbe, häufig mit kunstvollen Mustern und Motiven, (aus-)gestaltet wird. @de
toolkit label: Akteur als Illuminatorin/Illuminator von @de
toolkit definition: Eine Exemplar, das von einem Akteur durch Edelmetalle oder Farbe, häufig mit kunstvollen Mustern und Motiven, (aus-)gestaltet wird. @de
label: er agent, som er illuminator af @da
definition: Relaterer en agent til et eksemplar, som er udsmykket af en agent med ædelmetal eller farve, ofte med detaljerige mønstre og motiver. @da
toolkit label: agent, som er illuminator af @da
toolkit definition: Eksemplar, som er udsmykket af en agent med ædelmetal eller farve, ofte med detaljerige mønstre og motiver. @da
label: és agent il·luminador de @ca
definition: Relaciona un agent amb un ítem que és decorat per un agent usant metalls preciosos o amb color, sovint amb dissenys i motius elaborats. @ca
toolkit label: agent il·luminador de @ca
toolkit definition: Ítem que és decorat per un agent usant metalls preciosos o amb color, sovint amb dissenys i motius elaborats. @ca
definition: Liittää toimijan kappaleeseen, jonka toimija koristelee usein yksityiskohtaisin kuvioin tai motiivein käyttäen jalometalleja tai värejä.
toolkit label: illuminoinnin tekijä (toimija) kappaleessa
toolkit definition: Kappale, jonka toimija koristelee usein yksityiskohtaisin kuvioin tai motiivein käyttäen jalometalleja tai värejä.
toolkit label: illuminator av (agent) @no
toolkit definition: Et eksemplar som er dekorert av en agent ved bruk av edle metaller eller farger, gjerne med intrikate former og motiver. @no
label: ist Akteur als Illuminatorin/Illuminator von @de
has element type: 2
label: illuminátor ágense a következőnek: @hu
definition: Hozzákapcsol egy ágenst egy példányhoz, amelyet az ágens nemesfémeket vagy színeket használva díszít, gyakran kidolgozott rajzokkal és motívumokkal. @hu
toolkit label: illuminátor ágense: @hu
toolkit definition: Egy példány, amelyet egy ágens nemesfémeket vagy színeket használva díszít, gyakran kidolgozott rajzokkal és motívumokkal. @hu
alternative label: illuminator of @en
alternative label: illuminointi kappaleessa
label: er illuminator av (agent) @no
definition: Relaterer en agent til et eksemplar som er dekorert av en agent ved bruk av edle metaller eller farger, gjerne med intrikate former og motiver. @no
alternative label: illuminator av @no
label: is verluchter-actor van @nl
definition: Relateert een actor aan een item dat is versierd door een actor met gebruikmaking van edelmetalen of kleur, vaak met uitgebreide patronen en motieven. @nl
toolkit label: verluchter-actor van @nl
toolkit definition: Een item dat is versierd door een actor met gebruikmaking van edelmetalen of kleur, vaak met uitgebreide patronen en motieven. @nl
label: هو وكيل مزخرِف لـ @ar
definition: يربط وكيلا بمفردة يزينها وكيل بمعادن ثمينة أو بألوان، غالبًا بتصاميم وزخارف منمقة. @ar
alternative label: مزخرف لـ @ar
toolkit label: وكيل مزخرف @ar
toolkit definition: مفردة يزينها وكيل بمعادن ثمينة أو بألوان، غالبًا بتصاميم وزخارف منمقة. @ar
alternative label: il·luminador de @ca
alternative label: illuminator af @da
label: illumineerija (tegija) eksemplaris @et
definition: Seostab tegija eksemplariga, mille tegija on kaunistanud väärismetallide ja värvidega, kasutades sageli keerulisi kujundeid ja motiive. @et
alternative label: illumineerija eksemplaris @et
toolkit label: illumineerija (tegija) eksemplaris @et
toolkit definition: Eksemplar, mille tegija on kaunistanud väärismetallide ja värvidega, kasutades sageli keerulisi kujundeid ja motiive. @et
alternative label: illuminátora: @hu
label: è miniatore agente di @it
definition: Correla un agente a un item che è decorato da un agente utilizzando metalli preziosi o colore, spesso con disegni e motivi elaborati. @it
alternative label: miniatore di @it
toolkit label: miniatore agente di @it
toolkit definition: Mette in relazione un agente a un item che è decorato da un agente utilizzando metalli preziosi o colore, spesso con disegni e motivi elaborati. @it
alternative label: φωτιστής του @el
alternative label: enlumineur de @fr
label: ir iluminātors (aģents) @lv
definition: Sasaista aģentu ar vienību, ko aģents izgreznojis, izmantojot krāsu un/vai dārgmetālus, bieži ar izsmalcinātiem un filigrāniem zīmējumiem, burtiem un motīviem. @lv
toolkit label: ir iluminātors (aģents) @lv
toolkit definition: Vienība, ko aģents izgreznojis, izmantojot krāsu un/vai dārgmetālus, bieži ar izsmalcinātiem un filigrāniem zīmējumiem, burtiem un motīviem. @lv
alternative label: Illuminator von @de
alternative label: ……的彩饰者 @zh-hans
toolkit label: ……的彩饰者行为者 @zh-hans
toolkit definition: 被用贵重的金属或色彩（通常有精心的设计和图案）的一个行为者进行装饰的一个单件 @zh-hans
toolkit label: tezhip sanatçısı temsilcisidir @tr
toolkit definition: Değerli metaller veya renkler kullanılarak, genellikle özenle hazırlanmış desenler ve motiflerle bir temsilci tarafından süslenen bir kopya. @tr
has subproperty: illuminoinnin tekijä (yhteistoimija) kappaleessa

illuminoinnin tekijä (yhteistoimija) kappaleessa
status: Published
label: is illuminator collective agent of @en
lexical alias: illuminatorCollectiveAgentOf.en
definition: Relates a collective agent to an item that is decorated by a collective agent using precious metals or colour, often with elaborate designs and motifs. @en
toolkit label: illuminator collective agent of @en
toolkit definition: An item that is decorated by a collective agent using precious metals or colour, often with elaborate designs and motifs. @en
type: Property
domain: C10011
has element type: 2
sub property of: yhteistoimijaan liittyvä kappale
sub property of: illuminoinnin tekijä (toimija) kappaleessa
definition: Liittää yhteistoimijan kappaleeseen, jonka yhteistoimija koristelee usein yksityiskohtaisin kuvioin tai motiivein käyttäen jalometalleja tai värejä.
toolkit label: illuminoinnin tekijä (yhteistoimija) kappaleessa
toolkit definition: Kappale, jonka yhteistoimija koristelee usein yksityiskohtaisin kuvioin tai motiivein käyttäen jalometalleja tai värejä.
label: er illuminator for (kollektiv agent) @no
definition: Relaterer en kollektiv agent til et eksemplar som er dekorert av en kollektiv agent ved hjelp av edle metaller eller farger, gjerne med intrikate former og motiver. @no
toolkit label: illuminator for (kollektiv agent) @no
toolkit definition: Et eksemplar som er dekorert av en kollektiv agent ved hjelp av edle metaller eller farger, gjerne med intrikate former og motiver. @no
label: is verluchter-collectieve actor van @nl
definition: Relateert een collectieve actor aan een item dat is versierd door een collectieve actor met gebruikmaking van edelmetalen of kleur, vaak met uitgebreide patronen en motieven. @nl
toolkit label: verluchter-collectieve actor van @nl
toolkit definition: Een item dat is versierd door een collectieve actor met gebruikmaking van edelmetalen of kleur, vaak met uitgebreide patronen en motieven. @nl
label: هو وكيل جماعي مزخرف لـ @ar
definition: يربط وكيلا جماعيا بمفردة يزينها وكيل جماعي بمعادن ثمينة أو بألوان، غالبًا بتصاميم وزخارف منمقة. @ar
toolkit label: وكيل جماعي مزخرف @ar
toolkit definition: مفردة يزينها وكيل جماعي بمعادن ثمينة أو بألوان، غالبًا بتصاميم وزخارف منمقة. @ar
label: és agent col·lectiu il·luminador de @ca
definition: Relaciona un agent col·lectiu amb un ítem que és decorat per un agent col·lectiu usant metalls preciosos o amb color, sovint amb dissenys i motius elaborats. @ca
toolkit label: agent col·lectiu il·luminador de @ca
toolkit definition: Ítem que és decorat per un agent col·lectiu usant metalls preciosos o amb color, sovint amb dissenys i motius elaborats. @ca
label: er kollektiv agent, som er illuminator af @da
definition: Relaterer en kollektiv agent til et eksemplar, som er udsmykket af en kollektiv agent med ædelmetal eller farve, ofte med detaljerige mønstre og motiver. @da
toolkit label: kollektiv agent, som er illuminator af @da
toolkit definition: Eksemplar, som er udsmykket af en kollektiv agent med ædelmetal eller farve, ofte med detaljerige mønstre og motiver. @da
label: illumineerija (kollektiiv) eksemplaris @et
definition: Seostab kollektiivi eksemplariga, mille kollektiiv on kaunistanud väärismetallide ja värvidega, kasutades sageli keerulisi kujundeid ja motiive. @et
toolkit label: illumineerija (kollektiiv) eksemplaris @et
toolkit definition: Eksemplar, mille kollektiiv on kaunistanud väärismetallide ja värvidega, kasutades sageli keerulisi kujundeid ja motiive. @et
label: ist gemeinschaftlicher Akteur als Illuminatorin/Illuminator von @de
definition: Setzt einen gemeinschaftlichen Akteur in Beziehung zu einem Exemplar, das von einem gemeinschaftlichen Akteur durch Edelmetalle oder Farbe, häufig mit kunstvollen Mustern und Motiven, (aus-)gestaltet wird. @de
toolkit label: Gemeinschaftlicher Akteur als Illuminatorin/Illuminator von @de
toolkit definition: Ein Exemplar, das von einem gemeinschaftlichen Akteur durch Edelmetalle oder Farbe, häufig mit kunstvollen Mustern und Motiven, (aus-)gestaltet wird. @de
label: illuminátor kollektív ágense a következőnek: @hu
definition: Hozzákapcsol egy kollektív ágenst egy példányhoz, amelyet egy kollektív ágens nemesfémeket vagy színeket használva díszít, gyakran kidolgozott rajzokkal és motívumokkal. @hu
toolkit label: illuminátor kollektív ágense: @hu
toolkit definition: Egy példány, amelyet egy kollektív ágens nemesfémeket vagy színeket használva díszít, gyakran kidolgozott rajzokkal és motívumokkal. @hu
label: è miniatore agente collettivo di @it
definition: Correla un agente collettivo a un item decorato da un agente collettivo utilizzando metalli preziosi o colore, spesso con disegni e motivi elaborati. @it
toolkit label: miniatore agente collettivo di @it
toolkit definition: Item decorato da un agente collettivo utilizzando metalli preziosi o colore, spesso con disegni e motivi elaborati. @it
label: είναι φωτιστής συλλογικός φορέας του @el
toolkit label: φωτιστής συλλογικός φορέας του @el
label: est un agent collectif enlumineur de @fr
definition: Met un agent collectif en relation avec un item qui est orné par un agent collectif avec des métaux précieux ou de la couleur, souvent avec des dessins et des motifs élaborés. @fr
toolkit label: agent collectif enlumineur de @fr
toolkit definition: Item qui est orné par un agent collectif avec des métaux précieux ou de la couleur, souvent avec des dessins et des motifs élaborés. @fr
label: ir iluminātors (grupa) @lv
definition: Sasaista grupu ar vienību, ko grupa izgreznojusi, izmantojot krāsu un/vai dārgmetālus, bieži ar izsmalcinātiem un filigrāniem zīmējumiem, burtiem un motīviem. @lv
toolkit label: ir iluminātors (grupa) @lv
toolkit definition: Vienība, ko grupa izgreznojusi, izmantojot krāsu un/vai dārgmetālus, bieži ar izsmalcinātiem un filigrāniem zīmējumiem, burtiem un motīviem. @lv
label: 是……的彩饰者集体行为者 @zh-hans
definition: 将一个集体行为者与被用贵重的金属或色彩（通常有精心的设计和图案）的一个集体行为者进行装饰的一个单件关联起来。 @zh-hans
toolkit label: ……的彩饰者集体行为者 @zh-hans
toolkit definition: 被用贵重的金属或色彩（通常有精心的设计和图案）的一个集体行为者进行装饰的一个单件 @zh-hans
label: tezhip sanatçısı kolektif temsilcisidir @tr
definition: Kolektif bir temsilciyi değerli metaller veya renkler kullanılarak, genellikle ayrıntılı tasarımlar ve motiflerle süslenmiş bir kopya ile ilişkilendirilir. @tr
toolkit label: tezhip sanatçısı kolektif temsilcisidir @tr
toolkit definition: Değerli metaller veya renkler kullanılarak, genellikle özenle hazırlanmış desenler ve motiflerle kolektif bir temsilci tarafından süslenen bir kopya. @tr
has subproperty: illuminoinnin tekijä (yhteisö) kappaleessa
has subproperty: illuminoinnin tekijä (suku) kappaleessa
has subproperty: P50788

illuminoinnin tekijä (yhteisö) kappaleessa
status: Published
label: is illuminator corporate body of @en
lexical alias: illuminatorCorporateBodyOf.en
definition: Relates a corporate body to an item that is decorated by a corporate body using precious metals or colour, often with elaborate designs and motifs. @en
toolkit label: illuminator corporate body of @en
toolkit definition: An item that is decorated by a corporate body using precious metals or colour, often with elaborate designs and motifs. @en
type: Property
domain: C10005
has element type: 2
sub property of: yhteisöön liittyvä kappale
sub property of: illuminoinnin tekijä (yhteistoimija) kappaleessa
definition: Liittää yhteisön kappaleeseen, jonka yhteisö koristelee usein yksityiskohtaisin kuvioin tai motiivein käyttäen jalometalleja tai värejä.
toolkit label: illuminoinnin tekijä (yhteisö) kappaleessa
toolkit definition: Kappale, jonka yhteisö koristelee usein yksityiskohtaisin kuvioin tai motiivein käyttäen jalometalleja tai värejä.
label: er illuminator for (korporasjon) @no
definition: Relaterer en korporasjon til et eksemplar som er dekorert av en korporasjon ved hjelp av edle metaller eller farger, gjerne med intrikate former og motiver. @no
toolkit label: illuminator for (korporasjon) @no
toolkit definition: Et eksemplar som er dekorert av en korporasjon ved hjelp av edle metaller eller farger, gjerne med intrikate former og motiver. @no
label: is verluchter-corporatie van @nl
definition: Relateert een corporatie aan een item dat is versierd door een corporatie met gebruikmaking van edelmetalen of kleur, vaak met uitgebreide patronen en motieven. @nl
toolkit label: verluchter-corporatie van @nl
toolkit definition: Een item dat is versierd door een corporatie met gebruikmaking van edelmetalen of kleur, vaak met uitgebreide patronen en motieven. @nl
label: هي هيئة مزخرفة لـ @ar
definition: يربط هيئة بمفردة تزينها هيئة بمعادن ثمينة أو بألوان، غالبًا بتصاميم وزخارف منمقة. @ar
toolkit label: هيئة مزخرفة @ar
toolkit definition: مفردة تزينها هيئة بمعادن ثمينة أو بألوان، غالبًا بتصاميم وزخارف منمقة. @ar
label: er korporation, som er illuminator af @da
definition: Relaterer en korporation til et eksemplar, som er udsmykket af en korporation med ædelmetal eller farve, ofte med detaljerige mønstre og motiver. @da
toolkit label: korporation, som er illuminator af @da
toolkit definition: Eksemplar, som er udsmykket af en korporation med ædelmetal eller farve, ofte med detaljerige mønstre og motiver. @da
label: illumineerija (asutus) eksemplaris @et
definition: Seostab asutuse eksemplariga, mille asutus on kaunistanud väärismetallide ja värvidega, kasutades sageli keerulisi kujundeid ja motiive. @et
toolkit label: illumineerija (asutus) eksemplaris @et
toolkit definition: Eksemplar, mille asutus on kaunistanud väärismetallide ja värvidega, kasutades sageli keerulisi kujundeid ja motiive. @et
label: ist Körperschaft als Illuminatorin/Illuminator von @de
definition: Setzt eine Körperschaft in Beziehung zu einem Exemplar, das von einer Körperschaft durch Edelmetalle oder Farbe, häufig mit kunstvollen Mustern und Motiven, (aus-)gestaltet wird. @de
toolkit label: Körperschaft als Illuminatorin/Illuminator von @de
toolkit definition: Ein Exemplar, das von einer Körperschaft durch Edelmetalle oder Farbe, häufig mit kunstvollen Mustern und Motiven, (aus-)gestaltet wird. @de
label: illuminátor testülete a következőnek: @hu
definition: Hozzákapcsol egy testületet egy példányhoz, amelyet egy testület nemesfémeket vagy színeket használva díszít, gyakran kidolgozott rajzokkal és motívumokkal. @hu
toolkit label: illuminátor testülete: @hu
toolkit definition: Egy példány, amelyet egy testület nemesfémeket vagy színeket használva díszít, gyakran kidolgozott rajzokkal és motívumokkal. @hu
label: è miniatore ente di @it
definition: Correla un ente a un item decorato da un ente utilizzando metalli preziosi o colore, spesso con disegni e motivi elaborati. @it
toolkit label: miniatore ente di @it
toolkit definition: Item decorato da un ente utilizzando metalli preziosi o colore, spesso con disegni e motivi elaborati. @it
label: είναι φωτιστής συλλογικό όργανο του @el
toolkit label: φωτιστής συλλογικό όργανο του @el
label: est une collectivité enlumineuse de @fr
definition: Met une collectivité en relation avec un item qui est orné par une collectivité avec des métaux précieux ou de la couleur, souvent avec des dessins et des motifs élaborés. @fr
toolkit label: collectivité enlumineuse de @fr
toolkit definition: Item qui est orné par une collectivité avec des métaux précieux ou de la couleur, souvent avec des dessins et des motifs élaborés. @fr
label: ir iluminātors (institūcija) @lv
definition: Sasaista institūciju ar vienību, ko institūcija izgreznojusi, izmantojot krāsu un/vai dārgmetālus, bieži ar izsmalcinātiem un filigrāniem zīmējumiem, burtiem un motīviem. @lv
toolkit label: ir iluminātors (institūcija) @lv
toolkit definition: Vienība, ko institūcija izgreznojusi, izmantojot krāsu un/vai dārgmetālus, bieži ar izsmalcinātiem un filigrāniem zīmējumiem, burtiem un motīviem. @lv
label: és entitat corporativa il·luminadora de @ca
definition: Relaciona una entitat corporativa amb un ítem que és decorat per una entitat corporativa usant metalls o colors preciosos, sovint amb dibuixos i motius elaborats. @ca
toolkit label: entitat corporativa il·luminadora de @ca
toolkit definition: Ítem que és decorat per una entitat corporativa usant metalls o colors preciosos, sovint amb dibuixos i motius elaborats. @ca
label: 是……的彩饰者团体 @zh-hans
definition: 将一个团体与被用贵重的金属或色彩（通常有精心的设计和图案）的一个团体进行装饰的一个单件关联起来。 @zh-hans
toolkit label: ……的彩饰者团体 @zh-hans
toolkit definition: 被用贵重的金属或色彩（通常有精心的设计和图案）的一个团体进行装饰的一个单件 @zh-hans
label: tezhip sanatçısı tüzel kişisidir @tr
definition: Bir tüzel kişilik tarafından genellikle değerli metaller veya renkler kullanılarak, ayrıntılı tasarımlar ve motiflerle süslenmiş kopyayla ilişkilendirir. @tr
toolkit label: tezhip sanatçısı tüzel kişisidir @tr
toolkit definition: Değerli metaller veya renkler kullanılarak, genellikle özenle hazırlanmış desenler ve motiflerle tüzel bir kişi tarafından süslenen bir kopya. @tr
has subproperty: P50939

illuminoinnin tekijä (suku) kappaleessa
status: Published
label: is illuminator family of @en
lexical alias: illuminatorFamilyOf.en
definition: Relates a family to an item that is decorated by a family using precious metals or colour, often with elaborate designs and motifs. @en
toolkit label: illuminator family of @en
toolkit definition: An item that is decorated by a family using precious metals or colour, often with elaborate designs and motifs. @en
type: Property
domain: C10008
has element type: 2
sub property of: sukuun liittyvä kappale
sub property of: illuminoinnin tekijä (yhteistoimija) kappaleessa
definition: Liittää suvun kappaleeseen, jonka suku koristelee usein yksityiskohtaisin kuvioin tai motiivein käyttäen jalometalleja tai värejä.
toolkit label: illuminoinnin tekijä (suku) kappaleessa
toolkit definition: Kappale, jonka suku koristelee usein yksityiskohtaisin kuvioin tai motiivein käyttäen jalometalleja tai värejä.
label: er illuminator for (familie) @no
definition: Relaterer en familie til et eksemplar som er dekorert av en familie ved hjelp av edle metaller eller farger, gjerne med intrikate former og motiver. @no
toolkit label: illuminator for (familie) @no
toolkit definition: Et eksemplar som er dekorert av en familie ved hjelp av edle metaller eller farger, gjerne med intrikate former og motiver. @no
label: is verluchter-familie van @nl
definition: Relateert een familie aan een item dat is versierd door een familie met gebruikmaking van edelmetalen of kleur, vaak met uitgebreide patronen en motieven. @nl
toolkit label: verluchter-familie van @nl
toolkit definition: Een item dat is versierd door een familie met gebruikmaking van edelmetalen of kleur, vaak met uitgebreide patronen en motieven. @nl
label: هي عائلة مزخرفة لـ @ar
definition: يربط عائلة بمفردة تزينها عائلة بمعادن ثمينة أو بألوان، غالبًا بتصاميم وزخارف منمقة. @ar
toolkit label: عائلة مزخرفة @ar
toolkit definition: مفردة تزينها عائلة بمعادن ثمينة أو بألوان، غالبًا بتصاميم وزخارف منمقة. @ar
label: és família il·luminadora de @ca
definition: Relaciona una família amb un ítem que és decorat per una família usant metalls preciosos o amb color, sovint amb dissenys i motius elaborats. @ca
toolkit label: família il·luminadora de @ca
toolkit definition: Ítem que és decorat per una família usant metalls preciosos o amb color, sovint amb dissenys i motius elaborats. @ca
label: er familie, som er illuminator af @da
definition: Relaterer en familie til et eksemplar, som er udsmykket af en familie med ædelmetal eller farve, ofte med detaljerige mønstre og motiver. @da
toolkit label: familie, som er illuminator af @da
toolkit definition: Eksemplar, som er udsmykket af en familie med ædelmetal eller farve, ofte med detaljerige mønstre og motiver. @da
label: illumineerija (perekond) eksemplaris @et
definition: Seostab perekonna eksemplariga, mille perekond on kaunistanud väärismetallide ja värvidega, kasutades sageli keerulisi kujundeid ja motiive. @et
toolkit label: illumineerija (perekond) eksemplaris @et
toolkit definition: Eksemplar, mille perekond on kaunistanud väärismetallide ja värvidega, kasutades sageli keerulisi kujundeid ja motiive. @et
label: ist Familie als Illuminatorin/Illuminator von @de
definition: Setzt eine Familie in Beziehung zu einem Exemplar, das von einer Familie durch Edelmetalle und Farben, häufig mit kunstvollen Mustern und Motiven, (aus-)gestaltet wird. @de
toolkit label: Familie als Illuminatorin/Illuminator von @de
toolkit definition: Ein Exemplar, das von einer Familie durch Edelmetalle und Farben, häufig mit kunstvollen Mustern und Motiven, (aus-)gestaltet wird. @de
label: illuminátor családja a következőnek: @hu
definition: Hozzákapcsol egy ágenst egy példányhoz, amelyet egy család nemesfémeket vagy színeket használva díszít, gyakran kidolgozott rajzokkal és motívumokkal. @hu
toolkit label: illuminátor családja: @hu
toolkit definition: Egy példány, amelyet egy család nemesfémeket vagy színeket használva díszít, gyakran kidolgozott rajzokkal és motívumokkal. @hu
label: è miniatore famiglia di @it
definition: Correla una famiglia a un item decorato da una famiglia utilizzando metalli preziosi o colore, spesso con disegni e motivi elaborati. @it
toolkit label: miniatore famiglia di @it
toolkit definition: Item decorato da una famiglia utilizzando metalli preziosi o colore, spesso con disegni e motivi elaborati. @it
label: είναι φωτιστής οικογένεια του @el
definition: Συνδέει μια οικογένεια με ένα αντίτυπο το οποίο διακοσμείται από μια οικογένεια με τη χρήση πολύτιμων μετάλλων ή χρώματος, συχνά με περίτεχνα σχέδια και μοτίβα. @el
toolkit label: φωτιστής οικογένεια του @el
label: est une famille enlumineuse de @fr
definition: Met une famille en relation avec un item qui est orné par une famille avec des métaux précieux ou de la couleur, souvent avec des dessins et des motifs élaborés. @fr
toolkit label: famille enlumineuse de @fr
toolkit definition: Item qui est orné par une famille avec des métaux précieux ou de la couleur, souvent avec des dessins et des motifs élaborés. @fr
label: ir iluminātors (dzimta/ģimene) @lv
definition: Sasaista dzimtu/ģimeni ar vienību, ko dzimta/ģimene izgreznojusi, izmantojot krāsu un/vai dārgmetālus, bieži ar izsmalcinātiem un filigrāniem zīmējumiem, burtiem un motīviem. @lv
toolkit label: ir iluminātors (dzimta/ģimene) @lv
toolkit definition: Vienība, ko dzimta/ģimene izgreznojusi, izmantojot krāsu un/vai dārgmetālus, bieži ar izsmalcinātiem un filigrāniem zīmējumiem, burtiem un motīviem. @lv
label: 是……的彩饰者家族 @zh-hans
definition: 将一个家族与被用贵重的金属或色彩（通常有精心的设计和图案）的一个家族进行装饰的一个单件关联起来。 @zh-hans
toolkit label: ……的彩饰者家族 @zh-hans
toolkit definition: 被用贵重的金属或色彩（通常有精心的设计和图案）的一个家族进行装饰的一个单件 @zh-hans
label: tezhip sanatçısı ailesidir @tr
definition: Bir aile tarafından, değerli metaller veya renkler kullanılarak, genellikle özenli tasarımlar ve motiflerle dekore edilmiş bir kopyayla ilişkilendirir. @tr
toolkit label: tezhip sanatçısı ailesidir @tr
toolkit definition: Değerli metaller veya renkler kullanılarak, genellikle özenle hazırlanmış desenler ve motiflerle bir aile tarafından süslenen bir kopya. @tr
has subproperty: P51090

illuminoinnin tekijä (henkilö) kappaleessa
status: Published
label: is illuminator person of @en
lexical alias: illuminatorPersonOf.en
definition: Relates a person to an item that is decorated by a person using precious metals or colour, often with elaborate designs and motifs. @en
toolkit label: illuminator person of @en
toolkit definition: An item that is decorated by a person using precious metals or colour, often with elaborate designs and motifs. @en
type: Property
domain: C10004
has element type: 2
sub property of: henkilöön liittyvä kappale
sub property of: illuminoinnin tekijä (toimija) kappaleessa
definition: Liittää henkilön kappaleeseen, jonka henkilö koristelee usein yksityiskohtaisin kuvioin tai motiivein käyttäen jalometalleja tai värejä.
toolkit label: illuminoinnin tekijä (henkilö) kappaleessa
toolkit definition: Kappale, jonka henkilö koristelee usein yksityiskohtaisin kuvioin tai motiivein käyttäen jalometalleja tai värejä.
label: er illuminator for (person) @no
definition: Relaterer en person til et eksemplar som er dekorert av person ved hjelp av edle metaller eller farger, gjerne med intrikate former og motiver. @no
toolkit label: illuminator for (person) @no
toolkit definition: Et eksemplar som er dekorert av person ved hjelp av edle metaller eller farger, gjerne med intrikate former og motiver. @no
label: is verluchter-persoon van @nl
definition: Relateert een persoon aan een item dat is versierd door een persoon met gebruikmaking van edelmetalen of kleur, vaak met uitgebreide patronen en motieven. @nl
toolkit label: verluchter-persoon van @nl
toolkit definition: Een item dat is versierd door een persoon met gebruikmaking van edelmetalen of kleur, vaak met uitgebreide patronen en motieven. @nl
label: هو شخص مزخرف لـ @ar
definition: يربط شخصا بمفردة يزينها شخص بمعادن ثمينة أو بألوان، غالبًا بتصاميم وزخارف منمقة. @ar
toolkit label: شخص مزخرف @ar
toolkit definition: مفردة يزينها شخص بمعادن ثمينة أو بألوان، غالبًا بتصاميم وزخارف منمقة. @ar
label: és persona il·luminadora de @ca
definition: Relaciona una persona amb un ítem que és decorat per una persona usant metalls preciosos o amb color, sovint amb dissenys i motius elaborats. @ca
toolkit label: persona il·luminadora de @ca
toolkit definition: Ítem que és decorat per una persona usant metalls preciosos o amb color, sovint amb dissenys i motius elaborats. @ca
label: er person, som er illuminator af @da
definition: Relaterer en person til et eksemplar, som er udsmykket af en person med ædelmetal eller farve, ofte med detaljerige mønstre og motiver. @da
toolkit label: person, som er illuminator af @da
toolkit definition: Eksemplar, som er udsmykket af en person med ædelmetal eller farve, ofte med detaljerige mønstre og motiver. @da
label: illumineerija (isik) eksemplaris @et
definition: Seostab isiku eksemplariga, mille isik on kaunistanud väärismetallide ja värvidega, kasutades sageli keerulisi kujundeid ja motiive. @et
toolkit label: illumineerija (isik) eksemplaris @et
toolkit definition: Eksemplar, mille isik on kaunistanud väärismetallide ja värvidega, kasutades sageli keerulisi kujundeid ja motiive. @et
label: ist Person als Illuminatorin/Illuminator von @de
definition: Setzt eine Person in Beziehung zu einem Exemplar, das von einer Person durch Edelmetalle und Farben, häufig mit kunstvollen Mustern und Motiven, (aus-)gestaltet wird. @de
toolkit label: Person als Illuminatorin/Illuminator von @de
toolkit definition: Ein Exemplar, das von einer Person durch Edelmetalle und Farben, häufig mit kunstvollen Mustern und Motiven, (aus-)gestaltet wird. @de
label: illuminátor személye a következőnek: @hu
definition: Hozzákapcsol egy személyt egy példányhoz, amelyet egy személy nemesfémeket vagy színeket használva díszít, gyakran kidolgozott rajzokkal és motívumokkal. @hu
toolkit label: illuminátor személye: @hu
toolkit definition: Egy példány, amelyet egy személy nemesfémeket vagy színeket használva díszít, gyakran kidolgozott rajzokkal és motívumokkal. @hu
label: è miniatore persona di @it
definition: Correla una persona a un item decorato da una persona utilizzando metalli preziosi o colore, spesso con disegni e motivi elaborati. @it
toolkit label: miniatore persona di @it
toolkit definition: Item decorato da una persona utilizzando metalli preziosi o colore, spesso con disegni e motivi elaborati. @it
label: είναι φωτιστής φυσικό πρόσωπο του @el
toolkit label: φωτιστής φυσικό πρόσωπο του @el
label: est une personne enlumineuse de @fr
definition: Met une personne en relation avec un item qui est orné par une personne avec des métaux précieux ou de la couleur, souvent avec des dessins et des motifs élaborés. @fr
toolkit label: personne enlumineuse de @fr
toolkit definition: Item qui est orné par une personne avec des métaux précieux ou de la couleur, souvent avec des dessins et des motifs élaborés. @fr
label: ir iluminātors (persona) @lv
definition: Sasaista personu ar vienību, ko persona izgreznojusi, izmantojot krāsu un/vai dārgmetālus, bieži ar izsmalcinātiem un filigrāniem zīmējumiem, burtiem un motīviem. @lv
toolkit label: ir iluminātors (persona) @lv
toolkit definition: Vienība, ko persona izgreznojusi, izmantojot krāsu un/vai dārgmetālus, bieži ar izsmalcinātiem un filigrāniem zīmējumiem, burtiem un motīviem. @lv
label: 是……的彩饰者个人 @zh-hans
definition: 将一个个人与被用贵重的金属或色彩（通常有精心的设计和图案）的一个个人进行装饰的一个单件关联起来。 @zh-hans
toolkit label: ……的彩饰者个人 @zh-hans
toolkit definition: 被用贵重的金属或色彩（通常有精心的设计和图案）的一个个人进行装饰的一个单件 @zh-hans
label: tezhip sanatçısı kişisidir @tr
definition: Bir kişiyi, kişi tarafından değerli metaller veya renk kullanılarak, çoğunlukla detaylı tasarımlar ve motiflerle süslenmiş bir kopyayla ilişkilendirir. @tr
toolkit label: tezhip sanatçısı kişisidir @tr
toolkit definition: Değerli metaller veya renkler kullanılarak, genellikle özenle hazırlanmış desenler ve motiflerle bir kişi tarafından süslenen bir kopya. @tr
has subproperty: P50637

kuvittajana kuvituksessa
status: Deprecated
label: is illustrator of (Deprecated) @en
definition: Relates an agent to an expression that includes a contribution of supplementing the content with drawings, diagrams, photographs, etc. (Deprecated) @en
type: Property
domain: C10002
sub property of: is contributor to aggregated content of (Deprecated)
lexical alias: illustratorOf.en
label: est un illustrateur de @fr
definition: Met un agent qui contribue à une expression d’une œuvre en complétant le contenu principal avec des dessins, des diagrammes, des photographies, etc. en relation avec une expression. @fr
toolkit label: illustrateur de @fr
toolkit definition: Expression d’une œuvre qui intègre une contribution consistant à compléter le contenu principal avec des dessins, des diagrammes, des photographies, etc. @fr
toolkit label: illustrator of (Deprecated) @en
toolkit definition: An expression that includes a contribution of supplementing the content with drawings, diagrams, photographs, etc. (Deprecated) @en
instruction number: 18.5
label: είναι εικονογράφος του @el
definition: Συνδέει έναν φορέα, ο οποίος συνεισφέρει σε μια έκφραση ενός έργου συμπληρώνοντας το κύριο περιεχόμενο με σχέδια, σκίτσα, διαγράμματα, φωτογραφίες κ.λπ., με μια έκφραση. @el
toolkit label: εικονογράφος του @el
toolkit definition: Μια έκφραση ενός έργου που ενσωματώνει τη συνεισφορά της συμπλήρωσης του κύριου περιεχομένου με σχέδια, σκίτσα, διαγράμματα, φωτογραφίες κ.λπ. @el
definition: Setzt einen Akteur, der an einer Expression eines Werks mitwirkt, indem er den primären Inhalt mit Zeichnungen, Diagrammen, Fotografien usw. ergänzt, mit einer Expression in Beziehung. @de
toolkit label: Illustrator von @de
toolkit definition: Eine Expression eines Werks, bei der ein Akteur den primären Inhalt mit Zeichnungen, Diagrammen, Fotografien usw. ergänzt. @de
label: er illustrator til @da
definition: Relaterer en agent, der har bidraget til et udtryk af et værk ved at supplere hovedindholdet med tegninger, diagrammer, fotos etc. til et udtryk. @da
toolkit label: illustrator til @da
toolkit definition: Udtryk af et værk der inkorporerer et bidrag ved at supplere hovedindholdet med tegninger, diagrammer, fotos, etc. @da
label: és il·lustrador de @ca
definition: Relaciona un agent, que contribueix amb una expressió d’una obra complementant el contingut principal amb dibuixos, diagrames, fotografies, etc., amb una expressió. @ca
toolkit label: il·lustrador de @ca
toolkit definition: Expressió d’una obra que incorpora una contribució que complementa el contingut principal amb dibuixos, diagrames, fotografies, etc. @ca
definition: Liittää toimijan teoksen ekspressioon, jonka pääasiallista sisältöä on täydennetty piirroksilla, valokuvilla, kaavioilla tms.
toolkit label: kuvittajana kuvituksessa
toolkit definition: Teoksen ekspressio, jonka pääasiallista sisältöä on täydennetty piirroksilla, valokuvilla, kaavioilla tms.
toolkit label: illustratør av @no
toolkit definition: Et uttrykk av et verk som omfatter et bidrag i form av å tilføye tegninger, diagrammer, fotografier, etc. til hovedinnholdet. @no
label: ist Illustrator von @de
has element type: 2
label: illusztrátora @hu
definition: Egy ágenst (személyt, családot vagy testületet), aki/amely egy mű kifejezési formájához hozzájárul azzal, hogy az elsődleges tartalmat rajzokkal, ábrákkal, fotókkal stb. egészíti ki, hozzákapcsol egy kifejezési formához. @hu
toolkit label: illusztrátora @hu
toolkit definition: Egy mű kifejezési formája, amely hozzájárulást jelent azzal, hogy az elsődleges tartalmat kiegészíti rajzokkal, ábrákkal, fényképekkel stb. @hu
has subproperty: P50159

opettaja (toimija) ekspressiossa
status: Published
label: is instructor agent of @en
definition: Relates an agent to an expression that includes a contribution by an agent of teaching or providing a demonstration. @en
type: Property
domain: C10002
sub property of: esittäjä (toimija) ekspressiossa
lexical alias: instructorAgentOf.en
label: est un agent enseignant de @fr
definition: Met un agent en relation avec une expression qui intègre une contribution de la part d’un agent consistant à enseigner ou à faire une démonstration. @fr
toolkit label: agent enseignant de @fr
toolkit definition: Expression qui intègre une contribution de la part d’un agent consistant à enseigner ou à faire une démonstration. @fr
toolkit label: instructor agent of @en
toolkit definition: An expression that includes a contribution by an agent of teaching or providing a demonstration. @en
instruction number: 18.5
label: είναι εκπαιδευτής φορέας του @el
definition: Συνδέει έναν εκτελεστή, ο οποίος συνεισφέρει σε μια έκφραση ενός έργου μέσω της διδασκαλίας ή της επίδειξης, με μια έκφραση. @el
toolkit label: εκπαιδευτής φορέας του @el
toolkit definition: Μια έκφραση ενός έργου που ενσωματώνει τη συνεισφορά της διδασκαλίας ή επίδειξης. @el
definition: Setzt einen Akteur in Beziehung zu einer Expression, zu der ein Akteur beiträgt, indem er unterrichtet oder etwas demonstriert. @de
toolkit label: Akteur als Ausbilderin/Ausbilder von @de
toolkit definition: Eine Expression, zu der ein Akteur beiträgt, indem er unterrichtet oder etwas demonstriert. @de
label: er agent, som er instruktør af @da
definition: Relaterer en agent til et udtryk, som omfatter en agents bidrag ved at undervise eller ved at give en demonstration. @da
toolkit label: agent, som er instruktør af @da
toolkit definition: Udtryk, som omfatter en agents bidrag ved at undervise eller ved at give en demonstration. @da
label: és agent instructor de @ca
definition: Relaciona un agent amb una expressió que inclou una contribució d’un agent ensenyant o proporcionant una demostració. @ca
toolkit label: agent instructor de @ca
toolkit definition: Expressió que inclou una contribució d’un agent ensenyant o proporcionant una demostració. @ca
definition: Liittää toimijan ekspressioon, jonka tekemiseen toimija osallistuu opettamalla tai esittelemällä.
toolkit label: opettaja (toimija) ekspressiossa
toolkit definition: Ekspressio, jonka tekemiseen toimija osallistuu opettamalla tai esittelemällä.
toolkit label: instruktør for (agent) @no
toolkit definition: Et uttrykk som inkluderer et bidrag fra en agent i form av å gi instruksjoner eller en demonstrasjon. @no
label: ist Akteur als Ausbilderin/Ausbilder von @de
has element type: 2
label: oktató ágense a következőnek: @hu
definition: Hozzákapcsol egy ágenst egy kifejezési formához, amely magában foglalja egy tanító vagy szemléltetést tartó ágens közreműködését. @hu
toolkit label: oktató ágense: @hu
toolkit definition: Egy kifejezési forma, amely magában foglalja egy tanító vagy szemléltetést tartó ágens közreműködését. @hu
alternative label: instructor of @en
alternative label: opetustilanne
label: er instruktør for (agent) @no
definition: Relaterer en agent til et uttrykk som inkluderer et bidrag fra en agent i form av å gi instruksjoner eller en demonstrasjon. @no
alternative label: instruktør for @no
label: is instructeur-actor van @nl
definition: Relateert een actor aan een expressie die omvat een bijdrage door een actor door onderwijzen of verschaffen van een demonstratie. @nl
toolkit label: instructeur-actor van @nl
toolkit definition: Een expressie die omvat een bijdrage door een actor door onderwijzen of verschaffen van een demonstratie. @nl
label: هو وكيل محاضر لـ @ar
definition: يربط وكيلا بتعبيرة تتضمن إسهام وكيل بالتدريس أو تقديم عرض توضيحي. @ar
alternative label: محاضر @ar
toolkit label: وكيل محاضر @ar
toolkit definition: تعبيرة تتضمن إسهام وكيل بالتدريس أو بتقديم عرض توضيحي. @ar
alternative label: instructor de @ca
alternative label: instruktør af @da
label: instruktor (tegija) väljenduses @et
definition: Seostab tegija väljendusega, millesse tegija on andnud panuse, õpetades või ette näidates. @et
alternative label: instruktor väljenduses @et
toolkit label: instruktor (tegija) väljenduses @et
toolkit definition: Väljendus, millesse tegija on andnud panuse, õpetades või ette näidates. @et
alternative label: oktatója: @hu
label: è istruttore agente di @it
definition: Correla un agente a un'espressione che include un contributo da parte di un agente che insegna o fornisce una dimostrazione. @it
alternative label: istruttore di @it
toolkit label: istruttore agente di @it
toolkit definition: Espressione che include un contributo da parte di un agente che insegna o fornisce una dimostrazione. @it
alternative label: εκπαιδευτής του @el
alternative label: enseignant de @fr
label: ir instruktors (aģents) @lv
definition: Sasaista aģentu ar izteiksmi, kas ietver aģenta ieguldījumu, mācot vai demonstrējot. @lv
toolkit label: ir instruktors (aģents) @lv
toolkit definition: Izteiksme, kas ietver aģenta ieguldījumu, mācot vai demonstrējot. @lv
alternative label: Ausbilder von @de
alternative label: ……的教师 @zh-hans
toolkit label: ……的教师行为者 @zh-hans
toolkit definition: 包括有教学或提供演示的一个行为者的贡献的一种内容表达 @zh-hans
toolkit label: eğitmen temsilcisidir @tr
toolkit definition: Bir gösteriyi öğreten ya da temin eden bir temsilcinin katkısını içeren bir anlatım. @tr
has subproperty: opettaja (yhteistoimija) ekspressiossa

opettaja (yhteistoimija) ekspressiossa
status: Published
label: is instructor collective agent of @en
lexical alias: instructorCollectiveAgentOf.en
definition: Relates a collective agent to an expression that includes a contribution by a collective agent of teaching or providing a demonstration. @en
toolkit label: instructor collective agent of @en
toolkit definition: An expression that includes a contribution by a collective agent of teaching or providing a demonstration. @en
type: Property
domain: C10011
has element type: 2
sub property of: esittäjä (yhteistoimija) ekspressiossa
sub property of: opettaja (toimija) ekspressiossa
definition: Liittää yhteistoimijan ekspressioon, jonka tekemisessä yhteistoimija on osallisena opettamalla tai esittelemällä.
toolkit label: opettaja (yhteistoimija) ekspressiossa
toolkit definition: Ekspressio, jonka tekemisessä yhteistoimija on osallisena opettamalla tai esittelemällä.
label: er instruktør for (kollektiv agent) @no
definition: Relaterer en kollektiv agent til et uttrykk som inkluderer et bidrag fra en kollektiv agent i form av å gi instruksjoner eller en demonstrasjon. @no
toolkit label: instruktør for (kollektiv agent) @no
toolkit definition: Et uttrykk som inkluderer et bidrag fra en kollektiv agent i form av å gi instruksjoner eller en demonstrasjon. @no
label: is instructeur-collectieve actor van @nl
definition: Relateert een collectieve actor aan een expressie die omvat een bijdrage door een collectieve actor door onderwijzen of verschaffen van een demonstratie. @nl
toolkit label: instructeur-collectieve actor van @nl
toolkit definition: Een expressie die omvat een bijdrage door een collectieve actor door onderwijzen of verschaffen van een demonstratie. @nl
label: هو وكيل جماعي محاضر لـ @ar
definition: يربط وكيلا جماعيا بتعبيرة تتضمن إسهام وكيل جماعي التدريس أو تقديم عرض توضيحي @ar
toolkit label: وكيل جماعي محاضر @ar
toolkit definition: تعبيرة تتضمن إسهام وكيل جماعي التدريس أو تقديم عرض توضيحي. @ar
label: és agent col·lectiu instructor de @ca
definition: Relaciona un agent col·lectiu amb una expressió que inclou una contribució d’un agent col·lectiu ensenyant o proporcionant una demostració. @ca
toolkit label: agent col·lectiu instructor de @ca
toolkit definition: Expressió que inclou una contribució d’un agent col·lectiu ensenyant o proporcionant una demostració. @ca
label: er kollektiv agent, som er instruktør af @da
definition: Relaterer en kollektiv agent til et udtryk, som omfatter en kollektiv agents bidrag ved at undervise eller ved at give en demonstration. @da
toolkit label: kollektiv agent, som er instruktør af @da
toolkit definition: Udtryk, som omfatter en kollektiv agents bidrag ved at undervise eller ved at give en demonstration. @da
label: instruktor (kollektiiv) väljenduses @et
definition: Seostab kollektiivi väljendusega, millesse kollektiiv on andnud panuse, õpetades või ette näidates. @et
toolkit label: instruktor (kollektiiv) väljenduses @et
toolkit definition: Väljendus, millesse kollektiiv on andnud panuse, õpetades või ette näidates. @et
label: ist gemeinschaftlicher Akteur als Ausbilderin/Ausbilder von @de
definition: Setzt einen gemeinschaftlichen Akteur in Beziehung zu einer Expression, zu der ein gemeinschaftlicher Akteur beiträgt, indem er unterrichtet oder etwas demonstriert. @de
toolkit label: Gemeinschaftlicher Akteur als Ausbilderin/Ausbilder von @de
toolkit definition: Eine Expression, zu der ein gemeinschaftlicher Akteur beiträgt, indem er unterrichtet oder etwas demonstriert. @de
label: oktató kollektív ágense a következőnek: @hu
definition: Hozzákapcsol egy kollektív ágenst egy kifejezési formához, amely magában foglalja egy tanító vagy szemléltetést tartó kollektív ágens közreműködését. @hu
toolkit label: oktató kollektív ágense: @hu
toolkit definition: Egy kifejezési forma, amely magában foglalja egy tanító vagy szemléltetést tartó kollektív ágens közreműködését. @hu
label: è istruttore agente collettivo di @it
definition: Correla un agente collettivo a un'espressione che comprende un contributo di un agente collettivo nell'insegnamento o offerta di una dimostrazione. @it
toolkit label: istruttore agente collettivo di @it
toolkit definition: Espressione che comprende un contributo di un agente collettivo nell'insegnamento o offerta di una dimostrazione. @it
label: είναι εκπαιδευτής συλλογικός φορέας του @el
toolkit label: εκπαιδευτής συλλογικός φορέας του @el
label: est un agent collectif enseignant de @fr
definition: Met un agent collectif en relation avec une expression qui intègre une contribution de la part d’un agent collectif consistant à enseigner ou à faire une démonstration. @fr
toolkit label: agent collectif enseignant de @fr
toolkit definition: Expression qui intègre une contribution de la part d’un agent collectif consistant à enseigner ou à faire une démonstration. @fr
label: ir instruktors (grupa) @lv
definition: Sasaista grupu ar izteiksmi, kas ietver grupas ieguldījumu, mācot vai demonstrējot. @lv
toolkit label: ir instruktors (grupa) @lv
toolkit definition: Izteiksme, kas ietver grupas ieguldījumu, mācot vai demonstrējot. @lv
label: 是……的教师集体行为者 @zh-hans
definition: 将一个集体行为者与包括有教学或提供演示的一个集体行为者的贡献的一种内容表达关联起来。 @zh-hans
toolkit label: ……的教师集体行为者 @zh-hans
toolkit definition: 包括有教学或提供演示的一个集体行为者的贡献的一种内容表达 @zh-hans
label: eğitmen kolektif temsilcisidir @tr
definition: Kolektif bir temsilciyi, bir gösteriyi öğretmek ya da temin etmekle görevli bir kolektif temsilcinin katkısını içeren bir anlatım ile ilişkilendirir. @tr
toolkit label: eğitmen kolektif temsilcisidir @tr
toolkit definition: Bir gösteriyi öğreten ya da temin eden kolektif bir temsilcinin katkısını içeren bir anlatım. @tr
has subproperty: opettaja (yhteisö) ekspressiossa
has subproperty: opettaja (suku) ekspressiossa
has subproperty: P50770

opettaja (yhteisö) ekspressiossa
status: Published
label: is instructor corporate body of @en
lexical alias: instructorCorporateBodyOf.en
definition: Relates a corporate body to an expression that includes a contribution by a corporate body of teaching or providing a demonstration. @en
toolkit label: instructor corporate body of @en
toolkit definition: An expression that includes a contribution by a corporate body of teaching or providing a demonstration. @en
type: Property
domain: C10005
has element type: 2
sub property of: esittäjä (yhteisö) ekspressiossa
sub property of: opettaja (yhteistoimija) ekspressiossa
definition: Liittää yhteisön ekspressioon, jonka tekemisessä yhteisö on osallisena opettamalla tai esittelemällä.
toolkit label: opettaja (yhteisö) ekspressiossa
toolkit definition: Ekspressio, jonka tekemisessä yhteisö on osallisena opettamalla tai esittelemällä.
label: er instruktør for (korporasjon) @no
definition: Relaterer en korporasjon til et uttrykk som inkluderer et bidrag fra en korporasjon i form av å gi instruksjoner eller en demonstrasjon. @no
toolkit label: instruktør for (korporasjon) @no
toolkit definition: Et uttrykk som inkluderer et bidrag fra en korporasjon i form av å gi instruksjoner eller en demonstrasjon. @no
label: is instructeur-corporatie van @nl
definition: Relateert een corporatie aan een expressie die omvat een bijdrage door een corporatie door onderwijzen of verschaffen van een demonstratie. @nl
toolkit label: instructeur-corporatie van @nl
toolkit definition: Een expressie die omvat een bijdrage door een corporatie door onderwijzen of verschaffen van een demonstratie. @nl
label: هي هيئة تقدم محاضرات لـ @ar
definition: يربط هيئة بتعبيرة تتضمن إسهام هيئة في التدريس أو تقديم عرض توضيحي. @ar
toolkit label: هيئة تقدم محاضرات @ar
toolkit definition: تعبيرة تتضمن إسهام هيئة في التدريس أو تقديم عرض توضيحي. @ar
label: és entitat corporativa instructora de @ca
definition: Relaciona una entitat corporativa amb una expressió que inclou una contribució d’una entitat corporativa ensenyant o proporcionant una demostració. @ca
toolkit label: entitat corporativa instructora de @ca
toolkit definition: Expressió que inclou una contribució d’una entitat corporativa ensenyant o proporcionant una demostració. @ca
label: er korporation, som er instruktør af @da
definition: Relaterer en korporation til et udtryk, som omfatter en korporations bidrag ved at undervise eller ved at give en demonstration. @da
toolkit label: korporation, som er instruktør af @da
toolkit definition: Udtryk, som omfatter en korporations bidrag ved at undervise eller ved at give en demonstration. @da
label: instruktor (asutus) väljenduses @et
definition: Seostab asutuse väljendusega, millesse asutus on andnud panuse, õpetades või ette näidates. @et
toolkit label: instruktor (asutus) väljenduses @et
toolkit definition: Väljendus, millesse asutus on andnud panuse, õpetades või ette näidates. @et
label: ist Körperschaft als Ausbilderin/Ausbilder von @de
definition: Setzt eine Körperschaft in Beziehung zu einer Expression, zu der eine Körperschaft beiträgt, indem sie unterrichtet oder etwas demonstriert. @de
toolkit label: Körperschaft als Ausbilderin/Ausbilder von @de
toolkit definition: Eine Expression, zu der eine Körperschaft beiträgt, indem sie unterrichtet oder etwas demonstriert. @de
label: oktató testülete a következőnek: @hu
definition: Hozzákapcsol egy testületet egy kifejezési formához, amely magában foglalja egy tanító vagy szemléltetést tartó testület közreműködését. @hu
toolkit label: oktató testülete: @hu
toolkit definition: Egy kifejezési forma, amely magában foglalja egy tanító vagy szemléltetést tartó testület közreműködését. @hu
label: è istruttore ente di @it
definition: Correla un ente a un'espressione che comprende un contributo di un ente nell'insegnamento o offerta di una dimostrazione. @it
toolkit label: istruttore ente di @it
toolkit definition: Espressione che comprende un contributo di un ente nell'insegnamento o offerta di una dimostrazione. @it
label: είναι εκπαιδευτής συλλογικό όργανο του @el
toolkit label: εκπαιδευτής συλλογικό όργανο του @el
label: est une collectivité enseignante de @fr
definition: Met une collectivité en relation avec une expression qui intègre une contribution de la part d’une collectivité consistant à enseigner ou à faire une démonstration. @fr
toolkit label: collectivité enseignante de @fr
toolkit definition: Expression qui intègre une contribution de la part d’une collectivité consistant à enseigner ou à faire une démonstration. @fr
label: ir instruktors (institūcija) @lv
definition: Sasaista institūciju ar izteiksmi, kas ietver institūcijas ieguldījumu, mācot vai demonstrējot. @lv
toolkit label: ir instruktors (institūcija) @lv
toolkit definition: Izteiksme, kas ietver institūcijas ieguldījumu, mācot vai demonstrējot. @lv
label: 是……的教师团体 @zh-hans
definition: 将一个团体与包括有教学或提供演示的一个团体的贡献的一种内容表达关联起来。 @zh-hans
toolkit label: ……的教师团体 @zh-hans
toolkit definition: 包括有教学或提供演示的一个团体的贡献的一种内容表达 @zh-hans
label: eğitmen tüzel kişisidir @tr
definition: Bir tüzel kişiyi, bir tüzel kişiliğin öğretme veya gösteri yapma katkısını içeren bir anlatımla ilişkilendirir. @tr
toolkit label: eğitmen tüzel kişisi ile ilişkilidir @tr
toolkit definition: Bir öğretim veya gösteri sağlayan tüzel bir kişinin katkısını içeren bir anlatım. @tr
has subproperty: P50921

opettaja (suku) ekspressiossa
status: Published
label: is instructor family of @en
lexical alias: instructorFamilyOf.en
definition: Relates a family to an expression that includes a contribution by a family of teaching or providing a demonstration. @en
toolkit label: instructor family of @en
toolkit definition: An expression that includes a contribution by a family of teaching or providing a demonstration. @en
type: Property
domain: C10008
has element type: 2
sub property of: esittäjä (suku) ekspressiossa
sub property of: opettaja (yhteistoimija) ekspressiossa
definition: Liittää suvun ekspressioon, jonka tekemisessä suku on osallisena opettamalla tai esittelemällä.
toolkit label: opettaja (suku) ekspressiossa
toolkit definition: Ekspressio, jonka tekemisessä suku on osallisena opettamalla tai esittelemällä.
label: er instruktør for (familie) @no
definition: Relaterer en familie til et uttrykk som inkluderer et bidrag fra en familie i form av å gi instruksjoner eller en demonstrasjon. @no
toolkit label: instruktør for (familie) @no
toolkit definition: Et uttrykk som inkluderer et bidrag fra en familie i form av å gi instruksjoner eller en demonstrasjon. @no
label: is instructeur-familie van @nl
definition: Relateert een familie aan een expressie die omvat een bijdrage door een familie door onderwijzen of verschaffen van een demonstratie. @nl
toolkit label: instructeur-familie van @nl
toolkit definition: Een expressie die omvat een bijdrage door een familie door onderwijzen of verschaffen van een demonstratie. @nl
label: هي عائلة محاضِرة لـ @ar
definition: يربط عائلة بتعبيرة تتضمن إسهام عائلة التدريس أو تقديم عرض توضيحي. @ar
toolkit label: عائلة محاضِرة @ar
toolkit definition: تعبيرة تتضمن إسهام عائلة التدريس أو تقديم عرض توضيحي. @ar
label: és família instructora de @ca
definition: Relaciona una família amb una expressió que inclou una contribució d’una família ensenyant o proporcionant una demostració. @ca
toolkit label: família instructora de @ca
toolkit definition: Expressió que inclou una contribució d’una família ensenyant o proporcionant una demostració. @ca
label: er familie, som er instruktør af @da
definition: Relaterer en familie til et udtryk, som omfatter en families bidrag ved at undervise eller ved at give en demonstration. @da
toolkit label: familie, som er instruktør af @da
toolkit definition: Udtryk, som omfatter en families bidrag ved at undervise eller ved at give en demonstration. @da
label: instruktor (perekond) väljenduses @et
definition: Seostab perekonna väljendusega, millesse perekond on andnud panuse, õpetades või ette näidates. @et
toolkit label: instruktor (perekond) väljenduses @et
toolkit definition: Väljendus, millesse perekond on andnud panuse, õpetades või ette näidates. @et
label: ist Familie als Ausbilderin/Ausbilder von @de
definition: Setzt eine Familie in Beziehung zu einer Expression, zu der eine Familie beiträgt, indem sie unterrichtet oder etwas demonstriert. @de
toolkit label: Familie als Ausbilderin/Ausbilder von @de
toolkit definition: Eine Expression, zu der eine Familie beiträgt, indem sie unterrichtet oder etwas demonstriert. @de
label: oktató családja a következőnek: @hu
definition: Hozzákapcsol egy családot egy kifejezési formához, amely magában foglalja egy tanító vagy szemléltetést tartó család közreműködését. @hu
toolkit label: oktató családja: @hu
toolkit definition: Egy kifejezési forma, amely magában foglalja egy tanító vagy szemléltetést tartó család közreműködését. @hu
label: è istruttore famiglia di @it
definition: Correla una famiglia a un'espressione che comprende un contributo di una famiglia nell'insegnamento o offerta di una dimostrazione. @it
toolkit label: istruttore famiglia di @it
toolkit definition: Espressione che comprende un contributo di una famiglia nell'insegnamento o offerta di una dimostrazione. @it
label: είναι εκπαιδευτής οικογένεια του @el
toolkit label: εκπαιδευτής οικογένεια του @el
label: est une famille enseignante de @fr
definition: Met une famille en relation avec une expression qui intègre une contribution de la part d’une famille consistant à enseigner ou à faire une démonstration. @fr
toolkit label: famille enseignante de @fr
toolkit definition: Expression qui intègre une contribution de la part d’une famille consistant à enseigner ou à faire une démonstration. @fr
label: ir instruktors (dzimta/ģimene) @lv
definition: Sasaista dzimtu/ģimeni ar izteiksmi, kas ietver dzimtas/ģimenes ieguldījumu, mācot vai demonstrējot. @lv
toolkit label: ir instruktors (dzimta/ģimene) @lv
toolkit definition: Izteiksme, kas ietver dzimtas/ģimenes ieguldījumu, mācot vai demonstrējot. @lv
label: 是……的教师家族 @zh-hans
definition: 将一个家族与包括有教学或提供演示的一个家族的贡献的一种内容表达关联起来。 @zh-hans
toolkit label: ……的教师家族 @zh-hans
toolkit definition: 包括有教学或提供演示的一个家族的贡献的一种内容表达 @zh-hans
label: eğitmen ailesidir @tr
definition: Bir aileyi, bir ailenin öğretme veya gösteri yapma katkısını içeren bir anlatımla ilişkilendirir. @tr
toolkit label: eğitmen ailesidir @tr
toolkit definition: Bir gösteriyi öğreten ya da temin eden bir ailenin katkısını içeren bir anlatım. @tr
has subproperty: P51072

opettaja (henkilö) ekspressiossa
status: Published
label: is instructor person of @en
lexical alias: instructorPersonOf.en
definition: Relates a person to an expression that includes a contribution by a person of teaching or providing a demonstration. @en
toolkit label: instructor person of @en
toolkit definition: An expression that includes a contribution by a person of teaching or providing a demonstration. @en
type: Property
domain: C10004
has element type: 2
sub property of: esittäjä (henkilö) ekspressiossa
sub property of: opettaja (toimija) ekspressiossa
definition: Liittää henkilön ekspressioon, jonka tekemisessä henkilö on osallisena opettamalla tai esittelemällä.
toolkit label: opettaja (henkilö) ekspressiossa
toolkit definition: Ekspressio, jonka tekemisessä henkilö on osallisena opettamalla tai esittelemällä.
label: er instruktør for (person) @no
definition: Relaterer en person til et uttrykk som inkluderer et bidrag fra en person i form av å gi instruksjoner eller en demonstrasjon. @no
toolkit label: instruktør for (person) @no
toolkit definition: Et uttrykk som inkluderer et bidrag fra en person i form av å gi instruksjoner eller en demonstrasjon. @no
label: is instructeur-persoon van @nl
definition: Relateert een persoon aan een expressie die omvat een bijdrage door een persoon door onderwijzen of verschaffen van een demonstratie. @nl
toolkit label: instructeur-persoon van @nl
toolkit definition: Een expressie die omvat een bijdrage door een persoon door onderwijzen of verschaffen van een demonstratie. @nl
label: هو شخص محاضر لـ @ar
definition: يربط شخصا بتعبيرة تتضمن إسهام شخص التدريس أو تقديم عرض توضيحي @ar
toolkit label: شخص محاضر @ar
toolkit definition: تعبيرة تتضمن إسهام شخص للتدريس أو تقديم عرض توضيحي. @ar
label: és persona instructora de @ca
definition: Relaciona una persona amb una expressió que inclou una contribució d’una persona ensenyant o proporcionant una demostració. @ca
toolkit label: persona instructora de @ca
toolkit definition: Expressió que inclou una contribució d’una persona ensenyant o proporcionant una demostració. @ca
label: er person, som er instruktør af @da
definition: Relaterer en person til et udtryk, som omfatter en persons bidrag ved at undervise eller ved at give en demonstration. @da
toolkit label: person, som er instruktør af @da
toolkit definition: Udtryk, som omfatter en persons bidrag ved at undervise eller ved at give en demonstration. @da
label: instruktor (isik) väljenduses @et
definition: Seostab isiku väljendusega, millesse isik on andnud panuse, õpetades või ette näidates. @et
toolkit label: instruktor (isik) väljenduses @et
toolkit definition: Väljendus, millesse isik on andnud panuse, õpetades või ette näidates. @et
label: ist Person als Ausbilderin/Ausbilder von @de
definition: Setzt eine Person in Beziehung zu einer Expression, zu der eine Person beiträgt, indem sie unterrichtet oder etwas demonstriert. @de
toolkit label: Person als Ausbilderin/Ausbilder von @de
toolkit definition: Eine Expression, zu der eine Person beiträgt, indem sie unterrichtet oder etwas demonstriert. @de
label: oktató személye a következőnek: @hu
definition: Hozzákapcsol egy személyt egy kifejezési formához, amely magában foglalja egy tanító vagy szemléltetést tartó személy közreműködését. @hu
toolkit label: oktató személye: @hu
toolkit definition: Egy kifejezési forma, amely magában foglalja egy tanító vagy szemléltetést tartó személy közreműködését. @hu
label: è istruttore persona di @it
definition: Correla una persona a un'espressione che comprende un contributo di una persona nell'insegnamento o offerta di una dimostrazione. @it
toolkit label: istruttore persona di @it
toolkit definition: Espressione che comprende un contributo di una persona nell'insegnamento o offerta di una dimostrazione. @it
label: είναι εκπαιδευτής φυσικό πρόσωπο του @el
toolkit label: εκπαιδευτής φυσικό πρόσωπο του @el
label: est une personne enseignante de @fr
definition: Met une personne en relation avec une expression qui intègre une contribution de la part d’une personne consistant à enseigner ou à faire une démonstration. @fr
toolkit label: personne enseignante de @fr
toolkit definition: Expression qui intègre une contribution de la part d’une personne consistant à enseigner ou à faire une démonstration. @fr
label: ir instruktors (persona) @lv
definition: Sasaista personu ar izteiksmi, kas ietver personas ieguldījumu, mācot vai demonstrējot. @lv
toolkit label: ir instruktors (persona) @lv
toolkit definition: Izteiksme, kas ietver personas ieguldījumu, mācot vai demonstrējot. @lv
label: 是……的教师个人 @zh-hans
definition: 将一个个人与包括有教学或提供演示的一个个人的贡献的一种内容表达关联起来。 @zh-hans
toolkit label: ……的教师个人 @zh-hans
toolkit definition: 包括有教学或提供演示的一个个人的贡献的一种内容表达 @zh-hans
label: eğitmen kişisidir @tr
definition: Bir kişiyi, kişinin öğretme veya bir gösteri yapılmasıyla ilgili katkısını içeren anlatımla ilişkilendirir. @tr
toolkit label: eğitmen kişisidir @tr
toolkit definition: Bir gösteriyi öğreten ya da temin eden bir kişinin katkısını içeren bir anlatım. @tr
has subproperty: P50619

kapellimestari (toimija) ekspressiossa
status: Published
type: Property
label: is instrumental conductor agent of @en
lexical alias: instrumentalConductorAgentOf.en
definition: Relates an agent to an expression that includes a contribution by an agent of conducting and leading an instrumental performing group in a musical or dramatic presentation. @en
domain: C10002
toolkit label: instrumental conductor agent of @en
toolkit definition: An expression that includes a contribution by an agent of conducting and leading an instrumental performing group in a musical or dramatic presentation. @en
instruction number: 18.5
sub property of: johtaja (toimija) ekspressiossa
label: είναι διευθυντής ορχήστρας φορέας του @el
definition: Συνδέει έναν διευθυντή ορχήστρας, ο οποίος συνεισφέρει σε μια έκφραση ενός μουσικού έργου μέσω της διεύθυνσης ενός οργανικού συνόλου σε μια μουσική ή δραματική παρουσίαση κ.λπ., με μια έκφραση. @el
toolkit label: διευθυντής ορχήστρας φορέας του @el
toolkit definition: Μια έκφραση ενός μουσικού έργου που ενσωματώνει τη συνεισφορά της διεύθυνσης ενός οργανικού συνόλου σε μια μουσική ή δραματική παρουσίαση κ.λπ. @el
definition: Setzt einen Akteur in Beziehung zu einer Expression, zu der ein Akteur beiträgt, indem er eine Instrumentalgruppe in einer musikalischen oder dramatischen Darbietung leitet. @de
toolkit label: Akteur als Orchesterleiterin/Orchesterleiter von @de
toolkit definition: Eine Expression, zu der ein Akteur beiträgt, indem er eine Instrumentalgruppe in einer musikalischen oder dramatischen Darbietung leitet. @de
label: er agent, som er instrumentaldirigent af @da
definition: Relaterer en agent til et udtryk, som omfatter en agents bidrag ved at lede en optrædende instrumentalgruppe i en musikalsk eller dramatisk præsentation. @da
toolkit label: agent, som er instrumentaldirigent af @da
toolkit definition: Udtryk, som omfatter en agents bidrag ved at lede en optrædende instrumentalgruppe i en musikalsk eller dramatisk præsentation. @da
label: és agent director instrumental de @ca
definition: Relaciona un agent amb una expressió que inclou una contribució d’un agent dirigint un grup instrumental en una representació musical o dramàtica. @ca
toolkit label: agent director instrumental de @ca
toolkit definition: Expressió que inclou una contribució d’un agent dirigint un grup instrumental en una representació musical o dramàtica. @ca
definition: Liittää toimijan ekspressioon, jonka tekemiseen toimija osallistuu johtamalla soitinryhmää musiikki- tai näytelmäesityksessä tms.
toolkit label: kapellimestari (toimija) ekspressiossa
toolkit definition: Ekspressio, jonka tekemiseen toimija osallistuu johtamalla soitinryhmää musiikki- tai näytelmäesityksessä tms.
toolkit label: instrumentaldirigent for (agent) @no
toolkit definition: Et uttrykk som inkluderer et bidrag fra en agent i form av å lede en instrumentalgruppe i en musikalsk eller dramatisk forestilling. @no
label: ist Akteur als Orchesterleiterin/Orchesterleiter von @de
label: est un agent chef d’orchestre de @fr
definition: Met un agent en relation avec une expression qui intègre une contribution de la part d’un agent consistant à diriger un groupe d’instrumentistes dans une présentation musicale ou dramatique. @fr
toolkit label: agent chef d’orchestre de @fr
toolkit definition: Expression qui intègre une contribution de la part d’un agent consistant à diriger un groupe d’instrumentistes dans une présentation musicale ou dramatique. @fr
has element type: 2
label: zenekari karmester ágense a következőnek: @hu
definition: Hozzákapcsol egy ágenst egy kifejezési formához, amely magában foglalja egy zenei vagy drámai bemutatóban hangszeres előadói csoportot vezénylő és vezető ágens közreműködését. @hu
toolkit label: zenekari karmester ágense: @hu
toolkit definition: Egy kifejezési forma, amely magában foglalja egy zenei vagy drámai bemutatóban hangszeres előadói csoportot vezénylő és vezető ágens közreműködését. @hu
alternative label: instrumental conductor of @en
alternative label: kapellimestarina ekspressiossa
label: er instrumentaldirigent for (agent) @no
definition: Relaterer en agent til et uttrykk som inkluderer et bidrag fra en agent i form av å lede en instrumentalgruppe i en musikalsk eller dramatisk forestilling. @no
alternative label: instrumentaldirigent for @no
label: is instrumentaal dirigent-actor van @nl
definition: Relateert een actor aan een expressie die omvat een bijdrage door een actor van dirigeren en leiden van een instrumentaal optredende groep in een muziek- of dramapresentatie. @nl
toolkit label: instrumentaal dirigent-actor van @nl
toolkit definition: Een expressie die omvat een bijdrage door een actor van dirigeren en leiden van een instrumentaal optredende groep in een muziek- of dramapresentatie. @nl
label: هو وكيل قائد فرقة عزف لـ @ar
definition: يربط وكيلا بتعبيرة تتضمن إسهام وكيل في إدارة فرقة عزف وقيادتها في عرض موسيقي أو درامي. @ar
alternative label: قائد فرقة آلات عزف @ar
toolkit label: وكيل قائد فرقة عزف @ar
toolkit definition: تعبيرة تتضمن إسهام وكيل في إدارة فرقة عزف وقيادتها في عرض موسيقي أو درامي. @ar
alternative label: director instrumental de @ca
alternative label: instrumentaldirigent af @da
label: orkestrijuht (tegija) väljenduses @et
definition: Seostab tegija väljendusega, millesse tegija on andnud panuse, juhatades instrumentaalkoosseisu muusika- või draamaetenduses. @et
alternative label: orkestrijuht väljenduses @et
toolkit label: orkestrijuht (tegija) väljenduses @et
toolkit definition: Väljendus, millesse tegija on andnud panuse, juhatades instrumentaalkoosseisu muusika- või draamaetenduses. @et
alternative label: zenekari karmestere: @hu
label: è strumentale conduttore agente di @it
definition: Correla un agente a un'espressione che comprende il contributo da parte di un agente nel condurre o guidare un gruppo musicale che si esibisce in una rappresentazione musicale o teatrale. @it
alternative label: conduttore strumentale di @it
toolkit label: conduttore strumentale agente di @it
toolkit definition: Espressione che comprende il contributo da parte di un agente nel condurre o guidare un gruppo musicale che si esibisce in una rappresentazione musicate o teatrale. @it
alternative label: διευθυντής ορχήστρας του @el
alternative label: chef d’orchestre de @fr
label: ir orķestra diriģents (aģents) @lv
definition: Sasaista aģentu ar izteiksmi, kas ietver aģenta ieguldījumu, diriģējot un vadot orķestri muzikālā vai dramatiskā uzvedumā. @lv
toolkit label: ir orķestra diriģents (aģents) @lv
toolkit definition: Izteiksme, kas ietver aģenta ieguldījumu, diriģējot un vadot orķestri muzikālā vai dramatiskā uzvedumā. @lv
alternative label: Orchesterleiterin/Orchesterleiter von @de
alternative label: ……的器乐指挥 @zh-hans
toolkit label: ……的器乐指挥行为者 @zh-hans
toolkit definition: 包括在音乐或戏剧呈现中指挥并领导一个器乐表演团体的一个行为者的贡献的一种内容表达 @zh-hans
toolkit label: enstrüman şefi temsilcisidir @tr
toolkit definition: Müzikal veya dramatik bir sunumda enstrümantal bir performans grubunu yöneten ve yönlendiren bir temsilcinin katkısını içeren bir anlatım. @tr
has subproperty: kapellimestari (yhteistoimija) ekspressiossa

kapellimestari (yhteistoimija) ekspressiossa
status: Published
label: is instrumental conductor collective agent of @en
lexical alias: instrumentalConductorCollectiveAgentOf.en
definition: Relates a collective agent to an expression that includes a contribution by a collective agent of conducting and leading an instrumental performing group in a musical or dramatic presentation. @en
toolkit label: instrumental conductor collective agent of @en
toolkit definition: An expression that includes a contribution by a collective agent of conducting and leading an instrumental performing group in a musical or dramatic presentation. @en
type: Property
domain: C10011
has element type: 2
sub property of: johtaja (yhteistoimija) ekspressiossa
sub property of: kapellimestari (toimija) ekspressiossa
definition: Liittää yhteistoimijan ekspressioon, jonka tekemisessä yhteistoimija on osallisena johtamalla soitinryhmää musiikki- tai näytelmäesityksessä tms.
toolkit label: kapellimestari (yhteistoimija) ekspressiossa
toolkit definition: Ekspressio, jonka tekemisessä yhteistoimija on osallisena johtamalla soitinryhmää musiikki- tai näytelmäesityksessä tms.
label: er instrumentaldirigent for (kollektiv agent) @no
definition: Relaterer en kollektiv agent til et uttrykk som inkluderer et bidrag fra en kollektiv agent i form av direksjon og ledelse av en instrumentalgruppe i en musikalsk eller dramatisk forestilling. @no
toolkit label: instrumentaldirigent for (kollektiv agent) @no
toolkit definition: Et uttrykk som inkluderer et bidrag fra en kollektiv agent i form av direksjon og ledelse av en instrumentalgruppe i en musikalsk eller dramatisk forestilling. @no
label: is instrumentaal dirigent-collectieve actor van @nl
definition: Relateert een collectieve actor aan een expressie die omvat een bijdrage door een collectieve actor van dirigeren en leiden van een instrumentaal optredende groep in een muziek- of dramapresentatie. @nl
toolkit label: instrumentaal dirigent-collectieve actor van @nl
toolkit definition: Een expressie die omvat een bijdrage door een collectieve actor van dirigeren en leiden van een instrumentaal optredende groep in een muziek- of dramapresentatie. @nl
label: هو وكيل جماعي قائد فرقة عزف لـ @ar
definition: يربط وكيلا جماعيا بتعبيرة تتضمن إسهام وكيل جماعي في إدارة فرقة عزف وقيادتها في عرض موسيقي أو درامي. @ar
toolkit label: هو وكيل جماعي قائد فرقة عزف لـ @ar
toolkit definition: تعبيرة تتضمن إسهام وكيل جماعي في إدارة فرقة عزف وقيادتها في عرض موسيقي أو درامي. @ar
label: és agent col·lectiu director instrumental de @ca
definition: Relaciona un agent col·lectiu amb una expressió que inclou una contribució d’un agent col·lectiu dirigint un grup instrumental en una representació musical o dramàtica. @ca
toolkit label: agent col·lectiu director instrumental de @ca
toolkit definition: Expressió que inclou una contribució d’un agent col·lectiu dirigint un grup instrumental en una representació musical o dramàtica. @ca
label: er kollektiv agent, som er instrumentaldirigent af @da
definition: Relaterer en kollektiv agent til et udtryk, som omfatter en kollektiv agents bidrag ved at lede en optrædende instrumentalgruppe i en musikalsk eller dramatisk præsentation. @da
toolkit label: kollektiv agent, som er instrumentaldirigent af @da
toolkit definition: Udtryk, som omfatter en kollektiv agents bidrag ved at lede en optrædende instrumentalgruppe i en musikalsk eller dramatisk præsentation. @da
label: orkestrijuht (kollektiiv) väljenduses @et
definition: Seostab kollektiivi väljendusega, millesse kollektiiv on andnud panuse, juhatades instrumentaalkoosseisu muusika- või draamaetenduses. @et
toolkit label: orkestrijuht (kollektiiv) väljenduses @et
toolkit definition: Väljendus, millesse kollektiiv on andnud panuse, juhatades instrumentaalkoosseisu muusika- või draamaetenduses. @et
label: ist gemeinschaftlicher Akteur als Orchesterleiterin/Orchesterleiter von @de
definition: Setzt einen gemeinschaftlichen Akteur in Beziehung zu einer Expression, zu der ein gemeinschaftlicher Akteur beiträgt, indem er eine Instrumentalgruppe in einer musikalischen oder dramatischen Darbietung leitet. @de
toolkit label: Gemeinschaftlicher Akteur als Orchesterleiterin/Orchesterleiter von @de
toolkit definition: Eine Expression, zu der ein gemeinschaftlicher Akteur beiträgt, indem er eine Instrumentalgruppe in einer musikalischen oder dramatischen Darbietung leitet. @de
label: zenekari karmester kollektív ágense a következőnek: @hu
definition: Hozzákapcsol egy kollektív ágenst egy kifejezési formához, amely magában foglalja egy zenei vagy drámai bemutatóban hangszeres előadói csoportot vezénylő és vezető kollektív ágens közreműködését. @hu
toolkit label: zenekari karmester kollektív ágense: @hu
toolkit definition: Egy kifejezési forma, amely magában foglalja egy zenei vagy drámai bemutatóban hangszeres előadói csoportot vezénylő és vezető kollektív ágens közreműködését. @hu
label: è direttore d'orchestra agente collettivo di @it
definition: Correla un agente collettivo a un'espressione che comprende un contributo di un agente collettivo nella direzione e conduzione di un gruppo di esecuzione strumentale in una presentazione musicale o drammatica. @it
toolkit label: direttore d'orchestra agente collettivo di @it
toolkit definition: Espressione che comprende un contributo di un agente collettivo nella direzione e conduzione di un gruppo di esecuzione strumentale in una presentazione musicale o drammatica. @it
label: είναι διευθυντής ορχήστρας συλλογικός φορέας του @el
toolkit label: διευθυντής ορχήστρας συλλογικός φορέας του @el
label: est un agent collectif chef d’orchestre de @fr
definition: Met un agent collectif en relation avec une expression qui intègre une contribution de la part d’un agent collectif consistant à diriger un groupe d’instrumentistes dans une présentation musicale ou dramatique. @fr
toolkit label: agent collectif chef d’orchestre de @fr
toolkit definition: Expression qui intègre une contribution de la part d’un agent collectif consistant à diriger un groupe d’instrumentistes dans une présentation musicale ou dramatique. @fr
label: ir orķestra diriģents (grupa) @lv
definition: Sasaista grupu ar izteiksmi, kas ietver grupas ieguldījumu, diriģējot un vadot orķestri muzikālā vai dramatiskā uzvedumā. @lv
toolkit label: ir orķestra diriģents (grupa) @lv
toolkit definition: Izteiksme, kas ietver grupas ieguldījumu, diriģējot un vadot orķestri muzikālā vai dramatiskā uzvedumā. @lv
label: 是……的器乐指挥集体行为者 @zh-hans
definition: 将一个集体行为者与包括在音乐或戏剧呈现中指挥并领导一个器乐表演团体的一个集体行为者的贡献的一种内容表达关联起来。 @zh-hans
toolkit label: ……的器乐指挥集体行为者 @zh-hans
toolkit definition: 包括在音乐或戏剧呈现中指挥并领导一个器乐表演团体的一个集体行为者的贡献的一种内容表达 @zh-hans
label: enstrüman şefi kolektif temsilcisidir @tr
definition: Kolektif bir temsilciyi, müzikal veya dramatik bir sunumda enstrümantal bir performans grubunu yürüten ve yöneten kolektif bir temsilcinin katkısını içeren bir anlatımla ilikilendirir. @tr
toolkit label: enstrüman şefi kolektif temsilcisidir @tr
toolkit definition: Müzikal veya dramatik bir sunumda enstrümantal bir performans grubunu yöneten ve liderlik eden kolektif bir temsilcinin katkısını içeren bir anlatım. @tr
has subproperty: kapellimestari (yhteisö) ekspressiossa
has subproperty: kapellimestari (suku) ekspressiossa
has subproperty: P50726

kapellimestari (yhteisö) ekspressiossa
status: Published
label: is instrumental conductor corporate body of @en
lexical alias: instrumentalConductorCorporateBodyOf.en
definition: Relates a corporate body to an expression that includes a contribution by a corporate body of conducting and leading an instrumental performing group in a musical or dramatic presentation. @en
toolkit label: instrumental conductor corporate body of @en
toolkit definition: An expression that includes a contribution by a corporate body of conducting and leading an instrumental performing group in a musical or dramatic presentation. @en
type: Property
domain: C10005
has element type: 2
sub property of: johtaja (yhteisö) ekspressiossa
sub property of: kapellimestari (yhteistoimija) ekspressiossa
definition: Liittää yhteisön ekspressioon, jonka tekemisessä yhteisö on osallisena johtamalla soitinryhmää musiikki- tai näytelmäesityksessä tms.
toolkit label: kapellimestari (yhteisö) ekspressiossa
toolkit definition: Ekspressio, jonka tekemisessä yhteisö on osallisena johtamalla soitinryhmää musiikki- tai näytelmäesityksessä tms.
label: er instrumentaldirigent for (korporasjon) @no
definition: Relaterer en korporasjon til et uttrykk som inkluderer et bidrag fra en korporasjon i form av direksjon og ledelse av en instrumentalgruppe i en musikalsk eller dramatisk forestilling. @no
toolkit label: instrumentaldirigent for (korporasjon) @no
toolkit definition: Et uttrykk som inkluderer et bidrag fra en korporasjon i form av direksjon og ledelse av en instrumentalgruppe i en musikalsk eller dramatisk forestilling. @no
label: is instrumentaal dirigent-corporatie van @nl
definition: Relateert een corporatie aan een expressie die omvat een bijdrage door een corporatie van dirigeren en leiden van een instrumentaal optredende groep in een muziek- of dramapresentatie. @nl
toolkit label: instrumentaal dirigent-corporatie van @nl
toolkit definition: Een expressie die omvat een bijdrage door een corporatie van dirigeren en leiden van een instrumentaal optredende groep in een muziek- of dramapresentatie. @nl
label: هي هيئة قائدة لفرقة عزف لـ @ar
definition: يربط هيئة بتعبيرة تتضمن إسهام هيئة في إدارة فرقة عزف وقيادتها في عرض موسيقي أو درامي. @ar
toolkit label: هيئة قائدة لفرقة عزف @ar
toolkit definition: تعبيرة تتضمن إسهام هيئة في إدارة فرقة عزف وقيادتها في عرض موسيقي أو درامي. @ar
label: és entitat corporativa directora instrumental de @ca
definition: Relaciona una entitat corporativa amb una expressió que inclou una contribució d’una entitat corporativa dirigint un grup instrumental en una representació musical o dramàtica. @ca
toolkit label: entitat corporativa directora instrumental de @ca
toolkit definition: Expressió que inclou una contribució d’una entitat corporativa dirigint un grup instrumental en una representació musical o dramàtica. @ca
label: er korporation, som er instrumentaldirigent af @da
definition: Relaterer en korporation til et udtryk, som omfatter en korporations bidrag ved at lede en optrædende instrumentalgruppe i en musikalsk eller dramatisk præsentation. @da
toolkit label: korporation, som er instrumentaldirigent af @da
toolkit definition: Udtryk, som omfatter en korporations bidrag ved at lede en optrædende instrumentalgruppe i en musikalsk eller dramatisk præsentation. @da
label: orkestrijuht (asutus) väljenduses @et
definition: Seostab asutuse väljendusega, millesse asutus on andnud panuse, juhatades instrumentaalkoosseisu muusika- või draamaetenduses. @et
toolkit label: orkestrijuht (asutus) väljenduses @et
toolkit definition: Väljendus, millesse asutus on andnud panuse, juhatades instrumentaalkoosseisu muusika- või draamaetenduses. @et
label: ist Körperschaft als Orchesterleiterin/Orchesterleiter von @de
definition: Setzt eine Körperschaft in Beziehung zu einer Expression, zu der eine Körperschaft beiträgt, indem sie eine Instrumentalgruppe in einer musikalischen oder dramatischen Darbietung leitet. @de
toolkit label: Körperschaft als Orchesterleiterin/Orchesterleiter von @de
toolkit definition: Eine Expression, zu der eine Körperschaft beiträgt, indem sie eine Instrumentalgruppe in einer musikalischen oder dramatischen Darbietung leitet. @de
label: zenekari karmester testülete a következőnek: @hu
definition: Hozzákapcsol egy testületet egy kifejezési formához, amely magában foglalja egy zenei vagy drámai bemutatóban hangszeres előadói csoportot vezénylő és vezető testület közreműködését. @hu
toolkit label: zenekari karmester testülete: @hu
toolkit definition: Egy kifejezési forma, amely magában foglalja egy zenei vagy drámai bemutatóban hangszeres előadói csoportot vezénylő és vezető testület közreműködését. @hu
label: è direttore d'orchestra ente di @it
definition: Correla un ente a un'espressione che comprende un contributo di un ente nella direzione e conduzione di un gruppo di esecuzione strumentale in una presentazione musicale o drammatica. @it
toolkit label: direttore d'orchestra ente di @it
toolkit definition: Espressione che comprende un contributo di un ente nella direzione e conduzione di un gruppo di esecuzione strumentale in una presentazione musicale o drammatica. @it
label: είναι διευθυντής ορχήστρας συλλογικό όργανο του @el
toolkit label: διευθυντής ορχήστρας συλλογικό όργανο του @el
label: est une collectivité chef d’orchestre de @fr
definition: Met une collectivité en relation avec une expression qui intègre une contribution de la part d’une collectivité consistant à diriger un groupe d’instrumentistes dans une présentation musicale ou dramatique. @fr
toolkit label: collectivité chef d’orchestre de @fr
toolkit definition: Expression qui intègre une contribution de la part d’une collectivité consistant à diriger un groupe d’instrumentistes dans une présentation musicale ou dramatique. @fr
label: ir orķestra diriģents (institūcija) @lv
definition: Sasaista institūciju ar izteiksmi, kas ietver institūcijas ieguldījumu, diriģējot un vadot orķestri muzikālā vai dramatiskā uzvedumā. @lv
toolkit label: ir orķestra diriģents (institūcija) @lv
toolkit definition: Izteiksme, kas ietver institūcijas ieguldījumu, diriģējot un vadot orķestri muzikālā vai dramatiskā uzvedumā. @lv
label: 是……的器乐指挥团体 @zh-hans
definition: 将一个团体与包括在音乐或戏剧呈现中指挥并领导一个器乐表演团体的一个团体的贡献的一种内容表达关联起来。 @zh-hans
toolkit label: ……的器乐指挥团体 @zh-hans
toolkit definition: 包括在音乐或戏剧呈现中指挥并领导一个器乐表演团体的一个团体的贡献的一种内容表达 @zh-hans
label: enstrüman şefi tüzel kişisidir @tr
definition: Bir tüzel kişiyi, müzikal veya dramatik bir sunumda enstrümantal bir performans grubunu yönetme ve liderlik etme konusunda bir tüzel kişinin katkısını içeren bir anlatımla ilişkilendirir. @tr
toolkit label: enstrüman tüzel kişisidir @tr
toolkit definition: Müzikal veya dramatik bir sunumda enstrümantal bir performans grubunu yönetme ve liderlikte tüzel bir kişinin katkısını içeren bir anlatım. @tr
has subproperty: P50877

kapellimestari (suku) ekspressiossa
status: Published
label: is instrumental conductor family of @en
lexical alias: instrumentalConductorFamilyOf.en
definition: Relates a family to an expression that includes a contribution by a family of conducting and leading an instrumental performing group in a musical or dramatic presentation. @en
toolkit label: instrumental conductor family of @en
toolkit definition: An expression that includes a contribution by a family of conducting and leading an instrumental performing group in a musical or dramatic presentation. @en
type: Property
domain: C10008
has element type: 2
sub property of: johtaja (suku) ekspressiossa
sub property of: kapellimestari (yhteistoimija) ekspressiossa
definition: Liittää suvun ekspressioon, jonka tekemisessä suku on osallisena johtamalla soitinryhmää musiikki- tai näytelmäesityksessä tms.
toolkit label: kapellimestari (suku) ekspressiossa
toolkit definition: Ekspressio, jonka tekemisessä suku on osallisena johtamalla soitinryhmää musiikki- tai näytelmäesityksessä tms.
label: er instrumentaldirigent for (familie) @no
definition: Relaterer en familie til et uttrykk som inkluderer et bidrag fra en familie i form av direksjon og ledelse av en instrumentalgruppe i en musikalsk eller dramatisk forestilling. @no
toolkit label: instrumentaldirigent for (familie) @no
toolkit definition: Et uttrykk som inkluderer et bidrag fra en familie i form av direksjon og ledelse av en instrumentalgruppe i en musikalsk eller dramatisk forestilling. @no
label: is instrumentaal dirigent-familie van @nl
definition: Relateert een familie aan een expressie die omvat een bijdrage door een familie van dirigeren en leiden van een instrumentaal optredende groep in een muziek- of dramapresentatie. @nl
toolkit label: instrumentaal dirigent-familie van @nl
toolkit definition: Een expressie die omvat een bijdrage door een familie van dirigeren en leiden van een instrumentaal optredende groep in een muziek- of dramapresentatie. @nl
label: هي عائلة قائدة لفرقة عزف لـ @ar
definition: يربط عائلة بتعبيرة تتضمن إسهام عائلة في إدارة فرقة عزف وقيادتها في عرض موسيقي أو درامي. @ar
toolkit label: عائلة مسئولة عن قيادة فرقة آلات عزف @ar
toolkit definition: تعبيرة تتضمن إسهام عائلة في إدارة فرقة عزف وقيادتها في عرض موسيقي أو درامي. @ar
label: és família directora instrumental de @ca
definition: Relaciona una família amb una expressió que inclou una contribució d’una família dirigint un grup instrumental en una representació musical o dramàtica. @ca
toolkit label: família directora instrumental de @ca
toolkit definition: Expressió que inclou una contribució d’una família dirigint un grup instrumental en una representació musical o dramàtica. @ca
label: er familie, som er instrumentaldirigent af @da
definition: Relaterer en familie til et udtryk, som omfatter en families bidrag ved at lede en optrædende instrumentalgruppe i en musikalsk eller dramatisk præsentation. @da
toolkit label: familie, som er instrumentaldirigent af @da
toolkit definition: Udtryk, som omfatter en families bidrag ved at lede en optrædende instrumentalgruppe i en musikalsk eller dramatisk præsentation. @da
label: orkestrijuht (perekond) väljenduses @et
definition: Seostab perekonna väljendusega, millesse perekond on andnud panuse, juhatades instrumentaalkoosseisu muusika- või draamaetenduses. @et
toolkit label: orkestrijuht (perekond) väljenduses @et
toolkit definition: Väljendus, millesse perekond on andnud panuse, juhatades instrumentaalkoosseisu muusika- või draamaetenduses. @et
label: ist Familie als Orchesterleiterin/Orchesterleiter von @de
definition: Setzt eine Familie in Beziehung zu einer Expression, zu der eine Familie beiträgt, indem sie eine Instrumentalgruppe in einer musikalischen oder dramatischen Darbietung leitet. @de
toolkit label: Familie als Orchesterleiterin/Orchesterleiter von @de
toolkit definition: Eine Expression, zu der eine Familie beiträgt, indem sie eine Instrumentalgruppe in einer musikalischen oder dramatischen Darbietung leitet. @de
label: zenekari karmester családja a következőnek: @hu
definition: Hozzákapcsol egy családot egy kifejezési formához, amely magában foglalja egy zenei vagy drámai bemutatóban hangszeres előadói csoportot vezénylő és vezető család közreműködését. @hu
toolkit label: zenekari karmester családja: @hu
toolkit definition: Egy kifejezési forma, amely magában foglalja egy zenei vagy drámai bemutatóban hangszeres előadói csoportot vezénylő és vezető család közreműködését. @hu
label: è direttore di orchestra famiglia di @it
definition: Correla una famiglia a un'espressione che comprende un contributo di una famiglia nella direzione e conduzione di un gruppo di esecuzione strumentale in una presentazione musicale o drammatica. @it
toolkit label: direttore di orchestra famiglia di @it
toolkit definition: Espressione che comprende un contributo di una famiglia nella direzione e conduzione di un gruppo di esecuzione strumentale in una presentazione musicale o drammatica. @it
label: είναι διευθυντής ορχήστρας οικογένεια του @el
toolkit label: διευθυντής ορχήστρας οικογένεια του @el
label: est une famille chef d’orchestre de @fr
definition: Met une famille en relation avec une expression qui intègre une contribution de la part d’une famille consistant à diriger un groupe d’instrumentistes dans une présentation musicale ou dramatique. @fr
toolkit label: famille chef d’orchestre de @fr
toolkit definition: Expression qui intègre une contribution de la part d’une famille consistant à diriger un groupe d’instrumentistes dans une présentation musicale ou dramatique. @fr
label: ir orķestra diriģents (dzimta/ģimene) @lv
definition: Sasaista dzimtu/ģimeni ar izteiksmi, kas ietver dzimtas/ģimenes ieguldījumu, diriģējot un vadot orķestri muzikālā vai dramatiskā uzvedumā. @lv
toolkit label: ir orķestra diriģents (dzimta/ģimene) @lv
toolkit definition: Izteiksme, kas ietver dzimtas/ģimenes ieguldījumu, diriģējot un vadot orķestri muzikālā vai dramatiskā uzvedumā. @lv
label: 是……的器乐指挥家族 @zh-hans
definition: 将一个家族与包括在音乐或戏剧呈现中指挥并领导一个器乐表演团体的一个家族的贡献的一种内容表达关联起来。 @zh-hans
toolkit label: ……的器乐指挥家族 @zh-hans
toolkit definition: 包括在音乐或戏剧呈现中指挥并领导一个器乐表演团体的一个家族的贡献的一种内容表达 @zh-hans
label: enstrüman şefi ailesidir @tr
definition: Bir aileyi, müzikal veya dramatik bir sunumda enstrümantal bir performans grubunu yöneten ve yönlendiren bir ailenin katkısını içeren bir anlatımla ilişkilendirir. @tr
toolkit label: enstrüman şefi ailesidir @tr
toolkit definition: Müzikal veya dramatik bir sunumda enstrümantal bir performans grubunu yöneten ve yönlendiren bir ailenin katkısını içeren bir anlatım. @tr
has subproperty: P51028

kapellimestari (henkilö) ekspressiossa
status: Published
label: is instrumental conductor person of @en
lexical alias: instrumentalConductorPersonOf.en
definition: Relates a person to an expression that includes a contribution by a person of conducting and leading an instrumental performing group in a musical or dramatic presentation. @en
toolkit label: instrumental conductor person of @en
toolkit definition: An expression that includes a contribution by a person of conducting and leading an instrumental performing group in a musical or dramatic presentation. @en
type: Property
domain: C10004
has element type: 2
sub property of: johtaja (henkilö) ekspressiossa
sub property of: kapellimestari (toimija) ekspressiossa
definition: Liittää henkilön ekspressioon, jonka tekemisessä henkilö on osallisena johtamalla soitinryhmää musiikki- tai näytelmäesityksessä tms.
toolkit label: kapellimestari (henkilö) ekspressiossa
toolkit definition: Ekspressio, jonka tekemisessä henkilö on osallisena johtamalla soitinryhmää musiikki- tai näytelmäesityksessä tms.
label: er instrumentaldirigent for (person) @no
definition: Relaterer en person til et uttrykk som inkluderer et bidrag fra en person i form av direksjon og ledelse av en instrumentalgruppe i en musikalsk eller dramatisk forestilling. @no
toolkit label: instrumentaldirigent for (person) @no
toolkit definition: Et uttrykk som inkluderer et bidrag fra en person i form av direksjon og ledelse av en instrumentalgruppe i en musikalsk eller dramatisk forestilling. @no
label: is instrumentaal dirigent-persoon van @nl
definition: Relateert een persoon aan een expressie die omvat een bijdrage door een persoon van dirigeren en leiden van een instrumentaal optredende groep in een muziek- of dramapresentatie. @nl
toolkit label: instrumentaal dirigent-persoon van @nl
toolkit definition: Een expressie die omvat een bijdrage door een persoon van dirigeren en leiden van een instrumentaal optredende groep in een muziek- of dramapresentatie. @nl
label: هو شخص قائد فرقة عزف لـ @ar
definition: يربط شخصا بتعبيرة تتضمن إسهام شخص في إدارة فرقة عزف وقيادتها في عرض موسيقي أو درامي. @ar
toolkit label: شخص قائد فرقة آلات عزف @ar
toolkit definition: تعبيرة تتضمن إسهام شخص في إدارة فرقة عزف وقيادتها في عرض موسيقي أو درامي. @ar
label: és persona directora instrumental de @ca
definition: Relaciona una persona amb una expressió que inclou una contribució d’una persona dirigint un grup instrumental en una representació musical o dramàtica. @ca
toolkit label: persona directora instrumental de @ca
toolkit definition: Expressió que inclou una contribució d’una persona dirigint un grup instrumental en una representació musical o dramàtica. @ca
label: er person, som er instrumentaldirigent af @da
definition: Relaterer en person til et udtryk, som omfatter en persons bidrag ved at lede en optrædende instrumentalgruppe i en musikalsk eller dramatisk præsentation. @da
toolkit label: person, som er instrumentaldirigent af @da
toolkit definition: Udtryk, som omfatter en persons bidrag ved at lede en optrædende instrumentalgruppe i en musikalsk eller dramatisk præsentation. @da
label: orkestrijuht (isik) väljenduses @et
definition: Seostab isiku väljendusega, millesse isik on andnud panuse, juhatades instrumentaalkoosseisu muusika- või draamaetenduses. @et
toolkit label: orkestrijuht (isik) väljenduses @et
toolkit definition: Väljendus, millesse isik on andnud panuse, juhatades instrumentaalkoosseisu muusika- või draamaetenduses. @et
label: ist Person als Orchesterleiterin/Orchesterleiter von @de
definition: Setzt eine Person in Beziehung zu einer Expression, zu der eine Person beiträgt, indem sie eine Instrumentalgruppe in einer musikalischen oder dramatischen Darbietung leitet. @de
toolkit label: Person als Orchesterleiterin/Orchesterleiter von @de
toolkit definition: Eine Expression, zu der eine Person beiträgt, indem sie eine Instrumentalgruppe in einer musikalischen oder dramatischen Darbietung leitet. @de
label: zenekari karmester személye a következőnek: @hu
definition: Hozzákapcsol egy személyt egy kifejezési formához, amely magában foglalja egy zenei vagy drámai bemutatóban hangszeres előadói csoportot vezénylő és vezető személy közreműködését. @hu
toolkit label: zenekari karmester személye: @hu
toolkit definition: Egy kifejezési forma, amely magában foglalja egy zenei vagy drámai bemutatóban hangszeres előadói csoportot vezénylő és vezető személy közreműködését. @hu
label: è direttore d'orchestra persona di @it
definition: Correla una persona a un'espressione che comprende un contributo di una persona nella direzione e conduzione di un gruppo di esecuzione strumentale in una presentazione musicale o drammatica. @it
toolkit label: direttore d'orchestra persona di @it
toolkit definition: Espressione che comprende un contributo di una persona nella direzione e conduzione di un gruppo di esecuzione strumentale in una presentazione musicale o drammatica. @it
label: είναι διευθυντής ορχήστρας φυσικό πρόσωπο του @el
toolkit label: διευθυντής ορχήστρας φυσικό πρόσωπο του @el
label: est une personne chef d’orchestre de @fr
definition: Met une personne en relation avec une expression qui intègre une contribution de la part d’une personne consistant à diriger un groupe d’instrumentistes dans une présentation musicale ou dramatique. @fr
toolkit label: personne chef d’orchestre de @fr
toolkit definition: Expression qui intègre une contribution de la part d’une personne consistant à diriger un groupe d’instrumentistes dans une présentation musicale ou dramatique. @fr
label: ir orķestra diriģents (persona) @lv
definition: Sasaista personu ar izteiksmi, kas ietver personas ieguldījumu, diriģējot un vadot orķestri muzikālā vai dramatiskā uzvedumā. @lv
toolkit label: ir orķestra diriģents (persona) @lv
toolkit definition: Izteiksme, kas ietver personas ieguldījumu, diriģējot un vadot orķestri muzikālā vai dramatiskā uzvedumā. @lv
label: 是……的器乐指挥个人 @zh-hans
definition: 将一个个人与包括在音乐或戏剧呈现中指挥并领导一个器乐表演团体的一个个人的贡献的一种内容表达关联起来。 @zh-hans
toolkit label: ……的器乐指挥个人 @zh-hans
toolkit definition: 包括在音乐或戏剧呈现中指挥并领导一个器乐表演团体的一个个人的贡献的一种内容表达 @zh-hans
label: enstrüman şefi kişisidir @tr
definition: Bir kişiyi, müzikal veya dramatik bir sunumda enstrümantal bir performans grubunu yöneten ve yönlendiren bir kişinin katkısını içeren bir anlatımla ilişkilendirir. @tr
toolkit label: enstrüman şefi kişisidir @tr
toolkit definition: Müzikal veya dramatik bir sunumda enstrümantal bir performans grubunu yöneten ve yönlendiren bir kişinin katkısını içeren bir anlatım. @tr
has subproperty: P50575

soittaja (toimija) ekspressiossa
status: Published
label: is instrumentalist agent of @en
definition: Relates an agent to an expression that includes a contribution by an agent of playing a musical instrument. @en
type: Property
domain: C10002
sub property of: esittäjä (toimija) ekspressiossa
lexical alias: instrumentalistAgentOf.en
label: est un agent instrumentiste de @fr
definition: Met un agent en relation avec une expression qui intègre une contribution de la part d’un agent consistant à jouer d’un instrument de musique. @fr
toolkit label: agent instrumentiste de @fr
toolkit definition: Expression qui intègre une contribution de la part d’un agent consistant à jouer d’un instrument de musique. @fr
toolkit label: instrumentalist agent of @en
toolkit definition: An expression that includes a contribution by an agent of playing a musical instrument. @en
instruction number: 18.5
label: είναι εκτελεστής [μουσικού οργάνου] φορέας του @el
definition: Συνδέει έναν εκτελεστή, ο οποίος συνεισφέρει σε μια έκφραση ενός έργου μέσω της εκτέλεσης ενός μουσικού οργάνου, με μια έκφραση. @el
toolkit label: εκτελεστής [μουσικού οργάνου] του @el
toolkit definition: Μια έκφραση ενός έργου που ενσωματώνει τη συνεισφορά της εκτέλεσης ενός μουσικού οργάνου. @el
definition: Setzt einen Akteur in Beziehung zu einer Expression, zu der ein Akteur beiträgt, indem er ein Musikinstrument spielt. @de
toolkit label: Akteur als Instrumentalmusikerin/Instrumentalmusiker von @de
toolkit definition: Eine Expression, zu der ein Akteur beiträgt, indem er ein Musikinstrument spielt. @de
label: er agent, som er instrumentalist af @da
definition: Relaterer en agent til et udtryk, som omfatter en agents bidrag ved at spille et musikinstrument. @da
toolkit label: agent, som er instrumentalist af @da
toolkit definition: Udtryk, som omfatter en agents bidrag ved at spille et musikinstrument. @da
label: és agent instrumentista de @ca
definition: Relaciona un agent amb una expressió que inclou una contribució d’un agent tocant un instrument musical. @ca
toolkit label: agent instrumentista de @ca
toolkit definition: Expressió que inclou una contribució d’un agent tocant un instrument musical. @ca
definition: Liittää toimijan ekspressioon, jonka tekemiseen toimija osallistuu soittamalla soitinta.
toolkit label: soittaja (toimija) ekspressiossa
toolkit definition: Ekspressio, jonka tekemiseen toimija osallistuu soittamalla soitinta.
toolkit label: instrumentalist i (agent) @no
toolkit definition: Et uttrykk som inkluderer et bidrag fra en agent i form av å spille et musikkinstrument. @no
label: ist Akteur als Instrumentalmusikerin/Instrumentalmusiker von @de
has element type: 2
label: zenész ágense a következőnek: @hu
definition: Hozzákapcsol egy ágenst egy kifejezési formához, amely magában foglalja egy hangszeren játszó ágens közreműködését. @hu
toolkit label: zenész ágense: @hu
toolkit definition: Egy kifejezési forma, amely magában foglalja egy hangszeren játszó ágens közreműködését. @hu
alternative label: instrumentalist of @en
alternative label: soittajana ohjelmassa
label: er instrumentalist i (agent) @no
definition: Relaterer en agent til et uttrykk som inkluderer et bidrag fra en agent i form av å spille et musikkinstrument. @no
alternative label: instrumentalist i @no
label: is instrumentalist-actor van @nl
definition: Relateert een actor aan een expressie die omvat een bijdrage door een actor door het spelen van een muziekinstrument. @nl
toolkit label: instrumentalist-actor van @nl
toolkit definition: Een expressie die omvat een bijdrage door een actor door het spelen van een muziekinstrument. @nl
label: هو وكيل عازف لـ @ar
definition: يربط وكيلا بتعبيرة تتضمن إسهام وكيل بالعزف على آلة موسيقية. @ar
alternative label: عازف @ar
toolkit label: وكيل عازف @ar
toolkit definition: تعبيرة تتضمن إسهام وكيل بالعزف على آلة موسيقية. @ar
alternative label: instrumentista de @ca
alternative label: instrumentalist af @da
label: instrumentalist (tegija) väljenduses @et
definition: Seostab tegija väljendusega, millesse tegija on andnud panuse, mängides muusikainstrumenti. @et
alternative label: instrumentalist väljenduses @et
toolkit label: instrumentalist (tegija) väljenduses @et
toolkit definition: Väljendus, millesse tegija on andnud panuse, mängides muusikainstrumenti. @et
alternative label: zenésze: @hu
label: è strumentista agente di @it
definition: Correla un agente a un'espressione che include un contributo da parte di un agente nel suonare uno strumento musicale, @it
alternative label: strumentista di @it
toolkit label: strumentista agente di @it
toolkit definition: Espressione che include un contributo da parte di un agente nel suonare uno strumento musicale. @it
alternative label: εκτελεστής [μουσικού οργάνου] του @el
alternative label: instrumentiste de @fr
label: ir instrumentālists (aģents) @lv
definition: Sasaista aģentu ar izteiksmi, kas ietver aģenta ieguldījumu, spēlējot mūzikas instrumentu. @lv
toolkit label: ir instrumentālists (aģents) @lv
toolkit definition: Izteiksme, kas ietver aģenta ieguldījumu, spēlējot mūzikas instrumentu. @lv
alternative label: Instrumentalmusiker von @de
alternative label: ……的乐器演奏者 @zh-hans
toolkit label: ……的乐器演奏者行为者 @zh-hans
toolkit definition: 包括有演奏乐器的一个行为者的贡献的一种内容表达 @zh-hans
toolkit label: enstrümantalist temsilcisidir @tr
toolkit definition: Bir müzik aleti çalan bir temsilcinin katkısını içeren bir anlatım. @tr
has subproperty: soittaja (yhteistoimija) ekspressiossa

soittaja (yhteistoimija) ekspressiossa
status: Published
label: is instrumentalist collective agent of @en
lexical alias: instrumentalistCollectiveAgentOf.en
definition: Relates a collective agent to an expression that includes a contribution by a collective agent of playing a musical instrument. @en
toolkit label: instrumentalist collective agent of @en
toolkit definition: An expression that includes a contribution by a collective agent of playing a musical instrument. @en
type: Property
domain: C10011
has element type: 2
sub property of: esittäjä (yhteistoimija) ekspressiossa
sub property of: soittaja (toimija) ekspressiossa
definition: Liittää yhteistoimijan ekspressioon, jonka tekemisessä yhteistoimija on osallisena soittamalla soitinta.
toolkit label: soittaja (yhteistoimija) ekspressiossa
toolkit definition: Ekspressio, jonka tekemisessä yhteistoimija on osallisena soittamalla soitinta.
label: er instrumentalist for (kollektiv agent) @no
definition: Relaterer en kollektiv agent til et uttrykk som inkluderer et bidrag fra en kollektiv agent i form av å spille et musikkinstrument. @no
toolkit label: instrumentalist for (kollektiv agent) @no
toolkit definition: Et uttrykk som inkluderer et bidrag fra en kollektiv agent i form av å spille et musikkinstrument. @no
label: is instrumentalist-collectieve actor van @nl
definition: Relateert een collectieve actor aan een expressie die omvat een bijdrage door een collectieve actor van het spelen van een muziekinstrument. @nl
toolkit label: instrumentalist-collectieve actor van @nl
toolkit definition: Een expressie die omvat een bijdrage door een collectieve actor van het spelen van een muziekinstrument. @nl
label: هو وكيل جماعي عازف لـ @ar
definition: يربط وكيلا جماعيا بتعبيرة تتضمن إسهام وكيل جماعي في العزف على آلة موسيقية. @ar
toolkit label: وكيل جماعي عازف @ar
toolkit definition: تعبيرة تتضمن إسهام وكيل جماعي في العزف على آلة موسيقية. @ar
label: és agent col·lectiu instrumentista de @ca
definition: Relaciona un agent col·lectiu amb una expressió que inclou una contribució d’un agent col·lectiu tocant un instrument musical. @ca
toolkit label: agent col·lectiu instrumentista de @ca
toolkit definition: Expressió que inclou una contribució d’un agent col·lectiu tocant un instrument musical. @ca
label: er kollektiv agent, som er instrumentalist af @da
definition: Relaterer en kollektiv agent til et udtryk, som omfatter en kollektiv agents bidrag ved at spille et musikinstrument. @da
toolkit label: kollektiv agent, som er instrumentalist af @da
toolkit definition: Udtryk, som omfatter en kollektiv agents bidrag ved at spille et musikinstrument. @da
label: instrumentalist (kollektiiv) väljenduses @et
definition: Seostab kollektiivi väljendusega, millesse kollektiiv on andnud panuse, mängides muusikainstrumenti. @et
toolkit label: instrumentalist (kollektiiv) väljenduses @et
toolkit definition: Väljendus, millesse kollektiiv on andnud panuse, mängides muusikainstrumenti. @et
label: ist gemeinschaftlicher Akteur als Instrumentalmusikerin/Instrumentalmusiker von @de
definition: Setzt einen gemeinschaftlichen Akteur in Beziehung zu einer Expression, zu der ein gemeinschaftlicher Akteur beiträgt, indem er ein Musikinstrument spielt. @de
toolkit label: Gemeinschaftlicher Akteur als Instrumentalmusikerin/Instrumentalmusiker von @de
toolkit definition: Eine Expression, zu der ein gemeinschaftlicher Akteur beiträgt, indem er ein Musikinstrument spielt. @de
label: zenész kollektív ágense a következőnek: @hu
definition: Hozzákapcsol egy kollektív ágenst egy kifejezési formához, amely magában foglalja egy hangszeren játszó kollektív ágens közreműködését. @hu
toolkit label: zenész kollektív ágense: @hu
toolkit definition: Egy kifejezési forma, amely magában foglalja egy hangszeren játszó kollektív ágens közreműködését. @hu
label: è strumentista agente collettivo di @it
definition: Correla un agente collettivo a un'espressione che comprende un contributo di un agente collettivo nel suonare uno strumento musicale. @it
toolkit label: strumentista agente collettivo di @it
toolkit definition: Espressione che comprende un contributo di un agente collettivo nel suonare uno strumento musicale. @it
label: είναι εκτελεστής [μουσικού οργάνου] συλλογικός φορέας του @el
toolkit label: εκτελεστής [μουσικού οργάνου] συλλογικός φορέας του @el
label: est un agent collectif instrumentiste de @fr
definition: Met un agent collectif en relation avec une expression qui intègre une contribution de la part d’un agent collectif consistant à jouer d’un instrument de musique. @fr
toolkit label: agent collectif instrumentiste de @fr
toolkit definition: Expression qui intègre une contribution de la part d’un agent collectif consistant à jouer d’un instrument de musique. @fr
label: ir instrumentālists (grupa) @lv
definition: Sasaista grupu ar izteiksmi, kas ietver grupas ieguldījumu, spēlējot mūzikas instrumentu. @lv
toolkit label: ir instrumentālists (grupa) @lv
toolkit definition: Izteiksme, kas ietver grupas ieguldījumu, spēlējot mūzikas instrumentu. @lv
label: 是……的乐器演奏者集体行为者 @zh-hans
definition: 将一个集体行为者与包括有演奏乐器的一个集体行为者的贡献的一种内容表达关联起来。 @zh-hans
toolkit label: ……的乐器演奏者集体行为者 @zh-hans
toolkit definition: 包括有演奏乐器的一个集体行为者的贡献的一种内容表达 @zh-hans
label: enstrümantalist kolektif temsilcisidir @tr
definition: Kolektif bir temsilciyi, bir müzik aleti çalmak için kolektif bir temsilcinin katkısını içeren bir anlatım ile ilişkilendirir. @tr
toolkit label: enstrümantalist kolektif temsilcisidir @tr
toolkit definition: Bir müzik aleti çalmak için kolektif bir temsilcinin katkısını içeren bir anlatım. @tr
has subproperty: soittaja (yhteisö) ekspressiossa
has subproperty: soittaja (suku) ekspressiossa
has subproperty: P50755

soittaja (yhteisö) ekspressiossa
status: Published
label: is instrumentalist corporate body of @en
lexical alias: instrumentalistCorporateBodyOf.en
definition: Relates a corporate body to an expression that includes a contribution by a corporate body of playing a musical instrument. @en
toolkit label: instrumentalist corporate body of @en
toolkit definition: An expression that includes a contribution by a corporate body of playing a musical instrument. @en
type: Property
domain: C10005
has element type: 2
sub property of: esittäjä (yhteisö) ekspressiossa
sub property of: soittaja (yhteistoimija) ekspressiossa
definition: Liittää yhteisön ekspressioon, jonka tekemisessä yhteisö on osallisena soittamalla soitinta.
toolkit label: soittaja (yhteisö) ekspressiossa
toolkit definition: Ekspressio, jonka tekemisessä yhteisö on osallisena soittamalla soitinta.
label: er instrumentalist for (korporasjon) @no
definition: Relaterer en korporasjon til et uttrykk som inkluderer et bidrag fra en korporasjon i form av å spille et musikkinstrument. @no
toolkit label: instrumentalist for (korporasjon) @no
toolkit definition: Et uttrykk som inkluderer et bidrag fra en korporasjon i form av å spille et musikkinstrument. @no
label: is instrumentalist-corporatie van @nl
definition: Relateert een corporatie aan een expressie die omvat een bijdrage door een corporatie van het spelen van een muziekinstrument. @nl
toolkit label: instrumentalist-corporatie van @nl
toolkit definition: Een expressie die omvat een bijdrage door een corporatie van het spelen van een muziekinstrument. @nl
label: هي هيئة عازفة ل @ar
definition: يربط هيئة بتعبيرة تتضمن إسهام هيئة في العزف على آلة موسيقية. @ar
toolkit label: هيئة مسئولة عن العزف @ar
toolkit definition: تعبيرة تتضمن إسهام هيئة في العزف على آلة موسيقية. @ar
label: és entitat corporativa instrumentista de @ca
definition: Relaciona una entitat corporativa amb una expressió que inclou una contribució d’una entitat corporativa tocant un instrument musical. @ca
toolkit label: entitat corporativa instrumentista de @ca
toolkit definition: Expressió que inclou una contribució d’una entitat corporativa tocant un instrument musical. @ca
label: er korporation, som er instrumentalist af @da
definition: Relaterer en korporation til et udtryk, som omfatter en korporations bidrag ved at spille et musikinstrument. @da
toolkit label: korporation, som er instrumentalist af @da
toolkit definition: Udtryk, som omfatter en korporations bidrag ved at spille et musikinstrument. @da
label: instrumentalist (asutus) väljenduses @et
definition: Seostab asutuse väljendusega, millesse asutus on andnud panuse, mängides muusikainstrumenti. @et
toolkit label: instrumentalist (asutus) väljenduses @et
toolkit definition: Väljendus, millesse asutus on andnud panuse, mängides muusikainstrumenti. @et
label: ist Körperschaft als Instrumentalmusikerin/Instrumentalmusiker von @de
definition: Setzt eine Körperschaft in Beziehung zu einer Expression, zu der eine Körperschaft beiträgt, indem sie ein Musikinstrument spielt. @de
toolkit label: Körperschaft als Instrumentalmusikerin/Instrumentalmusiker von @de
toolkit definition: Eine Expression, zu der eine Körperschaft beiträgt, indem sie ein Musikinstrument spielt. @de
label: zenész testülete a következőnek: @hu
definition: Hozzákapcsol egy testületet egy kifejezési formához, amely magában foglalja egy hangszeren játszó testület közreműködését. @hu
toolkit label: zenész testülete: @hu
toolkit definition: Egy kifejezési forma, amely magában foglalja egy hangszeren játszó testület közreműködését. @hu
label: è strumentista ente di @it
definition: Correla un ente a un'espressione che comprende un contributo di un ente nel suonare uno strumento musicale. @it
toolkit label: strumentista ente di @it
toolkit definition: Espressione che comprende un contributo di un ente nel suonare uno strumento musicale. @it
label: είναι εκτελεστής [μουσικού οργάνου] συλλογικό όργανο του @el
toolkit label: εκτελεστής [μουσικού οργάνου] συλλογικό όργανο του @el
label: est une collectivité instrumentiste de @fr
definition: Met une collectivité en relation avec une expression qui intègre une contribution de la part d’une collectivité consistant à jouer d’un instrument de musique. @fr
toolkit label: collectivité instrumentiste de @fr
toolkit definition: Expression qui intègre une contribution de la part d’une collectivité consistant à jouer d’un instrument de musique. @fr
label: ir instrumentālists (institūcija) @lv
definition: Sasaista institūciju ar izteiksmi, kas ietver institūcijas ieguldījumu, spēlējot mūzikas instrumentu. @lv
toolkit label: ir instrumentālists (institūcija) @lv
toolkit definition: Izteiksme, kas ietver institūcijas ieguldījumu, spēlējot mūzikas instrumentu. @lv
label: 是……的乐器演奏者团体 @zh-hans
definition: 将一个团体与包括有演奏乐器的一个团体的贡献的一种内容表达关联起来。 @zh-hans
toolkit label: ……的乐器演奏者团体 @zh-hans
toolkit definition: 包括有演奏乐器的一个团体的贡献的一种内容表达 @zh-hans
label: enstrümentalist tüzel kişisidir @tr
definition: Bir tüzel kişiyi, bir müzik enstrümanı çalmak için bir tüzel kişiliğin katkısını içeren bir anlatımla ilişkilendirir. @tr
toolkit label: enstrümentalist tüzel kişisidir @tr
toolkit definition: Bir müzik aleti çalmak için bir tüzel kişinin katkısını içeren bir anlatım. @tr
has subproperty: P50906

soittaja (suku) ekspressiossa
status: Published
label: is instrumentalist family of @en
lexical alias: instrumentalistFamilyOf.en
definition: Relates a family to an expression that includes a contribution by a family of playing a musical instrument. @en
toolkit label: instrumentalist family of @en
toolkit definition: An expression that includes a contribution by a family of playing a musical instrument. @en
type: Property
domain: C10008
has element type: 2
sub property of: esittäjä (suku) ekspressiossa
sub property of: soittaja (yhteistoimija) ekspressiossa
definition: Liittää suvun ekspressioon, jonka tekemisessä suku on osallisena soittamalla soitinta.
toolkit label: soittaja (suku) ekspressiossa
toolkit definition: Ekspressio, jonka tekemisessä suku on osallisena soittamalla soitinta.
label: er instrumentalist for (familie) @no
definition: Relaterer en familie til et uttrykk som inkluderer et bidrag fra en familie i form av å spille et musikkinstrument. @no
toolkit label: instrumentalist for (familie) @no
toolkit definition: Et uttrykk som inkluderer et bidrag fra en familie i form av å spille et musikkinstrument. @no
label: is instrumentalist-familie van @nl
definition: Relateert een familie aan een expressie die omvat een bijdrage door een familie van het spelen van een muziekinstrument. @nl
toolkit label: instrumentalist-familie van @nl
toolkit definition: Een expressie die omvat een bijdrage door een familie van het spelen van een muziekinstrument. @nl
label: هي عائلة عازفة لـ @ar
definition: يربط عائلة بتعبيرة تتضمن إسهام عائلة في العزف على آلة موسيقية. @ar
toolkit label: عائلة عازفة @ar
toolkit definition: تعبيرة تتضمن إسهام عائلة في العزف على آلة موسيقية. @ar
label: és família instrumentista de @ca
definition: Relaciona una família amb una expressió que inclou una contribució d’una família tocant un instrument musical. @ca
toolkit label: família instrumentista de @ca
toolkit definition: Expressió que inclou una contribució d’una família tocant un instrument musical. @ca
label: er familie, som er instrumentalist af @da
definition: Relaterer en familie til et udtryk, som omfatter en families bidrag ved at spille et musikinstrument. @da
toolkit label: familie, som er instrumentalist af @da
toolkit definition: Udtryk, som omfatter en families bidrag ved at spille et musikinstrument. @da
label: instrumentalist (perekond) väljenduses @et
definition: Seostab perekonna väljendusega, millesse perekond on andnud panuse, mängides muusikainstrumenti. @et
toolkit label: instrumentalist (perekond) väljenduses @et
toolkit definition: Väljendus, millesse perekond on andnud panuse, mängides muusikainstrumenti. @et
label: ist Familie als Instrumentalmusikerin/Instrumentalmusiker von @de
definition: Setzt eine Familie in Beziehung zu einer Expression, zu der eine Familie beiträgt, indem sie ein Musikinstrument spielt. @de
toolkit label: Familie als Instrumentalmusikerin/Instrumentalmusiker von @de
toolkit definition: Eine Expression, zu der eine Familie beiträgt, indem sie ein Musikinstrument spielt. @de
label: zenész családja a következőnek: @hu
definition: Hozzákapcsol egy családot egy kifejezési formához, amely magában foglalja egy hangszeren játszó család közreműködését. @hu
toolkit label: zenész családja: @hu
toolkit definition: Egy kifejezési forma, amely magában foglalja egy hangszeren játszó család közreműködését. @hu
label: è strumentista famiglia di @it
definition: Correla una famiglia a un'espressione che comprende un contributo di una famiglia nel suonare uno strumento musicale. @it
toolkit label: strumentista famiglia di @it
toolkit definition: Espressione che comprende un contributo di una famiglia nel suonare uno strumento musicale. @it
label: είναι εκτελεστής [μουσικού οργάνου] οικογένεια του @el
toolkit label: εκτελεστής [μουσικού οργάνου] οικογένεια του @el
label: est une famille instrumentiste de @fr
definition: Met une famille en relation avec une expression qui intègre une contribution de la part d’une famille consistant à jouer d’un instrument de musique. @fr
toolkit label: famille instrumentiste de @fr
toolkit definition: Expression qui intègre une contribution de la part d’une famille consistant à jouer d’un instrument de musique. @fr
label: ir instrumentālists (dzimta/ģimene) @lv
definition: Sasaista dzimtu/ģimeni ar izteiksmi, kas ietver dzimtas/ģimenes ieguldījumu, spēlējot mūzikas instrumentu. @lv
toolkit label: ir instrumentālists (dzimta/ģimene) @lv
toolkit definition: Izteiksme, kas ietver dzimtas/ģimenes ieguldījumu, spēlējot mūzikas instrumentu. @lv
label: 是……的乐器演奏者家族 @zh-hans
definition: 将一个家族与包括有演奏乐器的一个家族的贡献的一种内容表达关联起来。 @zh-hans
toolkit label: ……的乐器演奏者家族 @zh-hans
toolkit definition: 包括有演奏乐器的一个家族的贡献的一种内容表达 @zh-hans
label: enstrümentalist ailesidir @tr
definition: Bir aileyi, bir müzik aleti çalmak için bir ailenin katkısını içeren bir anlatımla ilişkilendirir. @tr
toolkit label: enstrümantalist ailesidir @tr
toolkit definition: Bir müzik aleti çalan bir ailenin katkısını içeren bir anlatım. @tr
has subproperty: P51057

soittaja (henkilö) ekspressiossa
status: Published
label: is instrumentalist person of @en
lexical alias: instrumentalistPersonOf.en
definition: Relates a person to an expression that includes a contribution by a person of playing a musical instrument. @en
toolkit label: instrumentalist person of @en
toolkit definition: An expression that includes a contribution by a person of playing a musical instrument. @en
type: Property
domain: C10004
has element type: 2
sub property of: esittäjä (henkilö) ekspressiossa
sub property of: soittaja (toimija) ekspressiossa
definition: Liittää henkilön ekspressioon, jonka tekemisessä henkilö on osallisena soittamalla soitinta.
toolkit label: soittaja (henkilö) ekspressiossa
toolkit definition: Ekspressio, jonka tekemisessä henkilö on osallisena soittamalla soitinta.
label: er instrumentalist for (person) @no
definition: Relaterer en person til et uttrykk som inkluderer et bidrag fra en person i form av å spille et musikkinstrument. @no
toolkit label: instrumentalist for (person) @no
toolkit definition: Et uttrykk som inkluderer et bidrag fra en person i form av å spille et musikkinstrument. @no
label: is instrumentalist-persoon van @nl
definition: Relateert een persoon aan een expressie die omvat een bijdrage door een persoon van het spelen van een muziekinstrument. @nl
toolkit label: instrumentalist-persoon van @nl
toolkit definition: Een expressie die omvat een bijdrage door een persoon van het spelen van een muziekinstrument. @nl
label: هو شخص عازف لـ @ar
definition: يربط شخصا بتعبيرة تتضمن إسهام شخص في العزف على آلة موسيقية. @ar
toolkit label: شخص عازف @ar
toolkit definition: تعبيرة تتضمن إسهام شخص في العزف على آلة موسيقية. @ar
label: és persona instrumentista de @ca
definition: Relaciona una persona amb una expressió que inclou una contribució d’una persona tocant un instrument musical. @ca
toolkit label: persona instrumentista de @ca
toolkit definition: Expressió que inclou una contribució d’una persona tocant un instrument musical. @ca
label: er person, som er instrumentalist af @da
definition: Relaterer en person til et udtryk, som omfatter en persons bidrag ved at spille et musikinstrument. @da
toolkit label: person, som er instrumentalist af @da
toolkit definition: Udtryk, som omfatter en persons bidrag ved at spille et musikinstrument. @da
label: instrumentalist (isik) väljenduses @et
definition: Seostab isiku väljendusega, millesse isik on andnud panuse, mängides muusikainstrumenti. @et
toolkit label: instrumentalist (isik) väljenduses @et
toolkit definition: Väljendus, millesse isik on andnud panuse, mängides muusikainstrumenti. @et
label: ist Person als Instrumentalmusikerin/Instrumentalmusiker von @de
definition: Setzt eine Person in Beziehung zu einer Expression, zu der eine Person beiträgt, indem sie ein Musikinstrument spielt. @de
toolkit label: Person als Instrumentalmusikerin/Instrumentalmusiker von @de
toolkit definition: Eine Expression, zu der eine Person beiträgt, indem sie ein Musikinstrument spielt. @de
label: zenész személye a következőnek: @hu
definition: Hozzákapcsol egy személyt egy kifejezési formához, amely magában foglalja egy hangszeren játszó személy közreműködését. @hu
toolkit label: zenész személye: @hu
toolkit definition: Egy kifejezési forma, amely magában foglalja egy hangszeren játszó személy közreműködését. @hu
label: è strumentista persona di @it
definition: Correla una persona a un'espressione che comprende un contributo di una persona nel suonare uno strumento musicale. @it
toolkit label: strumentista persona di @it
toolkit definition: Espressione che comprende un contributo di una persona nel suonare uno strumento musicale. @it
label: είναι εκτελεστής [μουσικού οργάνου] φυσικό πρόσωπο του @el
toolkit label: εκτελεστής [μουσικού οργάνου] φυσικό πρόσωπο του @el
label: est une personne instrumentiste de @fr
definition: Met une personne en relation avec une expression qui intègre une contribution de la part d’une personne consistant à jouer d’un instrument de musique. @fr
toolkit label: personne instrumentiste de @fr
toolkit definition: Expression qui intègre une contribution de la part d’une personne consistant à jouer d’un instrument de musique. @fr
label: ir instrumentālists (persona) @lv
definition: Sasaista personu ar izteiksmi, kas ietver personas ieguldījumu, spēlējot mūzikas instrumentu. @lv
toolkit label: ir instrumentālists (persona) @lv
toolkit definition: Izteiksme, kas ietver personas ieguldījumu, spēlējot mūzikas instrumentu. @lv
label: 是……的乐器演奏者个人 @zh-hans
definition: 将一个个人与包括有演奏乐器的一个个人的贡献的一种内容表达关联起来。 @zh-hans
toolkit label: ……的乐器演奏者个人 @zh-hans
toolkit definition: 包括有演奏乐器的一个个人的贡献的一种内容表达 @zh-hans
label: enstrümentalist kişisidir @tr
definition: Bir kişiyi, bir kişinin müzik aleti çalmasına yaptığı katkıyı içeren bir anlatımla ilişkilendirir. @tr
toolkit label: enstrümentalist kişisidir @tr
toolkit definition: Bir müzik aleti çalan bir kişinin katkısını içeren bir anlatım. @tr
has subproperty: P50604

ekspression haastateltava (toimija) ekspressiossa
status: Published
label: is interviewee agent of expression of @en
definition: Relates an agent to an expression that includes a contribution by an agent of being interviewed, usually by a reporter or some other kind of agent who gathers information. @en
type: Property
domain: C10002
sub property of: esitykseen osallinen toimija ekspressiossa
lexical alias: intervieweeAgentOfExpressionOf.en
label: est un agent interviewé d’une expression de @fr
definition: Met un agent en relation avec une expression qui intègre une contribution de la part d’un agent consistant à être interviewé, habituellement par un reporteur ou un autre type d’agent recueillant de l’information. @fr
toolkit label: agent interviewé d’une expression de @fr
toolkit definition: Expression qui intègre une contribution de la part d’un agent consistant à être interviewé, habituellement par un reporteur ou un autre type d’agent recueillant de l’information. @fr
toolkit label: interviewee agent of expression of @en
toolkit definition: An expression that includes a contribution by an agent of being interviewed, usually by a reporter or some other kind of agent who gathers information. @en
instruction number: 18.5
label: είναι συνεντευξιαζόμενος φορέας της έκφρασης του @el
definition: Συνδέει έναν φορέα, ο οποίος συνεισφέρει σε μια έκφραση ενός έργου δίνοντας συνέντευξη σε έναν συνεντευκτή, συνήθως έναν δημοσιογράφο, δημοσκόπο ή άλλον φορέα συλλογής πληροφοριών, με μια έκφραση. @el
toolkit label: συνεντευξιαζόμενος φορέας της έκφρασης του @el
toolkit definition: Μια έκφραση ενός έργου που ενσωματώνει τη συνεισφορά της παραχώρησης συνέντευξης σε έναν συνεντευκτή, συνήθως έναν δημοσιογράφο, δημοσκόπο ή άλλον φορέα συλλογής πληροφοριών. @el
definition: Setzt einen Akteur in Beziehung zu einer Expression, zu der ein Akteur beiträgt, indem er einer Interviewerin/einem Interviewer antwortet. Dabei handelt es sich normalerweise um eine Reporterin/einen Reporter oder einen anderen Akteur, der Informationen zusammenträgt. @de
toolkit label: Akteur als Interviewte/Interviewter einer Expression von @de
toolkit definition: Eine Expression, zu der ein Akteur beiträgt, indem er einer Interviewerin/einem Interviewer antwortet. Dabei handelt es sich normalerweise um eine Reporterin/einen Reporter oder einen anderen Akteur, der Informationen zusammenträgt. @de
label: er agent, som er interviewperson for udtryk af @da
definition: Relaterer en agent til et udtryk, som omfatter en agents bidrag ved at besvare spørgsmål fra en interviewer, normalt en journalist eller en anden form for agent, som indsamler information. @da
toolkit label: agent, som er interviewperson for udtryk af @da
toolkit definition: Udtryk, som omfatter en agents bidrag ved at besvare spørgsmål fra en interviewer, normalt en journalist eller en anden form for agent, som indsamler information. @da
label: és agent entrevistat d’una expressió de @ca
definition: Relaciona un agent amb una expressió que inclou una contribució d’un agent essent entrevistat, habitualment per un periodista o qualsevol altre tipus d’agent que recull la informació. @ca
toolkit label: agent entrevistat d’una expressió de @ca
toolkit definition: Expressió que inclou una contribució d’un agent essent entrevistat, habitualment per un periodista o qualsevol altre tipus d’agent que recull la informació. @ca
definition: Liittää toimijan ekspressioon, jonka tekemiseen toimija osallistuu vastaamalla haastattelevalle toimijalle, tavallisesti toimittajalle, tai muulle tietoa keräävälle toimijalle.
toolkit label: ekspression haastateltava (toimija) ekspressiossa
toolkit definition: Ekspressio, jonka tekemiseen toimija osallistuu vastaamalla haastattelevalle toimijalle, tavallisesti toimittajalle, tai muulle tietoa keräävälle toimijalle.
toolkit label: intervjuobjekt for uttrykk for (agent) @no
toolkit definition: Et uttrykk som inkluderer et bidrag fra en agent i form av å svare på spørsmål fra en intervjuer, reporter eller annen agent som samler inn informasjon. @no
label: ist Akteur als Interviewte/Interviewter einer Expression von @de
has element type: 2
label: interjúalany ágense a következő kifejezési formának: @hu
definition: Hozzákapcsol egy ágenst egy kifejezési formához, amelyhez hozzátartozik egy ágens felelőssége a válaszadásért egy interjúkészítőnek, rendszerint egy riporternek vagy más információgyűjtő ágensnek. @hu
toolkit label: interjúalany ágense a következő kifejezési formának: @hu
toolkit definition: Egy kifejezési forma, amelyhez hozzátartozik egy ágens felelőssége a válaszadásért egy interjúkészítőnek, rendszerint egy riporternek vagy más információgyűjtő ágensnek. @hu
alternative label: interviewee of expression of @en
alternative label: haastateltavana haastattelussa (ekspressio)
label: er intervjuobjekt for uttrykk for (agent) @no
definition: Relaterer en agent til et uttrykk som inkluderer et bidrag fra en agent i form av å svare på spørsmål fra en intervjuer, reporter eller annen agent som samler inn informasjon. @no
alternative label: intervjuobjekt for uttrykk for @no
label: is geïnterviewde actor van expressie van @nl
definition: Relateert een actor aan een expressie die omvat een bijdrage door een actor door ondervraagd worden, meestal door een journalist of een andere soort actor die informatie verzamelt. @nl
toolkit label: geïnterviewde actor van expressie van @nl
toolkit definition: Een expressie die omvat een bijdrage door een actor door ondervraagd worden, meestal door een journalist of een andere soort actor die informatie verzamelt. @nl
label: هو وكيل ضيف مقابلة في تعبيرة لـ @ar
definition: يربط وكيلا بتعبيرة تتضمن إسهام وكيل يكون ضيف مقابلة عادةً مع مراسل أو وكيل من نوع آخر يجمع معلومات. @ar
alternative label: ضيف مقابلة في تعبيرة @ar
toolkit label: وكيل ضيف مقابلة في تعبيرة @ar
toolkit definition: تعبيرة تتضمن إسهام وكيل يكون ضيف مقابلة عادةً مع مراسل أو وكيل من نوع آخر يجمع معلومات. @ar
alternative label: entrevistat d’expressió de @ca
alternative label: interviewede for udtryk af @da
label: intervjueeritav (tegija) väljenduses @et
definition: Seostab tegija väljendusega, millesse tegija on andnud panuse, vastates intervjueerijale, reporterile või muule infot koguvale tegijale. @et
alternative label: intervjueeritav väljenduses @et
toolkit label: intervjueeritav (tegija) väljenduses @et
toolkit definition: Väljendus, millesse tegija on andnud panuse, vastates intervjueerijale, reporterile või muule infot koguvale tegijale. @et
alternative label: interjúalanya a következő kifejezési formának: @hu
label: è intervistato agente di espressione di @it
definition: Correla un agente a un'espressione che include un contributo da parte di un agente nell'essere intervistato, solitamente da un giornalista o altro tipo di agente che raccoglie informazioni. @it
alternative label: intervistato di espressione di @it
toolkit label: intervistato agente di espressione di @it
toolkit definition: Espressione che include un contributo da parte di un agente per essere intervistato, solitamente da reporter o da qualche altro tipo di agente che raccoglie informazioni. @it
alternative label: συνεντευξιαζόμενος της έκφρασης του @el
alternative label: interviewé (expression) de @fr
label: ir intervējamais (aģents) izteiksmē @lv
definition: Sasaista aģentu ar izteiksmi, kas ietver aģenta ieguldījumu, atbildot uz intervētāja, parasti reportiera, aptaujas organizētāja vai kāda cita informācijas apkopotāja jautājumiem. @lv
toolkit label: ir intervējamais (aģents) izteiksmē @lv
toolkit definition: Izteiksme, kas ietver aģenta ieguldījumu, atbildot uz intervētāja, parasti reportiera, aptaujas organizētāja vai kāda cita informācijas apkopotāja jautājumiem. @lv
alternative label: Interviewter (Expression) von @de
alternative label: ……的内容表达的受访者 @zh-hans
toolkit label: ……的内容表达的受访者行为者 @zh-hans
toolkit definition: 包括一个被采访（通常由记者或其他某种信息收集的行为者）的一个行为者的贡献的一种内容表达 @zh-hans
toolkit label: anlatımının görüşülen temsilcisidir @tr
toolkit definition: Genellikle bir muhabir veya bilgi toplayan başka bir tür temsilci tarafından röportaj yapılmasına bir temsilcinin katkıda bulunmasını içeren bir anlatım. @tr
has subproperty: ekspression haastateltava (yhteistoimija) ekspressiossa

teoksen haastateltava (toimija) teoksessa
status: Published
label: is interviewee agent of work of @en
definition: Relates an agent to a work that involves a responsibility of an agent for responding to an interviewer, usually a reporter, pollster, or some other kind of agent who gathers information. @en
type: Property
domain: C10002
sub property of: teoksen tekijä (toimija) teoksessa
lexical alias: intervieweeAgentOfWorkOf.en
label: est un agent interviewé d’une œuvre de @fr
definition: Met un agent en relation avec une œuvre qui comporte une responsabilité de la part d’un agent consistant à répondre à un intervieweur, habituellement un reporteur, un sondeur ou un autre type d’agent recueillant de l’information. @fr
toolkit label: agent interviewé d’une œuvre de @fr
toolkit definition: Œuvre qui comporte une responsabilité de la part d’un agent consistant à répondre à un intervieweur, habituellement un reporteur, un sondeur ou un autre type d’agent recueillant de l’information. @fr
toolkit label: interviewee agent of work of @en
toolkit definition: A work that involves a responsibility of an agent for responding to an interviewer, usually a reporter, pollster, or some other kind of agent who gathers information. @en
instruction number: 18.5
label: είναι συνεντευξιαζόμενος φορέας του έργου του @el
definition: Συνδέει έναν φορέα υπεύθυνο για τη δημιουργία ενός έργου αποκρινόμενος στον συνεντευκτή, συνήθως δημοσιογράφο, δημοσκόπο ή κάποιον άλλον φορέα συλλογής πληροφοριών, με ένα έργο. @el
toolkit label: συνεντευξιαζόμενος φορέας του έργου του @el
toolkit definition: Ένα έργο που περιλαμβάνει την ευθύνη της δημιουργίας [εφόσον ο φορέας] ενεργεί ως αποκρινόμενος στον λαμβάνοντα τη συνέντευξη, συνήθως δημοσιογράφο, δημοσκόπο ή κάποιον άλλον φορέα συλλογής πληροφοριών. @el
definition: Setzt einen Akteur in Beziehung zu einem Werk, bei dem ein Akteur einer Interviewerin/einem Interviewer antwortet. Dabei handelt es sich normalerweise um eine Reporterin/einen Reporter, eine Meinungsforscherin/einen Meinungsforscher oder anderen Akteur, die/der Informationen zusammenträgt. @de
toolkit label: Akteur als Interviewte/Interviewter eines Werks von @de
toolkit definition: Ein Werk, bei dem ein Akteur einer Interviewerin/einem Interviewer antwortet. Dabei handelt es sich normalerweise um eine Reporterin/einen Reporter, eine Meinungsforscherin/einen Meinungsforscher oder anderen Akteur, die/der Informationen zusammenträgt. @de
label: er agent, som er interviewperson for værk af @da
definition: Relaterer en agent til et værk, som involverer en agents ansvar for at besvare spørgsmål fra en interviewer, normalt en journalist, meningsmåler eller en anden form for agent, som indsamler information. @da
toolkit label: agent, som er interviewperson for værk af @da
toolkit definition: Værk, som involverer en agents ansvar for at besvare spørgsmål fra en interviewer, normalt en journalist, meningsmåler eller en anden form for agent, som indsamler information. @da
label: és agent entrevistat d’una obra de @ca
definition: Relaciona un agent amb una obra que implica una responsabilitat d’un agent responent a un entrevistador, habitualment un periodista, un enquestador o qualsevol altre tipus d’agent que recull la informació. @ca
toolkit label: agent entrevistat d’una obra de @ca
toolkit definition: Obra que implica una responsabilitat d’un agent responent a un entrevistador, habitualment un periodista, un enquestador o qualsevol altre tipus d’agent que recull la informació. @ca
definition: Liittää toimijan teokseen, jossa toimija on vastuussa teoksen luomisesta vastaamalla haastattelijalle, tavallisesti toimittajalle, mielipidetutkijalle tai muulle tietoa keräävälle toimijalle.
toolkit label: teoksen haastateltava (toimija) teoksessa
toolkit definition: Teos, jossa toimija on vastuussa teoksen luomisesta vastaamalla haastattelijalle, tavallisesti toimittajalle, mielipidetutkijalle tai muulle tietoa keräävälle toimijalle.
toolkit label: intervjuobjekt for verk for (agent) @no
toolkit definition: Et verk som involverer ansvar for en agent i form av å svare på spørsmål fra en intervjuer, reporter eller annen agent som samler inn informasjon. @no
label: ist Akteur als Interviewte/Interviewter eines Werks von @de
has element type: 2
label: interjúalany ágense a következő műnek: @hu
definition: Hozzákapcsol egy ágenst egy műhöz, amelyhez hozzátartozik egy ágens felelőssége egy interjúkészítőnek, általában riporternek, közvélemény-kutatónak, vagy valamilyen más információgyűjtő ágensnek, adott válaszért. @hu
toolkit label: interjúalany ágense a következő műnek: @hu
toolkit definition: Egy mű, amelyhez hozzátartozik egy ágens felelőssége egy interjúkészítőnek, általában riporternek, közvélemény-kutatónak, vagy valamilyen más információgyűjtő ágensnek, adott válaszért. @hu
alternative label: interviewee of @en
alternative label: haastateltavana haastattelussa
label: er intervjuobjekt for verk for (agent) @no
definition: Relaterer en agent til et verk som involverer ansvar for en agent i form av å svare på spørsmål fra en intervjuer, reporter eller annen agent som samler inn informasjon. @no
alternative label: intervjuobjekt for verk for @no
label: is geïnterviewde actor van werk van @nl
definition: Relateert een actor aan een werk dat met zich meebrengt een verantwoordelijkheid van een actor voor reageren op een interviewer, verslaggever, opiniepeiler of een andere soort actor die informatie verzamelt. @nl
toolkit label: geïnterviewde actor van werk van @nl
toolkit definition: Een werk dat met zich meebrengt een verantwoordelijkheid van een actor voor reageren op een interviewer, verslaggever, opiniepeiler of een andere soort actor die informatie verzamelt. @nl
label: هو وكيل ضيف مقابلة في عمل لـ @ar
definition: يربط وكيلا بعمل يترتب عليه مسئولية وكيل عن الاستجابة لمحاور، وعادة ما يكون مراسلًا أو مستطلع رأي أو وكيل من نوع آخر يجمع معلومات. @ar
alternative label: ضيف مقابلة في عمل @ar
toolkit label: وكيل ضيف مقابلة في عمل @ar
toolkit definition: عمل يترتب عليه مسئولية وكيل عن الاستجابة لمحاور، وعادة ما يكون مراسلًا أو مستطلع رأي أو وكيل من نوع آخر يجمع معلومات. @ar
alternative label: entrevistat de @ca
alternative label: interviewede af @da
label: intervjueeritav (tegija) teoses @et
definition: Seostab tegija teosega, mis sisaldab tegija vastutust intervjueerijale, reporterile, küsitlejale või muule infot koguvale tegijale vastamise eest. @et
alternative label: intervjueeritav teoses @et
toolkit label: intervjueeritav (tegija) teoses @et
toolkit definition: Teos, mis sisaldab tegija vastutust intervjueerijale, reporterile, küsitlejale või muule infot koguvale tegijale vastamise eest. @et
alternative label: interjúalanya: @hu
label: è intervistato agente di @it
definition: Correla un agente a un'opera che implica una responsabilità di un agente nel rispondere a un intervistatore, solitamente giornalista, sondaggista, o qualche altro genere di agente che raccoglie informazioni. @it
alternative label: intervistato di opera di @it
toolkit label: intervistato agente di opera di @it
toolkit definition: Opera che implica una responsabilità di un agente nel rispondere ad intervistatore, solitamente giornalista, sondaggista, o qualche altro genere di un agente che raccoglie informazioni. @it
alternative label: συνεντευξιαζόμενος του έργου του @el
alternative label: interviewé de @fr
label: ir intervējamais (aģents) darbā @lv
definition: Sasaista aģentu ar darbu, kas ietver aģenta atbildību, atbildot uz intervētāja, parasti reportiera, aptaujas organizētāja vai kāda cita informācijas apkopotāja jautājumiem. @lv
toolkit label: ir intervējamais (aģents) darbā @lv
toolkit definition: Darbs, kas ietver aģenta atbildību, atbildot uz intervētāja, parasti reportiera, aptaujas organizētāja vai kāda cita informācijas apkopotāja jautājumiem. @lv
alternative label: Interviewter von @de
alternative label: ……的受访者 @zh-hans
toolkit label: ……的作品的受访者行为者 @zh-hans
toolkit definition: 涉及回答采访者、记者、民意调查员或其他类型信息搜集行为者的一个行为者的责任的一种作品 @zh-hans
toolkit label: eserinin görüşülen temsilcisidir @tr
toolkit definition: Bir görüşmeciye, genellikle bir muhabire, anketöre veya bilgi toplayan başka bir tür temsilciye yanıt verme konusunda bir temsilcinin sorumluluğunu içeren bir çalışma. @tr
has subproperty: teoksen haastateltava (yhteistoimija) teoksessa

ekspression haastateltava (yhteistoimija) ekspressiossa
status: Published
label: is interviewee collective agent of expression of @en
lexical alias: intervieweeCollectiveAgentOfExpressionOf.en
definition: Relates a collective agent to an expression that includes a contribution by a collective agent of being interviewed, usually by a reporter or some other kind of agent who gathers information. @en
toolkit label: interviewee collective agent of expression of @en
toolkit definition: An expression that includes a contribution by a collective agent of being interviewed, usually by a reporter or some other kind of agent who gathers information. @en
type: Property
domain: C10011
has element type: 2
sub property of: esitykseen osallinen yhteistoimija ekspressiossa
sub property of: ekspression haastateltava (toimija) ekspressiossa
definition: Liittää yhteistoimijan ekspressioon, jonka tekemisessä yhteistoimija on osallisena vastaamalla haastattelijalle, tavallisesti toimittajalle, tai muulle tietoa keräävälle toimijalle.
toolkit label: ekspression haastateltava (yhteistoimija) ekspressiossa
toolkit definition: Ekspressio, jonka tekemisessä yhteistoimija on osallisena vastaamalla haastattelijalle, tavallisesti toimittajalle, tai muulle tietoa keräävälle toimijalle.
label: er intervjuobjekt for uttrykk for (kollektiv agent) @no
definition: Relaterer en kollektiv agent til et uttrykk som inkluderer et bidrag fra en kollektiv agent i form av å svare på spørsmål fra en intervjuer, reporter eller annen agent som samler inn informasjon. @no
toolkit label: intervjuobjekt for uttrykk for (kollektiv agent) @no
toolkit definition: Et uttrykk som inkluderer et bidrag fra en kollektiv agent i form av å svare på spørsmål fra en intervjuer, reporter eller annen agent som samler inn informasjon. @no
label: is geïnterviewde collectieve actor van expressie van @nl
definition: Relateert een collectieve actor aan een expressie die omvat een bijdrage door een collectieve actor door ondervraagd worden, meestal door een journalist of een andere soort actor die informatie verzamelt. @nl
toolkit label: geïnterviewde collectieve actor van expressie van @nl
toolkit definition: Een expressie die omvat een bijdrage door een collectieve actor door ondervraagd worden, meestal door een journalist of een andere soort actor die informatie verzamelt. @nl
label: هو وكيل جماعي ضيف مقابلة في تعبيرة لـ @ar
definition: يربط وكيلا جماعيا بتعبيرة تتضمن إسهام وكيل جماعي بكونه ضيف مقابلة عادةً يجريها مراسل أو وكيل من نوع آخر يجمع معلومات. @ar
toolkit label: وكيل جماعي ضيف مقابلة في تعبيرة لـ @ar
toolkit definition: يربط وكيلا جماعيا بتعبيرة تتضمن إسهام وكيل جماعي بكونه ضيف مقابلة عادةً يجريها مراسل أو وكيل من نوع آخر يجمع معلومات. @ar
label: és agent col·lectiu entrevistat d’una expressió de @ca
definition: Relaciona un agent col·lectiu amb una expressió que inclou una contribució d’un agent col·lectiu essent entrevistat, habitualment per un periodista o qualsevol altre tipus d’agent que recull la informació. @ca
toolkit label: agent col·lectiu entrevistat d’una expressió de @ca
toolkit definition: Expressió que inclou una contribució d’un agent col·lectiu essent entrevistat, habitualment per un periodista o qualsevol altre tipus d’agent que recull la informació. @ca
label: er kollektiv agent, som er interviewperson for udtryk af @da
definition: Relaterer en kollektiv agent til et udtryk, som omfatter en kollektiv agents bidrag ved at besvare spørgsmål fra en interviewer, normalt en journalist eller en anden form for agent, som indsamler information. @da
toolkit label: kollektiv agent, som er interviewperson for udtryk af @da
toolkit definition: Udtryk, som omfatter en kollektiv agents bidrag ved at besvare spørgsmål fra en interviewer, normalt en journalist eller en anden form for agent, som indsamler information. @da
label: intervjueeritav (kollektiiv) väljenduses @et
definition: Seostab kollektiivi väljendusega, millesse kollektiiv on andnud panuse, vastates intervjueerijale, reporterile või muule infot koguvale tegijale. @et
toolkit label: intervjueeritav (kollektiiv) väljenduses @et
toolkit definition: Väljendus, millesse kollektiiv on andnud panuse, vastates intervjueerijale, reporterile või muule infot koguvale tegijale. @et
label: ist gemeinschaftlicher Akteur als Interviewte/Interviewter einer Expression von @de
definition: Setzt einen gemeinschaftlichen Akteur in Beziehung zu einer Expression, zu der ein gemeinschaftlicher Akteur beiträgt, indem er einer Interviewerin/einem Interviewer antwortet. Dabei handelt es sich normalerweise um eine Reporterin/einen Reporter oder einen anderen Akteur, der Informationen zusammenträgt. @de
toolkit label: Gemeinschaftlicher Akteur als Interviewte/Interviewter einer Expression von @de
toolkit definition: Eine Expression, zu der ein gemeinschaftlicher Akteur beiträgt, indem er einer Interviewerin/einem Interviewer antwortet. Dabei handelt es sich normalerweise um eine Reporterin/einen Reporter oder einen anderen Akteur, der Informationen zusammenträgt. @de
label: interjúalany kollektív ágense a következő kifejezési formának: @hu
definition: Hozzákapcsol egy kollektív ágenst egy kifejezési formához, amelyhez hozzátartozik egy kollektív ágens felelőssége a válaszadásért egy interjúkészítőnek, rendszerint egy riporternek vagy más információgyűjtő ágensnek. @hu
toolkit label: interjúalany kollektív ágense a következő kifejezési formának: @hu
toolkit definition: Egy kifejezési forma, amelyhez hozzátartozik egy kollektív ágens felelőssége a válaszadásért egy interjúkészítőnek, rendszerint egy riporternek vagy más információgyűjtő ágensnek. @hu
label: è intervistato agente collettivo di espressione di @it
definition: Correla un agente collettivo a un'espressione che comprende un contributo di un agente collettivo nell'essere intervistato, solitamente da un giornalista o altro tipo di agente che raccoglie informazioni. @it
toolkit label: intervistato agente collettivo di espressione di @it
toolkit definition: Espressione che comprende un contributo di un agente collettivo nell'essere intervistato, solitamente da un giornalista o altro tipo di agente che raccoglie informazioni. @it
label: είναι συνεντευξιαζόμενος συλλογικός φορέας της έκφρασης του @el
toolkit label: συνεντευξιαζόμενος συλλογικός φορέας της έκφρασης του @el
label: est un agent collectif interviewé d’une expression de @fr
definition: Met un agent collectif en relation avec une expression qui intègre une contribution de la part d’un agent collectif consistant à être interviewé, habituellement par un reporteur ou un autre type d’agent recueillant de l’information. @fr
toolkit label: agent collectif interviewé d’une expression de @fr
toolkit definition: Expression qui intègre une contribution de la part d’un agent collectif consistant à être interviewé, habituellement par un reporteur ou un autre type d’agent recueillant de l’information. @fr
label: ir intervējamais (grupa) izteiksmē @lv
definition: Sasaista grupu ar izteiksmi, kas ietver grupas ieguldījumu, atbildot uz intervētāja, parasti reportiera, aptaujas organizētāja vai kāda cita informācijas apkopotāja jautājumiem. @lv
toolkit label: ir intervējamais (grupa) izteiksmē @lv
toolkit definition: Izteiksme, kas ietver grupas ieguldījumu, atbildot uz intervētāja, parasti reportiera, aptaujas organizētāja vai kāda cita informācijas apkopotāja jautājumiem. @lv
label: 是……的内容表达的受访者集体行为者 @zh-hans
definition: 将一个集体行为者与包括一个被采访（通常由记者或其他某种信息收集的行为者）的一个集体行为者的贡献的一种内容表达关联起来。 @zh-hans
toolkit label: ……的内容表达的受访者集体行为者 @zh-hans
toolkit definition: 包括一个被采访（通常由记者或其他某种信息收集的行为者）的一个集体行为者的贡献的一种内容表达 @zh-hans
label: anlatımının görüşülen kolektif temsilcisidir @tr
definition: Kolektif bir temsilcinin, genellikle bir ropörtör veya bilgi toplayan başka tür bir temsilci tarafından, kolektif bir temsilcinin mülakata katkısını içeren bir anlatımla ilişkilendirir. @tr
toolkit label: anlatımının görüşülen kolektif temsilcisidir @tr
toolkit definition: Genellikle bir muhabir veya bilgi toplayan başka bir tür temsilci tarafından röportaj yapılmasına kolektif bir temsilcinin katkısını içeren bir anlatım. @tr
has subproperty: ekspression haastateltava (yhteisö) ekspressiossa
has subproperty: ekspression haastateltava (suku) ekspressiossa
has subproperty: P50725

teoksen haastateltava (yhteistoimija) teoksessa
status: Published
label: is interviewee collective agent of work of @en
lexical alias: intervieweeCollectiveAgentOfWorkOf.en
definition: Relates a collective agent to a work that involves a responsibility of a collective agent for responding to an interviewer, usually a reporter, pollster, or some other kind of agent who gathers information. @en
toolkit label: interviewee collective agent of work of @en
toolkit definition: A work that involves a responsibility of a collective agent for responding to an interviewer, usually a reporter, pollster, or some other kind of agent who gathers information. @en
type: Property
domain: C10011
has element type: 2
sub property of: teoksen tekijä (yhteistoimija) teoksessa
sub property of: teoksen haastateltava (toimija) teoksessa
definition: Liittää yhteistoimijan teokseen, jossa yhteistoimija on vastuussa teoksen luomisesta vastaamalla haastattelijalle, tavallisesti toimittajalle, mielipidetutkijalle tai muulle tietoa keräävälle toimijalle.
toolkit label: teoksen haastateltava (yhteistoimija) teoksessa
toolkit definition: Teos, jossa yhteistoimija on vastuussa teoksen luomisesta vastaamalla haastattelijalle, tavallisesti toimittajalle, mielipidetutkijalle tai muulle tietoa keräävälle toimijalle.
label: er intervjuobjekt for verk for (kollektiv agent) @no
definition: Relaterer en kollektiv agent til et verk som involverer et ansvar for en kollektiv agent i form av å svare på spørsmål fra en intervjuer, som oftest en reporter eller annen agent som samler inn informasjon. @no
toolkit label: intervjuobjekt for verk for (kollektiv agent) @no
toolkit definition: Et verk som involverer et ansvar for en kollektiv agent i form av å svare på spørsmål fra en intervjuer, som oftest en reporter eller annen agent som samler inn informasjon. @no
label: is geïnterviewde collectieve actor van werk van @nl
definition: Relateert een collectieve actor aan een werk dat met zich meebrengt een verantwoordelijkheid van een collectieve actor voor reageren op een interviewer, verslaggever, opiniepeiler of een andere soort actor die informatie verzamelt. @nl
toolkit label: geïnterviewde collectieve actor van werk van @nl
toolkit definition: Een werk dat met zich meebrengt een verantwoordelijkheid van een collectieve actor voor reageren op een interviewer, verslaggever, opiniepeiler of een andere soort actor die informatie verzamelt. @nl
label: هو وكيل جماعي ضيف مقابلة في عمل لـ @ar
definition: يربط وكيلا جماعيا بعمل يترتب عليه مسئولية وكيل جماعي عن الاستجابة لمحاور، وعادة ما يكون مراسلًا أو مستطلع رأي أو وكيل من نوع آخر يجمع معلومات. @ar
toolkit label: وكيل جماعي ضيف مقابلة في عمل @ar
toolkit definition: عمل يترتب عليه مسئولية وكيل جماعي عن الاستجابة لمحاور، وعادة ما يكون مراسلًا أو مستطلع رأي أو وكيل من نوع آخر يجمع معلومات. @ar
label: és agent col·lectiu entrevistat d’una obra de @ca
definition: Relaciona un agent col·lectiu amb una obra que implica una responsabilitat d’un agent col·lectiu responent a un entrevistador, habitualment un periodista, un enquestador o qualsevol altre tipus d’agent que recull la informació. @ca
toolkit label: agent col·lectiu entrevistat d’una obra de @ca
toolkit definition: Obra que implica una responsabilitat d’un agent col·lectiu responent a un entrevistador, habitualment un periodista, un enquestador o qualsevol altre tipus d’agent que recull la informació. @ca
label: er kollektiv agent, som er interviewperson for værk af @da
definition: Relaterer en kollektiv agent til et værk, som involverer en kollektiv agents ansvar for at besvare spørgsmål fra en interviewer, normalt en journalist, meningsmåler eller en anden form for agent, som indsamler information. @da
toolkit label: kollektiv agent, som er interviewperson for værk af @da
toolkit definition: Værk, som involverer en kollektiv agents ansvar for at besvare spørgsmål fra en interviewer, normalt en journalist, meningsmåler eller en anden form for agent, som indsamler information. @da
label: intervjueeritav (kollektiiv) teoses @et
definition: Seostab kollektiivi teosega, mis sisaldab kollektiivi vastutust intervjueerijale, reporterile, küsitlejale või muule infot koguvale tegijale vastamise eest. @et
toolkit label: intervjueeritav (kollektiiv) teoses @et
toolkit definition: Teos, mis sisaldab kollektiivi vastutust intervjueerijale, reporterile, küsitlejale või muule infot koguvale tegijale vastamise eest. @et
label: ist gemeinschaftlicher Akteur als Interviewte/Interviewter eines Werks von @de
definition: Setzt einen gemeinschaftlichen Akteur in Beziehung zu einem Werk, bei dem ein gemeinschaftlicher Akteur einer Interviewerin/einem Interviewer antwortet. Dabei handelt es sich normalerweise um eine Reporterin/einen Reporter, eine Meinungsforscherin/einen Meinungsforscher oder anderen Akteur, die/der Informationen zusammenträgt. @de
toolkit label: Gemeinschaftlicher Akteur als Interviewte/Interviewter von @de
toolkit definition: Ein Werk, bei dem ein gemeinschaftlicher Akteur einer Interviewerin/einem Interviewer antwortet. Dabei handelt es sich normalerweise um eine Reporterin/einen Reporter, eine Meinungsforscherin/einen Meinungsforscher oder anderen Akteur, die/der Informationen zusammenträgt. @de
label: interjúalany kollektív ágense a következő műnek: @hu
definition: Hozzákapcsol egy kollektív ágenst egy műhöz, amelyhez hozzátartozik egy kollektív ágens felelőssége egy interjúkészítőnek, általában riporternek, közvélemény-kutatónak, vagy valamilyen más információgyűjtő ágensnek, adott válaszért. @hu
toolkit label: interjúalany kollektív ágense a következő műnek: @hu
toolkit definition: Egy mű, amelyhez hozzátartozik egy kollektív ágens felelőssége egy interjúkészítőnek, általában riporternek, közvélemény-kutatónak, vagy valamilyen más információgyűjtő ágensnek, adott válaszért. @hu
label: è intervistato agente collettivo di opera di @it
definition: Correla un agente collettivo a un'opera che implica una responsabilità di un agente collettivo nel rispondere a un intervistatore, solitamente un giornalista, sondaggista o altro tipo di agente che raccoglie informazioni. @it
toolkit label: intervistato agente collettivo di opera di @it
toolkit definition: Opera che implica una responsabilità di un agente collettivo nel rispondere a un intervistatore, solitamente un giornalista, sondaggista o un altro tipo di agente che raccoglie informazioni. @it
label: είναι συνεντευξιαζόμενος συλλογικός φορέας του έργου του @el
toolkit label: συνεντευξιαζόμενος συλλογικός φορέας του έργου του @el
label: est un agent collectif interviewé d’une œuvre de @fr
definition: Met un agent collectif en relation avec une œuvre qui comporte une responsabilité de la part d’un agent collectif consistant à répondre à un intervieweur, habituellement un reporteur, un sondeur ou un autre type d’agent recueillant de l’information. @fr
toolkit label: agent collectif interviewé d’une œuvre de @fr
toolkit definition: Œuvre qui comporte une responsabilité de la part d’un agent collectif consistant à répondre à un intervieweur, habituellement un reporteur, un sondeur ou un autre type d’agent recueillant de l’information. @fr
label: ir intervējamais (grupa) darbā @lv
definition: Sasaista grupu ar darbu, kas ietver grupas atbildību, atbildot uz intervētāja, parasti reportiera, aptaujas organizētāja vai kāda cita informācijas apkopotāja jautājumiem. @lv
toolkit label: intervējamais (grupa) darbā @lv
toolkit definition: Darbs, kas ietver grupas atbildību, atbildot uz intervētāja, parasti reportiera, aptaujas organizētāja vai kāda cita informācijas apkopotāja jautājumiem. @lv
label: 是……的作品的受访者集体行为者 @zh-hans
definition: 将一个集体行为者与涉及回答采访者、记者、民意调查员行为者或其他类型信息搜集行为者的一集体个行为者的责任的一种作品关联起来。 @zh-hans
toolkit label: ……的作品的受访者集体行为者 @zh-hans
toolkit definition: 涉及回答采访者、记者、民意调查员行为者或其他类型信息搜集行为者的一集体个行为者的责任的一种作品 @zh-hans
label: eserinin görüşülen kolektif temsilcisidir @tr
definition: Kolektif bir temsilciyi, genellikle bir muhabir, anketör veya bilgi toplayan başka bir tür aracı olan bir görüşmeciye yanıt verme sorumluluğunu içeren bir eserle ilişkilendirir. @tr
toolkit label: eserinin görüşülen kolektif temsilcisidir @tr
toolkit definition: Bir görüşmeciye, genellikle bir muhabire, anketöre veya bilgi toplayan başka bir tür temsilciye yanıt vermek için kollektif bir temsilcinin sorumluluğunu içeren bir eser. @tr
has subproperty: teoksen haastateltava (yhteisö) teoksessa
has subproperty: teoksen haastateltava (suku) teoksessa
has subproperty: P50710

ekspression haastateltava (yhteisö) ekspressiossa
status: Published
label: is interviewee corporate body of expression of @en
lexical alias: intervieweeCorporateBodyOfExpressionOf.en
definition: Relates a corporate body to an expression that includes a contribution by a corporate body of being interviewed, usually by a reporter or some other kind of agent who gathers information. @en
toolkit label: interviewee corporate body of expression of @en
toolkit definition: An expression that includes a contribution by a corporate body of being interviewed, usually by a reporter or some other kind of agent who gathers information. @en
type: Property
domain: C10005
has element type: 2
sub property of: esitykseen osallinen yhteisö ekspressiossa
sub property of: ekspression haastateltava (yhteistoimija) ekspressiossa
definition: Liittää yhteisön ekspressioon, jonka tekemisessä yhteisö on osallisena vastaamalla haastattelijalle, tavallisesti toimittajalle, tai muulle tietoa keräävälle toimijalle.
toolkit label: ekspression haastateltava (yhteisö) ekspressiossa
toolkit definition: Ekspressio, jonka tekemisessä yhteisö on osallisena vastaamalla haastattelijalle, tavallisesti toimittajalle, tai muulle tietoa keräävälle toimijalle.
label: er intervjuobjekt for uttrykk for (korporasjon) @no
definition: Relaterer en korporasjon til et uttrykk som inkluderer et bidrag fra en korporasjon i form av å svare på spørsmål fra en intervjuer, reporter eller annen agent som samler inn informasjon. @no
toolkit label: intervjuobjekt for uttrykk for (korporasjon) @no
toolkit definition: Et uttrykk som inkluderer et bidrag fra en korporasjon i form av å svare på spørsmål fra en intervjuer, reporter eller annen agent som samler inn informasjon. @no
label: is geïnterviewde corporatie van expressie van @nl
definition: Relateert een corporatie aan een expressie die omvat een bijdrage door een corporatie door ondervraagd worden, meestal door een journalist of een andere soort actor die informatie verzamelt. @nl
toolkit label: geïnterviewde corporatie van expressie van @nl
toolkit definition: Een expressie die omvat een bijdrage door een corporatie door ondervraagd worden, meestal door een journalist of een andere soort actor die informatie verzamelt. @nl
label: هي هيئة ضيفة مقابلة في تعبيرة لـ @ar
definition: يربط هيئة بتعبيرة تتضمن إسهام هيئة بكونها ضيفة مقابلة عادةً يجريها مراسل أو وكيل من نوع آخر يجمع معلومات. @ar
toolkit label: هيئة ضيفة مقابلة في تعبيرة لـ @ar
toolkit definition: تعبيرة تتضمن إسهام هيئة تكون ضيفة مقابلة عادةً مع مراسل أو وكيل من نوع آخر يجمع معلومات. @ar
label: és entitat corporativa entrevistada d’una expressió de @ca
definition: Relaciona una entitat corporativa amb una expressió que inclou una contribució d’una entitat corporativa essent entrevistat, habitualment per un periodista o qualsevol altre tipus d’agent que recull la informació. @ca
toolkit label: entitat corporativa entrevistada d’una expressió de @ca
toolkit definition: Expressió que inclou una contribució d’una entitat corporativa essent entrevistat, habitualment per un periodista o qualsevol altre tipus d’agent que recull la informació. @ca
label: er korporation, som er interviewperson for udtryk af @da
definition: Relaterer en korporation til et udtryk, som omfatter en korporations bidrag ved at besvare spørgsmål fra en interviewer, normalt en journalist eller en anden form for agent, som indsamler information. @da
toolkit label: korporation, som er interviewperson for udtryk af @da
toolkit definition: Udtryk, som omfatter en korporations bidrag ved at besvare spørgsmål fra en interviewer, normalt en journalist eller en anden form for agent, som indsamler information. @da
label: intervjueeritav (asutus) väljenduses @et
definition: Seostab asutuse väljendusega, millesse asutus on andnud panuse, vastates intervjueerijale, reporterile või muule infot koguvale tegijale. @et
toolkit label: intervjueeritav (asutus) väljenduses @et
toolkit definition: Väljendus, millesse asutus on andnud panuse, vastates intervjueerijale, reporterile või muule infot koguvale tegijale. @et
label: ist Körperschaft als Interviewte/Interviewter einer Expression von @de
definition: Setzt eine Körperschaft in Beziehung zu einer Expression, zu der eine Körperschaft beiträgt, indem sie einer Interviewerin/einem Interviewer antwortet. Dabei handelt es sich normalerweise um eine Reporterin/einen Reporter oder einen anderen Akteur, der Informationen zusammenträgt. @de
toolkit label: Körperschaft als Interviewte/Interviewter einer Expression von @de
toolkit definition: Eine Expression, zu der eine Körperschaft beiträgt, indem sie einer Interviewerin/einem Interviewer antwortet. Dabei handelt es sich normalerweise um eine Reporterin/einen Reporter oder einen anderen Akteur, der Informationen zusammenträgt. @de
label: interjúalany testülete a következő kifejezési formának: @hu
definition: Hozzákapcsol egy testületet egy kifejezési formához, amelyhez hozzátartozik egy testület felelőssége a válaszadásért egy interjúkészítőnek, rendszerint egy riporternek, vagy más információgyűjtő ágensnek. @hu
toolkit label: interjúalany testülete a következő kifejezési formának: @hu
toolkit definition: Egy kifejezési forma, amelyhez hozzátartozik egy testület felelőssége a válaszadásért egy interjúkészítőnek, rendszerint egy riporternek, vagy más információgyűjtő ágensnek. @hu
label: è intervistato ente di espressione di @it
definition: Correla un ente a un'espressione che comprende un contributo di un ente nell'essere intervistato, solitamente da un giornalista o altro tipo di agente che raccoglie informazioni. @it
toolkit label: intervistato ente di espressione di @it
toolkit definition: Espressione che comprende un contributo di un ente nell'essere intervistato, solitamente da un giornalista o altro tipo di agente che raccoglie informazioni. @it
label: είναι συνεντευξιαζόμενος συλλογικό όργανο της έκφρασης του @el
toolkit label: συνεντευξιαζόμενος συλλογικό όργανο της έκφρασης του @el
label: est une collectivité interviewée d’une expression de @fr
definition: Met une collectivité en relation avec une expression qui intègre une contribution de la part d’une collectivité consistant à être interviewé, habituellement par un reporteur ou un autre type d’agent recueillant de l’information. @fr
toolkit label: collectivité interviewée d’une expression de @fr
toolkit definition: Expression qui intègre une contribution de la part d’une collectivité consistant à être interviewé, habituellement par un reporteur ou un autre type d’agent recueillant de l’information. @fr
label: ir intervējamais (institūcija) izteiksmē @lv
definition: Sasaista institūciju ar izteiksmi, kas ietver institūcijas ieguldījumu, atbildot uz intervētāja, parasti reportiera, aptaujas organizētāja vai kāda cita informācijas apkopotāja jautājumiem. @lv
toolkit label: ir intervējamais (institūcija) izteiksmē @lv
toolkit definition: Izteiksme, kas ietver institūcijas ieguldījumu, atbildot uz intervētāja, parasti reportiera, aptaujas organizētāja vai kāda cita informācijas apkopotāja jautājumiem. @lv
label: 是……的内容表达的受访者团体 @zh-hans
definition: 将一个团体与包括一个被采访（通常由记者或其他某种信息收集的行为者）的一个团体的贡献的一种内容表达关联起来。 @zh-hans
toolkit label: ……的内容表达的受访者团体 @zh-hans
toolkit definition: 包括一个被采访（通常由记者或其他某种信息收集的行为者）的一个团体的贡献的一种内容表达 @zh-hans
label: anlatımının görüşülen tüzel kişisidir @tr
definition: Bir tüzel kişiyi, genellikle bir muhabir veya bilgi toplayan başka bir tür temsilci tarafından, bir tüzel kişiliğin röportaj yapılmasına katkısını içeren bir anlatımla ilişkilendirir. @tr
toolkit label: anlatımının görüşülen tüzel kişisidir @tr
toolkit definition: Genellikle bir muhabir veya bilgi toplayan başka bir tür temsilci tarafından röportaj yapılmasına tüzel bir kişinin katkısını içeren bir anlatım. @tr
has subproperty: P50876

teoksen haastateltava (yhteisö) teoksessa
status: Published
label: is interviewee corporate body of work of @en
lexical alias: intervieweeCorporateBodyOfWorkOf.en
definition: Relates a corporate body to a work that involves a responsibility of a corporate body for responding to an interviewer, usually a reporter, pollster, or some other kind of agent who gathers information. @en
toolkit label: interviewee corporate body of work of @en
toolkit definition: A work that involves a responsibility of a corporate body for responding to an interviewer, usually a reporter, pollster, or some other kind of agent who gathers information. @en
type: Property
domain: C10005
has element type: 2
sub property of: teoksen tekijä (yhteisö) teoksessa
sub property of: teoksen haastateltava (yhteistoimija) teoksessa
definition: Liittää yhteisön teokseen, jossa yhteisö on vastuussa teoksen luomisesta vastaamalla haastattelijalle, tavallisesti toimittajalle, mielipidetutkijalle tai muulle tietoa keräävälle toimijalle.
toolkit label: teoksen haastateltava (yhteisö) teoksessa
toolkit definition: Teos, jossa yhteisö on vastuussa teoksen luomisesta vastaamalla haastattelijalle, tavallisesti toimittajalle, mielipidetutkijalle tai muulle tietoa keräävälle toimijalle.
label: er intervjuobjekt for verk for (korporasjon) @no
definition: Relaterer en korporasjon til et verk som involverer et ansvar for en korporasjon i form av å svare på spørsmål fra en intervjuer, som oftest en reporter eller annen agent som samler inn informasjon. @no
toolkit label: intervjuobjekt for verk for (korporasjon) @no
toolkit definition: Et verk som involverer et ansvar for en korporasjon i form av å svare på spørsmål fra en intervjuer, som oftest en reporter eller annen agent som samler inn informasjon. @no
label: is geïnterviewde corporatie van werk van @nl
definition: Relateert een corporatie aan een werk dat met zich meebrengt een verantwoordelijkheid van een corporatie voor reageren op een interviewer, verslaggever, opiniepeiler of een andere soort actor die informatie verzamelt. @nl
toolkit label: geïnterviewde corporatie van werk van @nl
toolkit definition: Een werk dat met zich meebrengt een verantwoordelijkheid van een corporatie voor reageren op een interviewer, verslaggever, opiniepeiler of een andere soort actor die informatie verzamelt. @nl
label: هي هيئة ضيفة مقابلة في عمل لـ @ar
definition: يربط هيئة بعمل يترتب عليه مسئولية هيئة عن الاستجابة لمحاور، وعادة ما يكون مراسلًا أو مستطلع رأي أو وكيل من نوع آخر يجمع معلومات. @ar
toolkit label: هيئة ضيفة مقابلة في عمل @ar
toolkit definition: عمل يترتب عليه مسئولية هيئة عن الاستجابة لمحاور، وعادة ما يكون مراسلًا أو مستطلع رأي أو وكيل من نوع آخر يجمع معلومات. @ar
label: és entitat corporativa entrevistada d’una obra de @ca
definition: Relaciona una entitat corporativa amb una obra que implica una responsabilitat d’una entitat corporativa responent a un entrevistador, habitualment un periodista, un enquestador o qualsevol altre tipus d’agent que recull la informació. @ca
toolkit label: entitat corporativa entrevistada d’una obra de @ca
toolkit definition: Obra que implica una responsabilitat d’una entitat corporativa responent a un entrevistador, habitualment un periodista, un enquestador o qualsevol altre tipus d’agent que recull la informació. @ca
label: er korporation, som er interviewperson for værk af @da
definition: Relaterer en korporation til et værk, som involverer en korporations ansvar for at besvare spørgsmål fra en interviewer, normalt en journalist, meningsmåler eller en anden form for agent, som indsamler information. @da
toolkit label: korporation, som er interviewperson for værk af @da
toolkit definition: Værk, som involverer en korporations ansvar for at besvare spørgsmål fra en interviewer, normalt en journalist, meningsmåler eller en anden form for agent, som indsamler information. @da
label: intervjueeritav (asutus) teoses @et
definition: Seostab asutuse teosega, mis sisaldab asutuse vastutust intervjueerijale, reporterile, küsitlejale või muule infot koguvale tegijale vastamise eest. @et
toolkit label: intervjueeritav (asutus) teoses @et
toolkit definition: Teos, mis sisaldab asutuse vastutust intervjueerijale, reporterile, küsitlejale või muule infot koguvale tegijale vastamise eest. @et
label: ist Körperschaft als Interviewte/Interviewter eines Werks von @de
definition: Setzt eine Körperschaft in Beziehung zu einem Werk, bei dem eine Körperschaft einer Interviewerin/einem Interviewer antwortet. Dabei handelt es sich normalerweise um eine Reporterin/einen Reporter, eine Meinungsforscherin/einen Meinungsforscher oder anderen Akteur, die/der Informationen zusammenträgt. @de
toolkit label: Körperschaft als Interviewte/Interviewter eines Werks von @de
toolkit definition: Ein Werk, bei dem eine Körperschaft einer Interviewerin/einem Interviewer antwortet. Dabei handelt es sich normalerweise um eine Reporterin/einen Reporter, eine Meinungsforscherin/einen Meinungsforscher oder anderen Akteur, die/der Informationen zusammenträgt. @de
label: interjúalany testülete a következő műnek: @hu
definition: Hozzákapcsol egy testületet egy műhöz, amelyhez hozzátartozik egy testület felelőssége egy interjúkészítőnek, általában riporternek, közvélemény-kutatónak, vagy valamilyen más információgyűjtő ágensnek, adott válaszért. @hu
toolkit label: interjúalany testülete a következő műnek: @hu
toolkit definition: Egy mű, amelyhez hozzátartozik egy testület felelőssége egy interjúkészítőnek, általában riporternek, közvélemény-kutatónak, vagy valamilyen más információgyűjtő ágensnek, adott válaszért. @hu
label: è intervistato ente di opera di @it
definition: Correla un ente a un'opera che implica una responsabilità di un ente nel rispondere a un intervistatore, solitamente un giornalista, sondaggista o altro tipo di agente che raccoglie informazioni. @it
toolkit label: intervistato ente di opera di @it
toolkit definition: Opera che implica una responsabilità di un ente nel rispondere a un intervistatore, solitamente un giornalista, sondaggista o altro tipo di agente che raccoglie informazioni. @it
label: είναι συνεντευξιαζόμενος συλλογικό όργανο του έργου του @el
toolkit label: συνεντευξιαζόμενος συλλογικό όργανο του έργου του @el
label: est une collectivité interviewée d’une œuvre de @fr
definition: Met une collectivité en relation avec une œuvre qui comporte une responsabilité de la part d’une collectivité consistant à répondre à un intervieweur, habituellement un reporteur, un sondeur ou un autre type d’agent recueillant de l’information. @fr
toolkit label: collectivité interviewée d’une œuvre de @fr
toolkit definition: Œuvre qui comporte une responsabilité de la part d’une collectivité consistant à répondre à un intervieweur, habituellement un reporteur, un sondeur ou un autre type d’agent recueillant de l’information. @fr
label: ir intervējamais (institūcija) darbā @lv
definition: Sasaista institūciju ar darbu, kas ietver institūcijas atbildību, atbildot uz intervētāja, parasti reportiera, aptaujas organizētāja vai kāda cita informācijas apkopotāja jautājumiem. @lv
toolkit label: intervējamais (institūcija) darbā @lv
toolkit definition: Darbs, kas ietver institūcijas atbildību, atbildot uz intervētāja, parasti reportiera, aptaujas organizētāja vai kāda cita informācijas apkopotāja jautājumiem. @lv
label: 是……的作品的受访者团体 @zh-hans
definition: 将一个团体与涉及回答采访者、记者、民意调查员行为者或其他类型信息搜集行为者的一个团体的责任的一种作品关联起来。 @zh-hans
toolkit label: ……的作品的受访者团体 @zh-hans
toolkit definition: 涉及回答采访者、记者、民意调查员行为者或其他类型信息搜集行为者的一个团体的责任的一种作品 @zh-hans
label: eserinin görüşülen tüzel kişisidir @tr
definition: Bir tüzel kişiyi, bir görüşmeciye, genellikle bir muhabire, anketöre veya bilgi toplayan başka bir tür temsilciye yanıt verme sorumluluğunu içeren bir eserke ilişkilendirir. @tr
toolkit label: eserinin görüşülen tüzel kişisidir @tr
toolkit definition: Bir görüşmeciye, genellikle bir muhabire, anketöre veya bilgi toplayan başka bir tür temsilciye yanıt verme konusunda bir tüzel kişinin sorumluluğunu içeren bir çalışma. @tr
has subproperty: P50861

ekspression haastateltava (suku) ekspressiossa
status: Published
label: is interviewee family of expression of @en
lexical alias: intervieweeFamilyOfExpressionOf.en
definition: Relates a family to an expression that includes a contribution by a family of being interviewed, usually by a reporter or some other kind of agent who gathers information. @en
toolkit label: interviewee family of expression of @en
toolkit definition: An expression that includes a contribution by a family of being interviewed, usually by a reporter or some other kind of agent who gathers information. @en
type: Property
domain: C10008
has element type: 2
sub property of: esitykseen osallinen suku ekspressiossa
sub property of: ekspression haastateltava (yhteistoimija) ekspressiossa
definition: Liittää suvun ekspressioon, jonka tekemisessä suku on osallisena vastaamalla haastattelijalle, tavallisesti toimittajalle, tai muulle tietoa keräävälle toimijalle.
toolkit label: ekspression haastateltava (suku) ekspressiossa
toolkit definition: Ekspressio, jonka tekemisessä suku on osallisena vastaamalla haastattelijalle, tavallisesti toimittajalle, tai muulle tietoa keräävälle toimijalle.
label: er intervjuobjekt for uttrykk for (familie) @no
definition: Relaterer en familie til et uttrykk som inkluderer et bidrag fra en familie i form av å svare på spørsmål fra en intervjuer, reporter eller annen agent som samler inn informasjon. @no
toolkit label: intervjuobjekt for uttrykk for (familie) @no
toolkit definition: Et uttrykk som inkluderer et bidrag fra en familie i form av å svare på spørsmål fra en intervjuer, reporter eller annen agent som samler inn informasjon. @no
label: is geïnterviewde familie van expressie van @nl
definition: Relateert een familie aan een expressie die omvat een bijdrage door een familie door ondervraagd worden, meestal door een journalist of een andere soort actor die informatie verzamelt. @nl
toolkit label: geïnterviewde familie van expressie van @nl
toolkit definition: Een expressie die omvat een bijdrage door een familie door ondervraagd worden, meestal door een journalist of een andere soort actor die informatie verzamelt. @nl
label: هي عائلة ضيفة مقابلة في تعبيرة لـ @ar
definition: يربط عائلة بتعبيرة تتضمن إسهام عائلة تكون ضيفة مقابلة عادةً مع مراسل أو وكيل من نوع آخر يجمع معلومات. @ar
toolkit label: عائلة ضيفة مقابلة في تعبيرة @ar
toolkit definition: تعبيرة تتضمن إسهام عائلة تكون ضيفة مقابلة عادةً مع مراسل أو وكيل من نوع آخر يجمع معلومات. @ar
label: és família entrevistada d’una expressió de @ca
definition: Relaciona una família amb una expressió que inclou una contribució d’una família essent entrevistada, habitualment per un periodista o qualsevol altre tipus d’agent que recull la informació. @ca
toolkit label: família entrevistada d’una expressió de @ca
toolkit definition: Expressió que inclou una contribució d’una família essent entrevistada, habitualment per un periodista o qualsevol altre tipus d’agent que recull la informació. @ca
label: er familie, som er interviewperson for udtryk af @da
definition: Relaterer en familie til et udtryk, som omfatter en families bidrag ved at besvare spørgsmål fra en interviewer, normalt en journalist eller en anden form for agent, som indsamler information. @da
toolkit label: familie, som er interviewperson for udtryk af @da
toolkit definition: Udtryk, som omfatter en families bidrag ved at besvare spørgsmål fra en interviewer, normalt en journalist eller en anden form for agent, som indsamler information. @da
label: intervjueeritav (perekond) väljenduses @et
definition: Seostab perekonna väljendusega, millesse perekond on andnud panuse, vastates intervjueerijale, reporterile või muule infot koguvale tegijale. @et
toolkit label: intervjueeritav (perekond) väljenduses @et
toolkit definition: Väljendus, millesse perekond on andnud panuse, vastates intervjueerijale, reporterile või muule infot koguvale tegijale. @et
label: ist Familie als Interviewte/Interviewter einer Expression von @de
definition: Setzt eine Familie in Beziehung zu einer Expression, zu der eine Familie beiträgt, indem sie einer Interviewerin/einem Interviewer antwortet. Dabei handelt es sich normalerweise um eine Reporterin/einen Reporter oder einen anderen Akteur, der Informationen zusammenträgt. @de
toolkit label: Familie als Interviewte/Interviewter einer Expression von @de
toolkit definition: Eine Expression, zu der eine Familie beiträgt, indem sie einer Interviewerin/einem Interviewer antwortet. Dabei handelt es sich normalerweise um eine Reporterin/einen Reporter oder einen anderen Akteur, der Informationen zusammenträgt. @de
label: interjúalany családja a következő kifejezési formának: @hu
definition: Hozzákapcsol egy családot egy kifejezési formához, amelyhez hozzátartozik egy család felelőssége a válaszadásért egy interjúkészítőnek, rendszerint egy riporternek, vagy más információgyűjtő ágensnek. @hu
toolkit label: interjúalany családja a következő kifejezési formának: @hu
toolkit definition: Egy kifejezési forma, amelyhez hozzátartozik egy család felelőssége a válaszadásért egy interjúkészítőnek, rendszerint egy riporternek, vagy más információgyűjtő ágensnek. @hu
label: è intervistato famiglia di espressione di @it
definition: Correla una famiglia a un'espressione che comprende un contributo di una famiglia nell'essere intervistata, solitamente da un giornalista o altro tipo di agente che raccoglie informazioni. @it
toolkit label: intervistato famiglia di espressione di @it
toolkit definition: Espressione che comprende un contributo di una famiglia nell'essere intervistata, solitamente da un giornalista o altro tipo di agente che raccoglie informazioni. @it
label: είναι συνεντευξιαζόμενος οικογένεια της έκφρασης του @el
toolkit label: συνεντευξιαζόμενος οικογένεια της έκφρασης του @el
label: est une famille interviewée d’une expression de @fr
definition: Met une famille en relation avec une expression qui intègre une contribution de la part d’une famille consistant à être interviewé, habituellement par un reporteur ou un autre type d’agent recueillant de l’information. @fr
toolkit label: famille interviewée d’une expression de @fr
toolkit definition: Expression qui intègre une contribution de la part d’une famille consistant à être interviewé, habituellement par un reporteur ou un autre type d’agent recueillant de l’information. @fr
label: ir intervējamais (dzimta/ģimene) izteiksmē @lv
definition: Sasaista dzimtu/ģimeni ar izteiksmi, kas ietver dzimtas/ģimenes ieguldījumu, atbildot uz intervētāja, parasti reportiera, aptaujas organizētāja vai kāda cita informācijas apkopotāja jautājumiem. @lv
toolkit label: ir intervējamais (dzimta/ģimene) izteiksmē @lv
toolkit definition: Izteiksme, kas ietver dzimtas/ģimenes ieguldījumu, atbildot uz intervētāja, parasti reportiera, aptaujas organizētāja vai kāda cita informācijas apkopotāja jautājumiem. @lv
label: 是……的内容表达的受访者家族 @zh-hans
definition: 将一个家族与包括一个被采访（通常由记者或其他某种信息收集的行为者）的一个家族的贡献的一种内容表达关联起来。 @zh-hans
toolkit label: ……的内容表达的受访者家族 @zh-hans
toolkit definition: 包括一个被采访（通常由记者或其他某种信息收集的行为者）的一个家族的贡献的一种内容表达 @zh-hans
label: anlatımının görüşülen ailesidir @tr
definition: Bir aileyi, genellikle bir muhabir veya bilgi toplayan başka tür bir aracı tarafından röportaj yapılan bir ailenin katkısını içeren bir anlatımla ilişkilendirir. @tr
toolkit label: anlatımının görüşülen ailesidir @tr
toolkit definition: Genellikle bir muhabir veya bilgi toplayan başka bir tür temsilci tarafından röportaj yapılmasına bir ailenin katkıda bulunmasını içeren bir anlatım. @tr
has subproperty: P51027

teoksen haastateltava (suku) teoksessa
status: Published
label: is interviewee family of work of @en
lexical alias: intervieweeFamilyOfWorkOf.en
definition: Relates a family to a work that involves a responsibility of a family for responding to an interviewer, usually a reporter, pollster, or some other kind of agent who gathers information. @en
toolkit label: interviewee family of work of @en
toolkit definition: A work that involves a responsibility of a family for responding to an interviewer, usually a reporter, pollster, or some other kind of agent who gathers information. @en
type: Property
domain: C10008
has element type: 2
sub property of: teoksen tekijä (suku) teoksessa
sub property of: teoksen haastateltava (yhteistoimija) teoksessa
definition: Liittää suvun teokseen, jossa suku on vastuussa teoksen luomisesta vastaamalla haastattelijalle, tavallisesti toimittajalle, mielipidetutkijalle tai muulle tietoa keräävälle toimijalle.
toolkit label: teoksen haastateltava (suku) teoksessa
toolkit definition: Teos, jossa suku on vastuussa teoksen luomisesta vastaamalla haastattelijalle, tavallisesti toimittajalle, mielipidetutkijalle tai muulle tietoa keräävälle toimijalle.
label: er intervjuobjekt for verk for (familie) @no
definition: Relaterer en familie til et verk som involverer et ansvar for en familie i form av å svare på spørsmål fra en intervjuer, som oftest en reporter eller annen agent som samler inn informasjon. @no
toolkit label: intervjuobjekt for verk for (familie) @no
toolkit definition: Et verk som involverer et ansvar for en familie i form av å svare på spørsmål fra en intervjuer, som oftest en reporter eller annen agent som samler inn informasjon. @no
label: is geïnterviewde familie van werk van @nl
definition: Relateert een familie aan een werk dat met zich meebrengt een verantwoordelijkheid van een familie voor reageren op een interviewer, verslaggever, opiniepeiler of een andere soort actor die informatie verzamelt. @nl
toolkit label: geïnterviewde familie van werk van @nl
toolkit definition: Een werk dat met zich meebrengt een verantwoordelijkheid van een familie voor reageren op een interviewer, verslaggever, opiniepeiler of een andere soort actor die informatie verzamelt. @nl
label: هي عائلة ضيفة مقابلة في عمل لـ @ar
definition: يربط عائلة بعمل يترتب عليه مسئولية عائلة عن الاستجابة لمحاور، وعادة ما يكون مراسلًا أو مستطلع رأي أو وكيل من نوع آخر يجمع معلومات. @ar
toolkit label: عائلة ضيفة مقابلة في عمل @ar
toolkit definition: عمل يترتب عليه مسئولية عائلة عن الاستجابة لمحاور، وعادة ما يكون مراسلًا أو مستطلع رأي أو وكيل من نوع آخر يجمع معلومات. @ar
label: és família entrevistada d’una obra de @ca
definition: Relaciona una família amb una obra que implica una responsabilitat d’una família responent a un entrevistador, habitualment un periodista, un enquestador o qualsevol altre tipus d’agent que recull la informació. @ca
toolkit label: família entrevistada d’una obra de @ca
toolkit definition: Obra que implica una responsabilitat d’una família responent a un entrevistador, habitualment un periodista, un enquestador o qualsevol altre tipus d’agent que recull la informació. @ca
label: er familie, som er interviewperson for værk af @da
definition: Relaterer en familie til et værk, som involverer en families ansvar for at besvare spørgsmål fra en interviewer, normalt en journalist, meningsmåler eller en anden form for agent, som indsamler information. @da
toolkit label: familie, som er interviewperson for værk af @da
toolkit definition: Værk, som involverer en families ansvar for at besvare spørgsmål fra en interviewer, normalt en journalist, meningsmåler eller en anden form for agent, som indsamler information. @da
label: intervjueeritav (perekond) teoses @et
definition: Seostab perekonna teosega, mis sisaldab perekonna vastutust intervjueerijale, reporterile, küsitlejale või muule infot koguvale tegijale vastamise eest. @et
toolkit label: intervjueeritav (perekond) teoses @et
toolkit definition: Teos, mis sisaldab perekonna vastutust intervjueerijale, reporterile, küsitlejale või muule infot koguvale tegijale vastamise eest. @et
label: ist Familie als Interviewte/Interviewter eines Werks von @de
definition: Setzt eine Familie in Beziehung zu einem Werk, bei dem eine Familie einer Interviewerin/einem Interviewer antwortet. Dabei handelt es sich normalerweise um eine Reporterin/einen Reporter, eine Meinungsforscherin/einen Meinungsforscher oder anderen Akteur, die/der Informationen zusammenträgt. @de
toolkit label: Familie als Interviewte/Interviewter eines Werks von @de
toolkit definition: Ein Werk, bei dem eine Familie einer Interviewerin/einem Interviewer antwortet. Dabei handelt es sich normalerweise um eine Reporterin/einen Reporter, eine Meinungsforscherin/einen Meinungsforscher oder anderen Akteur, die/der Informationen zusammenträgt. @de
label: interjúalany családja a következő műnek: @hu
definition: Hozzákapcsol egy családot egy műhöz, amelyhez hozzátartozik egy család felelőssége egy interjúkészítőnek, általában riporternek, közvélemény-kutatónak, vagy valamilyen más információgyűjtő ágensnek, adott válaszért. @hu
toolkit label: interjúalany családja a következő műnek: @hu
toolkit definition: Egy mű, amelyhez hozzátartozik egy család felelőssége egy interjúkészítőnek, általában riporternek, közvélemény-kutatónak, vagy valamilyen más információgyűjtő ágensnek, adott válaszért. @hu
label: è intervistato famiglia di opera di @it
definition: Correla una famiglia a un'opera che implica una responsabilità di una famiglia nel rispondere a un intervistatore, solitamente un giornalista, sondaggista o altro tipo di agente che raccoglie informazioni. @it
toolkit label: intervistato famiglia di opera di @it
toolkit definition: Opera che implica una responsabilità di una famiglia nel rispondere a un intervistatore, solitamente un giornalista, sondaggista o altro tipo di agente che raccoglie informazioni. @it
label: είναι συνεντευξιαζόμενος οικογένεια του έργου του @el
toolkit label: συνεντευξιαζόμενος οικογένεια του έργου του @el
label: est une famille interviewée d’une œuvre de @fr
definition: Met une famille en relation avec une œuvre qui comporte une responsabilité de la part d’une famille consistant à répondre à un intervieweur, habituellement un reporteur, un sondeur ou un autre type d’agent recueillant de l’information. @fr
toolkit label: famille interviewée d’une œuvre de @fr
toolkit definition: Œuvre qui comporte une responsabilité de la part d’une famille consistant à répondre à un intervieweur, habituellement un reporteur, un sondeur ou un autre type d’agent recueillant de l’information. @fr
label: ir intervējamais (dzimta/ģimene) darbā @lv
definition: Sasaista dzimtu/ģimeni ar darbu, kas ietver dzimtas/ģimenes atbildību, atbildot uz intervētāja, parasti reportiera, aptaujas organizētāja vai kāda cita informācijas apkopotāja jautājumiem. @lv
toolkit label: intervējamais (dzimta/ģimene) darbā @lv
toolkit definition: Darbs, kas ietver dzimtas/ģimenes atbildību, atbildot uz intervētāja, parasti reportiera, aptaujas organizētāja vai kāda cita informācijas apkopotāja jautājumiem. @lv
label: 是……的作品的受访者家族 @zh-hans
definition: 将一个家族与涉及回答采访者、记者、民意调查员或其他类型信息搜集行为者的一个家族的责任的一种作品关联起来。 @zh-hans
toolkit label: ……的作品的受访者家族 @zh-hans
toolkit definition: 涉及回答采访者、记者、民意调查员或其他类型信息搜集行为者的一个家族的责任的一种作品 @zh-hans
label: eserinin görüşülen ailesidir @tr
definition: Bir aileyi, genellikle bir muhabir, anketçi veya bilgi toplayan diğer bir tür temsilciye karşı cevap verme sorumluluğunu içeren bir eserle ilişkilendirir. @tr
toolkit label: eserinin görüşülen ailesidir @tr
toolkit definition: Bir görüşmeciye, genellikle bir muhabire, anketöre veya bilgi toplayan başka bir tür temsilciye yanıt verme konusunda bir ailenin sorumluluğunu içeren bir çalışma. @tr
has subproperty: P51012

ekspression haastateltava (henkilö) ekspressiossa
status: Published
label: is interviewee person of expression of @en
lexical alias: intervieweePersonOfExpressionOf.en
definition: Relates a person to an expression that includes a contribution by a person of being interviewed, usually by a reporter or some other kind of agent who gathers information. @en
toolkit label: interviewee person of expression of @en
toolkit definition: An expression that includes a contribution by a person of being interviewed, usually by a reporter or some other kind of agent who gathers information. @en
type: Property
domain: C10004
has element type: 2
sub property of: esitykseen osallinen henkilö ekspressiossa
sub property of: ekspression haastateltava (toimija) ekspressiossa
definition: Liittää henkilön ekspressioon, jonka tekemisessä henkilö on osallisena vastaamalla haastattelijalle, tavallisesti toimittajalle, tai muulle tietoa keräävälle toimijalle.
toolkit label: ekspression haastateltava (henkilö) ekspressiossa
toolkit definition: Ekspressio, jonka tekemisessä henkilö on osallisena vastaamalla haastattelijalle, tavallisesti toimittajalle, tai muulle tietoa keräävälle toimijalle.
label: er intervjuobjekt for uttrykk for (person) @no
definition: Relaterer en person til et uttrykk som inkluderer et bidrag fra en person i form av å svare på spørsmål fra en intervjuer, reporter eller annen agent som samler inn informasjon. @no
toolkit label: intervjuobjekt for uttrykk for (person) @no
toolkit definition: Et uttrykk som inkluderer et bidrag fra en person i form av å svare på spørsmål fra en intervjuer, reporter eller annen agent som samler inn informasjon. @no
label: is geïnterviewde persoon van expressie van @nl
definition: Relateert een persoon aan een expressie die omvat een bijdrage door een persoon door ondervraagd worden, meestal door een journalist of een andere soort actor die informatie verzamelt. @nl
toolkit label: geïnterviewde persoon van expressie van @nl
toolkit definition: Een expressie die omvat een bijdrage door een persoon door ondervraagd worden, meestal door een journalist of een andere soort actor die informatie verzamelt. @nl
label: هو شخص ضيف مقابلة في تعبيرة @ar
definition: يربط شخصا بتعبيرة تتضمن إسهام شخص يكون ضيف مقابلة عادةً مع مراسل أو وكيل من نوع آخر يجمع معلومات. @ar
toolkit label: شخص ضيف مقابلة في تعبيرة @ar
toolkit definition: تعبيرة تتضمن إسهام شخص يكون ضيف مقابلة عادةً مع مراسل أو وكيل من نوع آخر يجمع معلومات. @ar
label: és persona entrevistada d’una expressió de @ca
definition: Relaciona una persona amb una expressió que inclou una contribució d’una persona essent entrevistat, habitualment per un periodista o qualsevol altre tipus d’agent que recull la informació. @ca
toolkit label: persona entrevistada d’una expressió de @ca
toolkit definition: Expressió que inclou una contribució d’una persona essent entrevistat, habitualment per un periodista o qualsevol altre tipus d’agent que recull la informació. @ca
label: er person, som er interviewperson for udtryk af @da
definition: Relaterer en person til et udtryk, som omfatter en persons bidrag ved at besvare spørgsmål fra en interviewer, normalt en journalist eller en anden form for agent, som indsamler information. @da
toolkit label: person, som er interviewperson for udtryk af @da
toolkit definition: Udtryk, som omfatter en persons bidrag ved at besvare spørgsmål fra en interviewer, normalt en journalist eller en anden form for agent, som indsamler information. @da
label: intervjueeritav (isik) väljenduses @et
definition: Seostab isiku väljendusega, millesse isik on andnud panuse, vastates intervjueerijale, reporterile või muule infot koguvale tegijale. @et
toolkit label: intervjueeritav (isik) väljenduses @et
toolkit definition: Väljendus, millesse isik on andnud panuse, vastates intervjueerijale, reporterile või muule infot koguvale tegijale. @et
label: ist Person als Interviewte/Interviewter einer Expression von @de
definition: Setzt eine Person in Beziehung zu einer Expression, zu der eine Person beiträgt, indem sie einer Interviewerin/einem Interviewer antwortet. Dabei handelt es sich normalerweise um eine Reporterin/einen Reporter oder einen anderen Akteur, der Informationen zusammenträgt. @de
toolkit label: Person als Interviewte/Interviewter einer Expression von @de
toolkit definition: Eine Expression, zu der eine Person beiträgt, indem sie einer Interviewerin/einem Interviewer antwortet. Dabei handelt es sich normalerweise um eine Reporterin/einen Reporter oder einen anderen Akteur, der Informationen zusammenträgt. @de
label: interjúalany személye a következő kifejezési formának: @hu
definition: Hozzákapcsol egy személyt egy kifejezési formához, amelyhez hozzátartozik egy személy felelőssége a válaszadásért egy interjúkészítőnek, rendszerint egy riporternek vagy más információgyűjtő ágensnek. @hu
toolkit label: interjúalany személye a következő kifejezési formának: @hu
toolkit definition: Egy kifejezési forma, amelyhez hozzátartozik egy személy felelőssége a válaszadásért egy interjúkészítőnek, rendszerint egy riporternek vagy más információgyűjtő ágensnek. @hu
label: è intervistato persona di espressione di @it
definition: Correla una persona a un'espressione che comprende un contributo di una persona nell'essere intervistato, solitamente da un giornalista o altro tipo di agente che raccoglie informazioni. @it
toolkit label: intervistato persona di espressione di @it
toolkit definition: Espressione che comprende un contributo di una persona nell'essere intervistato, solitamente da un giornalista o altro tipo di agente che raccoglie informazioni. @it
label: είναι συνεντευξιαζόμενος φυσικό πρόσωπο της έκφρασης του @el
toolkit label: συνεντευξιαζόμενος φυσικό πρόσωπο της έκφρασης του @el
label: est une personne interviewée d’une expression de @fr
definition: Met une personne en relation avec une expression qui intègre une contribution de la part d’une personne consistant à être interviewé, habituellement par un reporteur ou un autre type d’agent recueillant de l’information. @fr
toolkit label: personne interviewée d’une expression de @fr
toolkit definition: Expression qui intègre une contribution de la part d’une personne consistant à être interviewé, habituellement par un reporteur ou un autre type d’agent recueillant de l’information. @fr
label: ir intervējamais (persona) izteiksmē @lv
definition: Sasaista personu ar izteiksmi, kas ietver personas ieguldījumu, atbildot uz intervētāja, parasti reportiera, aptaujas organizētāja vai kāda cita informācijas apkopotāja jautājumiem. @lv
toolkit label: ir intervējamais (persona) izteiksmē @lv
toolkit definition: Izteiksme, kas ietver personas ieguldījumu, atbildot uz intervētāja, parasti reportiera, aptaujas organizētāja vai kāda cita informācijas apkopotāja jautājumiem. @lv
label: 是……的内容表达的受访者个人 @zh-hans
definition: 将一个个人与包括一个被采访（通常由记者或其他某种信息收集的行为者）的一个个人的贡献的一种内容表达关联起来。 @zh-hans
toolkit label: ……的内容表达的受访者个人 @zh-hans
toolkit definition: 包括一个被采访（通常由记者或其他某种信息收集的行为者）的一个个人的贡献的一种内容表达 @zh-hans
label: anlatımının görüşülen kişisidir @tr
definition: Bir kişiyi, genellikle bir muhabir veya bilgi toplayan başka bir tür temsilci tarafından, röportaj yapılan bir kişinin katkısını içeren bir anlatımla ilişkilendirir. @tr
toolkit label: anlatımının görüşülen kişisidir @tr
toolkit definition: Genellikle bir muhabir veya bilgi toplayan başka bir tür temsilci tarafından röportaj yapılmasına bir kişinin katkıda bulunmasını içeren bir anlatım. @tr
has subproperty: P50574

teoksen haastateltava (henkilö) teoksessa
status: Published
label: is interviewee person of work of @en
lexical alias: intervieweePersonOfWorkOf.en
definition: Relates a person to a work that involves a responsibility of a person for responding to an interviewer, usually a reporter, pollster, or some other kind of agent who gathers information. @en
toolkit label: interviewee person of work of @en
toolkit definition: A work that involves a responsibility of a person for responding to an interviewer, usually a reporter, pollster, or some other kind of agent who gathers information. @en
type: Property
domain: C10004
has element type: 2
sub property of: teoksen tekijä (henkilö) teoksessa
sub property of: teoksen haastateltava (toimija) teoksessa
definition: Liittää henkilön teokseen, jossa henkilö on vastuussa teoksen luomisesta vastaamalla haastattelijalle, tavallisesti toimittajalle, mielipidetutkijalle tai muulle tietoa keräävälle toimijalle.
toolkit label: teoksen haastateltava (henkilö) teoksessa
toolkit definition: Teos, jossa henkilö on vastuussa teoksen luomisesta vastaamalla haastattelijalle, tavallisesti toimittajalle, mielipidetutkijalle tai muulle tietoa keräävälle toimijalle.
label: er intervjuobjekt for verk for (person) @no
definition: Relaterer en person til et verk som involverer et ansvar for en person i form av å svare på spørsmål fra en intervjuer, som oftest en reporter eller annen agent som samler inn informasjon. @no
toolkit label: intervjuobjekt for verk for (person) @no
toolkit definition: Et verk som involverer et ansvar for en person i form av å svare på spørsmål fra en intervjuer, som oftest en reporter eller annen agent som samler inn informasjon. @no
label: is geïnterviewde persoon van werk van @nl
definition: Relateert een persoon aan een werk dat met zich meebrengt een verantwoordelijkheid van een persoon voor reageren op een interviewer, verslaggever, opiniepeiler of een andere soort actor die informatie verzamelt. @nl
toolkit label: geïnterviewde persoon van werk van @nl
toolkit definition: Een werk dat met zich meebrengt een verantwoordelijkheid van een persoon voor reageren op een interviewer, verslaggever, opiniepeiler of een andere soort actor die informatie verzamelt. @nl
label: هو شخص ضيف مقابلة في عمل @ar
definition: يربط شخصا بعمل يترتب عليه مسئولية شخص عن الاستجابة لمحاور، وعادة ما يكون مراسلًا أو مستطلع رأي أو وكيل من نوع آخر يجمع معلومات. @ar
toolkit label: شخص ضيف مقابلة في عمل @ar
toolkit definition: عمل يترتب عليه مسئولية شخص عن الاستجابة لمحاور، وعادة ما يكون مراسلًا أو مستطلع رأي أو وكيل من نوع آخر يجمع معلومات. @ar
label: és persona entrevistada d’una obra de @ca
definition: Relaciona una persona amb una obra que implica una responsabilitat d’una persona responent a un entrevistador, habitualment un periodista, un enquestador o qualsevol altre tipus d’agent que recull la informació. @ca
toolkit label: persona entrevistada d’una obra de @ca
toolkit definition: Obra que implica una responsabilitat d’una persona responent a un entrevistador, habitualment un periodista, un enquestador o qualsevol altre tipus d’agent que recull la informació. @ca
label: er person, som er interviewperson for værk af @da
definition: Relaterer en person til et værk, som involverer en persons ansvar for at besvare spørgsmål fra en interviewer, normalt en journalist, meningsmåler eller en anden form for agent, som indsamler information. @da
toolkit label: person, som er interviewperson for udtryk af @da
toolkit definition: Værk, som involverer en persons ansvar for at besvare spørgsmål fra en interviewer, normalt en journalist, meningsmåler eller en anden form for agent, som indsamler information. @da
label: intervjueeritav (isik) teoses @et
definition: Seostab isiku teosega, mis sisaldab isiku vastutust intervjueerijale, reporterile, küsitlejale või muule infot koguvale tegijale vastamise eest. @et
toolkit label: intervjueeritav (isik) teoses @et
toolkit definition: Teos, mis sisaldab isiku vastutust intervjueerijale, reporterile, küsitlejale või muule infot koguvale tegijale vastamise eest. @et
label: ist Person als Interviewte/Interviewter eines Werks von @de
definition: Setzt eine Person in Beziehung zu einem Werk, bei dem eine Person einer Interviewerin/einem Interviewer antwortet. Dabei handelt es sich normalerweise um eine Reporterin/einen Reporter, eine Meinungsforscherin/einen Meinungsforscher oder anderen Akteur, die/der Informationen zusammenträgt. @de
toolkit label: Person als Interviewte/Interviewter eines Werks von @de
toolkit definition: Ein Werk, bei dem eine Person einer Interviewerin/einem Interviewer antwortet. Dabei handelt es sich normalerweise um eine Reporterin/einen Reporter, eine Meinungsforscherin/einen Meinungsforscher oder anderen Akteur, die/der Informationen zusammenträgt. @de
label: interjúalany személye a következő műnek: @hu
definition: Hozzákapcsol egy személyt egy műhöz, amelyhez hozzátartozik egy személy felelőssége egy interjúkészítőnek, általában riporternek, közvélemény-kutatónak, vagy valamilyen más információgyűjtő ágensnek, adott válaszért. @hu
toolkit label: interjúalany személye a következő műnek: @hu
toolkit definition: Egy mű, amelyhez hozzátartozik egy személy felelőssége egy interjúkészítőnek, általában riporternek, közvélemény-kutatónak, vagy valamilyen más információgyűjtő ágensnek, adott válaszért. @hu
label: è intervistato persona di opera di @it
definition: Correla una persona a un'opera che implica una responsabilità di una persona nel rispondere a un intervistatore, solitamente un giornalista, sondaggista o altro tipo di agente che raccoglie informazioni. @it
toolkit label: intervistato persona di opera di @it
toolkit definition: Opera che implica una responsabilità di una persona nel rispondere a un intervistatore, di solito un giornalista, sondaggista o un altro tipo di agente che raccoglie informazioni. @it
label: είναι συνεντευξιαζόμενος φυσικό πρόσωπο του έργου του @el
toolkit label: συνεντευξιαζόμενος φυσικό πρόσωπο του έργου του @el
label: est une personne interviewée d’une œuvre de @fr
definition: Met une personne en relation avec une œuvre qui comporte une responsabilité de la part d’une personne consistant à répondre à un intervieweur, habituellement un reporteur, un sondeur ou un autre type d’agent recueillant de l’information. @fr
toolkit label: personne interviewée d’une œuvre de @fr
toolkit definition: Œuvre qui comporte une responsabilité de la part d’une personne consistant à répondre à un intervieweur, habituellement un reporteur, un sondeur ou un autre type d’agent recueillant de l’information. @fr
label: ir intervējamais (persona) darbā @lv
definition: Sasaista personu ar darbu, kas ietver personas atbildību, atbildot uz intervētāja, parasti reportiera, aptaujas organizētāja vai kāda cita informācijas apkopotāja jautājumiem. @lv
toolkit label: intervējamais (persona) darbā @lv
toolkit definition: Darbs, kas ietver personas atbildību, atbildot uz intervētāja, parasti reportiera, aptaujas organizētāja vai kāda cita informācijas apkopotāja jautājumiem. @lv
label: 是……的作品的受访者个人 @zh-hans
definition: 将一个个人与涉及回答采访者、记者、民意调查员行为者或其他类型信息搜集个人的责任的一种作品关联起来。 @zh-hans
toolkit label: ……的作品的受访者个人 @zh-hans
toolkit definition: 涉及回答采访者、记者、民意调查员行为者或其他类型信息搜集个人的责任的一种作品 @zh-hans
label: eserinin görüşülen kişisidir @tr
definition: Bir kişiyi, bir kişinin bir görüşmeciye, genellikle bir muhabire, anketöre veya bilgi toplayan başka bir tür aracıya yanıt verme sorumluluğunu içeren bir eserle ilişkilendirir. @tr
toolkit label: eserinin görüşülen kişisidir @tr
toolkit definition: Bir görüşmeciye, genellikle bir muhabire, anketöre veya bilgi toplayan başka bir tür temsilciye yanıt verme konusunda bir kişinin sorumluluğunu içeren bir çalışma. @tr
has subproperty: P50559

ekspression haastattelija (toimija) ekspressiossa
status: Published
label: is interviewer agent of expression of @en
definition: Relates an agent to an expression that includes a contribution by an agent of interviewing, reporting, or some other kind of gathering of information. @en
type: Property
domain: C10002
sub property of: esitykseen osallinen toimija ekspressiossa
lexical alias: interviewerAgentOfExpressionOf.en
label: est un agent intervieweur d’une expression de @fr
definition: Met un agent en relation avec une expression qui intègre une contribution de la part d’un agent consistant à réaliser un entretien, un reportage ou un autre type de collecte d’informations. @fr
toolkit label: agent intervieweur d’une expression de @fr
toolkit definition: Expression qui intègre une contribution de la part d’un agent consistant à réaliser un entretien, un reportage ou un autre type de collecte d’informations. @fr
toolkit label: interviewer agent of expression of @en
toolkit definition: An expression that includes a contribution by an agent of interviewing, reporting, or some other kind of gathering of information. @en
instruction number: 18.5
label: είναι συνεντευκτής φορέας της έκφρασης του @el
definition: Συνδέει έναν φορέα, ο οποίος συνεισφέρει σε μια έκφραση ενός έργου ως συνεντευκτής, δημοσιογράφος, δημοσκόπος ή άλλος φορέας συλλογής πληροφοριών, με μια έκφραση. @el
toolkit label: συνεντευκτής φορέας της έκφρασης του @el
toolkit definition: Μια έκφραση ενός έργου που ενσωματώνει τη συνεισφορά ενός φορέα που ενεργεί ως ο συνεντευκτής, ως δημοσιογράφος, δημοσκόπος ή κάποιος άλλος φορέας συλλογής πληροφοριών. @el
definition: Setzt einen Akteur in Beziehung zu einer Expression, zu der ein Akteur beiträgt, indem er als Interviewerin/Interviewer, Reporterin/Reporter, Meinungsforscherin/Meinungsforscher oder anderer Akteur Informationen zusammenträgt. @de
toolkit label: Akteur als Interviewerin/Interviewer einer Expression von @de
toolkit definition: Eine Expression, zu der ein Akteur beiträgt, indem er als Interviewerin/Interviewer, Reporterin/Reporter, Meinungsforscherin/Meinungsforscher oder anderer Akteur Informationen zusammenträgt. @de
label: er agent, som er interviewer for udtryk af @da
definition: Relaterer en agent til et udtryk, som omfatter en agents bidrag ved at interviewe, rapportere eller en anden form for indsamling af information. @da
toolkit label: agent, som er interviewer for udtryk af @da
toolkit definition: Udtryk, som omfatter en agents bidrag ved at interviewe, rapportere eller en anden form for indsamling af information. @da
label: és agent entrevistador d’una expressió de @ca
definition: Relaciona un agent amb una expressió que inclou una contribució d’un agent entrevistant, informant o recopilant informació d’alguna altra manera. @ca
toolkit label: agent entrevistador d’una expressió de @ca
toolkit definition: Expressió que inclou una contribució d’un agent entrevistant, informant o recopilant informació d’alguna altra manera. @ca
definition: Liittää toimijan ekspressioon, jonka tekemiseen toimija osallistuu toimimalla haastattelijana, toimittajana tai jonain muuna tietoja keräävänä toimijana.
toolkit label: ekspression haastattelija (toimija) ekspressiossa
toolkit definition: Ekspressio, jonka tekemiseen toimija osallistuu toimimalla haastattelijana, toimittajana tai jonain muuna tietoja keräävänä toimijana.
toolkit label: intervjuer for uttrykk av (agent) @no
toolkit definition: Et uttrykk som inkluderer et bidrag fra en agent i form av intervjuer, reporter eller annen form for innsamling av informasjon. @no
label: ist Akteur als Interviewerin/Interviewer einer Expression von @de
has element type: 2
label: interjúkészítő ágense a következő kifejezési formának: @hu
definition: Hozzákapcsol egy ágenst egy kifejezési formához, amely magában foglalja egy ágens közreműködését interjúban, riportban vagy más információgyűjtő minőségben. @hu
toolkit label: interjúkészítő ágense a következő kifejezési formának: @hu
toolkit definition: Egy kifejezési forma, amely magában foglalja egy ágens közreműködését interjúban, riportban vagy más információgyűjtő minőségben. @hu
alternative label: interviewer (expression) of @en
alternative label: haastattelijana haastattelussa (ekspressio)
label: er intervjuer for uttrykk av (agent) @no
definition: Relaterer en agent til et uttrykk som inkluderer et bidrag fra en agent i form av intervjuer, reporter eller annen form for innsamling av informasjon. @no
alternative label: intervjuer for uttrykk av @no
label: is interviewer-actor van expressie van @nl
definition: Relateert een actor aan een expressie die omvat een bijdrage door een actor door ondervragen, rapporteren of een andere vorm van informatie verzamelen. @nl
toolkit label: interviewer-actor van expressie van @nl
toolkit definition: Een expressie die omvat een bijdrage door een actor door ondervragen, rapporteren of een andere vorm van informatie verzamelen. @nl
label: هو وكيل محاور في تعبيرة لـ @ar
definition: يربط وكيلا بتعبيرة تتضمن إسهام وكيل في إجراء مقابلات أو إعداد تقارير أو جمع المعلومات بطريقة أخرى. @ar
alternative label: محاور في تعبيرة @ar
toolkit label: وكيل محاور في تعبيرة @ar
toolkit definition: تعبيرة تتضمن إسهام وكيل في إجراء مقابلات أو إعداد تقارير أو جمع المعلومات بطريقة أخرى. @ar
alternative label: entrevistador (expressió) de @ca
alternative label: interviewer (udtryk) af @da
label: intervjueerija (tegija) väljenduses @et
definition: Seostab tegija väljendusega, millesse tegija on andnud panuse, intervjueerides, tehes reportaaži või kogudes muul viisil infot. @et
alternative label: intervjueerija väljenduses @et
toolkit label: intervjueerija (tegija) väljenduses @et
toolkit definition: Väljendus, millesse tegija on andnud panuse, intervjueerides, tehes reportaaži või kogudes muul viisil infot. @et
alternative label: interjúkészítője a következőnek (kifejezési forma): @hu
label: è intervistatore agente di espressione di @it
definition: Correla un agente a un'espressione che include un contributo da parte di un agente nell'intervistare, riferire notizie o qualche altro tipo di raccolta di informazioni. @it
alternative label: intervistatore di espressione di @it
toolkit label: intervistatore agente di espressione di @it
toolkit definition: Espressione che include un contributo da parte di un agente nell'intervistare, riferire notizie o qualche altro tipo di raccolta di informazioni. @it
alternative label: συνεντευκτής της έκφρασης του @el
alternative label: intervieweur (expression) de @fr
label: ir intervētājs (aģents) izteiksmē @lv
definition: Sasaista aģentu ar izteiksmi, kas ietver aģenta ieguldījumu, darbojoties kā intervētājs, reportieris, aptaujas organizētājs vai kāds cits informācijas apkopotājs. @lv
toolkit label: ir intervētājs (aģents) izteiksmē @lv
toolkit definition: Izteiksme, kas ietver aģenta ieguldījumu, darbojoties kā intervētājs, reportieris, aptaujas organizētājs vai kāds cits informācijas apkopotājs. @lv
alternative label: Interviewer (Expression) von @de
alternative label: ……的采访者（内容表达） @zh-hans
toolkit label: ……的内容表达的采访者行为者 @zh-hans
toolkit definition: 包括一个采访、报道或其他某种信息收集的一个行为者的贡献的一种内容表达 @zh-hans
toolkit label: anlatımının görüşmeci temsilcisidir @tr
toolkit definition: Röportaj, raporlama veya başka bir tür bilgi toplayan bir temsilcinin katkısını içeren bir anlatım. @tr
has subproperty: ekspression haastattelija (yhteistoimija) ekspressiossa

teoksen haastattelija (toimija) teoksessa
status: Published
label: is interviewer agent of work of @en
definition: Relates an agent to a work that involves a responsibility by an agent for acting as an interviewer, reporter, pollster, or some other kind of agent who gathers information. @en
type: Property
domain: C10002
sub property of: teoksen tekijä (toimija) teoksessa
lexical alias: interviewerAgentOfWorkOf.en
label: est un agent intervieweur d’une œuvre de @fr
definition: Met un agent en relation avec une œuvre qui comporte une responsabilité de la part d’un agent consistant à agir à titre d’intervieweur, de reporteur, de sondeur ou d’autre type d’agent recueillant de l’information. @fr
toolkit label: agent intervieweur d’une œuvre de @fr
toolkit definition: Œuvre qui comporte une responsabilité de la part d’un agent consistant à agir à titre d’intervieweur, de reporteur, de sondeur ou d’autre type d’agent recueillant de l’information. @fr
toolkit label: interviewer agent of work of @en
toolkit definition: A work that involves a responsibility of an agent for acting as an interviewer, reporter, pollster, or some other kind of agent who gathers information. @en
instruction number: 18.5
label: είναι συνεντευκτής φορέας του έργου του @el
definition: Συνδέει έναν φορέα υπεύθυνο για τη δημιουργία ενός έργου ενεργώντας ως συνεντευκτής, δημοσιογράφος, δημοσκόπος ή ως κάποιος άλλος φορέας συγκέντρωσης πληροφοριών, με ένα έργο. @el
toolkit label: συνεντευκτής φορέας του έργου του @el
toolkit definition: Ένα έργο που περιλαμβάνει την ευθύνη της δημιουργίας [εφόσον ο φορέας] ενεργεί ως συνεντευκτής, δημοσιογράφος, δημοσκόπος ή ως κάποιος άλλος φορέας συγκέντρωσης πληροφοριών. @el
definition: Setzt einen Akteur in Beziehung zu einem Werk, bei dem ein Akteur als Interviewerin/Interviewer, Reporterin/Reporter, Meinungsforscherin/Meinungsforscher oder anderer Akteur Informationen zusammenträgt. @de
toolkit label: Akteur als Interviewerin/Interviewer eines Werks von @de
toolkit definition: Ein Werk, bei dem ein Akteur als Interviewerin/Interviewer, Reporterin/Reporter, Meinungsforscherin/Meinungsforscher oder anderer Akteur Informationen zusammenträgt. @de
label: er agent, som er interviewer for værk af @da
definition: Relaterer en agent til et værk, som involverer en agents ansvar for at optræde som interviewer, journalist, meningsmåler eller en anden form for agent, som indsamler information. @da
toolkit label: agent, som er interviewer for værk af @da
toolkit definition: Værk, som involverer en agents ansvar for at optræde som interviewer, journalist, meningsmåler eller en anden form for agent, som indsamler information. @da
label: és agent entrevistador d’una obra de @ca
definition: Relaciona un agent amb una obra que implica una responsabilitat d’un agent actuant com un entrevistador, un periodista, un enquestador o qualsevol altre tipus d’agent que recull la informació. @ca
toolkit label: agent entrevistador d’una obra de @ca
toolkit definition: Obra que implica una responsabilitat d’un agent actuant com un entrevistador, un periodista, un enquestador o qualsevol altre tipus d’agent que recull la informació. @ca
definition: Liittää toimijan teokseen, jonka luomisesta toimija on vastuussa toimimalla haastattelijana, toimittajana, mielipidetutkijana tai jonkinlaisena muuna tietoja keräävänä toimijana.
toolkit label: teoksen haastattelija (toimija) teoksessa
toolkit definition: Teos, jonka luomisesta toimija on vastuussa toimimalla haastattelijana, toimittajana, mielipidetutkijana tai jonkinlaisena muuna tietoja keräävänä toimijana.
toolkit label: intervjuer for verk for (agent) @no
toolkit definition: Et verk som involverer ansvar for en agent i form av å fungere som intervjuer, reporter eller en annen agent som samler inn informasjon. @no
label: ist Akteur als Interviewerin/Interviewer eines Werks von @de
has element type: 2
label: interjúkészítő ágense a következő műnek: @hu
definition: Hozzákapcsol egy ágenst egy műhöz, amelyhez hozzátartozik egy ágens felelőssége interjúkészítőként, riporterként, közvélemény-kutatóként, vagy valamilyen más információgyűjtő ágensként. @hu
toolkit label: interjúkészítő ágense a következő műnek: @hu
toolkit definition: Egy mű, amelyhez hozzátartozik egy ágens felelőssége interjúkészítőként, riporterként, közvélemény-kutatóként, vagy valamilyen más információgyűjtő ágensként. @hu
alternative label: interviewer of @en
alternative label: haastattelijana haastattelussa
label: er intervjuer for verk for (agent) @no
definition: Relaterer en agent til et verk som involverer ansvar for en agent i form av å fungere som intervjuer, reporter eller en annen agent som samler inn informasjon. @no
alternative label: intervjuer av @no
label: is interviewer-actor van werk van @nl
definition: Relateert een actor aan een werk dat met zich meebrengt een verantwoordelijkheid van een actor voor optreden als een interviewer, verslaggever, opiniepeiler of een andere soort actor die informatie verzamelt. @nl
toolkit label: interviewer-actor van werk van @nl
toolkit definition: Een werk dat met zich meebrengt een verantwoordelijkheid van een actor voor optreden als een interviewer, verslaggever, opiniepeiler of een andere soort actor die informatie verzamelt. @nl
label: هو وكيل محاور في عمل لـ @ar
definition: يربط وكيلا بعمل يترتب عليه مسئولية وكيل يعمل كمحاور أو مراسل أو مستطلع رأي أو وكيل من نوع آخر يجمع معلومات. @ar
alternative label: محاور @ar
toolkit label: وكيل محاور في عمل لـ @ar
toolkit definition: يربط وكيلا بعمل يترتب عليه مسئولية وكيل يعمل كمحاور أو مراسل أو مستطلع رأي أو وكيل من نوع آخر يجمع معلومات. @ar
alternative label: entrevistador de @ca
alternative label: interviewer af @da
label: intervjueerija (tegija) teoses @et
definition: Seostab tegija teosega, mis sisaldab tegija vastutust tegutsemise eest intervjueerija, reporteri, küsitleja või muu infot koguva tegijana. @et
alternative label: intervjueerija teoses @et
toolkit label: intervjueerija (tegija) teoses @et
toolkit definition: Teos, mis sisaldab tegija vastutust tegutsemise eest intervjueerija, reporteri, küsitleja või muu infot koguva tegijana. @et
alternative label: interjúkészítője: @hu
label: è intervistatore agente di @it
definition: Correla un agente a un'opera che implica una responsabilità di un agente nell'agire come intervistatore, giornalista, sondaggista o qualche altro genere di agente che raccoglie informazioni. @it
alternative label: intervistatore di opera di @it
toolkit label: intervistatore agente di opera di @it
toolkit definition: Opera che implica una responsabilità di un agente nell'agire come intervistatore, giornalista, sondaggista o qualche altro genere di agente che raccoglie informazioni. @it
alternative label: συνεντευκτής του έργου του @el
alternative label: intervieweur de @fr
label: ir intervētājs (aģents) darbā @lv
definition: Sasaista aģentu ar darbu, kas ietver aģenta atbildību, darbojoties kā intervētājs, reportieris, aptaujas organizētājs vai kāds cits informācijas apkopotājs. @lv
toolkit label: ir intervētājs (aģents) darbā @lv
toolkit definition: Darbs, kas ietver aģenta atbildību, darbojoties kā intervētājs, reportieris, aptaujas organizētājs vai kāds cits informācijas apkopotājs. @lv
alternative label: Interviewer von @de
alternative label: ……的采访者 @zh-hans
toolkit label: ……作品的采访者行为者 @zh-hans
toolkit definition: 涉及担当采访者、记者、民意调查员行为者或其他类型信息搜集的一个行为者的责任的一种作品 @zh-hans
toolkit label: eserinin görüşmeci temsilcisidir @tr
toolkit definition: Bir temsilcinin görüşmeci, muhabir, anketör veya bilgi toplayan başka türde bir temsilci olarak hareket etme sorumluluğunu içeren bir çalışma. @tr
has subproperty: teoksen haastattelija (yhteistoimija) teoksessa

ekspression haastattelija (yhteistoimija) ekspressiossa
status: Published
label: is interviewer collective agent of expression of @en
lexical alias: interviewerCollectiveAgentOfExpressionOf.en
definition: Relates a collective agent to an expression that includes a contribution by a collective agent of interviewing, reporting, or some other kind of gathering of information. @en
toolkit label: interviewer collective agent of expression of @en
toolkit definition: An expression that includes a contribution by a collective agent of interviewing, reporting, or some other kind of gathering of information. @en
type: Property
domain: C10011
has element type: 2
sub property of: esitykseen osallinen yhteistoimija ekspressiossa
sub property of: ekspression haastattelija (toimija) ekspressiossa
definition: Liittää yhteistoimijan ekspressioon, jonka tekemisessä yhteistoimija on osallisena toimimalla haastattelijana, toimittajana tai jonain muuna tietoja keräävänä toimijana.
toolkit label: ekspression haastattelija (yhteistoimija) ekspressiossa
toolkit definition: Ekspressio, jonka tekemisessä yhteistoimija on osallisena toimimalla haastattelijana, toimittajana tai jonain muuna tietoja keräävänä toimijana.
label: er intervjuer for uttrykk for (kollektiv agent) @no
definition: Relaterer en kollektiv agent til et uttrykk som inkluderer et bidrag fra en kollektiv agent i form av intervjuer, rapportering eller en annen form for innsamling av informasjon. @no
toolkit label: intervjuer for uttrykk for (kollektiv agent) @no
toolkit definition: Et uttrykk som inkluderer et bidrag fra en kollektiv agent i form av intervjuer, rapportering eller en annen form for innsamling av informasjon. @no
label: is interviewer-collectieve actor van expressie van @nl
definition: Relateert een collectieve actor aan een expressie die omvat een bijdrage door een collectieve actor door ondervragen, rapporteren of een andere vorm van informatie verzamelen. @nl
toolkit label: interviewer-collectieve actor van expressie van @nl
toolkit definition: Een expressie die omvat een bijdrage door een collectieve actor door ondervragen, rapporteren of een andere vorm van informatie verzamelen. @nl
label: هو وكيل جماعي محاور في تعبيرة لـ @ar
definition: يربط وكيلا جماعيا بتعبيرة تتضمن إسهام وكيل جماعي في إجراء مقابلات أو إعداد تقارير أو جمع المعلومات بطريقة أخرى. @ar
toolkit label: وكيل جماعي محاور في تعبيرة @ar
toolkit definition: تعبيرة تتضمن إسهام وكيل جماعي في إجراء مقابلات أو إعداد تقارير أو جمع المعلومات بطريقة أخرى. @ar
label: és agent col·lectiu entrevistador d’una expressió de @ca
definition: Relaciona un agent col·lectiu amb una expressió que inclou una contribució d’un agent col·lectiu entrevistant, informant o recopilant informació d’alguna altra manera. @ca
toolkit label: agent col·lectiu entrevistador d’una expressió de @ca
toolkit definition: Expressió que inclou una contribució d’un agent col·lectiu entrevistant, informant o recopilant informació d’alguna altra manera. @ca
label: er kollektiv agent, som er interviewer for udtryk af @da
definition: Relaterer en kollektiv agent til et udtryk, som omfatter en kollektiv agents bidrag ved at interviewe, rapportere eller en anden form for indsamling af information. @da
toolkit label: kollektiv agent, som er interviewer for udtryk af @da
toolkit definition: Udtryk, som omfatter en kollektiv agents bidrag ved at interviewe, rapportere eller en anden form for indsamling af information. @da
label: intervjueerija (kollektiiv) väljenduses @et
definition: Seostab kollektiivi väljendusega, millesse kollektiiv on andnud panuse, intervjueerides, tehes reportaaži või kogudes muul viisil infot. @et
toolkit label: intervjueerija (kollektiiv) väljenduses @et
toolkit definition: Väljendus, millesse kollektiiv on andnud panuse, intervjueerides, tehes reportaaži või kogudes muul viisil infot. @et
label: ist gemeinschaftlicher Akteur als Interviewerin/Interviewer einer Expression von @de
definition: Setzt einen gemeinschaftlichen Akteur in Beziehung zu einer Expression, zu der ein gemeinschaftlicher Akteur beiträgt, indem er als Interviewerin/Interviewer, Reporterin/Reporter, Meinungsforscherin/Meinungsforscher oder anderer gemeinschaftlicher Akteur Informationen zusammenträgt. @de
toolkit label: Gemeinschaftlicher Akteur als Interviewerin/Interviewer einer Expression von @de
toolkit definition: Eine Expression, zu der ein gemeinschaftlicher Akteur beiträgt, indem er als Interviewerin/Interviewer, Reporterin/Reporter, Meinungsforscherin/Meinungsforscher oder anderer gemeinschaftlicher Akteur Informationen zusammenträgt. @de
label: interjúkészítő kollektív ágense a következő kifejezési formának: @hu
definition: Hozzákapcsol egy kollektív ágenst egy kifejezési formához, amely magában foglalja egy kollektív ágens közreműködését interjúban, riportban vagy más információgyűjtő minőségben. @hu
toolkit label: interjúkészítő kollektív ágense a következő kifejezési formának: @hu
toolkit definition: Egy kifejezési forma, amely magában foglalja egy kollektív ágens közreműködését interjúban, riportban vagy más információgyűjtő minőségben. @hu
label: è intervistatore agente collettivo di espressione di @it
definition: Correla un agente collettivo a un'espressione che comprende un contributo di un agente collettivo nell'intervistare, riferire notizie o altro tipo di raccolta di informazioni. @it
toolkit label: intervistatore agente collettivo di espressione di @it
toolkit definition: Espressione che comprende un contributo di un agente collettivo nell'intervistare, riferire notizie o altro tipo di raccolta di informazioni. @it
label: είναι συνεντευκτής συλλογικός φορέας της έκφρασης του @el
toolkit label: συνεντευκτής συλλογικός φορέας της έκφρασης του @el
label: est un agent collectif intervieweur d’une expression de @fr
definition: Met un agent collectif en relation avec une expression qui intègre une contribution de la part d’un agent collectif consistant à réaliser un entretien, un reportage ou un autre type de collecte d’informations. @fr
toolkit label: agent collectif intervieweur d’une expression de @fr
toolkit definition: Expression qui intègre une contribution de la part d’un agent collectif consistant à réaliser un entretien, un reportage ou un autre type de collecte d’informations. @fr
label: ir intervētājs (grupa) izteiksmē @lv
definition: Sasaista grupu ar izteiksmi, kas ietver grupas ieguldījumu, darbojoties kā intervētājs, reportieris, aptaujas organizētājs vai kāds cits informācijas apkopotājs. @lv
toolkit label: ir intervētājs (grupa) izteiksmē @lv
toolkit definition: Izteiksme, kas ietver grupas ieguldījumu, darbojoties kā intervētājs, reportieris, aptaujas organizētājs vai kāds cits informācijas apkopotājs. @lv
label: 是……的内容表达的采访者集体行为者 @zh-hans
definition: 将一个集体行为者与包括一个采访、报道或其他某种信息收集的一个集体行为者的贡献的一种内容表达关联起来。 @zh-hans
toolkit label: ……的内容表达的采访者集体行为者 @zh-hans
toolkit definition: 包括一个采访、报道或其他某种信息收集的一个集体行为者的贡献的一种内容表达 @zh-hans
label: anlatımının görüşmeci kolektif temsilcisidir @tr
definition: Kolektif bir temsilciyi, kolektif bir temsilcinin görüşme, raporlama veya başka bir tür bilgi toplama katkısını içeren ifadeyle ilişkilendirir. @tr
toolkit label: anlatımının görüşmeci kolektif temsilcisidir @tr
toolkit definition: Görüşme, raporlama veya başka bir tür bilgi toplama konusunda kolektif bir temsilcinin katkısını içeren bir anlatım. @tr
has subproperty: ekspression haastattelija (yhteisö) ekspressiossa
has subproperty: ekspression haastattelija (suku) ekspressiossa
has subproperty: P50739

teoksen haastattelija (yhteistoimija) teoksessa
status: Published
label: is interviewer collective agent of work of @en
lexical alias: interviewerCollectiveAgentOfWorkOf.en
definition: Relates a collective agent to a work that involves a responsibility by a collective agent for acting as an interviewer, reporter, pollster, or some other kind of collective agent who gathers information. @en
toolkit label: interviewer collective agent of work of @en
toolkit definition: A work that involves a responsibility of a collective agent for acting as an interviewer, reporter, pollster, or some other kind of collective agent who gathers information. @en
type: Property
domain: C10011
has element type: 2
sub property of: teoksen tekijä (yhteistoimija) teoksessa
sub property of: teoksen haastattelija (toimija) teoksessa
definition: Liittää yhteistoimijan teokseen, jonka luomisesta yhteistoimija on vastuussa toimimalla haastattelijana, toimittajana, mielipidetutkijana tai jonkinlaisena muuna tietoja keräävänä yhteistoimijana.
toolkit label: teoksen haastattelija (yhteistoimija) teoksessa
toolkit definition: Teos, jonka luomisesta yhteistoimija on vastuussa toimimalla haastattelijana, toimittajana, mielipidetutkijana tai jonkinlaisena muuna tietoja keräävänä yhteistoimijana.
label: er intervjuer for verk for (kollektiv agent) @no
definition: Relaterer en kollektiv agent til et verk som involverer et ansvar for en kollektiv agent i form av å fungere som intervjuer, reporter, eller som en annen kollektiv agent som samler inn informasjon. @no
toolkit label: intervjuer for verk for (kollektiv agent) @no
toolkit definition: Et verk som involverer et ansvar for en kollektiv agent i form av å fungere som intervjuer, reporter, eller som en annen kollektiv agent som samler inn informasjon. @no
label: is interviewer-collectieve actor van werk van @nl
definition: Relateert een collectieve actor aan een werk dat met zich meebrengt een verantwoordelijkheid van een collectieve actor voor optreden als een interviewer, verslaggever, opiniepeiler of een andere soort collectieve actor die informatie verzamelt. @nl
toolkit label: interviewer-collectieve actor van werk van @nl
toolkit definition: Een werk dat met zich meebrengt een verantwoordelijkheid van een collectieve actor voor optreden als een interviewer, verslaggever, opiniepeiler of een andere soort collectieve actor die informatie verzamelt. @nl
label: هو وكيل جماعي محاور في عمل لـ @ar
definition: يربط وكيلا جماعيا بعمل ينطوي على تحمله مسئولية العمل كمحاور أو كمراسل أو خبير استطلاعات رأي، أو كوكيل جماعي من نوع آخر يجمع معلومات. @ar
toolkit label: وكيل جماعي محاور في عمل @ar
toolkit definition: عمل يترتب عليه مسئولية وكيل جماعي عن العمل كمحاور أو كمراسل أو كخبير استطلاعات رأي، أو كوكيل جماعي من نوع آخر يجمع معلومات. @ar
label: és agent col·lectiu entrevistador d’una obra de @ca
definition: Relaciona un agent col·lectiu amb una obra que implica una responsabilitat d’un agent col·lectiu actuant com un entrevistador, un periodista, un enquestador o qualsevol altre agent col·lectiu que recull la informació. @ca
toolkit label: agent col·lectiu entrevistador d’una obra de @ca
toolkit definition: Obra que implica una responsabilitat d’un agent col·lectiu actuant com un entrevistador, un periodista, un enquestador o qualsevol altre agent col·lectiu que recull la informació. @ca
label: er kollektiv agent, som er interviewer for værk af @da
definition: Relaterer en kollektiv agent til et værk, som involverer en kollektiv agents ansvar for at optræde som interviewer, journalist, meningsmåler eller en anden form for kollektiv agent, som indsamler information. @da
toolkit label: kollektiv agent, som er interviewer for værk af @da
toolkit definition: Værk, som involverer en kollektiv agents ansvar for at optræde som interviewer, journalist, meningsmåler eller en anden form for kollektiv agent, som indsamler information. @da
label: intervjueerija (kollektiiv) teoses @et
definition: Seostab kollektiivi teosega, mis sisaldab kollektiivi vastutust tegutsemise eest intervjueerija, reporteri, küsitleja või muu infot koguva kollektiivina. @et
toolkit label: intervjueerija (kollektiiv) teoses @et
toolkit definition: Teos, mis sisaldab kollektiivi vastutust tegutsemise eest intervjueerija, reporteri, küsitleja või muu infot koguva kollektiivina. @et
label: ist gemeinschaftlicher Akteur als Interviewerin/Interviewer eines Werks von @de
definition: Setzt einen gemeinschaftlicher Akteur in Beziehung zu einem Werk, bei dem ein gemeinschaftlicher Akteur als Interviewerin/Interviewer, Reporterin/Reporter, Meinungsforscherin/Meinungsforscher oder anderer gemeinschaftlicher Akteur Informationen zusammenträgt. @de
toolkit label: Gemeinschaftlicher Akteur als Interviewerin/Interviewer eines Werks von @de
toolkit definition: Ein Werk, bei dem ein gemeinschaftlicher Akteur als Interviewerin/Interviewer, Reporterin/Reporter, Meinungsforscherin/Meinungsforscher oder anderer gemeinschaftlicher Akteur Informationen zusammenträgt. @de
label: interjúkészítő kollektív ágense a következő műnek: @hu
definition: Hozzákapcsol egy kollektív ágenst egy műhöz, amelyhez hozzátartozik egy kollektív ágens felelőssége interjúkészítőként, riporterként, közvélemény-kutatóként, vagy valamilyen más információgyűjtő kollektív ágensként. @hu
toolkit label: interjúkészítő kollektív ágense a következő műnek: @hu
toolkit definition: Egy mű, amelyhez hozzátartozik egy kollektív ágens felelőssége interjúkészítőként, riporterként, közvélemény-kutatóként, vagy valamilyen más információgyűjtő kollektív ágensként. @hu
label: è intervistatore agente collettivo di opera di @it
definition: Correla un agente collettivo a un'opera che implica una responsabilità di un agente collettivo nell'agire come intervistatore, giornalista, sondaggista o qualche altro tipo di agente collettivo che raccoglie informazioni. @it
toolkit label: intervistatore agente collettivo di opera di @it
toolkit definition: Opera che implica una responsabilità di un agente collettivo nell'agire come intervistatore, giornalista, sondaggista o qualche altro tipo di agente collettivo che raccoglie informazioni. @it
label: είναι συνεντευκτής συλλογικός φορέας του έργου του @el
toolkit label: συνεντευκτής συλλογικός φορέας του έργου του @el
label: est un agent collectif intervieweur d’une œuvre de @fr
definition: Met un agent collectif en relation avec une œuvre qui comporte une responsabilité de la part d’un agent collectif consistant à agir à titre d’intervieweur, de reporteur, de sondeur ou d’autre type d’agent collectif recueillant de l’information. @fr
toolkit label: agent collectif intervieweur d’une œuvre de @fr
toolkit definition: Œuvre qui comporte une responsabilité de la part d’un agent collectif consistant à agir à titre d’intervieweur, de reporteur, de sondeur ou d’autre type d’agent collectif recueillant de l’information. @fr
label: ir intervētājs (grupa) darbā @lv
definition: Sasaista grupu ar darbu, kas ietver grupas atbildību, darbojoties kā intervētājs, reportieris, aptaujas organizētājs vai kāds cits informācijas apkopotājs. @lv
toolkit label: ir intervētājs (grupa) darbā @lv
toolkit definition: Darbs, kas ietver grupas atbildību, darbojoties kā intervētājs, reportieris, aptaujas organizētājs vai kāds cits informācijas apkopotājs. @lv
label: 是……作品的采访者集体行为者 @zh-hans
definition: 将一个集体行为者与涉及担当采访者、记者、民意调查员行为者或其他类型信息搜集的一个集体行为者的责任的一种作品关联起来。 @zh-hans
toolkit label: ……作品的采访者集体行为者 @zh-hans
toolkit definition: 涉及担当采访者、记者、民意调查员行为者或其他类型信息搜集的一个集体行为者的责任的一种作品 @zh-hans
label: eserinin görüşmeci kolektif temsilcisidir @tr
definition: Kolektif bir temsilciyi, kolektif bir temsilcinin mülakatçı, muhabir, anketör veya bilgi toplayan başka bir tür kolektif temsilci olarak hareket etme sorumluluğunu içeren bir eserle ilişkilendirir. @tr
toolkit label: eserinin görüşmeci kolektif temsilcisidir @tr
toolkit definition: Görüşmeci, muhabir, anketör veya bilgi toplayan başka tür bir kolektif temsilci olarak hareket etme sorumluluğunu içeren bir eser. @tr
has subproperty: teoksen haastattelija (yhteisö) teoksessa
has subproperty: teoksen haastattelija (suku) teoksessa
has subproperty: P50678

ekspression haastattelija (yhteisö) ekspressiossa
status: Published
label: is interviewer corporate body of expression of @en
lexical alias: interviewerCorporateBodyOfExpressionOf.en
definition: Relates a corporate body to an expression that includes a contribution by a corporate body of interviewing, reporting, or some other kind of gathering of information. @en
toolkit label: interviewer corporate body of expression of @en
toolkit definition: An expression that includes a contribution by a corporate body of interviewing, reporting, or some kind of other gathering of information. @en
type: Property
domain: C10005
has element type: 2
sub property of: esitykseen osallinen yhteisö ekspressiossa
sub property of: ekspression haastattelija (yhteistoimija) ekspressiossa
definition: Liittää yhteisön ekspressioon, jonka tekemisessä yhteisö on osallisena toimimalla haastattelijana, toimittajana tai jonain muuna tietoja keräävänä toimijana.
toolkit label: ekspression haastattelija (yhteisö) ekspressiossa
toolkit definition: Ekspressio, jonka tekemisessä yhteisö on osallisena toimimalla haastattelijana, toimittajana tai jonain muuna tietoja keräävänä toimijana.
label: er intervjuer for uttrykk for (korporasjon) @no
definition: Relaterer en korporasjon til et uttrykk som inkluderer et bidrag fra en korporasjon i form av intervjuer, rapportering eller en annen form for innsamling av informasjon. @no
toolkit label: intervjuer for uttrykk for (korporasjon) @no
toolkit definition: Et uttrykk som inkluderer et bidrag fra en korporasjon i form av intervjuer, rapportering eller en annen form for innsamling av informasjon. @no
label: is interviewer-corporatie van expressie van @nl
definition: Relateert een corporatie aan een expressie die omvat een bijdrage door een corporatie door ondervragen, rapporteren of een andere vorm van informatie verzamelen. @nl
toolkit label: interviewer-corporatie van expressie van @nl
toolkit definition: Een expressie die omvat een bijdrage door een corporatie door ondervragen, rapporteren of een andere vorm van informatie verzamelen. @nl
label: هي هيئة محاورة في تعبيرة لـ @ar
definition: يربط هيئة بتعبيرة تتضمن إسهام هيئة في إجراء مقابلات أو إعداد تقارير أو جمع المعلومات بطريقة أخرى. @ar
toolkit label: هيئة محاورة في تعبيرة @ar
toolkit definition: تعبيرة تتضمن إسهام هيئة لإجراء المقابلات أو إعداد التقارير أو أي نوع آخر من جمع المعلومات. @ar
label: és entitat corporativa entrevistadora d’una expressió de @ca
definition: Relaciona una entitat corporativa amb una expressió que inclou una contribució d’una entitat corporativa entrevistant, informant o recopilant informació d’alguna altra manera. @ca
toolkit label: entitat corporativa entrevistadora d’una expressió de @ca
toolkit definition: Expressió que inclou una contribució d’una entitat corporativa entrevistant, informant o recopilant informació d’alguna altra manera. @ca
label: er korporation, som er interviewer for udtryk af @da
definition: Relaterer en korporation til et udtryk, som omfatter en korporations bidrag ved at interviewe, rapportere eller en anden form for indsamling af information. @da
toolkit label: korporation, som er interviewer for udtryk af @da
toolkit definition: Udtryk, som omfatter en korporations bidrag ved at interviewe, rapportere eller en anden form for indsamling af information. @da
label: intervjueerija (asutus) väljenduses @et
definition: Seostab asutuse väljendusega, millesse asutus on andnud panuse, intervjueerides, tehes reportaaži või kogudes muul viisil infot. @et
toolkit label: intervjueerija (asutus) väljenduses @et
toolkit definition: Väljendus, millesse asutus on andnud panuse, intervjueerides, tehes reportaaži või kogudes muul viisil infot. @et
label: ist Körperschaft als Interviewerin/Interviewer einer Expression von @de
definition: Setzt eine Körperschaft in Beziehung zu einer Expression, zu der eine Körperschaft beiträgt, indem sie als Interviewerin/Interviewer, Reporterin/Reporter, Meinungsforscherin/Meinungsforscher oder andere Körperschaft Informationen zusammenträgt. @de
toolkit label: Körperschaft als Interviewerin/Interviewer einer Expression von @de
toolkit definition: Eine Expression, zu der eine Körperschaft beiträgt, indem sie als Interviewerin/Interviewer, Reporterin/Reporter, Meinungsforscherin/Meinungsforscher oder andere Körperschaft Informationen zusammenträgt. @de
label: interjúkészítő testülete a következő kifejezési formának: @hu
definition: Hozzákapcsol egy testületet egy kifejezési formához, amely magában foglalja egy testület közreműködését interjúban, riportban vagy más információgyűjtő minőségben. @hu
toolkit label: interjúkészítő testülete a következő kifejezési formának: @hu
toolkit definition: Egy kifejezési forma, amely magában foglalja egy testület közreműködését interjúban, riportban vagy más információgyűjtő minőségben. @hu
label: è intervistatore ente di espressione di @it
definition: Correla un ente a un'espressione che include un contributo di un ente nell'intervistare, riferire notizie o altro tipo di raccolta di informazioni. @it
toolkit label: intervistatore ente di espressione di @it
toolkit definition: Espressione che comprende un contributo di un ente nell'intervistare, riferire notizie o altro tipo di raccolta di informazioni. @it
label: είναι συνεντευκτής συλλογικό όργανο της έκφρασης του @el
toolkit label: συνεντευκτής συλλογικό όργανο της έκφρασης του @el
label: est une collectivité intervieweuse d’une expression de @fr
definition: Met une collectivité en relation avec une expression qui intègre une contribution de la part d’une collectivité consistant à réaliser un entretien, un reportage ou un autre type de collecte d’informations. @fr
toolkit label: collectivité intervieweuse d’une expression de @fr
toolkit definition: Expression qui intègre une contribution de la part d’une collectivité consistant à réaliser un entretien, un reportage ou un autre type de collecte d’informations. @fr
label: ir intervētājs (institūcija) izteiksmē @lv
definition: Sasaista institūciju ar izteiksmi, kas ietver institūcijas ieguldījumu, darbojoties kā intervētājs, reportieris, aptaujas organizētājs vai kāds cits informācijas apkopotājs. @lv
toolkit label: ir intervētājs (institūcija) izteiksmē @lv
toolkit definition: Izteiksme, kas ietver institūcijas ieguldījumu, darbojoties kā intervētājs, reportieris, aptaujas organizētājs vai kāds cits informācijas apkopotājs. @lv
label: 是……的内容表达的采访者团体 @zh-hans
definition: 将一个团体与包括一个采访、报道或其他某种信息收集的一个团体的贡献的一种内容表达关联起来。 @zh-hans
toolkit label: ……的内容表达的采访者团体 @zh-hans
toolkit definition: 包括一个采访、报道或其他某种信息收集的一个团体的贡献的一种内容表达 @zh-hans
label: anlatımının görüşmeci tüzel kişisidir @tr
definition: Bir tüzel kişiyi, bir tüzel kişiliğin görüşme, raporlama veya başka türde bilgi toplama katkısını içeren bir anlatımla ilişkilendirir. @tr
toolkit label: anlatımının görüşmeci tüzel kişisidir @tr
toolkit definition: Röportaj, raporlama veya bir tür başka bilgi toplamada tüzel bir kişinin katkısını içeren bir anlatım. @tr
has subproperty: P50890

teoksen haastattelija (yhteisö) teoksessa
status: Published
label: is interviewer corporate body of work of @en
lexical alias: interviewerCorporateBodyOfWorkOf.en
definition: Relates a corporate body to a work that involves a responsibility by a corporate body for acting as an interviewer, reporter, pollster, or some other kind of corporate body who gathers information. @en
toolkit label: interviewer corporate body of work of @en
toolkit definition: A work that involves a responsibility of a corporate body for acting as an interviewer, reporter, pollster, or some other kind of corporate body who gathers information. @en
type: Property
domain: C10005
has element type: 2
sub property of: teoksen tekijä (yhteisö) teoksessa
sub property of: teoksen haastattelija (yhteistoimija) teoksessa
definition: Liittää yhteisön teokseen, jonka luomisesta yhteisö on vastuussa toimimalla haastattelijana, toimittajana, mielipidetutkijana tai jonkinlaisena muuna tietoja keräävänä yhteisönä.
toolkit label: teoksen haastattelija (yhteisö) teoksessa
toolkit definition: Teos, jonka luomisesta yhteisö on vastuussa toimimalla haastattelijana, toimittajana, mielipidetutkijana tai jonkinlaisena muuna tietoja keräävänä yhteisönä.
label: er intervjuer for verk for (korporasjon) @no
definition: Relaterer en korporasjon til et verk som involverer et ansvar for en korporasjon i form av å fungere som intervjuer, reporter, eller som en annen korporasjon som samler inn informasjon. @no
toolkit label: intervjuer for verk for (korporasjon) @no
toolkit definition: Et verk som involverer et ansvar for en korporasjon i form av å fungere som intervjuer, reporter, eller som en annen korporasjon som samler inn informasjon. @no
label: is interviewer-corporatie van werk van @nl
definition: Relateert een corporatie aan een werk dat met zich meebrengt een verantwoordelijkheid van een corporatie voor optreden als een interviewer, verslaggever, opiniepeiler of een andere soort corporatie die informatie verzamelt. @nl
toolkit label: interviewer-corporatie van werk van @nl
toolkit definition: Een werk dat met zich meebrengt een verantwoordelijkheid van een corporatie voor optreden als een interviewer, verslaggever, opiniepeiler of een andere soort corporatie die informatie verzamelt. @nl
label: هي هيئة محاورة في عمل لـ @ar
definition: يربط هيئة بعمل يترتب عليه مسئولية هيئة عن العمل كمحاور أو مراسل، أو خبير استطلاعات رأي، أو كهيئة من أي نوع تجمع المعلومات. @ar
toolkit label: هيئة محاورة في عمل لـ @ar
toolkit definition: عمل يترتب عليه مسئولية هيئة عن العمل كمحاور أو مراسل أو خبير استطلاعات رأي أو كهيئة من أي نوع تجمع المعلومات. @ar
label: és entitat corporativa entrevistadora d’una obra de @ca
definition: Relaciona una entitat corporativa amb una obra que implica una responsabilitat d’una entitat corporativa actuant com un entrevistador, un periodista, un enquestador o qualsevol altra entitat corporativa que recull la informació. @ca
toolkit label: entitat corporativa entrevistadora d’una obra de @ca
toolkit definition: Obra que implica una responsabilitat d’una entitat corporativa actuant com un entrevistador, un periodista, un enquestador o qualsevol altra entitat corporativa que recull la informació. @ca
label: er korporation, som er interviewer for værk af @da
definition: Relaterer en korporation til et værk, som involverer en korporations ansvar for at optræde som interviewer, journalist, meningsmåler eller en anden form for korporation, som indsamler information. @da
toolkit label: korporation, som er interviewer for værk af @da
toolkit definition: Værk, som involverer en korporations ansvar for at optræde som interviewer, journalist, meningsmåler eller en anden form for korporation, som indsamler information. @da
label: intervjueerija (asutus) teoses @et
definition: Seostab asutuse teosega, mis sisaldab asutuse vastutust tegutsemise eest intervjueerija, reporteri, küsitleja või muu infot koguva asutusena. @et
toolkit label: intervjueerija (asutus) teoses @et
toolkit definition: Teos, mis sisaldab asutuse vastutust tegutsemise eest intervjueerija, reporteri, küsitleja või muu infot koguva asutusena. @et
label: ist Körperschaft als Interviewerin/Interviewer eines Werks von @de
definition: Setzt eine Körperschaft in Beziehung zu einem Werk, bei dem eine Körperschaft als Interviewerin/Interviewer, Reporterin/Reporter, Meinungsforscherin/Meinungsforscher oder andere Person Informationen zusammenträgt. @de
toolkit label: Körperschaft als Interviewerin/Interviewer eines Werks von @de
toolkit definition: Ein Werk, bei dem eine Körperschaft als Interviewerin/Interviewer, Reporterin/Reporter, Meinungsforscherin/Meinungsforscher oder andere Person Informationen zusammenträgt. @de
label: interjúkészítő testülete a következő műnek: @hu
definition: Hozzákapcsol egy testületet egy műhöz, amelyhez hozzátartozik egy testület felelőssége interjúkészítőként, riporterként, közvélemény-kutatóként, vagy valamilyen más információgyűjtő testületként. @hu
toolkit label: interjúkészítő testülete a következő műnek: @hu
toolkit definition: Egy mű, amelyhez hozzátartozik egy testület felelőssége interjúkészítőként, riporterként, közvélemény-kutatóként, vagy valamilyen más információgyűjtő testületként. @hu
label: è intervistatore ente di opera di @it
definition: Correla un ente a un'opera che implica una responsabilità di un ente nell'agire come intervistatore, giornalista, sondaggista o altro tipo di ente che raccoglie informazioni. @it
toolkit label: intervistatore ente di opera di @it
toolkit definition: Opera che implica una responsabilità di un ente nell'agire come intervistatore, giornalista, sondaggista o qualche altro tipo di ente che raccoglie informazioni. @it
label: είναι συνεντευκτής συλλογικό όργανο του έργου του @el
toolkit label: συνεντευκτής συλλογικό όργανο του έργου του @el
label: est une collectivité intervieweuse d’une œuvre de @fr
definition: Met une collectivité en relation avec une œuvre qui comporte une responsabilité de la part d’une collectivité consistant à agir à titre d’intervieweur, de reporteur, de sondeur ou d’autre type de collectivité recueillant de l’information. @fr
toolkit label: collectivité intervieweuse d’une œuvre de @fr
toolkit definition: Œuvre qui comporte une responsabilité de la part d’une collectivité consistant à agir à titre d’intervieweur, de reporteur, de sondeur ou d’autre type de collectivité recueillant de l’information. @fr
label: ir intervētājs (institūcija) darbā @lv
definition: Sasaista institūciju ar darbu, kas ietver institūcijas atbildību, darbojoties kā intervētājs, reportieris, aptaujas organizētājs vai kāds cits informācijas apkopotājs. @lv
toolkit label: ir intervētājs (institūcija) darbā @lv
toolkit definition: Darbs, kas ietver institūcijas atbildību, darbojoties kā intervētājs, reportieris, aptaujas organizētājs vai kāds cits informācijas apkopotājs. @lv
label: 是……作品的采访者团体 @zh-hans
definition: 将一个团体与涉及担当采访者、记者、民意调查员行为者或其他类型信息搜集的一个团体的责任的一种作品关联起来。 @zh-hans
toolkit label: ……作品的采访者团体 @zh-hans
toolkit definition: 涉及担当采访者、记者、民意调查员行为者或其他类型信息搜集的一个团体的责任的一种作品 @zh-hans
label: eserinin görüşmeci tüzel kişisidir @tr
definition: Bir tüzel kişiyi, bir tüzel kişiliğin bilgi toplayan bir görüşmeci, muhabir, anketör veya başka türde bir tüzel kişi olarak hareket etme sorumluluğunu içeren bir eserle ilişkilendirir. @tr
toolkit label: eserinin görüşmeci tüzel kişisidir @tr
toolkit definition: Bir tüzel kişinin görüşmeci, muhabir, anketör veya bilgi toplayan başka türde bir tüzel kişi olarak hareket etme sorumluluğunu içeren bir çalışma. @tr
has subproperty: P50829

ekspression haastattelija (suku) ekspressiossa
status: Published
label: is interviewer family of expression of @en
lexical alias: interviewerFamilyOfExpressionOf.en
definition: Relates a family to an expression that includes a contribution by a family of interviewing, reporting, or some other kind of gathering of information. @en
toolkit label: interviewer family of expression of @en
toolkit definition: An expression that includes a contribution by a family of interviewing, reporting, or some other kind of gathering of information. @en
type: Property
domain: C10008
has element type: 2
sub property of: esitykseen osallinen suku ekspressiossa
sub property of: ekspression haastattelija (yhteistoimija) ekspressiossa
definition: Liittää suvun ekspressioon, jonka tekemisessä suku on osallisena toimimalla haastattelijana, toimittajana tai jonain muuna tietoja keräävänä toimijana.
toolkit label: ekspression haastattelija (suku) ekspressiossa
toolkit definition: Ekspressio, jonka tekemisessä suku on osallisena toimimalla haastattelijana, toimittajana tai jonain muuna tietoja keräävänä toimijana.
label: er intervjuer for uttrykk for (familie) @no
definition: Relaterer en familie til et uttrykk som inkluderer et bidrag fra en familie i form av intervjuer, rapportering eller en annen form for innsamling av informasjon. @no
toolkit label: intervjuer for uttrykk for (familie) @no
toolkit definition: Et uttrykk som inkluderer et bidrag fra en familie i form av intervjuer, rapportering eller en annen form for innsamling av informasjon. @no
label: is interviewer-familie van expressie van @nl
definition: Relateert een familie aan een expressie die omvat een bijdrage door een familie door ondervragen, rapporteren of een andere vorm van informatie verzamelen. @nl
toolkit label: interviewer-familie van expressie van @nl
toolkit definition: Een expressie die omvat een bijdrage door een familie door ondervragen, rapporteren of een andere vorm van informatie verzamelen. @nl
label: هي عائلة محاورة في تعبيرة لـ @ar
definition: يربط عائلة بتعبيرة تتضمن إسهام عائلة في إجراء مقابلات أو إعداد تقارير أو جمع المعلومات بطريقة أخرى. @ar
toolkit label: عائلة محاورة في تعبيرة @ar
toolkit definition: تعبيرة تتضمن إسهام عائلة في إجراء مقابلات أو إعداد تقارير أو جمع المعلومات بطريقة أخرى. @ar
label: és família entrevistadora d’una expressió de @ca
definition: Relaciona una família amb una expressió que inclou una contribució d’una família entrevistant, informant o recopilant informació d’alguna altra manera. @ca
toolkit label: família entrevistadora d’una expressió de @ca
toolkit definition: Expressió que inclou una contribució d’una família entrevistant, informant o recopilant informació d’alguna altra manera. @ca
label: er familie, som er interviewer for udtryk af @da
definition: Relaterer en familie til et udtryk, som omfatter en families bidrag ved at interviewe, rapportere eller en anden form for indsamling af information. @da
toolkit label: familie, som er interviewer for udtryk af @da
toolkit definition: Udtryk, som omfatter en families bidrag ved at interviewe, rapportere eller en anden form for indsamling af information. @da
label: intervjueerija (perekond) väljenduses @et
definition: Seostab perekonna väljendusega, millesse perekond on andnud panuse, intervjueerides, tehes reportaaži või kogudes muul viisil infot. @et
toolkit label: intervjueerija (perekond) väljenduses @et
toolkit definition: Väljendus, millesse perekond on andnud panuse, intervjueerides, tehes reportaaži või kogudes muul viisil infot. @et
label: ist Familie als Interviewerin/Interviewer einer Expression von @de
definition: Setzt eine Familie in Beziehung zu einer Expression, zu der eine Familie beiträgt, indem sie als Interviewerin/Interviewer, Reporterin/Reporter, Meinungsforscherin/Meinungsforscher oder andere Familie Informationen zusammenträgt. @de
toolkit label: Familie als Interviewerin/Interviewer einer Expression von @de
toolkit definition: Eine Expression, zu der eine Familie beiträgt, indem sie als Interviewerin/Interviewer, Reporterin/Reporter, Meinungsforscherin/Meinungsforscher oder andere Familie Informationen zusammenträgt. @de
label: interjúkészítő családja a következő kifejezési formának: @hu
definition: Hozzákapcsol egy családot egy kifejezési formához, amely magában foglalja egy család közreműködését interjúban, riportban vagy más információgyűjtő minőségben. @hu
toolkit label: interjúkészítő családja a következő kifejezési formának: @hu
toolkit definition: Egy kifejezési forma, amely magában foglalja egy család közreműködését interjúban, riportban vagy más információgyűjtő minőségben. @hu
label: è intervistatore famiglia di espressione di @it
definition: Correla una famiglia a un'espressione che comprende un contributo di una famiglia nell'intervistare, riferire notizie o altro tipo di raccolta di informazioni. @it
toolkit label: intervistatore famiglia di espressione di @it
toolkit definition: Espressione che comprende un contributo di una famiglia nell'intervistare, riferire notizie o altro tipo di raccolta di informazioni. @it
label: είναι συνεντευκτής οικογένεια της έκφρασης του @el
toolkit label: συνεντευκτής οικογένεια της έκφρασης του @el
label: est une famille intervieweuse d’une expression de @fr
definition: Met une famille en relation avec une expression qui intègre une contribution de la part d’une famille consistant à réaliser un entretien, un reportage ou un autre type de collecte d’informations. @fr
toolkit label: famille intervieweuse d’une expression de @fr
toolkit definition: Expression qui intègre une contribution de la part d’une famille consistant à réaliser un entretien, un reportage ou un autre type de collecte d’informations. @fr
label: ir intervētājs (dzimta/ģimene) izteiksmē @lv
definition: Sasaista dzimtu/ģimeni ar izteiksmi, kas ietver dzimtas/ģimenes ieguldījumu, darbojoties kā intervētājs, reportieris, aptaujas organizētājs vai kāds cits informācijas apkopotājs. @lv
toolkit label: ir intervētājs (dzimta/ģimene) izteiksmē @lv
toolkit definition: Izteiksme, kas ietver dzimtas/ģimenes ieguldījumu, darbojoties kā intervētājs, reportieris, aptaujas organizētājs vai kāds cits informācijas apkopotājs. @lv
label: 是……的内容表达的采访者家族 @zh-hans
definition: 将一个家族与包括一个采访、报道或其他某种信息收集的一个家族的贡献的一种内容表达关联起来。 @zh-hans
toolkit label: ……的内容表达的采访者家族 @zh-hans
toolkit definition: 包括一个采访、报道或其他某种信息收集的一个家族的贡献的一种内容表达 @zh-hans
label: anlatımının görüşmeci ailesidir @tr
definition: Bir aileyi, bir ailenin röportaj, raporlama veya başka bir tür bilgi toplama katkısını içeren bir anlatımla ilişkilendirir. @tr
toolkit label: anlatımının görüşmeci ailesidir @tr
toolkit definition: Röportaj, raporlama veya başka bir tür bilgi toplayan bir ailenin katkısını içeren bir anlatım. @tr
has subproperty: P51041

teoksen haastattelija (suku) teoksessa
status: Published
label: is interviewer family of work of @en
lexical alias: interviewerFamilyOfWorkOf.en
definition: Relates a family to a work that involves a responsibility by a family for acting as an interviewer, reporter, pollster, or some other kind of family who gathers information. @en
toolkit label: interviewer family of work of @en
toolkit definition: A work that involves a responsibility of a family for acting as an interviewer, reporter, pollster, or some other kind of family who gathers information. @en
type: Property
domain: C10008
has element type: 2
sub property of: teoksen tekijä (suku) teoksessa
sub property of: teoksen haastattelija (yhteistoimija) teoksessa
definition: Liittää suvun teokseen, jonka luomisesta suku on vastuussa toimimalla haastattelijana, toimittajana, mielipidetutkijana tai jonkinlaisena muuna tietoja keräävänä sukuna.
toolkit label: teoksen haastattelija (suku) teoksessa
toolkit definition: Teos, jonka luomisesta suku on vastuussa toimimalla haastattelijana, toimittajana, mielipidetutkijana tai jonkinlaisena muuna tietoja keräävänä sukuna.
label: er intervjuer for verk for (familie) @no
definition: Relaterer en familie til et verk som involverer et ansvar for en familie i form av å fungere som intervjuer, reporter, eller som en annen familie som samler inn informasjon. @no
toolkit label: intervjuer for verk for (familie) @no
toolkit definition: Et verk som involverer et ansvar for en familie i form av å fungere som intervjuer, reporter, eller som en annen familie som samler inn informasjon. @no
label: is interviewer-familie van werk van @nl
definition: Relateert een familie aan een werk dat met zich meebrengt een verantwoordelijkheid van een familie voor optreden als een interviewer, verslaggever, opiniepeiler of een andere soort familie die informatie verzamelt. @nl
toolkit label: interviewer-familie van werk van @nl
toolkit definition: Een werk dat met zich meebrengt een verantwoordelijkheid van een familie voor optreden als een interviewer, verslaggever, opiniepeiler of een andere soort familie die informatie verzamelt. @nl
label: هي عائلة محاورة في عمل لـ @ar
definition: يربط عائلة بعمل يترتب عليه مسئولية عائلة عن العمل كمحاور أو مراسل أو مستطلع آراء أو عائلة من نوع آخر تجمع المعلومات. @ar
toolkit label: عائلة محاورة في عمل @ar
toolkit definition: عمل يترتب عليه مسئولية عائلة عن العمل كمحاور أو كمراسل أو مستطلع آراء أو عائلة من نوع آخر تجمع المعلومات. @ar
label: és família entrevistadora d’una obra de @ca
definition: Relaciona una família amb una obra que implica una responsabilitat d’una família actuant com un entrevistador, un periodista, un enquestador o qualsevol altre tipus de família que recull la informació. @ca
toolkit label: família entrevistadora d’una obra de @ca
toolkit definition: Obra que implica una responsabilitat d’una família actuant com un entrevistador, un periodista, un enquestador o qualsevol altre tipus de família que recull la informació. @ca
label: er familie, som er interviewer for værk af @da
definition: Relaterer en familie til et værk, som involverer en families ansvar for at optræde som interviewer, journalist, meningsmåler eller en anden form for familie, som indsamler information. @da
toolkit label: familie, som er interviewer for værk af @da
toolkit definition: Værk, som involverer en families ansvar for at optræde som interviewer, journalist, meningsmåler eller en anden form for familie, som indsamler information. @da
label: intervjueerija (perekond) teoses @et
definition: Seostab perekonna teosega, mis sisaldab perekonna vastutust tegutsemise eest intervjueerija, reporteri, küsitleja või muu infot koguva perekonnana. @et
toolkit label: intervjueerija (perekond) teoses @et
toolkit definition: Teos, mis sisaldab perekonna vastutust tegutsemise eest intervjueerija, reporteri, küsitleja või muu infot koguva perekonnana. @et
label: ist Familie als Interviewerin/Interviewer eines Werks von @de
definition: Setzt eine Familie in Beziehung zu einem Werk, bei dem eine Familie als Interviewerin/Interviewer, Reporterin/Reporter, Meinungsforscherin/Meinungsforscher oder andere Familie Informationen zusammenträgt. @de
toolkit label: Familie als Interviewerin/Interviewer eines Werks von @de
toolkit definition: Ein Werk, bei dem eine Familie als Interviewerin/Interviewer, Reporterin/Reporter, Meinungsforscherin/Meinungsforscher oder andere Familie Informationen zusammenträgt. @de
label: interjúkészítő családja a következő műnek: @hu
definition: Hozzákapcsol egy családot egy műhöz, amelyhez hozzátartozik egy család felelőssége interjúkészítőként, riporterként, közvélemény-kutatóként, vagy valamilyen más információgyűjtő családként. @hu
toolkit label: interjúkészítő családja a következő műnek: @hu
toolkit definition: Egy mű, amelyhez hozzátartozik egy család felelőssége interjúkészítőként, riporterként, közvélemény-kutatóként, vagy valamilyen más információgyűjtő családként. @hu
label: è intervistatore famiglia di opera di @it
definition: Correla una famiglia a un'opera che implica una responsabilità di una famiglia nell'agire come intervistatore, giornalista, sondaggista o qualche altro tipo di famiglia che raccoglie informazioni. @it
toolkit label: intervistatore famiglia di opera di @it
toolkit definition: Opera che implica una responsabilità di una famiglia nell'agire come intervistatore, giornalista, sondaggista o qualche altro tipo di famiglia che raccoglie informazioni. @it
label: είναι συνεντευκτής οικογένεια του έργου του @el
toolkit label: συνεντευκτής οικογένεια του έργου του @el
label: est une famille intervieweuse d’une œuvre de @fr
definition: Met une famille en relation avec une œuvre qui comporte une responsabilité de la part d’une famille consistant à agir à titre d’intervieweur, de reporteur, de sondeur ou d’autre type de famille recueillant de l’information. @fr
toolkit label: famille intervieweuse d’une œuvre de @fr
toolkit definition: Œuvre qui comporte une responsabilité de la part d’une famille consistant à agir à titre d’intervieweur, de reporteur, de sondeur ou d’autre type de famille recueillant de l’information. @fr
label: ir intervētājs (dzimta/ģimene) darbā @lv
definition: Sasaista dzimtu/ģimeni ar darbu, kas ietver dzimtas/ģimenes atbildību, darbojoties kā intervētājs, reportieris, aptaujas organizētājs vai kāds cits informācijas apkopotājs. @lv
toolkit label: ir intervētājs (dzimta/ģimene) darbā @lv
toolkit definition: Darbs, kas ietver dzimtas/ģimenes atbildību, darbojoties kā intervētājs, reportieris, aptaujas organizētājs vai kāds cits informācijas apkopotājs. @lv
label: 是……作品的采访者家族 @zh-hans
definition: 将一个家族与涉及担当采访者、记者、民意调查员或其他类型信息搜集的一个家族的责任的一种作品关联起来。 @zh-hans
toolkit label: ……作品的采访者家族 @zh-hans
toolkit definition: 涉及担当采访者、记者、民意调查员或其他类型信息搜集的一个家族的责任的一种作品 @zh-hans
label: eserinin görüşmeci ailesidir @tr
definition: Bir aileyi, bir ailenin görüşmeci, muhabir, anketör veya bilgi toplayan başka bir tür aile olarak hareket etme sorumluluğunu içeren bir eserle ilişkilendirir. @tr
toolkit label: eserinin görüşmeci ailesidir @tr
toolkit definition: Bir ailenin görüşmeci, muhabir, anketör veya bilgi toplayan başka türde bir aile olarak hareket etme sorumluluğunu içeren bir çalışma. @tr
has subproperty: P50980

ekspression haastattelija (henkilö) ekspressiossa
status: Published
label: is interviewer person of expression of @en
lexical alias: interviewerPersonOfExpressionOf.en
definition: Relates a person to an expression that includes a contribution by a person of interviewing, reporting, or some other kind of gathering of information. @en
toolkit label: interviewer person of expression of @en
toolkit definition: An expression that includes a contribution by a person of interviewing, reporting, or some other kind of gathering of information. @en
type: Property
domain: C10004
has element type: 2
sub property of: esitykseen osallinen henkilö ekspressiossa
sub property of: ekspression haastattelija (toimija) ekspressiossa
definition: Liittää henkilön ekspressioon, jonka tekemisessä henkilö on osallisena toimimalla haastattelijana, toimittajana tai jonain muuna tietoja keräävänä toimijana.
toolkit label: ekspression haastattelija (henkilö) ekspressiossa
toolkit definition: Ekspressio, jonka tekemisessä henkilö on osallisena toimimalla haastattelijana, toimittajana tai jonain muuna tietoja keräävänä toimijana.
label: er intervjuer for uttrykk for (person) @no
definition: Relaterer en person til et uttrykk som inkluderer et bidrag fra en person i form av intervjuer, rapportering eller en annen form for innsamling av informasjon. @no
toolkit label: intervjuer for uttrykk for (person) @no
toolkit definition: Et uttrykk som inkluderer et bidrag fra en person i form av intervjuer, rapportering eller en annen form for innsamling av informasjon. @no
label: is interviewer-persoon van expressie van @nl
definition: Relateert een persoon aan een expressie die omvat een bijdrage door een persoon door ondervragen, rapporteren of een andere vorm van informatie verzamelen. @nl
toolkit label: interviewer-persoon van expressie van @nl
toolkit definition: Een expressie die omvat een bijdrage door een persoon door ondervragen, rapporteren of een andere vorm van informatie verzamelen. @nl
label: هو شخص محاور في تعبيرة لـ @ar
definition: يربط شخصا بتعبيرة تتضمن إسهام شخص في إجراء مقابلات أو في إعداد تقارير أو جمع المعلومات بطريقة أخرى. @ar
toolkit label: شخص محاور في تعبيرة @ar
toolkit definition: تعبيرة تتضمن إسهام شخص في إجراء مقابلات أو إعداد تقارير أو جمع المعلومات بطريقة أخرى. @ar
label: és persona entrevistadora d’una expressió de @ca
definition: Relaciona una persona amb una expressió que inclou una contribució d’una persona entrevistant, informant o recopilant informació d’alguna altra manera. @ca
toolkit label: persona entrevistadora d’una expressió de @ca
toolkit definition: Expressió que inclou una contribució d’una persona entrevistant, informant o recopilant informació d’alguna altra manera. @ca
label: er person, som er interviewer for udtryk af @da
definition: Relaterer en person til et udtryk, som omfatter en persons bidrag ved at interviewe, rapportere eller en anden form for indsamling af information. @da
toolkit label: person, som er interviewer for udtryk af @da
toolkit definition: Udtryk, som omfatter en persons bidrag ved at interviewe, rapportere eller en anden form for indsamling af information. @da
label: intervjueerija (isik) väljenduses @et
definition: Seostab isiku väljendusega, millesse isik on andnud panuse, intervjueerides, tehes reportaaži või kogudes muul viisil infot. @et
toolkit label: intervjueerija (isik) väljenduses @et
toolkit definition: Väljendus, millesse isik on andnud panuse, intervjueerides, tehes reportaaži või kogudes muul viisil infot. @et
label: ist Person als Interviewerin/Interviewer einer Expression von @de
definition: Setzt eine Person in Beziehung zu einer Expression, zu der eine Person beiträgt, indem sie als Interviewerin/Interviewer, Reporterin/Reporter, Meinungsforscherin/Meinungsforscher oder andere Person Informationen zusammenträgt. @de
toolkit label: Person als Interviewerin/Interviewer einer Expression von @de
toolkit definition: Eine Expression, zu der eine Person beiträgt, indem sie als Interviewerin/Interviewer, Reporterin/Reporter, Meinungsforscherin/Meinungsforscher oder andere Person Informationen zusammenträgt. @de
label: interjúkészítő személye a következő kifejezési formának: @hu
definition: Hozzákapcsol egy személyt egy kifejezési formához, amely magában foglalja egy személy közreműködését interjúban, riportban vagy más információgyűjtő minőségben. @hu
toolkit label: interjúkészítő személye a következő kifejezési formának: @hu
toolkit definition: Egy kifejezési forma, amely magában foglalja egy személy közreműködését interjúban, riportban vagy más információgyűjtő minőségben. @hu
label: è intervistatore persona di espressione di @it
definition: Correla una persona a un'espressione che comprende un contributo di una persona nell'intervistare, riferire notizie o altro tipo di raccolta di informazioni. @it
toolkit label: intervistatore persona di espressione di @it
toolkit definition: Espressione che comprende un contributo di una persona nell'intervistare, riferire notizie o altro tipo di raccolta di informazioni. @it
label: είναι συνεντευκτής φυσικό πρόσωπο της έκφρασης του @el
toolkit label: εσυνεντευκτής φυσικό πρόσωπο της έκφρασης του @el
label: est une personne intervieweuse d’une expression de @fr
definition: Met une personne en relation avec une expression qui intègre une contribution de la part d’une personne consistant à réaliser un entretien, un reportage ou un autre type de collecte d’informations. @fr
toolkit label: personne intervieweuse d’une expression de @fr
toolkit definition: Expression qui intègre une contribution de la part d’une personne consistant à réaliser un entretien, un reportage ou un autre type de collecte d’informations. @fr
label: ir intervētājs (persona) izteiksmē @lv
definition: Sasaista personu ar izteiksmi, kas ietver personas ieguldījumu, darbojoties kā intervētājs, reportieris, aptaujas organizētājs vai kāds cits informācijas apkopotājs. @lv
toolkit label: ir intervētājs (persona) izteiksmē @lv
toolkit definition: Izteiksme, kas ietver personas ieguldījumu, darbojoties kā intervētājs, reportieris, aptaujas organizētājs vai kāds cits informācijas apkopotājs. @lv
label: 是……的内容表达的采访者个人 @zh-hans
definition: 将一个个人与包括一个采访、报道或其他某种信息收集的一个个人的贡献的一种内容表达关联起来。 @zh-hans
toolkit label: ……的内容表达的采访者个人 @zh-hans
toolkit definition: 包括一个采访、报道或其他某种信息收集的一个个人的贡献的一种内容表达 @zh-hans
label: anlatımının görüşmeci kişisidir @tr
definition: Bir kişiyi, bir kişinin görüşme, raporlama veya başka türde bilgi toplama katkısını içeren bir anlatımla ilişkilendirir. @tr
toolkit label: anlatımının görüşmeci kişisidir @tr
toolkit definition: Röportaj, raporlama veya başka bir tür bilgi toplayan bir kişinin katkısını içeren bir anlatım. @tr
has subproperty: P50588

teoksen haastattelija (henkilö) teoksessa
status: Published
label: is interviewer person of work of @en
lexical alias: interviewerPersonOfWorkOf.en
definition: Relates a person to a work that involves a responsibility by a person for acting as an interviewer, reporter, pollster, or some other kind of person who gathers information. @en
toolkit label: interviewer person of work of @en
toolkit definition: A work that involves a responsibility of a person for acting as an interviewer, reporter, pollster, or some other kind of person who gathers information. @en
type: Property
domain: C10004
has element type: 2
sub property of: teoksen tekijä (henkilö) teoksessa
sub property of: teoksen haastattelija (toimija) teoksessa
definition: Liittää henkilön teokseen, jonka luomisesta henkilö on vastuussa toimimalla haastattelijana, toimittajana, mielipidetutkijana tai jonkinlaisena muuna tietoja keräävänä henkilönä.
toolkit label: teoksen haastattelija (henkilö) teoksessa
toolkit definition: Teos, jonka luomisesta henkilö on vastuussa toimimalla haastattelijana, toimittajana, mielipidetutkijana tai jonkinlaisena muuna tietoja keräävänä henkilönä.
label: er intervjuer for verk for (person) @no
definition: Relaterer en person til et verk som involverer et ansvar for en person i form av å fungere som intervjuer, reporter, eller som en annen person som samler inn informasjon. @no
toolkit label: intervjuer for verk for (person) @no
toolkit definition: Et verk som involverer et ansvar for en person i form av å fungere som intervjuer, reporter, eller som en annen person som samler inn informasjon. @no
label: is interviewer-persoon van werk van @nl
definition: Relateert een persoon aan een werk dat met zich meebrengt een verantwoordelijkheid van een persoon voor optreden als een interviewer, verslaggever, opiniepeiler of een andere soort persoon die informatie verzamelt. @nl
toolkit label: interviewer-persoon van werk van @nl
toolkit definition: Een werk dat met zich meebrengt een verantwoordelijkheid van een persoon voor optreden als een interviewer, verslaggever, opiniepeiler of een andere soort persoon die informatie verzamelt. @nl
label: هو شخص محاور في عمل لـ @ar
definition: يربط شخصا بعمل ينطوي على مسئولية شخص عن العمل كمحاور أو مراسل أو كاتب استطلاع أو أي نوع آخر من الأشخاص الذين يجمعون المعلومات. @ar
toolkit label: شخص محاور في عمل @ar
toolkit definition: عمل يترتب عليه مسئولية وكيل عن العمل كمحاور أو مراسل أو كاتب استطلاع أو أي نوع آخر من الأشخاص الذين يجمعون المعلومات. @ar
label: és persona entrevistadora d’una obra de @ca
definition: Relaciona una persona amb una obra que implica una responsabilitat d’una persona actuant com un entrevistador, un periodista, un enquestador o qualsevol altra persona que recull la informació. @ca
toolkit label: persona entrevistadora d’una obra de @ca
toolkit definition: Obra que implica una responsabilitat d’una persona actuant com un entrevistador, un periodista, un enquestador o qualsevol altra persona que recull la informació. @ca
label: er person, som er interviewer for værk af @da
definition: Relaterer en person til et værk, som involverer en persons ansvar for at optræde som interviewer, journalist, meningsmåler eller en anden form for person, som indsamler information. @da
toolkit label: person, som er interviewer for værk af @da
toolkit definition: Værk, som involverer en persons ansvar for at optræde som interviewer, journalist, meningsmåler eller en anden form for person, som indsamler information. @da
label: intervjueerija (isik) teoses @et
definition: Seostab isiku teosega, mis sisaldab isiku vastutust tegutsemise eest intervjueerija, reporteri, küsitleja või muu infot koguva isikuna. @et
toolkit label: intervjueerija (isik) teoses @et
toolkit definition: Teos, mis sisaldab isiku vastutust tegutsemise eest intervjueerija, reporteri, küsitleja või muu infot koguva isikuna. @et
label: ist Person als Interviewerin/Interviewer eines Werks von @de
definition: Setzt eine Person in Beziehung zu einem Werk, bei dem eine Person als Interviewerin/Interviewer, Reporterin/Reporter, Meinungsforscherin/Meinungsforscher oder andere Person Informationen zusammenträgt. @de
toolkit label: Person als Interviewerin/Interviewer eines Werks von @de
toolkit definition: Ein Werk, bei dem eine Person als Interviewerin/Interviewer, Reporterin/Reporter, Meinungsforscherin/Meinungsforscher oder andere Person Informationen zusammenträgt. @de
label: interjúkészítő személye a következő műnek: @hu
definition: Hozzákapcsol egy személyt egy műhöz, amelyhez hozzátartozik egy személy felelőssége interjúkészítőként, riporterként, közvélemény-kutatóként, vagy valamilyen más információgyűjtő személyként. @hu
toolkit label: interjúkészítő személye a következő műnek: @hu
toolkit definition: Egy mű, amelyhez hozzátartozik egy személy felelőssége interjúkészítőként, riporterként, közvélemény-kutatóként, vagy valamilyen más információgyűjtő személyként. @hu
label: è intervistatore persona di opera di @it
definition: Correla una persona a un'opera che implica una responsabilità di una persona nell'agire come intervistatore, giornalista, sondaggista o altro tipo di persona che raccoglie informazioni. @it
toolkit label: intervistatore persona di opera di @it
toolkit definition: Opera che implica una responsabilità di una persona nell'agire come intervistatore, giornalista, sondaggista o altro tipo di persona che raccoglie informazioni. @it
label: είναι συνεντευκτής φυσικό πρόσωπο του έργου του @el
toolkit label: συνεντευκτής φυσικό πρόσωπο του έργου του @el
label: est une personne intervieweuse d’une œuvre de @fr
definition: Met une personne en relation avec une œuvre qui comporte une responsabilité de la part d’une personne consistant à agir à titre d’intervieweur, de reporteur, de sondeur ou d’autre type de personne recueillant de l’information. @fr
toolkit label: personne intervieweuse d’une œuvre de @fr
toolkit definition: Œuvre qui comporte une responsabilité de la part d’une personne consistant à agir à titre d’intervieweur, de reporteur, de sondeur ou d’autre type de personne recueillant de l’information. @fr
label: ir intervētājs (persona) darbā @lv
definition: Sasaista personu ar darbu, kas ietver personas atbildību, darbojoties kā intervētājs, reportieris, aptaujas organizētājs vai kāds cits informācijas apkopotājs. @lv
toolkit label: ir intervētājs (persona) darbā @lv
toolkit definition: Darbs, kas ietver personas atbildību, darbojoties kā intervētājs, reportieris, aptaujas organizētājs vai kāds cits informācijas apkopotājs. @lv
label: 是……的作品的采访者个人 @zh-hans
definition: 将一个个人与涉及担当采访者、记者、民意调查员的一个个人或其他类型信息搜集个人的责任的一种作品关联起来。 @zh-hans
toolkit label: ……的作品的采访者个人 @zh-hans
toolkit definition: 涉及担当采访者、记者、民意调查员的一个个人或其他类型信息搜集个人的责任的一种作品 @zh-hans
label: eserinin görüşmeci kişisidir @tr
definition: Bir kişiyi, bir kişinin mülakatçı, muhabir, anketör veya bilgi toplayan başka tür bir kişi olarak hareket etme sorumluluğunu içeren bir eserle ilişkilendirir. @tr
toolkit label: eserinin görüşmeci kişisidir @tr
toolkit definition: Bir kişinin görüşmeci, muhabir, anketör veya bilgi toplayan başka türde bir kişi olarak hareket etme sorumluluğunu içeren bir çalışma. @tr
has subproperty: P50527

keksijä (toimija) teoksessa
status: Published
label: is inventor agent of @en
definition: Relates an agent to a work that involves a responsibility of an agent for creating a new device or process. @en
type: Property
domain: C10002
sub property of: teoksen tekijä (toimija) teoksessa
lexical alias: inventorAgentOf.en
label: est un agent inventeur de @fr
definition: Met un agent en relation avec une œuvre qui comporte une responsabilité de la part d’un agent consistant à créer un nouveau dispositif ou procédé. @fr
toolkit label: agent inventeur de @fr
toolkit definition: Œuvre qui comporte une responsabilité de la part d’un agent consistant à créer un nouveau dispositif ou procédé. @fr
toolkit label: inventor agent of @en
toolkit definition: A work that involves a responsibility of an agent for creating a new device or process. @en
instruction number: 18.5
label: είναι εφευρέτης φορέας του @el
definition: Συνδέει έναν φορέα υπεύθυνο για τη δημιουργία μιας νέας συσκευής ή διαδικασίας, με ένα έργο. @el
toolkit label: εφευρέτης φορέας του @el
toolkit definition: Ένα έργο που περιλαμβάνει την ευθύνη της δημιουργίας μιας νέας συσκευής ή διαδικασίας. @el
definition: Setzt einen Akteur in Beziehung zu einem Werk, bei dem ein Akteur für die Schaffung eines neuen Geräts oder Prozesses verantwortlich ist. @de
toolkit label: Akteur als Erfinderin/Erfinder von @de
toolkit definition: Ein Werk, bei dem ein Akteur für die Schaffung eines neuen Geräts oder Prozesses verantwortlich ist. @de
label: er agent, som er opfinder af @da
definition: Relaterer en agent til et værk, som involverer en agents ansvar for at skabe en ny anordning eller proces. @da
toolkit label: agent, som er opfinder af @da
toolkit definition: Værk, som involverer en agents ansvar for at skabe en ny anordning eller proces. @da
label: és agent inventor de @ca
definition: Relaciona un agent amb una obra que implica una responsabilitat d’un agent en la creació d’un mecanisme o procés nou. @ca
toolkit label: agent inventor de @ca
toolkit definition: Obra que implica una responsabilitat d’un agent en la creació d’un mecanisme o procés nou. @ca
definition: Liittää toimijan teokseen, jossa toimija on vastuussa uuden välineen tai menetelmän luomisesta.
toolkit label: keksijä (toimija) teoksessa
toolkit definition: Teos, jossa toimija on vastuussa uuden välineen tai menetelmän luomisesta.
toolkit label: oppfinner av (agent) @no
toolkit definition: Et verk som involverer ansvar for en agent i form av en ny innretning eller prosess. @no
label: ist Akteur als Erfinderin/Erfinder von @de
has element type: 2
label: feltaláló ágense a következőnek: @hu
definition: Hozzákapcsol egy ágenst egy műhöz, amelyhez hozzátartozik egy ágens felelőssége egy új eszköz vagy eljárás létrehozásáért. @hu
toolkit label: feltaláló ágense: @hu
toolkit definition: Egy mű, amelyhez hozzátartozik egy ágens felelőssége egy új eszköz vagy eljárás létrehozásáért. @hu
alternative label: inventor of @en
alternative label: keksintö
label: er oppfinner av (agent) @no
definition: Relaterer en agent til et verk som involverer ansvar for en agent i form av en ny innretning eller prosess. @no
alternative label: oppfinner av @no
label: is uitvinder-actor van @nl
definition: Relateert een actor aan een werk dat met zich meebrengt een verantwoordelijkheid van een actor voor het creëren van een nieuw apparaat of proces. @nl
toolkit label: uitvinder-actor van @nl
toolkit definition: Een werk dat met zich meebrengt een verantwoordelijkheid van een actor voor het creëren van een nieuw apparaat of proces. @nl
label: هو وكيل مخترع لـ @ar
definition: يربط وكيلا بعمل يترتب عليه مسئولية وكيل عن ابتكار جهاز أو عملية جديدة. @ar
alternative label: مخترع @ar
toolkit label: وكيل مخترع @ar
toolkit definition: عمل يترتب عليه مسئولية وكيل عن ابتكار جهاز أو عملية جديدة. @ar
alternative label: inventor de @ca
alternative label: opfinder af @da
label: leiutaja (tegija) teoses @et
definition: Seostab tegija teosega, mis sisaldab tegija vastutust uue seadme või protsessi eest. @et
alternative label: leiutaja teoses @et
toolkit label: leiutaja (tegija) teoses @et
toolkit definition: Teos, mis sisaldab tegija vastutust uue seadme või protsessi eest. @et
alternative label: feltalálója: @hu
label: è inventore agente di @it
definition: Correla un agente a un'opera che implica una responsabilità di un agente per un nuovo dispositivo o processo. @it
alternative label: inventore di @it
toolkit label: inventore agente di @it
toolkit definition: Opera che implica una responsabilità di un agente per un nuovo dispositivo o processo. @it
alternative label: εφευρέτης του @el
alternative label: inventeur de @fr
label: ir izgudrotājs (aģents) @lv
definition: Sasaista aģentu ar darbu, kas ietver aģenta atbildību par jaunas ierīces vai procesa radīšanu. @lv
toolkit label: ir izgudrotājs (aģents) @lv
toolkit definition: Darbs, kas ietver aģenta atbildību par jaunas ierīces vai procesa radīšanu. @lv
alternative label: Erfinderin/Erfinder von @de
alternative label: ……的发明者 @zh-hans
toolkit label: ……的发明者行为者 @zh-hans
toolkit definition: 涉及创建一个新装置或新过程的一个行为者的责任的一种作品 @zh-hans
toolkit label: mucit temsilcisidir @tr
toolkit definition: Yeni bir cihaz veya süreç oluşturmak için bir temsilcinin sorumluluğunu içeren bir çalışma. @tr
has subproperty: keksijä (yhteistoimija) teoksessa

keksijä (yhteistoimija) teoksessa
status: Published
label: is inventor collective agent of @en
lexical alias: inventorCollectiveAgentOf.en
definition: Relates a collective agent to a work that involves a responsibility of a collective agent for creating a new device or process. @en
toolkit label: inventor collective agent of @en
toolkit definition: A work that involves a responsibility of a collective agent for creating a new device or process. @en
type: Property
domain: C10011
has element type: 2
sub property of: teoksen tekijä (yhteistoimija) teoksessa
sub property of: keksijä (toimija) teoksessa
definition: Liittää yhteistoimijan teokseen, jossa yhteistoimija on vastuussa uuden välineen tai menetelmän luomisesta.
toolkit label: keksijä (yhteistoimija) teoksessa
toolkit definition: Teos, jossa yhteistoimija on vastuussa uuden välineen tai menetelmän luomisesta.
label: er oppfinner av (kollektiv agent) @no
definition: Relaterer en kollektiv agent til et verk som involverer et ansvar for en kollektiv agent i form av en ny innretning eller prosess. @no
toolkit label: oppfinner av (kollektiv agent) @no
toolkit definition: Et verk som involverer et ansvar for en kollektiv agent i form av en ny innretning eller prosess. @no
label: is uitvinder-collectieve actor van @nl
definition: Relateert een collectieve actor aan een werk dat met zich meebrengt een verantwoordelijkheid van een collectieve actor voor het creëren van een nieuw apparaat of proces. @nl
toolkit label: uitvinder-collectieve actor van @nl
toolkit definition: Een werk dat met zich meebrengt een verantwoordelijkheid van een collectieve actor voor het creëren van een nieuw apparaat of proces. @nl
label: هو وكيل جماعي مخترع لـ @ar
definition: يربط وكيلا جماعيا بعمل يترتب عليه مسئولية وكيل جماعي عن ابتكار جهاز أو عملية جديدة. @ar
toolkit label: وكيل جماعي مخترع @ar
toolkit definition: عمل يترتب عليه مسئولية وكيل جماعي عن ابتكار جهاز أو عملية جديدة. @ar
label: és agent col·lectiu inventor de @ca
definition: Relaciona un agent col·lectiu amb una obra que implica una responsabilitat d’un agent col·lectiu en la creació d’un mecanisme o procés nou. @ca
toolkit label: agent col·lectiu inventor de @ca
toolkit definition: Obra que implica una responsabilitat d’un agent col·lectiu en la creació d’un mecanisme o procés nou. @ca
label: er kollektiv agent, som er opfinder af @da
definition: Relaterer en kollektiv agent til et værk, som involverer en kollektiv agents ansvar for at skabe en ny anordning eller proces. @da
toolkit label: kollektiv agent, som er opfinder af @da
toolkit definition: Værk, som involverer en kollektiv agents ansvar for at skabe en ny anordning eller proces. @da
label: leiutaja (kollektiiv) teoses @et
definition: Seostab kollektiivi teosega, mis sisaldab kollektiivi vastutust uue seadme või protsessi eest. @et
toolkit label: leiutaja (kollektiiv) teoses @et
toolkit definition: Teos, mis sisaldab kollektiivi vastutust uue seadme või protsessi eest. @et
label: ist gemeinschaftlicher Akteur als Erfinderin/Erfinder von @de
definition: Setzt einen gemeinschaftlicher Akteur in Beziehung zu einem Werk, bei dem ein gemeinschaftlicher Akteur für die Schaffung ein neues Geräts oder Prozesses verantwortlich ist. @de
toolkit label: Gemeinschaftlicher Akteur als Erfinderin/Erfinder von @de
toolkit definition: Ein Werk, bei dem ein gemeinschaftlicher Akteur für die Schaffung ein neues Geräts oder Prozesses verantwortlich ist. @de
label: feltaláló kollektív ágense a következőnek: @hu
definition: Hozzákapcsol egy kollektív ágenst egy műhöz, amelyhez hozzátartozik egy kollektív ágens felelőssége egy új eszköz vagy eljárás létrehozásáért. @hu
toolkit label: feltaláló kollektív ágense: @hu
toolkit definition: Egy mű, amelyhez hozzátartozik egy kollektív ágens felelőssége egy új eszköz vagy eljárás létrehozásáért. @hu
label: è inventore agente collettivo di @it
definition: Correla un agente collettivo a un'opera che implica una responsabilità di un agente collettivo per un nuovo dispositivo o processo. @it
toolkit label: inventore agente collettivo di @it
toolkit definition: Opera che implica una responsabilità di un agente collettivo per un nuovo dispositivo o processo. @it
label: είναι εφευρέτης συλλογικός φορέας του @el
toolkit label: εφευρέτης συλλογικός φορέας του @el
label: est un agent collectif inventeur de @fr
definition: Met un agent collectif en relation avec une œuvre qui comporte une responsabilité de la part d’un agent collectif consistant à créer un nouveau dispositif ou procédé. @fr
toolkit label: agent collectif inventeur de @fr
toolkit definition: Œuvre qui comporte une responsabilité de la part d’un agent collectif consistant à créer un nouveau dispositif ou procédé. @fr
label: ir izgudrotājs (grupa) @lv
definition: Sasaista grupu ar darbu, kas ietver grupas atbildību par jaunas ierīces vai procesa radīšanu. @lv
toolkit label: ir izgudrotājs (grupa) @lv
toolkit definition: Darbs, kas ietver grupas atbildību par jaunas ierīces vai procesa radīšanu. @lv
label: 是……的发明者集体行为者 @zh-hans
definition: 将一个集体行为者与涉及创建一个新装置或新过程的一个具体行为者的责任的一种作品关联起来。 @zh-hans
toolkit label: ……的发明者集体行为者 @zh-hans
toolkit definition: 涉及创建一个新装置或新过程的一个具体行为者的责任的一种作品 @zh-hans
label: mucit kolektif temsilcisidir @tr
definition: Kolektif bir temsilciyi, yeni bir cihaz veya süreç oluşturmak için kolektif bir temsilcinin sorumluluğunu içeren bir eserle ilişkilendirir. @tr
toolkit label: mucit kolektif temsilcisidir @tr
toolkit definition: Yeni bir cihaz veya süreç oluşturmak için kolektif bir temsilcinin sorumluluğunu içeren bir eser. @tr
has subproperty: keksijä (yhteisö) teoksessa
has subproperty: keksijä (suku) teoksessa
has subproperty: P50677

keksijä (yhteisö) teoksessa
status: Published
label: is inventor corporate body of @en
lexical alias: inventorCorporateBodyOf.en
definition: Relates a corporate body to a work that involves a responsibility of a corporate body for creating a new device or process. @en
toolkit label: inventor corporate body of @en
toolkit definition: A work that involves a responsibility of a corporate body for creating a new device or process. @en
type: Property
domain: C10005
has element type: 2
sub property of: teoksen tekijä (yhteisö) teoksessa
sub property of: keksijä (yhteistoimija) teoksessa
definition: Liittää yhteisön teokseen, jossa yhteisö on vastuussa uuden välineen tai menetelmän luomisesta.
toolkit label: keksijä (yhteisö) teoksessa
toolkit definition: Teos, jossa yhteisö on vastuussa uuden välineen tai menetelmän luomisesta.
label: er oppfinner av (korporasjon) @no
definition: Relaterer en korporasjon til et verk som involverer et ansvar for en korporasjon i form av en ny innretning eller prosess. @no
toolkit label: oppfinner av (korporasjon) @no
toolkit definition: Et verk som involverer et ansvar for en korporasjon i form av en ny innretning eller prosess. @no
label: is uitvinder-corporatie van @nl
definition: Relateert een corporatie aan een werk dat met zich meebrengt een verantwoordelijkheid van een corporatie voor het creëren van een nieuw apparaat of proces. @nl
toolkit label: uitvinder-corporatie van @nl
toolkit definition: Een werk dat met zich meebrengt een verantwoordelijkheid van een corporatie voor het creëren van een nieuw apparaat of proces. @nl
label: هي هيئة مخترعة لـ @ar
definition: يربط هيئة بعمل يترتب عليه مسئولية هيئة عن ابتكار جهاز أو عملية جديدة. @ar
toolkit label: هيئة مخترعة @ar
toolkit definition: عمل يترتب عليه مسئولية هيئة عن ابتكار جهاز أو عملية جديدة. @ar
label: és entitat corporativa inventora de @ca
definition: Relaciona una entitat corporativa amb una obra que implica una responsabilitat d’una entitat corporativa en la creació d’un mecanisme o un procés nou. @ca
toolkit label: entitat corporativa inventora de @ca
toolkit definition: Obra que implica una responsabilitat d’una entitat corporativa en la creació d’un mecanisme o un procés nou. @ca
label: er korporation, som er opfinder af @da
definition: Relaterer en korporation til et værk, som involverer en korporations ansvar for at skabe en ny anordning eller proces. @da
toolkit label: korporation, som er opfinder af @da
toolkit definition: Værk, som involverer en korporations ansvar for at skabe en ny anordning eller proces. @da
label: leiutaja (asutus) teoses @et
definition: Seostab asutuse teosega, mis sisaldab asutuse vastutust uue seadme või protsessi eest. @et
toolkit label: leiutaja (asutus) teoses @et
toolkit definition: Teos, mis sisaldab asutuse vastutust uue seadme või protsessi eest. @et
label: ist Körperschaft als Erfinderin/Erfinder von @de
definition: Setzt eine Körperschaft in Beziehung zu einem Werk, bei dem eine Körperschaft für die Schaffung eines neuen Geräts oder Prozesses verantwortlich ist. @de
toolkit label: Körperschaft als Erfinderin/Erfinder von @de
toolkit definition: Ein Werk, bei dem eine Körperschaft für die Schaffung eines neuen Geräts oder Prozesses verantwortlich ist. @de
label: feltaláló testülete a következőnek: @hu
definition: Hozzákapcsol egy testületet egy műhöz, amelyhez hozzátartozik egy testület felelőssége egy új eszköz vagy eljárás létrehozásáért. @hu
toolkit label: feltaláló testülete: @hu
toolkit definition: Egy mű, amelyhez hozzátartozik egy testület felelőssége egy új eszköz vagy eljárás létrehozásáért. @hu
label: è inventore ente di @it
definition: Correla un ente a un'opera che implica una responsabilità di un ente per un nuovo dispositivo o processo. @it
toolkit label: inventore ente di @it
toolkit definition: Opera che implica una responsabilità di un ente per un nuovo dispositivo o processo. @it
label: είναι εφευρέτης συλλογικό όργανο του @el
toolkit label: εφευρέτης συλλογικό όργανο του @el
label: est une collectivité inventrice de @fr
definition: Met une collectivité en relation avec une œuvre qui comporte une responsabilité de la part d’une collectivité consistant à créer un nouveau dispositif ou procédé. @fr
toolkit label: collectivité inventrice de @fr
toolkit definition: Œuvre qui comporte une responsabilité de la part d’une collectivité consistant à créer un nouveau dispositif ou procédé. @fr
label: ir izgudrotājs (institūcija) @lv
definition: Sasaista institūciju ar darbu, kas ietver institūcijas atbildību par jaunas ierīces vai procesa radīšanu. @lv
toolkit label: ir izgudrotājs (institūcija) @lv
toolkit definition: Darbs, kas ietver institūcijas atbildību par jaunas ierīces vai procesa radīšanu. @lv
label: 是……的发明者团体 @zh-hans
definition: 将一个团体与涉及创建一个新装置或新过程的一个团体的责任的一种作品关联起来。 @zh-hans
toolkit label: ……的发明者团体 @zh-hans
toolkit definition: 涉及创建一个新装置或新过程的一个团体的责任的一种作品 @zh-hans
label: mucit tüzel kişisidir @tr
definition: Bir tüzel kişiyi, yeni bir cihaz veya süreç yaratma sorumluluğunu içeren bir eserle ilişkilendirir. @tr
toolkit label: mucit tüzel kişisidir @tr
toolkit definition: Yeni bir cihaz veya süreç oluşturmak için bir tüzel kişinin sorumluluğunu içeren bir çalışma. @tr
has subproperty: P50828

keksijä (suku) teoksessa
status: Published
label: is inventor family of @en
lexical alias: inventorFamilyOf.en
definition: Relates a family to a work that involves a responsibility of a family for creating a new device or process. @en
toolkit label: inventor family of @en
toolkit definition: A work that involves a responsibility of a family for creating a new device or process. @en
type: Property
domain: C10008
has element type: 2
sub property of: teoksen tekijä (suku) teoksessa
sub property of: keksijä (yhteistoimija) teoksessa
definition: Liittää suvun teokseen, jossa suku on vastuussa uuden välineen tai menetelmän luomisesta.
toolkit label: keksijä (suku) teoksessa
toolkit definition: Teos, jossa suku on vastuussa uuden välineen tai menetelmän luomisesta.
label: er oppfinner av (familie) @no
definition: Relaterer en familie til et verk som involverer et ansvar for en familie i form av en ny innretning eller prosess. @no
toolkit label: oppfinner av (familie) @no
toolkit definition: Et verk som involverer et ansvar for en familie i form av en ny innretning eller prosess. @no
label: is uitvinder-familie van @nl
definition: Relateert een familie aan een werk dat met zich meebrengt een verantwoordelijkheid van een familie voor het creëren van een nieuw apparaat of proces. @nl
toolkit label: uitvinder-familie van @nl
toolkit definition: Een werk dat met zich meebrengt een verantwoordelijkheid van een familie voor het creëren van een nieuw apparaat of proces. @nl
label: هي عائلة مخترعة لـ @ar
definition: يربط عائلة بعمل يترتب عليه مسئولية عائلة عن ابتكار جهاز أو عملية جديدة. @ar
toolkit label: عائلة مخترعة @ar
toolkit definition: عمل يترتب عليه مسئولية عائلة عن ابتكار جهاز أو عملية جديدة. @ar
label: és família inventora de @ca
definition: Relaciona una família amb una obra que implica una responsabilitat d’una família en la creació d’un mecanisme o procés nou. @ca
toolkit label: família inventora de @ca
toolkit definition: Obra que implica una responsabilitat d’una família en la creació d’un mecanisme o procés nou. @ca
label: er familie, som er opfinder af @da
definition: Relaterer en familie til et værk, som involverer en families ansvar for at skabe en ny anordning eller proces. @da
toolkit label: familie, som er opfinder af @da
toolkit definition: Værk, som involverer en families ansvar for en ny anordning eller proces. @da
label: leiutaja (perekond) teoses @et
definition: Seostab perekonna teosega, mis sisaldab perekonna vastutust uue seadme või protsessi eest. @et
toolkit label: leiutaja (perekond) teoses @et
toolkit definition: Teos, mis sisaldab perekonna vastutust uue seadme või protsessi eest. @et
label: ist Familie als Erfinderin/Erfinder von @de
definition: Setzt eine Familie in Beziehung zu einem Werk, bei dem eine Familie für die Schaffung eines neuen Geräts oder Prozesses verantwortlich ist. @de
toolkit label: Familie als Erfinderin/Erfinder von @de
toolkit definition: Ein Werk, bei dem eine Familie für die Schaffung eines neuen Geräts oder Prozesses verantwortlich ist. @de
label: feltaláló családja a következőnek: @hu
definition: Hozzákapcsol egy családot egy műhöz, amelyhez hozzátartozik egy család felelőssége egy új eszköz vagy eljárás létrehozásáért. @hu
toolkit label: feltaláló családja: @hu
toolkit definition: Egy mű, amelyhez hozzátartozik egy család felelőssége egy új eszköz vagy eljárás létrehozásáért. @hu
label: è inventore famiglia di @it
definition: Correla una famiglia a un'opera che implica una responsabilità di una famiglia per un nuovo strumento o processo. @it
toolkit label: inventore famiglia di @it
toolkit definition: Opera che implica una responsabilità di una famiglia per un nuovo strumento o processo. @it
label: είναι εφευρέτης οικογένεια του @el
toolkit label: εφευρέτης οικογένεια του @el
label: est une famille inventrice de @fr
definition: Met une famille en relation avec une œuvre qui comporte une responsabilité de la part d’une famille consistant à créer un nouveau dispositif ou procédé. @fr
toolkit label: famille inventrice de @fr
toolkit definition: Œuvre qui comporte une responsabilité de la part d’une famille consistant à créer un nouveau dispositif ou procédé. @fr
label: ir izgudrotājs (dzimta/ģimene) @lv
definition: Sasaista dzimtu/ģimeni ar darbu, kas ietver dzimtas/ģimenes atbildību par jaunas ierīces vai procesa radīšanu. @lv
toolkit label: ir izgudrotājs (dzimta/ģimene) @lv
toolkit definition: Darbs, kas ietver dzimtas/ģimenes atbildību par jaunas ierīces vai procesa radīšanu. @lv
label: 是……的发明者家族 @zh-hans
definition: 将一个家族与涉及创建一个新装置或新过程的一个家族的责任的一种作品关联起来。 @zh-hans
toolkit label: ……的发明者家族 @zh-hans
toolkit definition: 涉及创建一个新装置或新过程的一个家族的责任的一种作品 @zh-hans
label: mucit ailesidir @tr
definition: Bir aileyi, bir ailenin yeni bir cihaz veya süreç oluşturma sorumluluğunu içeren bir eserle ilişkilendirir. @tr
toolkit label: mucit ailesidir @tr
toolkit definition: Yeni bir cihaz veya süreç oluşturmak için bir ailenin sorumluluğunu içeren bir çalışma. @tr
has subproperty: P50979

keksijä (henkilö) teoksessa
status: Published
label: is inventor person of @en
lexical alias: inventorPersonOf.en
definition: Relates a person to a work that involves a responsibility of a person for creating a new device or process. @en
toolkit label: inventor person of @en
toolkit definition: A work that involves a responsibility of a person for creating a new device or process. @en
type: Property
domain: C10004
has element type: 2
sub property of: teoksen tekijä (henkilö) teoksessa
sub property of: keksijä (toimija) teoksessa
definition: Liittää henkilön teokseen, jossa henkilö on vastuussa uuden välineen tai menetelmän luomisesta.
toolkit label: keksijä (henkilö) teoksessa
toolkit definition: Teos, jossa henkilö on vastuussa uuden välineen tai menetelmän luomisesta.
label: er oppfinner av (person) @no
definition: Relaterer en person til et verk som involverer et ansvar for en person i form av en ny innretning eller prosess. @no
toolkit label: oppfinner av (person) @no
toolkit definition: Et verk som involverer et ansvar for en person i form av en ny innretning eller prosess. @no
label: is uitvinder-persoon van @nl
definition: Relateert een persoon aan een werk dat met zich meebrengt een verantwoordelijkheid van een persoon voor het creëren van een nieuw apparaat of proces. @nl
toolkit label: uitvinder-persoon van @nl
toolkit definition: Een werk dat met zich meebrengt een verantwoordelijkheid van een persoon voor het creëren van een nieuw apparaat of proces. @nl
label: هو شخص مخترع لـ @ar
definition: يربط شخصا بعمل يترتب عليه مسئولية شخص عن ابتكار جهاز أو عملية جديدة. @ar
toolkit label: شخص مخترع @ar
toolkit definition: عمل يترتب عليه مسئولية شخص عن ابتكار جهاز أو عملية جديدة. @ar
label: és persona inventora de @ca
definition: Relaciona una persona amb una obra que implica una responsabilitat d’una persona en la creació d’un mecanisme o procés nou. @ca
toolkit label: persona inventora de @ca
toolkit definition: Obra que implica una responsabilitat d’una persona en la creació d’un mecanisme o procés nou. @ca
label: er person, som er opfinder af @da
definition: Relaterer en person til et værk, som involverer en persons ansvar for at skabe en ny anordning eller proces. @da
toolkit label: person, som er opfinder af @da
toolkit definition: Værk, som involverer en persons ansvar for at skabe en ny anordning eller proces. @da
label: leiutaja (isik) teoses @et
definition: Seostab isiku teosega, mis sisaldab isiku vastutust uue seadme või protsessi eest. @et
toolkit label: leiutaja (isik) teoses @et
toolkit definition: Teos, mis sisaldab isiku vastutust uue seadme või protsessi eest. @et
label: ist Person als Erfinderin/Erfinder von @de
definition: Setzt eine Person in Beziehung zu einem Werk, bei dem eine Person für die Schaffung eines neuen Geräts oder Prozesses verantwortlich ist. @de
toolkit label: Person als Erfinderin/Erfinder von @de
toolkit definition: Ein Werk, bei dem eine Person für die Schaffung eines neuen Geräts oder Prozesses verantwortlich ist. @de
label: feltaláló személye a következőnek: @hu
definition: Hozzákapcsol egy személyt egy műhöz, amelyhez hozzátartozik egy személy felelőssége egy új eszköz vagy eljárás létrehozásáért. @hu
toolkit label: feltaláló személye: @hu
toolkit definition: Egy mű, amelyhez hozzátartozik egy személy felelőssége egy új eszköz vagy eljárás létrehozásáért. @hu
label: è inventore persona di @it
definition: Correla una persona a un'opera che implica una responsabilità di una persona per un nuovo dispositivo o processo. @it
toolkit label: inventore persona di @it
toolkit definition: Opera che implica una responsabilità di una persona per un nuovo dispositivo o processo. @it
label: είναι εφευρέτης φυσικό πρόσωπο του @el
toolkit label: εφευρέτης φυσικό πρόσωπο του @el
label: est une personne inventrice de @fr
definition: Met une personne en relation avec une œuvre qui comporte une responsabilité de la part d’une personne consistant à créer un nouveau dispositif ou procédé. @fr
toolkit label: personne inventrice de @fr
toolkit definition: Œuvre qui comporte une responsabilité de la part d’une personne consistant à créer un nouveau dispositif ou procédé. @fr
label: ir izgudrotājs (persona) @lv
definition: Sasaista personu ar darbu, kas ietver personas atbildību par jaunas ierīces vai procesa radīšanu. @lv
toolkit label: ir izgudrotājs (persona) @lv
toolkit definition: Darbs, kas ietver personas atbildību par jaunas ierīces vai procesa radīšanu. @lv
label: 是……的发明者个人 @zh-hans
definition: 将一个个人与涉及创建一个新装置或新过程的一个个人的责任的一种作品关联起来。 @zh-hans
toolkit label: ……的发明者个人 @zh-hans
toolkit definition: 涉及创建一个新装置或新过程的一个个人的责任的一种作品 @zh-hans
label: mucit kişisidir @tr
definition: Bir kişiyi yeni bir cihaz veya süreç yaratma sorumluluğunu içeren bir eserle ilişkilendirir. @tr
toolkit label: mucit kişisidir @tr
toolkit definition: Yeni bir cihaz veya süreç oluşturmak için bir kişinin sorumluluğunu içeren bir çalışma. @tr
has subproperty: P50526

sääntöjen ohjaaman tuomioistuimen päätös
status: Published
label: is court governed of @en
definition: Relates a corporate body to a work of a court governed by court rules, regardless of their official nature to a work. @en
type: Property
domain: C10005
sub property of: teoksen tekijä (yhteisö) teoksessa
lexical alias: courtGovernedOf.en
label: est un tribunal régi de @fr
definition: Met une collectivité en relation avec une œuvre d’un tribunal régi par des règles de pratique, sans égard à leur nature officielle. @fr
toolkit label: tribunal régi de @fr
toolkit definition: Œuvre d’un tribunal régi par des règles de pratique, sans égard à leur nature officielle. @fr
toolkit label: court governed of @en
toolkit definition: A work of a court governed by court rules, regardless of their official nature. @en
instruction number: 18.5
label: είναι δικαστήριο διεπόμενο του @el
definition: Συνδέει ένα δικαστήριο, το οποίο εφαρμόζει δικαστικούς/δικονομικούς κανόνες, ανεξάρτητα από τον επίσημο χαρακτήρα τους, με ένα έργο. @el
toolkit label: δικαστήριο διεπόμενο του @el
toolkit definition: Ένα έργο ενός δικαστηρίου που εφαρμόζει δικαστικούς/δικονομικούς κανόνες, ανεξάρτητα από τον επίσημο χαρακτήρα τους. @el
definition: Setzt eine Körperschaft in Beziehung zu einem Werk eines Gerichts, das durch gerichtliche Verfahrensvorschriften geregelt wird, unabhängig von deren förmlicher Rechtsnatur. @de
toolkit label: durch Verfahrensvorschriften geregeltes Gericht von @de
toolkit definition: Ein Werk eines Gerichts, das durch gerichtliche Verfahrensvorschriften geregelt wird, unabhängig von deren förmlicher Rechtsnatur. @de
label: er retsinstans underlagt af @da
definition: Relaterer en korporation til et værk fra en retsinstans, som er underlagt retsregler, uden hensyn til deres officielle status. @da
toolkit label: retsinstans underlagt af @da
toolkit definition: Værk fra en retsinstans, som er underlagt retsregler, uden hensyn til deres officielle status. @da
label: és tribunal regit de @ca
definition: Relaciona una entitat corporativa amb una obra d’un tribunal regit per regles de procediment, independentment de la seva natura oficial. @ca
toolkit label: tribunal regit de @ca
toolkit definition: Obra d’un tribunal regit per regles de procediment, independentment de la seva natura oficial. @ca
definition: Liittää yhteisön teokseen, joka on sääntöjen ohjaaman tuomioistuimen tekemä, riippumatta säännön virallisesta luonteesta.
toolkit label: sääntöjen ohjaaman tuomioistuimen päätös
toolkit definition: Teos, jonka on tehnyt sääntöjen ohjaama tuomioistuin riippumatta säännön virallisesta luonteesta.
toolkit label: domstol som styres for @no
toolkit definition: Et verk fra en domstol som styres av rettergangsregler, uavhengig av deres offisielle status. @no
label: ist durch Verfahrensvorschriften geregeltes Gericht von @de
has element type: 2
label: irányított bírósága a következőnek: @hu
definition: Hozzákapcsol egy testületet egy műhöz, amely bírósági szabályzatok által irányított bíróság hatálya alá tartozik, függetlenül a mű hivatalos természetétől. @hu
toolkit label: irányított bírósága: @hu
toolkit definition: Egy mű, amely bírósági szabályzatok által irányított bíróság hatálya alá tartozik, függetlenül a mű hivatalos természetétől. @hu
label: er domstol som styres for @no
definition: Relaterer en korporasjon til et verk fra en domstol som styres av rettergangsregler, uavhengig av deres offisielle status. @no
label: is hof geregeerd van @nl
definition: Relateert een corporatie aan een werk van een hof geregeerd door rechtbankregels, ongeacht hun officiële aard. @nl
toolkit label: hof geregeerd van @nl
toolkit definition: Een werk van een hof geregeerd door rechtbankregels, ongeacht hun officiële aard. @nl
label: هي محكمة تعمل وفقا لـ @ar
definition: يربط هيئة بعمل محكمة تعمل وفقا للوائح المحاكم، بغض النظر عن طابعها الرسمي. @ar
toolkit label: محكمة تعمل وفقا لـ @ar
toolkit definition: عمل محكمة وفقا للوائح المحاكم، بغض النظر عن طابعها الرسمي. @ar
label: kohus teoses @et
definition: Seostab asutuse teosega, mille on loonud menetluseeskirjadest (sõltumata nende vormilisest olemusest) juhinduv kohus. @et
toolkit label: kohus teoses @et
toolkit definition: Teos, mille on loonud menetluseeskirjadest (sõltumata nende vormilisest olemusest) juhinduv kohus. @et
label: è autorità giudiziaria disciplinata da @it
definition: Correla un ente a un'opera di un tribunale disciplinata da regole giudiziarie, indipendentemente dal loro carattere ufficiale, rispetto a un'opera. @it
toolkit label: autorità giudiziaria disciplinata da @it
toolkit definition: Opera di un tribunale disciplinata da regole giudiziarie, indipendentemente dal loro carattere ufficiale. @it
label: ir procesuālas tiesas spriedums @lv
definition: Sasaista institūciju ar darbu, ko radījusi tiesa saskaņā ar procesuālajiem noteikumiem (neatkarīgi no to formālā rakstura). @lv
toolkit label: procesuālas tiesas spriedums @lv
toolkit definition: Darbs, ko radījusi tiesa saskaņā ar procesuālajiem noteikumiem (neatkarīgi no to formālā rakstura). @lv
label: 是……的受管辖的法院 @zh-hans
definition: 将一个团体与一个通过法院规则（不管其与作品的正式性质）受管辖的法院的作品关联起来。 @zh-hans
toolkit label: ……的受管辖的法院 @zh-hans
toolkit definition: 一个通过法院规则（不管其与作品的正式性质）受管辖的法院的作品 @zh-hans
label: mahkeme yönetimindedir @tr
definition: Bir tüzel kişi, resmi niteliğine bakılmaksızın, mahkeme kuralları tarafından yönetilen bir mahkemenin bir eseri ile ilişkilendirir. @tr
toolkit label: mahkeme tarafından yönetilen @tr
toolkit definition: Bir eserin resmi niteliğine bakılmaksızın, mahkeme kuralları tarafından yönetilen bir mahkemenin eseri. @tr
has subproperty: P50044

julkaisija (toimija) teokselle
status: Published
label: is issuing agent of @en
definition: Relates an agent to a work that involves a responsibility of an agent for issuing a work, such as an official organ of the body. @en
type: Property
domain: C10002
sub property of: toimijaan liittyvä teos
label: est un agent émetteur de @fr
definition: Met un agent en relation avec une œuvre qui comporte une responsabilité de la part d’un agent consistant à publier une œuvre, tel un organe officiel de l’agent. @fr
toolkit label: agent émetteur de @fr
toolkit definition: Œuvre qui comporte une responsabilité de la part d’un agent consistant à publier une œuvre, tel un organe officiel de l’agent. @fr
toolkit label: issuing agent of @en
toolkit definition: A work that involves a responsibility of an agent for issuing a work, such as an official organ of the body. @en
instruction number: 18.5
label: είναι εκδοτικός οργανισμός φορέας του @el
definition: Συνδέει έναν φορέα, ο οποίος εκδίδει ένα έργο, όπως ένα επίσημο όργανο του οργάνου, με ένα έργο. @el
toolkit label: εκδοτικός οργανισμός φορέας του @el
toolkit definition: Ένα έργο που περιλαμβάνει μια ευθύνη για την έκδοση ενός έργου, όπως ένα επίσημο όργανο του οργάνου. @el
definition: Setzt einen Akteur in Beziehung zu einem Werk, bei dem ein Akteur für die Herausgabe eines Werks, zum Beispiel eines offiziellen Organs der Körperschaft, verantwortlich ist. @de
toolkit label: Herausgebender Akteur von @de
toolkit definition: Ein Werk, bei dem ein Akteur für die Herausgabe eines Werks, zum Beispiel eines offiziellen Organs der Körperschaft, verantwortlich ist. @de
label: er udstedende agent af @da
definition: Relaterer en agent til et værk, som involverer en agents ansvar for at udgive et værk, som et officielt organ for en organisation. @da
toolkit label: udstedende agent af @da
toolkit definition: Værk, som involverer en agents ansvar for at udgive et værk, som et officielt organ for en organisation. @da
label: és agent d’entitat editora de @ca
definition: Relaciona un agent amb una obra que implica una responsabilitat d’un agent en la publicació d’una obra, com ara un òrgan oficial de l’entitat. @ca
toolkit label: agent d’entitat editora de @ca
toolkit definition: Obra que implica una responsabilitat d’un agent en la publicació d’una obra, com ara un òrgan oficial de l’entitat. @ca
definition: Liittää toimijan teokseen, jossa toimija on vastuussa (esim. virallisena toimielimenä) teoksen julkaisemisesta.
toolkit label: julkaisija (toimija) teokselle
toolkit definition: Teos, jossa toimija on vastuussa (esim. virallisena toimielimenä) teoksen julkaisemisesta.
toolkit label: utgiverorgan for (agent) @no
toolkit definition: Et verk som involverer ansvar for en agent i form av å utgi et verk, for eksempel korporasjonens offisielle organ. @no
label: ist herausgebender Akteur von @de
has element type: 2
label: kibocsátó ágense a következőnek: @hu
definition: Hozzákapcsol egy ágenst egy műhöz, amelyhez hozzátartozik egy ágens felelőssége egy olyan mű kibocsátásáért, mint amilyen egy társaság hivatalos orgánuma. @hu
toolkit label: kibocsátó ágense: @hu
toolkit definition: Egy mű, amelyhez hozzátartozik egy ágens felelőssége egy olyan mű kibocsátásáért, mint amilyen egy társaság hivatalos orgánuma. @hu
alternative label: issuing body of @en
alternative label: julkaisija manifestaatiossa
label: er utgiverorgan for (agent) @no
definition: Relaterer en agent til et verk som involverer ansvar for en agent i form av å utgi et verk, for eksempel korporasjonens offisielle organ. @no
alternative label: utgiverorgan for @no
lexical alias: issuingAgentOf.en
label: is uitvaardiger-actor van @nl
definition: Relateert een actor aan een werk dat met zich meebrengt een verantwoordelijkheid van een actor voor uitvaardigen van een werk, zoals een officieel orgaan van de instantie. @nl
toolkit label: uitvaardiger-actor van @nl
toolkit definition: Een werk dat met zich meebrengt een verantwoordelijkheid van een actor voor uitvaardigen van een werk, zoals een officieel orgaan van de instantie. @nl
label: هو وكيل جهة إصدار لـ @ar
definition: يربط وكيلا بعمل يترتب عليه مسئولية وكيل عن إصدار عمل، مثل الصحيفة الرسمية للهيئة. @ar
alternative label: جهة إصدار @ar
toolkit label: وكيل جهة إصدار @ar
toolkit definition: عمل يترتب عليه مسئولية وكيل عن إصدار عمل، مثل الصحيفة الرسمية للهيئة. @ar
alternative label: entitat editora de @ca
alternative label: ansvarlig institution af @da
label: väljaandja (tegija) teoses @et
definition: Seostab tegija teosega, mis sisaldab tegija vastutust teose, nt asutuse ametliku häälekandja väljaandmise eest. @et
alternative label: väljaandja teoses @et
toolkit label: väljaandja (tegija) teoses @et
toolkit definition: Teos, mis sisaldab tegija vastutust teose, nt asutuse ametliku häälekandja väljaandmise eest. @et
alternative label: kibocsátója: @hu
label: è ente emittente agente di @it
definition: Correla un agente a un opera che implica la responsabilità di un agente per l'emissione di un'opera, come un organo ufficiale dell'ente. @it
alternative label: organismo emittente di @it
toolkit label: organismo emittente agente di @it
toolkit definition: Opera che implica la responsabilità di un agente per l'emissione di un'opera, come un organo ufficiale dell'ente. @it
alternative label: εκδοτικός οργανισμός του @el
alternative label: organisme de publication de @fr
label: ir publicētājs (aģents) @lv
definition: Sasaista aģentu ar darbu, kas ietver aģenta atbildību par darba publicēšanu, piemēram, iestādes biļetens. @lv
toolkit label: ir publicētājs (aģents) @lv
toolkit definition: Darbs, kas ietver aģenta atbildību par darba publicēšanu, piemēram, iestādes biļetens. @lv
alternative label: Herausgebendes Organ von @de
alternative label: ……的颁布团体 @zh-hans
toolkit label: ……的颁布行为者 @zh-hans
toolkit definition: 涉及一个颁布一种作品（例如一个团体的机关刊物）的一个行为者的责任的一种作品 @zh-hans
toolkit label: Yayınlayan temsilcisi @tr
toolkit definition: Bir kurumun resmi bir organı gibi, bir eserin yayınlanmasına ilişkin bir temsilcinin sorumluluğunu içeren bir eser. @tr
has subproperty: julkaisija (yhteistoimija) teokselle

julkaisija (yhteistoimija) teokselle
status: Published
label: is issuing collective agent of @en
definition: Relates a collective agent to a work that involves a responsibility of a collective agent for issuing a work, such as an official organ of the body. @en
toolkit label: issuing collective agent of @en
toolkit definition: A work that involves a responsibility of a collective agent for issuing a work, such as an official organ of the body. @en
type: Property
domain: C10011
has element type: 2
sub property of: yhteistoimijaan liittyvä teos
sub property of: julkaisija (toimija) teokselle
definition: Liittää yhteistoimijan teokseen, jossa yhteistoimija on vastuussa (esim. virallisena toimielimenä) teoksen julkaisemisesta.
toolkit label: julkaisija (yhteistoimija) teokselle
toolkit definition: Teos, jossa yhteishenkilö on vastuussa (esim. virallisena toimielimenä) teoksen julkaisemisesta.
label: er utgiver av (kollektiv agent) @no
definition: Relaterer en kollektiv agent til et verk som involverer et ansvar for en kollektiv agent i form av å utgi et verk. @no
toolkit label: utgiver av (kollektiv agent) @no
toolkit definition: Et verk som involverer et ansvar for en kollektiv agent i form av å utgi et verk. @no
lexical alias: issuingCollectiveAgentOf.en
label: is uitvaardiger-collectieve actor van @nl
definition: Relateert een collectieve actor aan een werk dat met zich meebrengt een verantwoordelijkheid van een collectieve actor voor uitvaardigen van een werk, zoals een officieel orgaan van de instantie. @nl
toolkit label: uitvaardiger-collectieve actor van @nl
toolkit definition: Een werk dat met zich meebrengt een verantwoordelijkheid van een collectieve actor voor uitvaardigen van een werk, zoals een officieel orgaan van de instantie. @nl
label: هو وكيل جماعي جهة إصدار لـ @ar
definition: يربط وكيلا جماعيا بعمل يترتب عليه مسئولية وكيل جماعي عن إصدار عمل، مثل جريدة رسمية لجهة. @ar
toolkit label: وكيل جماعي جهة إصدار @ar
toolkit definition: عمل يترتب عليه مسئولية وكيل جماعي عن إصدار عمل، مثل الجريدة الرسمية لهيئة. @ar
label: és agent col·lectiu d’entitat editora de @ca
definition: Relaciona un agent col·lectiu amb una obra que implica una responsabilitat d’un agent col·lectiu en la publicació d’una obra, com ara un òrgan oficial de l’entitat. @ca
toolkit label: agent col·lectiu d’entitat editora de @ca
toolkit definition: Obra que implica una responsabilitat d’un agent col·lectiu en la publicació d’una obra, com ara un òrgan oficial de l’entitat. @ca
label: er udgivende kollektiv agent af @da
definition: Relaterer en kollektiv agent til et værk, som involverer en kollektiv agents ansvar for at udgive et værk, som et officielt organ for en organisation. @da
toolkit label: udgivende kollektiv agent af @da
toolkit definition: Værk, som involverer en kollektiv agents ansvar for at udgive et værk, som et officielt organ for en organisation. @da
label: väljaandja (kollektiiv) teoses @et
definition: Seostab kollektiivi teosega, mis sisaldab kollektiivi vastutust teose, nt asutuse ametliku häälekandja väljaandmise eest. @et
toolkit label: väljaandja (kollektiiv) teoses @et
toolkit definition: Teos, mis sisaldab kollektiivi vastutust teose, nt asutuse ametliku häälekandja väljaandmise eest. @et
label: ist herausgebender gemeinschaftlicher Akteur von @de
definition: Setzt einen gemeinschaftlichen Akteur in Beziehung zu einem Werk, bei dem ein gemeinschaftlicher Akteur für die Herausgabe eines Werks, zum Beispiel eines offiziellen Organs der Körperschaft, verantwortlich ist. @de
toolkit label: Herausgebender gemeinschaftlicher Akteur von @de
toolkit definition: Ein Werk, bei dem ein gemeinschaftlicher Akteur für die Herausgabe eines Werks, zum Beispiel eines offiziellen Organs der Körperschaft, verantwortlich ist. @de
label: kibocsátó kollektív ágense a következőnek: @hu
definition: Hozzákapcsol egy kollektív ágenst egy műhöz, amelyhez hozzátartozik egy kollektív ágens felelőssége egy olyan mű kibocsátásáért, mint amilyen egy társaság hivatalos orgánuma. @hu
toolkit label: kibocsátó kollektív ágense: @hu
toolkit definition: Egy mű, amelyhez hozzátartozik egy kollektív ágens felelőssége egy olyan mű kibocsátásáért, mint amilyen egy társaság hivatalos orgánuma. @hu
label: è ente emittente agente collettivo di @it
definition: Correla un agente collettivo a un'opera che implica una responsabilità di un agente collettivo per l'emissione di un'opera, come un organo ufficiale dell'ente. @it
toolkit label: ente emittente agente collettivo di @it
toolkit definition: Opera che implica una responsabilità di un agente collettivo per l'emissione di un'opera, come un organo ufficiale dell'ente. @it
label: είναι οργανισμός έκδοσης συλλογικός φορέας του @el
toolkit label: οργανισμός έκδοσης συλλογικός φορέας του @el
label: est un agent collectif émetteur de @fr
definition: Met un agent collectif en relation avec une œuvre qui comporte une responsabilité de la part d’un agent collectif consistant à publier une œuvre, tel un organe officiel de l’agent collectif. @fr
toolkit label: agent collectif émetteur de @fr
toolkit definition: Œuvre qui comporte une responsabilité de la part d’un agent collectif consistant à publier une œuvre, tel un organe officiel de l’agent collectif. @fr
label: ir publicētājs (grupa) @lv
definition: Sasaista grupu ar darbu, kas ietver grupas atbildību par darba publicēšanu, piemēram, iestādes biļetens. @lv
toolkit label: ir publicētājs (grupa) @lv
toolkit definition: Darbs, kas ietver grupas atbildību par darba publicēšanu, piemēram, iestādes biļetens. @lv
label: 是……的颁布集体行为者 @zh-hans
definition: 将一个集体行为者与涉及一个颁布一种作品（例如一个团体的机关刊物）的一个集体行为者的责任的一种作品关联起来。 @zh-hans
toolkit label: ……的颁布集体行为者 @zh-hans
toolkit definition: 涉及一个颁布一种作品（例如一个团体的机关刊物）的一个集体行为者的责任的一种作品 @zh-hans
label: piyasaya çıkaran kolektif temsilcisidir @tr
definition: Kollektif bir temsilciyi, kuruluşun resmi bir organı gibi, bir eseri yayınlama sorumluluğunu içeren bir eseri ilişkilendirir. @tr
toolkit label: yayınlayan kollektif temsilcisi @tr
toolkit definition: Kuruluşun resmi bir organı gibi, bir eser yayınlamak için kollektif bir temsilci sorumluluğunu içeren bir eser. @tr
has subproperty: julkaisija (yhteisö) teokselle
has subproperty: julkaisija (suku) teokselle
has subproperty: P50697

julkaisija (yhteisö) teokselle
status: Published
label: is issuing corporate body of @en
definition: Relates a corporate body to a work that involves a responsibility of a corporate body for issuing a work, such as an official organ of the body. @en
toolkit label: issuing corporate body of @en
toolkit definition: A work that involves a responsibility of a corporate body for issuing a work, such as an official organ of the body. @en
type: Property
domain: C10005
has element type: 2
sub property of: julkaisija (yhteistoimija) teokselle
definition: Liittää yhteisön teokseen, jossa yhteisö on vastuussa (esim. virallisena toimielimenä) teoksen julkaisemisesta.
toolkit label: julkaisija (yhteisö) teokselle
toolkit definition: Teos, jossa yhteisö on vastuussa (esim. virallisena toimielimenä) teoksen julkaisemisesta.
label: er utgiver av (korporasjon) @no
definition: Relaterer en korporasjon til et verk som involverer et ansvar for en korporasjon i form av å utgi et verk. @no
toolkit label: utgiver av (korporasjon) @no
toolkit definition: Et verk som involverer et ansvar for en korporasjon i form av å utgi et verk. @no
sub property of: yhteisöön liittyvä teos
lexical alias: issuingCorporateBodyOf.en
label: is uitvaardiger-corporatie van @nl
definition: Relateert een corporatie aan een werk dat met zich meebrengt een verantwoordelijkheid van een corporatie voor uitvaardigen van een werk, zoals een officieel orgaan van de instantie. @nl
toolkit label: uitvaardiger-corporatie van @nl
toolkit definition: Een werk dat met zich meebrengt een verantwoordelijkheid van een corporatie voor uitvaardigen van een werk, zoals een officieel orgaan van de instantie. @nl
label: هي هيئة جهة إصدار لـ @ar
definition: يربط هيئة بعمل يترتب عليه مسئولية هيئة عن إصدار عمل، مثل جريدة رسمية لجهة. @ar
toolkit label: هيئة جهة إصدار @ar
toolkit definition: عمل يترتب عليه مسئولية هيئة عن إصدار عمل، مثل جريدة رسمية لجهة. @ar
label: és entitat corporativa d’entitat editora de @ca
definition: Relaciona una entitat corporativa amb una obra que implica una responsabilitat d’una entitat corporativa en la publicació d’una obra, com ara un òrgan oficial de l’entitat. @ca
toolkit label: entitat corporativa d’entitat editora de @ca
toolkit definition: Obra que implica una responsabilitat d’una entitat corporativa en la publicació d’una obra, com ara un òrgan oficial de l’entitat. @ca
label: er korporation, som er udstedende organ af @da
definition: Relaterer en korporation til et værk, som involverer en korporations ansvar for at udgive et værk, som et officielt organ for en organisation. @da
toolkit label: korporation, som er udstedende organ af @da
toolkit definition: Værk, som involverer en korporations ansvar for at udgive et værk, som et officielt organ for en organisation. @da
label: väljaandja (asutus) teoses @et
definition: Seostab asutuse teosega, mis sisaldab asutuse vastutust teose, nt asutuse ametliku häälekandja väljaandmise eest. @et
toolkit label: väljaandja (asutus) teoses @et
toolkit definition: Teos, mis sisaldab asutuse vastutust teose, nt asutuse ametliku häälekandja väljaandmise eest. @et
label: ist herausgebende Körperschaft von @de
definition: Setzt eine Körperschaft in Beziehung zu einem Werk, bei dem eine Körperschaft für die Herausgabe eines Werks, zum Beispiel eines offiziellen Organs der Körperschaft, verantwortlich ist. @de
toolkit label: Herausgebende Körperschaft von @de
toolkit definition: Ein Werk, bei dem eine Körperschaft für die Herausgabe eines Werks, zum Beispiel eines offiziellen Organs der Körperschaft, verantwortlich ist. @de
label: kibocsátó testülete a következőnek: @hu
definition: Hozzákapcsol egy testületet egy műhöz, amelyhez hozzátartozik egy testület felelőssége egy olyan mű kibocsátásáért, mint amilyen egy társaság hivatalos orgánuma. @hu
toolkit label: kibocsátó testülete: @hu
toolkit definition: Egy mű, amelyhez hozzátartozik egy testület felelőssége egy olyan mű kibocsátásáért, mint amilyen egy társaság hivatalos orgánuma. @hu
label: è ente emittente ente di @it
definition: Correla un un ente con un'opera che implica una responsabilità di un ente per l'emissione di un'opera, come un organo ufficiale dell'ente. @it
toolkit label: ente emittente ente di @it
toolkit definition: Opera che implica una responsabilità di un ente per l'emissione di un'opera, come un organo ufficiale dell'ente. @it
label: είναι οργανισμός έκδοσης συλλογικό όργανο του @el
toolkit label: οργανισμός έκδοσης συλλογικό όργανο του @el
label: est une collectivité émettrice de @fr
definition: Met une collectivité en relation avec une œuvre qui comporte une responsabilité de la part d’une collectivité consistant à publier une œuvre, tel un organe officiel de la collectivité. @fr
toolkit label: collectivité émettrice de @fr
toolkit definition: Œuvre qui comporte une responsabilité de la part d’une collectivité consistant à publier une œuvre, tel un organe officiel de la collectivité. @fr
label: ir publicētājs (institūcija) @lv
definition: Sasaista institūciju ar darbu, kas ietver institūcijas atbildību par darba publicēšanu, piemēram, iestādes biļetens. @lv
toolkit label: ir publicētājs (institūcija) @lv
toolkit definition: Darbs, kas ietver institūcijas atbildību par darba publicēšanu, piemēram, iestādes biļetens. @lv
label: 是……的颁布团体 @zh-hans
definition: 将一个团体与涉及一个颁布一种作品（例如一个团体的机关刊物）的一个团体的责任的一种作品关联起来。 @zh-hans
toolkit label: ……的颁布团体 @zh-hans
toolkit definition: 涉及一个颁布一种作品（例如一个团体的机关刊物）的一个团体的责任的一种作品 @zh-hans
label: piyasaya çıkaran tüzel kişisidir @tr
definition: Bir tüzel kişiyi, tüzel kişiliğin resmi bir organı gibi bir eser yayınlama sorumluluğunu içeren bir eserle ilişkilendirir. @tr
toolkit label: Yayınlayan tüzel kişi @tr
toolkit definition: Bir kurumun resmi bir organı gibi, bir eserin yayınlanmasına ilişkin tüzel bir kişinin sorumluluğunu içeren bir eser. @tr
has subproperty: P50848

julkaisija (suku) teokselle
status: Published
label: is issuing family of @en
definition: Relates a family to a work that involves a responsibility of a family for issuing a work, such as an official organ of the body. @en
toolkit label: issuing family of @en
toolkit definition: A work that involves a responsibility of a family for issuing a work, such as an official organ of the body. @en
type: Property
domain: C10008
has element type: 2
sub property of: sukuun liittyvä teos
sub property of: julkaisija (yhteistoimija) teokselle
definition: Liittää suvun teokseen, jossa suku on vastuussa (esim. virallisena toimielimenä) teoksen julkaisemisesta.
toolkit label: julkaisija (suku) teokselle
toolkit definition: Teos, jossa suku on vastuussa (esim. virallisena toimielimenä) teoksen julkaisemisesta.
label: er utgiver av (familie) @no
definition: Relaterer en familie til et verk som involverer et ansvar for en familie i form av å utgi et verk. @no
toolkit label: utgiver av (familie) @no
toolkit definition: Et verk som involverer et ansvar for en familie i form av å utgi et verk. @no
lexical alias: issuingFamilyOf.en
label: is uitvaardiger-familie van @nl
definition: Relateert een familie aan een werk dat met zich meebrengt een verantwoordelijkheid van een familie voor uitvaardigen van een werk, zoals een officieel orgaan van de instantie. @nl
toolkit label: uitvaardiger-familie van @nl
toolkit definition: Een werk dat met zich meebrengt een verantwoordelijkheid van een familie voor uitvaardigen van een werk, zoals een officieel orgaan van de instantie. @nl
label: هي عائلة جهة إصدار لـ @ar
definition: يربط عائلة بعمل يترتب عليه مسئولية عائلة عن إصدار عمل، مثل جريدة رسمية لجهة. @ar
toolkit label: عائلة جهة إصدار @ar
toolkit definition: عمل يترتب عليه مسئولية عائلة عن إصدار عمل، مثل جريدة رسمية لجهة. @ar
label: és família d’entitat editora de @ca
definition: Relaciona una família amb una obra que implica una responsabilitat d’una família en la publicació d’una obra, com ara un òrgan oficial de l’entitat. @ca
toolkit label: família d’entitat editora de @ca
toolkit definition: Obra que implica una responsabilitat d’una família en la publicació d’una obra, com ara un òrgan oficial de l’entitat. @ca
label: er familie, som er udstedende af @da
definition: Relaterer en familie til et værk, som involverer en families ansvar for at udgive et værk, som et officielt organ for en organisation. @da
toolkit label: familie, som er udstedende af @da
toolkit definition: Værk, som involverer en families ansvar for at udgive et værk, som et officielt organ for en organisation. @da
label: väljaandja (perekond) teoses @et
definition: Seostab perekonna teosega, mis sisaldab perekonna vastutust teose, nt asutuse ametliku häälekandja väljaandmise eest. @et
toolkit label: väljaandja (perekond) teoses @et
toolkit definition: Teos, mis sisaldab perekonna vastutust teose, nt asutuse ametliku häälekandja väljaandmise eest. @et
label: ist herausgebende Familie von @de
definition: Setzt eine Familie in Beziehung zu einem Werk, bei dem eine Familie für die Herausgabe eines Werks, zum Beispiel eines offiziellen Organs der Körperschaft, verantwortlich ist. @de
toolkit label: Herausgebende Familie von @de
toolkit definition: Ein Werk, bei dem eine Familie für die Herausgabe eines Werks, zum Beispiel eines offiziellen Organs der Körperschaft, verantwortlich ist. @de
label: kibocsátó családja a következőnek: @hu
definition: Hozzákapcsol egy családot egy műhöz, amelyhez hozzátartozik egy család felelőssége egy olyan mű kibocsátásáért, mint amilyen egy társaság hivatalos orgánuma. @hu
toolkit label: kibocsátó családja: @hu
toolkit definition: Egy mű, amelyhez hozzátartozik egy család felelőssége egy olyan mű kibocsátásáért, mint amilyen egy társaság hivatalos orgánuma. @hu
label: è ente emittente famiglia di @it
definition: Correla una famiglia a un'opera che implica una responsabilità di una famiglia per l'emissione di un'opera, come un organo ufficiale dell'ente. @it
toolkit label: ente emittente famiglia di @it
toolkit definition: Opera che implica una responsabilità di una famiglia per l'emissione di un'opera, come un organo ufficiale dell'ente. @it
label: είναι οργανισμός έκδοσης οικογένεια του @el
toolkit label: οργανισμός έκδοσης οικογένεια του @el
label: est une famille émettrice de @fr
definition: Met une famille en relation avec une œuvre qui comporte une responsabilité de la part d’une famille consistant à publier une œuvre, tel un organe officiel de la famille. @fr
toolkit label: famille émettrice de @fr
toolkit definition: Œuvre qui comporte une responsabilité de la part d’une famille consistant à publier une œuvre, tel un organe officiel de la famille. @fr
label: ir publicētājs (dzimta/ģimene) @lv
definition: Sasaista dzimtu/ģimeni ar darbu, kas ietver dzimtas/ģimenes atbildību par darba publicēšanu, piemēram, iestādes biļetens. @lv
toolkit label: ir publicētājs (dzimta/ģimene) @lv
toolkit definition: Darbs, kas ietver dzimtas/ģimenes atbildību par darba publicēšanu, piemēram, iestādes biļetens. @lv
label: 是……的颁布家族 @zh-hans
definition: 将一个家族与涉及一个颁布一种作品（例如一个团体的机关刊物）的一个家族的责任的一种作品关联起来。 @zh-hans
toolkit label: ……的颁布家族 @zh-hans
toolkit definition: 涉及一个颁布一种作品（例如一个团体的机关刊物）的一个家族的责任的一种作品 @zh-hans
label: piyasaya çıkaran ailesidir @tr
definition: Bir aileyi, resmi bir organ gibi bir eserin çıkarılmasında bir ailenin sorumluluğunu içeren bir eserle ilişkilendirir. @tr
toolkit label: yayınlayan ailesi @tr
toolkit definition: Bir kurumun resmi bir organı gibi, bir eserin yayınlanmasına ilişkin bir ailenin sorumluluğunu içeren bir eser. @tr
has subproperty: P50999

julkaisija (henkilö) teokselle
status: Published
label: is issuing person of @en
definition: Relates a person to a work that involves a responsibility of a person for issuing a work, such as an official organ of the body. @en
toolkit label: issuing person of @en
toolkit definition: A work that involves a responsibility of a person for issuing a work, such as an official organ of the body. @en
type: Property
domain: C10004
has element type: 2
sub property of: henkilöön liittyvä teos
sub property of: julkaisija (toimija) teokselle
definition: Liittää henkilön teokseen, jossa henkilö on vastuussa (esim. virallisena toimielimenä) teoksen julkaisemisesta.
toolkit label: julkaisija (henkilö) teokselle
toolkit definition: Teos, jossa henkilö on vastuussa (esim. virallisena toimielimenä) teoksen julkaisemisesta.
label: er utgiver av (person) @no
definition: Relaterer en person til et verk som involverer et ansvar for en person i form av å utgi et verk. @no
toolkit label: utgiver av (person) @no
toolkit definition: Et verk som involverer et ansvar for en person i form av å utgi et verk. @no
lexical alias: issuingPersonOf.en
label: is uitvaardiger-persoon van @nl
definition: Relateert een persoon aan een werk dat met zich meebrengt een verantwoordelijkheid van een persoon voor uitvaardigen van een werk, zoals een officieel orgaan van de instantie. @nl
toolkit label: uitvaardiger-persoon van @nl
toolkit definition: Een werk dat met zich meebrengt een verantwoordelijkheid van een persoon voor uitvaardigen van een werk, zoals een officieel orgaan van de instantie. @nl
label: هو شخص جهة إصدار لـ @ar
definition: يربط شخصا بعمل يترتب عليه مسئولية شخص عن إصدار عمل، مثل الصحيفة الرسمية لهيئة. @ar
toolkit label: شخص جهة إصدار @ar
toolkit definition: عمل يترتب عليه مسئولية شخص عن إصدار عمل، مثل الصحيفة الرسمية لهيئة. @ar
label: és persona d’entitat editora de @ca
definition: Relaciona una persona amb una obra que implica una responsabilitat d’una persona en la publicació d’una obra, com ara un òrgan oficial de l’entitat. @ca
toolkit label: persona d’entitat editora de @ca
toolkit definition: Obra que implica una responsabilitat d’una persona en la publicació d’una obra, com ara un òrgan oficial de l’entitat. @ca
label: er udstedende person af @da
definition: Relaterer en person til et værk, som involverer en persons ansvar for at udgive et værk, som et officielt organ for en organisation. @da
toolkit label: udstedende person af @da
toolkit definition: Værk, som involverer en persons ansvar for at udgive et værk, som et officielt organ for en organisation. @da
label: väljaandja (isik) teoses @et
definition: Seostab isiku teosega, mis sisaldab isiku vastutust teose, nt asutuse ametliku häälekandja väljaandmise eest. @et
toolkit label: väljaandja (isik) teoses @et
toolkit definition: Teos, mis sisaldab isiku vastutust teose, nt asutuse ametliku häälekandja väljaandmise eest. @et
label: ist herausgebende Person von @de
definition: Setzt eine Person in Beziehung zu einem Werk, bei dem eine Person für die Herausgabe eines Werks, zum Beispiel eines offiziellen Organs der Körperschaft, verantwortlich ist. @de
toolkit label: Herausgebende Person von @de
toolkit definition: Ein Werk, bei dem eine Person für die Herausgabe eines Werks, zum Beispiel eines offiziellen Organs der Körperschaft, verantwortlich ist. @de
label: kibocsátó személye a következőnek: @hu
definition: Hozzákapcsol egy személyt egy műhöz, amelyhez hozzátartozik egy személy felelőssége egy olyan mű kibocsátásáért, mint amilyen egy társaság hivatalos orgánuma. @hu
toolkit label: kibocsátó személye: @hu
toolkit definition: Egy mű, amelyhez hozzátartozik egy személy felelőssége egy olyan mű kibocsátásáért, mint amilyen egy társaság hivatalos orgánuma. @hu
label: è ente emittente persona di @it
definition: Correla una persona a un'opera che implica una responsabilità di una persona per l'emissione di un'opera, come un organo ufficiale dell'ente. @it
toolkit label: ente emittente persona di @it
toolkit definition: Opera che implica una responsabilità di una persona per l'emissione di un'opera, come un organo ufficiale dell'ente. @it
label: είναι οργανισμός έκδοσης φυσικό πρόσωπο του @el
toolkit label: οργανισμός έκδοσης φυσικό πρόσωπο του @el
label: est une personne émettrice de @fr
definition: Met une personne en relation avec une œuvre qui comporte une responsabilité de la part d’une personne consistant à publier une œuvre, tel un organe officiel de la personne. @fr
toolkit label: personne émettrice de @fr
toolkit definition: Œuvre qui comporte une responsabilité de la part d’une personne consistant à publier une œuvre, tel un organe officiel de la personne. @fr
label: ir publicētājs (persona) @lv
definition: Sasaista personu ar darbu, kas ietver personas atbildību par darba publicēšanu, piemēram, iestādes biļetens. @lv
toolkit label: ir publicētājs (persona) @lv
toolkit definition: Darbs, kas ietver personas atbildību par darba publicēšanu, piemēram, iestādes biļetens. @lv
label: 是……的颁布个人 @zh-hans
definition: 将一个个人与涉及一个颁布一种作品（例如一个团体的机关刊物）的个人的责任的一种作品关联起来。 @zh-hans
toolkit label: ……的颁布个人 @zh-hans
toolkit definition: 涉及一个颁布一种作品（例如一个团体的机关刊物）的个人的责任的一种作品 @zh-hans
label: piyasaya çıkaran kişisidir @tr
definition: Bir kişiyi, vücudun resmi bir organı gibi bir eser yayınlama sorumluluğunu içeren bir eserle ilişkilendirir. @tr
toolkit label: Yayınlayan kişisi @tr
toolkit definition: Bir kurumun resmi bir organı gibi, bir eserin yayınlanmasına ilişkin bir kişinin sorumluluğunu içeren bir eser. @tr
has subproperty: P50546

lisähuomautusten kirjoittaja kappaleessa
status: Published
label: is annotator of @en
definition: Relates a person to an item that carries notes and other information added by hand. @en
type: Property
domain: C10004
sub property of: muokkaaja (henkilö) kappaleessa
lexical alias: annotatorOf.en
label: est un annotateur de @fr
definition: Met une personne en relation avec un item qui porte des notes ou d’autres informations ajoutées à la main. @fr
toolkit label: annotateur de @fr
toolkit definition: Item qui porte des notes ou d’autres informations ajoutées à la main. @fr
toolkit label: annotator of @en
toolkit definition: An item that carries notes and other information added by hand. @en
instruction number: 18.5
label: είναι σχολιαστής του @el
definition: Συνδέει ένα φυσικό πρόσωπο, το οποίο δημιουργεί χειρόγραφα σχόλια/σημειώσεις σε ένα αντίτυπο, με ένα αντίτυπο. @el
toolkit label: σχολιαστής του @el
toolkit definition: Ένα αντίτυπο που φέρει χειρόγραφες σημειώσεις. @el
definition: Setzt eine Person in Beziehung zu einem Exemplar, das handschriftlich Anmerkungen und andere Informationen beinhaltet. @de
toolkit label: Annotierende Person von @de
toolkit definition: Ein Exemplar, das handschriftlich Anmerkungen und andere Informationen beinhaltet. @de
label: er annoteringsskriver af @da
definition: Relaterer en person til et eksemplar, som har noter og anden information skrevet i hånden. @da
toolkit label: annoteringsskriver af @da
toolkit definition: Eksemplar, som har noter og anden information skrevet i hånden. @da
label: és anotador de @ca
definition: Relaciona una persona amb un ítem que porta notes i altra informació afegida a mà. @ca
toolkit label: anotador de @ca
toolkit definition: Ítem que porta notes i altra informació afegida a mà. @ca
definition: Liittää henkilön kappaleeseen, joka sisältää käsinkirjoitettuja huomautuksia ja muita selityksiä.
toolkit label: lisähuomautusten kirjoittaja kappaleessa
toolkit definition: Kappale, joka sisältää käsinkirjoitettuja huomautuksia ja muita selityksiä.
toolkit label: annoterende person for @no
toolkit definition: Et eksemplar som har håndskrevne notater og annen informasjon. @no
label: ist annotierende Person von @de
has element type: 2
label: jegyzetekkel ellátója a következőnek: @hu
definition: Hozzákapcsol egy személyt egy példányhoz, amely jegyzeteket és más, kézzel írott információt hordoz. @hu
toolkit label: jegyzetekkel ellátója: @hu
toolkit definition: Egy példány, amely jegyzeteket és más, kézzel írott információt hordoz. @hu
alternative label: huomautusten kirjoittajana kappaleessa
label: er annoterende person for @no
definition: Relaterer en person til et eksemplar som har håndskrevne notater og annen informasjon. @no
label: is annotator van @nl
definition: Relateert een persoon aan een item waarop noten en andere informatie met de hand toegevoegd zijn. @nl
toolkit label: annotator van @nl
toolkit definition: Een item waarop noten en andere informatie met de hand toegevoegd zijn. @nl
label: هو مُعلِّق على @ar
definition: يربط شخصا بمفردة تشتمل على ملاحظات ومعلومات أخرى أضيفت بخط اليد. @ar
toolkit label: مُعلِق على @ar
toolkit definition: مفردة تشتمل على ملاحظات ومعلومات أخرى أضيفت بخط اليد. @ar
label: sissekirjutuste autor eksemplaris @et
definition: Seostab isiku eksemplariga, milles on käsitsi kirjutatud märkusi ja muud infot. @et
toolkit label: sissekirjutuste autor eksemplaris @et
toolkit definition: Eksemplar, milles on käsitsi kirjutatud märkusi ja muud infot. @et
label: è annotatore di @it
definition: Correla una persona a un item che riporta note e altre informazioni aggiunte a mano. @it
toolkit label: annotatore di @it
toolkit definition: Item che riporta note e altre informazioni aggiunte a mano. @it
label: ir anotējis @lv
definition: Sasaista personu ar vienību, kurai ir pievienotas ar roku rakstītas piezīmes vai cita informācija. @lv
toolkit label: anotējis @lv
toolkit definition: Vienība, kurai ir pievienotas ar roku rakstītas piezīmes vai cita informācija @lv
label: 是……的手写批注者 @zh-hans
definition: 将一个个人与载有手加批注和其他信息的单件关联起来。 @zh-hans
toolkit label: ……的手写批注者 @zh-hans
toolkit definition: 载有手加批注和其他信息的单件 @zh-hans
label: yorumlayıcısıdır @tr
definition: Bir kişiyi, el yazısı notlar ve diğer bilgileri içeren bir kopyayla ilişkilendirir. @tr
toolkit label: yorumlayıcı @tr
toolkit definition: Elle eklenen notları ve diğer bilgileri taşıyan bir kopya. @tr
has subproperty: P50128

julkishallinnollisen yhteisön hallintoalue
status: Published
label: has place governed @en
type: Property
definition: Relates a corporate body to a place that is governed by a corporate body who is a government. @en
domain: C10005
sub property of: yhteisöön liittyvä paikka
toolkit label: place governed @en
toolkit definition: A place that is governed by a corporate body who is a government. @en
has element type: 2
definition: Liittää yhteisön hallintoalueeseen, joka on julkishallinnollisen yhteisön hallinnoima.
toolkit label: julkishallinnollisen yhteisön hallintoalue
toolkit definition: Hallintoalue, joka on julkishallinnollisen yhteisön hallinnoima.
label: har jurisdiksjon som styres @no
definition: Relaterer en korporasjon til et sted som er en jurisdiksjon som styres ved lov, vedtekt, etc., som ble vedtatt av en annen myndighet. @no
toolkit label: jurisdiksjon som styres @no
toolkit definition: Et sted som er en jurisdiksjon som styres ved lov, vedtekt, etc., som ble vedtatt av en annen myndighet. @no
label: heeft geregeerde jurisdictie @nl
definition: Relateert een corporatie aan een plaats die een jurisdictie is geregeerd door een wet, regeling etc. die vastgesteld werd door een andere regering. @nl
toolkit label: geregeerde jurisdictie @nl
toolkit definition: Een plaats die een jurisdictie is geregeerd door een wet, regeling etc. die vastgesteld werd door een andere regering. @nl
label: له اختصاص قضائي @ar
definition: يربط هيئة بمكان يخضع لسلطة قضائية يحكمها قانون أو لائحة تنظيمية، إلخ، سنتها حكومة أخرى. @ar
toolkit label: اختصاص قضائي @ar
toolkit definition: مكان يخضع لسلطة قضائية يحكمها قانون أو لائحة تنظيمية، إلخ، سنتها حكومة أخرى. @ar
label: té com a lloc regit @ca
definition: Relaciona una entitat corporativa amb un lloc que és regit per una entitat corporativa que és un govern. @ca
toolkit label: lloc regit @ca
toolkit definition: Un lloc que és regit per una entitat corporativa que és un govern. @ca
label: har jurisdiktion underlagt @da
definition: Relaterer en korporation til et sted, som er en jurisdiktion, som er underlagt en lov, forordning, etc., som blev vedtaget af en anden myndighed. @da
toolkit label: jurisdiktion underlagt @da
toolkit definition: Sted, som er en jurisdiktion, som er underlagt en lov, forordning, etc., som blev vedtaget af en anden myndighed. @da
label: valitsetav võimkond @et
definition: Seostab asutuse kohaga, mis on teise valitsuse kehtestatud seaduste, määruste vms alusel valitsetav võimkond. @et
toolkit label: valitsetav võimkond @et
toolkit definition: Koht, mis on teise valitsuse kehtestatud seaduste, määruste vms alusel valitsetav võimkond. @et
label: hat geregelte Gebietskörperschaft @de
definition: Setzt eine Körperschaft in Beziehung zu einem Geografikum, das durch ein Gesetz, eine Verordnung und so weiter geregelt wird, das/die von einer anderen Regierung erlassen wurde. @de
toolkit label: Geregelte Gebietskörperschaft @de
toolkit definition: Ein Geografikum, das durch ein Gesetz, eine Verordnung und so weiter geregelt wird, das/die von einer anderen Regierung erlassen wurde. @de
label: joghatósága a következő: @hu
definition: Hozzákapcsol egy testületet egy helyhez, amely egy másik igazgatási szerv által hozott törvény, rendelet stb. hatálya alá tartozó joghatóság. @hu
toolkit label: joghatóság: @hu
toolkit definition: Egy hely, amely egy másik igazgatási szerv által hozott törvény, rendelet stb. hatálya alá tartozó joghatóság. @hu
label: ha come giurisdizione governata @it
definition: Correla un ente a un luogo che è una giurisdizione governata da una legge, normativa, etc., che è stata adottata da un altro governo. @it
toolkit label: giurisdizione governata @it
toolkit definition: Luogo che è una giurisdizione governata da una legge, normativa, etc., promulgata da un altro governo. @it
label: έχει δικαιοδοσία κυβερνούμενη @el
toolkit label: δικαιοδοσία κυβερνούμενη @el
label: a pour lieu régi @fr
definition: Met une collectivité en relation avec un lieu qui est régi par une collectivité constituant un gouvernement. @fr
toolkit label: lieu régi @fr
toolkit definition: Lieu qui est régi par une collectivité constituant un gouvernement. @fr
label: pārvaldāmā jurisdikcija @lv
definition: Sasaista institūciju ar vietu, kuru pārvalda institūcija, balstoties likumos, noteikumos u.tml., kurus pieņēmusi cita jurisdikcija. @lv
toolkit label: pārvaldāmā jurisdikcija @lv
toolkit definition: Teritorija, kuru pārvalda institūcija, balstoties likumos, noteikumos u.tml., kurus pieņēmusi cita jurisdikcija. @lv
alternative label: jurisdiction governed @en
lexical alias: placeGoverned.en
label: 有所管理的辖区 @zh-hans
definition: 将一个团体与作为根据另一个政府所颁布的法律、法规等管理的一个辖区的一个地点关联起来。 @zh-hans
toolkit label: 所管理的辖区 @zh-hans
toolkit definition: 作为根据另一个政府所颁布的法律、法规等管理的一个辖区的一个地点 @zh-hans
alternative label: juridiction régie @fr
alternative label: jurisdicció regida @ca
label: yönetilen yargı alanı ile ilişkilidir @tr
definition: Bir tüzel kişiyi, başka bir hükümet tarafından yürürlüğe girmiş kanun, düzenleme vb. vasıtasıyla yargı yetkisi olan bir yer ile ilişkilendirir. @tr
toolkit label: Yargı yetkisi @tr
toolkit definition: Başka bir hükümet tarafından yürürlüğe girmiş kanun, düzenleme vb. vasıtasıyla yargı alanı olan bir yer. @tr
has subproperty: P50425

soveltavan lainkäyttöalueen päätös
status: Deprecated
type: Property
domain: C10005
sub property of: muuna toimijana teoksessa
lexical alias: jurisdictionGovernedOf.en
label: est une juridiction régie de @fr
definition: Met une juridiction régie par une loi, un règlement, etc. qui a été promulgué par une autre juridiction en relation avec une œuvre. @fr
toolkit label: juridiction régie de @fr
toolkit definition: Loi, règlement, etc. promulgué par une autre juridiction. @fr
instruction number: 18.5
label: είναι δικαιοδοσία που κυβερνάται από @el
definition: Συνδέει μια δικαιοδοσία, που διέπεται από έναν νόμο, κανονισμό κ.λπ., που θεσπίζεται από κάποια άλλη δικαιοδοσία, με ένα έργο. @el
toolkit label: δικαιοδοσία κυβερνάται από @el
toolkit definition: Ένας νόμος, κανονισμός κ.λπ. ο οποίος θεσπίζεται από κάποια άλλη δικαιοδοσία. @el
definition: Setzt eine Gebietskörperschaft, die durch ein Gesetz, eine Verordnung usw. geregelt wird, das/die von einer anderen Gebietskörperschaft erlassen wurde, mit einem Werk in Beziehung. @de
toolkit label: Geregelte Gebietskörperschaft von @de
toolkit definition: Ein Gesetz, eine Verordnung usw., das/die von einer anderen Gebietskörperschaft erlassen wurde. @de
label: er jurisdiktion underlagt @da
definition: Relaterer en jurisdiktion, der er underlagt en lov, forordning etc., der var vedtaget af en anden domsmyndighed til et værk. @da
toolkit label: jurisdiktion underlagt @da
toolkit definition: Lov, forordning etc., der blev vedtaget af en anden jurisdiktion. @da
label: és jurisdicció regida de @ca
definition: Relaciona una jurisdicció, que promulga una llei, un reglament, una constitució, una regla de funcionament d’un tribunal, etc., amb una obra. @ca
toolkit label: jurisdicció regida de @ca
toolkit definition: Llei, reglament, etc., promulgat per una altra jurisdicció. @ca
definition: Liittää soveltavan lainkäyttöalueen toisen lainkäyttöalueen säätämään lakiin, asetukseen tms.
toolkit label: soveltavan lainkäyttöalueen päätös
toolkit definition: Toisen lainkäyttöalueen säätämä laki, asetus tms.
toolkit label: jurisdiksjon som styres av @no
toolkit definition: En lov, vedtekt, etc. som ble vedtatt i en annen jurisdiksjon. @no
label: ist geregelte Gebietskörperschaft von @de
has subproperty: P50069

toimijaan liittyvä toimija
status: Published
sub property of: toimijaan liittyvä RDA-entiteetti
type: Property
label: has related agent of agent @en
lexical alias: relatedAgentOfAgent.en
definition: Relates an agent to an agent who is associated with an agent. @en
domain: C10002
label: έχει σχετικό φορέα του φορέα @el
definition: Συνδέει έναν φορέα με έναν φορέα ο οποίος συνδέεται με έναν περιγραφόμενο φορέα. @el
label: har agent relateret til agent @da
definition: Relaterer en agent til en agent, som er knyttet til en agent. @da
label: té com a agent relacionat amb un agent @ca
definition: Relaciona un agent amb un agent que s’associa amb un agent. @ca
definition: Liittää toimijan toimijaan, joka liittyy toimijaan.
toolkit label: toimijaan liittyvä toimija
toolkit definition: Toimija, joka liittyy toimijaan.
label: a pour agent en relation avec un agent @fr
definition: Met un agent en relation avec un agent qui est associé à un agent. @fr
toolkit label: related agent of agent @en
toolkit definition: An agent who is associated with an agent. @en
has element type: 1
sub property of: P00006
label: ágenshez kapcsolódó ágens a következő: @hu
definition: Hozzákapcsol egy ágenst egy ágenshez kapcsolódó ágenshez. @hu
label: har agent relatert til agent @no
definition: Relaterer en agent til en agent som forbindes med en agent. @no
toolkit label: agent relatert til agent @no
toolkit definition: En agent som forbindes med en agent. @no
label: heeft gerelateerde actor van actor @nl
definition: Relateert een actor aan een actor die geassocieerd is met een actor. @nl
toolkit label: gerelateerde actor van actor @nl
toolkit definition: Een actor die geassocieerd is met een actor. @nl
label: له وكيل مرتبط بوكيل @ar
definition: يربط وكيلا بوكيل مرتبط بوكيل. @ar
toolkit label: وكيل مرتبط بوكيل @ar
toolkit definition: وكيل مرتبط بوكيل. @ar
toolkit label: agent relacionat amb un agent @ca
toolkit definition: Agent que s’associa amb un agent. @ca
toolkit label: agent relateret til agent @da
toolkit definition: Agent, som er knyttet til en agent. @da
label: tegijaga seotud tegija @et
definition: Seostab tegija tegijaga seotud tegijaga. @et
toolkit label: tegijaga seotud tegija @et
toolkit definition: Tegijaga seotud tegija. @et
label: hat mit Akteur in Beziehung stehenden Akteur @de
definition: Setzt einen Akteur in Beziehung zu einem Akteur, der mit einem Akteur in Verbindung steht. @de
toolkit label: Mit Akteur in Beziehung stehender Akteur @de
toolkit definition: Ein Akteur, der mit einem Akteur in Verbindung steht. @de
toolkit label: ágenshez kapcsolódó ágens: @hu
toolkit definition: Egy ágenshez kapcsolódó ágens. @hu
label: ha come agente correlato di agente @it
definition: Correla un agente a un agente associato a un agente. @it
toolkit label: agente correlato di agente @it
toolkit definition: Agente associato a un agente. @it
toolkit label: σχετικός φορέας του φορέα @el
toolkit definition: Ένας φορέας που συνδέεται με έναν φορέα. @el
toolkit label: agent en relation avec un agent @fr
toolkit definition: Agent qui est associé à un agent. @fr
label: ar aģentu saistītais aģents @lv
definition: Sasaista aģentu ar aģentu, kas saistīts ar aģentu. @lv
toolkit label: ar aģentu saistītais aģents @lv
toolkit definition: Aģents, kas saistīts ar aģentu. @lv
label: 有行为者的关联行为者 @zh-hans
definition: 将一个行为者与和一个行为者有关的一个行为者关联起来。 @zh-hans
toolkit label: 行为者的关联行为者 @zh-hans
toolkit definition: 和一个行为者有关的一个行为者 @zh-hans
label: temsilicinin ilgili temsilcisi ile ilişkilidir @tr
definition: Bir temsilciyi, bir temsilciyle bağlantılı olan bir temsilciyle ilişkilendirir. @tr
toolkit label: temsilcinin İlişkili temsilcisi @tr
toolkit definition: Bir temsilciyle bağlantılı olan bir temsilci. @tr
has subproperty: yhteistoimijaan liittyvä toimija
has subproperty: henkilöön liittyvä toimija
has subproperty: toimijaan liittyvä yhteistoimija
has subproperty: toimijaan liittyvä henkilö
has subproperty: P50309

sukuun liittyvä toimija
status: Published
sub property of: sukuun liittyvä RDA-entiteetti
type: Property
label: has related agent of family @en
lexical alias: relatedAgentOfFamily.en
definition: Relates a family to an agent who is associated with a family. @en
domain: C10008
sub property of: yhteistoimijaan liittyvä toimija
label: έχει σχετικό φορέα της οικογένειας @el
definition: Συνδέει μια οικογένεια με έναν φορέα ο οποίος συνδέεται με μια περιγραφόμενη οικογένεια. @el
label: har agent relateret til familie @da
definition: Relaterer en familie til en agent, som er knyttet til en familie. @da
label: té com a agent relacionat amb una família @ca
definition: Relaciona una família amb un agent que s’associa amb una família. @ca
definition: Liittää suvun toimijaan, joka liittyy sukuun.
toolkit label: sukuun liittyvä toimija
toolkit definition: Toimija, joka liittyy sukuun.
label: a pour agent en relation avec une famille @fr
definition: Met une famille en relation avec un agent qui est associé à une famille. @fr
toolkit label: related agent of family @en
toolkit definition: An agent who is associated with a family. @en
has element type: 1
label: családhoz kapcsolódó ágens a következő: @hu
definition: Hozzákapcsol egy családot egy családhoz kapcsolódó ágenshez. @hu
label: har agent relatert til familie @no
definition: Relaterer en familie til en agent som forbindes med en familie. @no
toolkit label: agent relatert til familie @no
toolkit definition: En agent som forbindes med en familie. @no
label: heeft gerelateerde actor van familie @nl
definition: Relateert een familie aan een actor die geassocieerd is met een familie. @nl
toolkit label: gerelateerde actor van familie @nl
toolkit definition: Een actor die geassocieerd is met een familie. @nl
label: له وكيل مرتبط بعائلة @ar
definition: يربط عائلة بوكيل مرتبط بعائلة. @ar
toolkit label: وكيل مرتبط بعائلة @ar
toolkit definition: وكيل ذو صلة بعائلة. @ar
toolkit label: agent relacionat amb una família @ca
toolkit definition: Agent que s’associa amb una família. @ca
toolkit label: agent relateret til familie @da
toolkit definition: Agent, som er knyttet til en familie. @da
label: perekonnaga seotud tegija @et
definition: Seostab perekonna perekonnaga seotud tegijaga. @et
toolkit label: perekonnaga seotud tegija @et
toolkit definition: Perekonnaga seotud tegija. @et
label: hat mit Familie in Beziehung stehenden Akteur @de
definition: Setzt eine Familie in Beziehung zu einem Akteur, der mit einer Familie in Verbindung steht. @de
toolkit label: Mit Familie in Beziehung stehender Akteur @de
toolkit definition: Ein Akteur, der mit einer Familie in Verbindung steht. @de
toolkit label: családhoz kapcsolódó ágens: @hu
toolkit definition: Egy családhoz kapcsolódó ágens. @hu
label: ha come agente correlato di famiglia @it
definition: Correla una famiglia a un agente associato a una famiglia. @it
toolkit label: agente correlato di famiglia @it
toolkit definition: Agente associato a una famiglia. @it
toolkit label: σχετικός φορέας της οικογένειας @el
toolkit label: agent en relation avec une famille @fr
toolkit definition: Agent qui est associé à une famille. @fr
label: ar dzimtu/ģimeni saistītais aģents @lv
definition: Sasaista dzimtu/ģimeni ar aģentu, kas saistīts ar dzimtu/ģimenei. @lv
toolkit label: ar dzimtu/ģimeni saistītais aģents @lv
toolkit definition: Aģents, kas saistīts ar dzimtu/ģimenei. @lv
label: 有家族的关联行为者 @zh-hans
definition: 将一个家族与和一个家族有关的一个行为者关联起来。 @zh-hans
toolkit label: 家族的关联行为者 @zh-hans
toolkit definition: 和一个家族有关的一个行为者 @zh-hans
label: ailenin ilgili temsilcisi ile ilişkilidir @tr
definition: Bir aileyi, aileyle bağlantılı bir temsilciyle ilişkilendirir. @tr
toolkit label: aileyle ilişkili temsilci @tr
toolkit definition: Bir aile ile bağlantılı olan bir temsilci. @tr
has subproperty: sukuun liittyvä yhteistoimija
has subproperty: sukuun liittyvä henkilö
has subproperty: P50324

yhteistoimijaan liittyvä toimija
status: Published
sub property of: yhteistoimijaan liittyvä RDA-entiteetti
type: Property
label: has related agent of collective agent @en
lexical alias: relatedAgentOfCollectiveAgent.en
definition: Relates a collective agent to an agent who is associated with a collective agent. @en
domain: C10011
sub property of: toimijaan liittyvä toimija
label: έχει σχετικό φορέα του συλλογικού φορέα @el
definition: Συνδέει έναν συλλογικό φορέα με έναν φορέα ο οποίος συνδέεται με έναν συλλογικό φορέα. @el
label: har agent relateret til kollektiv agent @da
definition: Relaterer en kollektiv agent til en agent, som er knyttet til en kollektiv agent. @da
label: té com a agent relacionat amb un agent col·lectiu @ca
definition: Relaciona un agent col·lectiu amb un agent que s’associa amb un agent col·lectiu. @ca
definition: Liittää yhteistoimijan toimijaan, joka liittyy yhteistoimijaan.
toolkit label: yhteistoimijaan liittyvä toimija
toolkit definition: Toimija, joka liittyy yhteistoimijaan.
label: a pour agent en relation avec un agent collectif @fr
definition: Met un agent collectif en relation avec un agent qui est associé à un agent collectif. @fr
toolkit label: related agent of collective agent @en
toolkit definition: An agent who is associated with a collective agent. @en
has element type: 1
label: kollektív ágenshez kapcsolódó ágens a következő: @hu
definition: Hozzákapcsol egy kollektív ágenst egy kollektív ágenshez kapcsolódó ágenshez. @hu
label: har agent relatert til kollektiv agent @no
definition: Relaterer en kollektiv agent til en agent som forbindes med en kollektiv agent. @no
toolkit label: agent relatert til kollektiv agent @no
toolkit definition: En agent som forbindes med en kollektiv agent. @no
label: heeft gerelateerde actor van collectieve actor @nl
definition: Relateert een collectieve actor aan een actor die geassocieerd is met een collectieve actor. @nl
toolkit label: gerelateerde actor van collectieve actor @nl
toolkit definition: Een actor die geassocieerd is met een collectieve actor. @nl
label: له وكيل مرتبط بوكيل جماعي @ar
definition: يربط وكيلا جماعيا بوكيل ذي صلة بوكيل جماعي. @ar
toolkit label: وكيل مرتبط بوكيل جماعي @ar
toolkit definition: وكيل ذو صلة بوكيل جماعي. @ar
toolkit label: agent relacionat amb un agent col·lectiu @ca
toolkit definition: Agent que s’associa amb un agent col·lectiu. @ca
toolkit label: agent relateret til kollektiv agent @da
toolkit definition: Agent, som er knyttet til en kollektiv agent. @da
label: kollektiiviga seotud tegija @et
definition: Seostab kollektiivi kollektiiviga seotud tegijaga. @et
toolkit label: kollektiiviga seotud tegija @et
toolkit definition: Kollektiiviga seotud tegija. @et
label: hat mit gemeinschaftlichem Akteur in Beziehung stehenden Akteur @de
definition: Setzt einen gemeinschaftlichen Akteur in Beziehung zu einem Akteur, der mit einem gemeinschaftlichen Akteur in Verbindung steht. @de
toolkit label: Mit gemeinschaftlichem Akteur in Beziehung stehender Akteur @de
toolkit definition: Ein Akteur, der mit einem gemeinschaftlichen Akteur in Verbindung steht. @de
toolkit label: kollektív ágenshez kapcsolódó ágens: @hu
toolkit definition: Egy kollektív ágenshez kapcsolódó ágens. @hu
label: ha come opera correlata di un agente collettivo @it
definition: Correla un agente collettivo a un'opera associata a un agente collettivo. @it
toolkit label: opera correlata a un agente collettivo @it
toolkit definition: Opera associata a un agente collettivo. @it
toolkit label: σχετικός φορέας του συλλογικού φορέα @el
toolkit label: agent en relation avec un agent collectif @fr
toolkit definition: Agent qui est associé à un agent collectif. @fr
label: ar grupu saistītais aģents @lv
definition: Sasaista grupu ar aģentu, kas saistīts ar grupu. @lv
toolkit label: ar grupu saistītais aģents @lv
toolkit definition: Aģents, kas saistīts ar grupu. @lv
label: 有集体行为者的关联行为者 @zh-hans
definition: 将一个集体行为者与和一个集体行为者有关的一个行为者关联起来。 @zh-hans
toolkit label: 集体行为者的关联行为者 @zh-hans
toolkit definition: 和一个集体行为者有关的一个行为者 @zh-hans
label: kolektif temsilcinin ilgili temsilcisi ile ilişkilidir @tr
definition: Kolektif bir temsilciyi, kolektif temsilciyle bağlantılı bir temsilciyle ilişkilendirir. @tr
toolkit label: kolektif temsilcinin ilişkili temsilcisi @tr
toolkit definition: Kolektif bir temsilciyle bağlantılı olan bir temsilci. @tr
has subproperty: sukuun liittyvä toimija
has subproperty: yhteistoimijaan liittyvä yhteistoimija
has subproperty: yhteistoimijaan liittyvä henkilö
has subproperty: yhteisöön liittyvä toimija
has subproperty: P50358

henkilöön liittyvä toimija
status: Published
sub property of: henkilöön liittyvä RDA-entiteetti
type: Property
label: has related agent of person @en
lexical alias: relatedAgentOfPerson.en
definition: Relates a person to an agent who is associated with a person. @en
domain: C10004
sub property of: toimijaan liittyvä toimija
label: έχει σχετικό φορέα του φυσικού προσώπου @el
definition: Συνδέει ένα φυσικό πρόσωπο με έναν φορέα ο οποίος συνδέεται με ένα περιγραφόμενο φυσικό πρόσωπο. @el
label: har agent relateret til person @da
definition: Relaterer en person til en agent, som er knyttet til en person. @da
label: té com a agent relacionat amb una persona @ca
definition: Relaciona una persona amb un agent que s’associa amb una persona. @ca
definition: Liittää henkilön toimijaan,joka liittyy henkilöön.
toolkit label: henkilöön liittyvä toimija
toolkit definition: Toimija,joka liittyy henkilöön.
label: a pour agent en relation avec une personne @fr
definition: Met une personne en relation avec un agent qui est associé à une personne. @fr
toolkit label: related agent of person @en
toolkit definition: An agent who is associated with a person. @en
has element type: 1
label: személyhez kapcsolódó ágens a következő: @hu
definition: Hozzákapcsol egy személyt egy személyhez kapcsolódó ágenshez. @hu
label: har agent relatert til person @no
definition: Relaterer en person til en agent som forbindes med en person. @no
toolkit label: agent relatert til person @no
toolkit definition: En agent som forbindes med en person. @no
label: heeft gerelateerde actor van persoon @nl
definition: Relateert een persoon aan een actor die geassocieerd is met een persoon. @nl
toolkit label: gerelateerde actor van persoon @nl
toolkit definition: Een actor die geassocieerd is met een persoon. @nl
label: له وكيل مرتبط بشخص @ar
definition: يربط شخصا بوكيل ذي صلة بشخص. @ar
toolkit label: وكيل مرتبط بشخص @ar
toolkit definition: وكيل مرتبط بشخص. @ar
toolkit label: agent relacionat amb una persona @ca
toolkit definition: Agent que s’associa amb una persona. @ca
toolkit label: agent relateret til person @da
toolkit definition: Agent, som er knyttet til en person. @da
label: isikuga seotud tegija @et
definition: Seostab isiku isikuga seotud tegijaga. @et
toolkit label: isikuga seotud tegija @et
toolkit definition: Isikuga seotud tegija. @et
label: hat mit Person in Beziehung stehenden Akteur @de
definition: Setzte eine Person in Beziehung zu einem Akteur, der mit einer Person in Verbindung steht. @de
toolkit label: Mit Person in Beziehung stehender Akteur @de
toolkit definition: Ein Akteur, der mit einer Person in Verbindung steht. @de
toolkit label: személyhez kapcsolódó ágens: @hu
toolkit definition: Egy személyhez kapcsolódó ágens. @hu
label: ha come agente correlato di persona @it
definition: Correla una persona a un agente associato a una persona. @it
toolkit label: agente correlato di persona @it
toolkit definition: Agente associato a una persona. @it
toolkit label: σχετικός φορέας του φυσικού προσώπου @el
toolkit label: agent en relation avec une personne @fr
toolkit definition: Agent qui est associé à une personne. @fr
label: ar personu saistītais aģents @lv
definition: Sasaista personu ar aģentu, kas saistīts ar personu. @lv
toolkit label: ar personu saistītais aģents @lv
toolkit definition: Aģents, kas saistīts ar personu. @lv
label: 有个人的关联行为者 @zh-hans
definition: 将一个个人与和一个个人有关的一个行为者关联起来。 @zh-hans
toolkit label: 个人的关联行为者 @zh-hans
toolkit definition: 和一个个人有关的一个行为者 @zh-hans
label: kişinin ilgili temsilcisi ile ilişkilidir @tr
definition: Bir kişiyi, bir kişiyle bağlantılı olan bir temsilciyle ilişkilendirir. @tr
toolkit label: kişinin ilişkili temsilcisi @tr
toolkit definition: Bir kişiyle bağlantılı olan bir temsilci. @tr
has subproperty: henkilöön liittyvä yhteistoimija
has subproperty: henkilöön liittyvä henkilö
has subproperty: P50315

sukuun liittyvä suku
status: Published
sub property of: sukuun liittyvä yhteistoimija
type: Property
label: has related family of family @en
lexical alias: relatedFamilyOfFamily.en
definition: Relates a family to a family who is associated with a family. @en
domain: C10008
sub property of: yhteistoimijaan liittyvä suku
label: έχει σχετική οικογένεια της οικογένειας @el
definition: Συνδέει μια οικογένεια με μια οικογένεια η οποία συνδέεται με μια περιγραφόμενη οικογένεια. @el
label: har familie relateret til familie @da
definition: Relaterer en familie til en familie, som er knyttet til en familie. @da
label: té com a família relacionada amb una família @ca
definition: Relaciona una família amb una família que s’associa amb una família. @ca
definition: Liittää suvun sukuun, joka liittyy sukuun.
toolkit label: sukuun liittyvä suku
toolkit definition: Suku, joka liittyy sukuun.
label: a pour famille en relation avec une famille @fr
definition: Met une famille en relation avec une famille qui est associée à une famille. @fr
toolkit label: related family of family @en
toolkit definition: A family who is associated with a family. @en
has element type: 1
label: családhoz kapcsolódó család a következő: @hu
definition: Hozzákapcsol egy családot egy családhoz kapcsolódó családhoz. @hu
label: har familie relatert til familie @no
definition: Relaterer en familie til en familie som forbindes med en familie. @no
toolkit label: familie relatert til familie @no
toolkit definition: En familie som forbindes med en familie. @no
label: heeft gerelateerde familie van familie @nl
definition: Relateert een familie aan een familie die geassocieerd is met een familie. @nl
toolkit label: gerelateerde familie van familie @nl
toolkit definition: Een familie die geassocieerd is met een familie. @nl
label: له عائلة مرتبطة بعائلة @ar
definition: يربط عائلة بعائلة ذات صلة بعائلة. @ar
toolkit label: عائلة مرتبطة بعائلة @ar
toolkit definition: عائلة ذات صلة بعائلة. @ar
toolkit label: família relacionada amb una família @ca
toolkit definition: Família que s’associa amb una família. @ca
toolkit label: familie relateret til familie @da
toolkit definition: Familie, som er knyttet til en familie. @da
label: perekonnaga seotud perekond @et
definition: Seostab perekonna perekonnaga seotud perekonnaga. @et
toolkit label: perekonnaga seotud perekond @et
toolkit definition: Perekonnaga seotud perekond. @et
label: hat mit Familie in Beziehung stehende Familie @de
definition: Setzt eine Familie in Beziehung zu einer Familie, die mit einer Familie in Verbindung steht. @de
toolkit label: Mit Familie in Beziehung stehende Familie @de
toolkit definition: Eine Familie, die mit einer Familie in Verbindung steht. @de
toolkit label: családhoz kapcsolódó család: @hu
toolkit definition: Egy családhoz kapcsolódó család. @hu
label: ha come famiglia correlata di famiglia @it
definition: Correla una famiglia a una famiglia associata a una famiglia. @it
toolkit label: famiglia correlata di famiglia @it
toolkit definition: Famiglia associata a una famiglia. @it
toolkit label: σχετική οικογένεια της οικογένειας @el
toolkit label: famille en relation avec une famille @fr
toolkit definition: Famille qui est associée à une famille. @fr
label: ar dzimtu/ģimeni saistītā dzimta/ģimene @lv
definition: Sasaista dzimtu/ģimeni ar dzimtu/ģimeni, kas saistīta ar dzimtu/ģimeni. @lv
toolkit label: ar dzimtu/ģimeni saistītā dzimta/ģimene @lv
toolkit definition: Dzimta/ģimene, kas saistīta ar dzimtu/ģimeni. @lv
label: 有家族的关联家族 @zh-hans
definition: 将一个家族与和一个家族有关的一个家族关联起来。 @zh-hans
toolkit label: 家族的关联家族 @zh-hans
toolkit definition: 和一个家族有关的一个家族 @zh-hans
label: ailenin ilgili ailesi ile ilişkilidir @tr
definition: Bir aileyi, aileyle ilişkisi olan bir aile ile ilişkilendirir. @tr
toolkit label: Aileyle ilişkili aile @tr
toolkit definition: Bir aile ile bağlantılı olan bir aile. @tr
has subproperty: suvun sukuhaara
has subproperty: sukuhaara suvussa
has subproperty: suvun edeltäjä
has subproperty: suvun seuraaja
has subproperty: P50326

toimijaan liittyvä suku
status: Published
label: has related family of agent @en
definition: Relates an agent to a family who is associated with an agent being identified. @en
type: Property
domain: C10002
lexical alias: relatedFamilyOfAgent.en
sub property of: toimijaan liittyvä yhteistoimija
label: έχει σχετική οικογένεια του φορέα @el
definition: Συνδέει έναν φορέα με μια οικογένεια που συνδέεται με έναν ταυτοποιημένο φορέα. @el
label: har familie relateret til agent @da
definition: Relaterer en agent til en familie, som er knyttet til en agent, som identificeres. @da
label: té com a família relacionada amb un agent @ca
definition: Relaciona un agent amb una família que s’associa amb un agent que s’identifica. @ca
definition: Liittää toimijan sukuun, johon identifioitavana oleva toimija liittyy.
toolkit label: toimijaan liittyvä suku
toolkit definition: Suku, johon identifioitavana oleva toimija liittyy.
label: a pour famille en relation avec un agent @fr
definition: Met un agent en relation avec une famille qui est associée à un agent en cours d’identification. @fr
toolkit label: related family of agent @en
toolkit definition: A family who is associated with an agent being identified. @en
has element type: 1
sub property of: P00008
label: ágenshez kapcsolódó család a következő: @hu
definition: Hozzákapcsol egy ágenst egy azonosított ágenshez kapcsolodó családhoz. @hu
label: har familie relatert til agent @no
definition: Relaterer en agent til en familie som forbindes med en identifisert agent. @no
toolkit label: familie relatert til agent @no
toolkit definition: En familie som forbindes med en identifisert agent. @no
label: heeft gerelateerde familie van actor @nl
definition: Relateert een actor aan een familie die geassocieerd is met een actor die wordt geïdentificeerd. @nl
toolkit label: gerelateerde familie van actor @nl
toolkit definition: Een familie die geassocieerd is met een actor die wordt geïdentificeerd. @nl
label: له عائلة مرتبطة بوكيل @ar
definition: يربط وكيلا بعائلة مرتبطة بوكيل معروف الهوية. @ar
toolkit label: عائلة مرتبطة بوكيل @ar
toolkit definition: عائلة مرتبطة بوكيل معروف الهوية. @ar
toolkit label: família relacionada amb un agent @ca
toolkit definition: Família que s’associa amb un agent que s’identifica. @ca
toolkit label: familie relateret til agent @da
toolkit definition: Familie, som er knyttet til en agent, som identificeres. @da
label: tegijaga seotud perekond @et
definition: Seostab tegija perekonnaga, kes on seotud identifitseeritava tegijaga. @et
toolkit label: tegijaga seotud perekond @et
toolkit definition: Perekond, kes on seotud identifitseeritava tegijaga. @et
label: hat mit Akteur in Beziehung stehende Familie @de
definition: Setzt einen Akteur in Beziehung zu einer Familie, die mit einem Akteur in Verbindung steht. @de
toolkit label: mit Akteur in Beziehung stehende Familie @de
toolkit definition: Eine Familie, die mit einem Akteur in Verbindung steht. @de
toolkit label: ágenshez kapcsolódó család: @hu
toolkit definition: Egy azonosított ágenshez kapcsolódó család. @hu
label: ha come famiglia correlata di agente @it
definition: Correla un agente a una famiglia associata all'agente che si sta identificando. @it
toolkit label: famiglia correlata di agente @it
toolkit definition: Famiglia associata all'agente che si sta identificando. @it
toolkit label: σχετική οικογένεια του φορέα @el
toolkit definition: Μια οικογένεια που συνδέεται με τον προσδιοριζόμενο φορέα. @el
toolkit label: famille en relation avec un agent @fr
toolkit definition: Famille qui est associée à un agent en cours d’identification. @fr
label: ar aģentu saistītā dzimta/ģimene @lv
definition: Sasaista aģentu ar dzimtu/ģimeni, kas saistīta aģentu. @lv
toolkit label: ar aģentu saistītā dzimta/ģimene @lv
toolkit definition: Dzimta/ģimene, kas saistīta aģentu. @lv
label: 有行为者的相关家族 @zh-hans
definition: 将一个行为者与和所标识的一个行为者相关的一个家族关联起来。 @zh-hans
toolkit label: 行为者的相关家族 @zh-hans
toolkit definition: 和所标识的一个行为者相关的一个家族 @zh-hans
label: temsilcinin ilgili ailesi ile ilişkilidir @tr
definition: Bir temsilciyi, kimliği belirlenen bir temsilciyle bağlantılı olan bir aileyle ilişkilendirir. @tr
toolkit label: temsilciyle ilişkili aile @tr
toolkit definition: Kimliği belirlenen bir temsilciyle bağlantısı olan bir aile. @tr
has subproperty: yhteistoimijaan liittyvä suku
has subproperty: henkilöön liittyvä suku
has subproperty: P50219

yhteistoimijaan liittyvä suku
status: Published
sub property of: yhteistoimijaan liittyvä yhteistoimija
type: Property
label: has related family of collective agent @en
lexical alias: relatedFamilyOfCollectiveAgent.en
definition: Relates a collective agent to a family who is associated with a collective agent. @en
domain: C10011
sub property of: toimijaan liittyvä suku
label: έχει σχετική οικογένεια του συλλογικού φορέα @el
definition: Συνδέει έναν συλλογικό φορέα με μια οικογένεια η οποία συνδέεται με έναν συλλογικό φορέα. @el
label: har familie relateret til kollektiv agent @da
definition: Relaterer en kollektiv agent til en familie, som er knyttet til en kollektiv agent. @da
label: té com a família relacionada amb un agent col·lectiu @ca
definition: Relaciona un agent col·lectiu amb una família que s’associa amb un agent col·lectiu. @ca
definition: Liittää yhteistoimijan sukuun, joka liittyy yhteistoimijaan.
toolkit label: yhteistoimijaan liittyvä suku
toolkit definition: Suku, joka liittyy yhteistoimijaan.
label: a pour famille en relation avec un agent collectif @fr
definition: Met un agent collectif en relation avec une famille qui est associée à un agent collectif. @fr
toolkit label: related family of collective agent @en
toolkit definition: A family who is associated with a collective agent. @en
has element type: 1
label: kollektív ágenshez kapcsolódó család a következő: @hu
definition: Hozzákapcsol egy kollektív ágenst egy kollektív ágenshez kapcsolódó családhoz. @hu
label: har familie relatert til kollektiv agent @no
definition: Relaterer en kollektiv agent til en familie som forbindes med en kollektiv agent. @no
toolkit label: familie relatert til kollektiv agent @no
toolkit definition: En familie som forbindes med en kollektiv agent. @no
label: heeft gerelateerde familie van collectieve actor @nl
definition: Relateert een collectieve actor aan een familie die geassocieerd is met een collectieve actor. @nl
toolkit label: gerelateerde familie van collectieve actor @nl
toolkit definition: Een familie die geassocieerd is met een collectieve actor. @nl
label: له عائلة مرتبطة بوكيل جماعي @ar
definition: يربط وكيلا جماعيا بعائلة ذات صلة بوكيل جماعي. @ar
toolkit label: عائلة مرتبطة بوكيل جماعي @ar
toolkit definition: عائلة ذات صلة بوكيل جماعي. @ar
toolkit label: família relacionada amb un agent col·lectiu @ca
toolkit definition: Família que s’associa amb un agent col·lectiu. @ca
toolkit label: familie relateret til kollektiv agent @da
toolkit definition: Familie, som er knyttet til en kollektiv agent. @da
label: kollektiiviga seotud perekond @et
definition: Seostab kollektiivi kollektiiviga seotud perekonnaga. @et
toolkit label: kollektiiviga seotud perekond @et
toolkit definition: Kollektiiviga seotud perekond. @et
label: hat mit gemeinschaftlichem Akteur in Beziehung stehende Familie @de
definition: Setzt einen gemeinschaftlichen Akteur in Beziehung zu einer Familie, die mit einem gemeinschaftlichen Akteur in Verbindung steht. @de
toolkit label: Mit gemeinschaftlichem Akteur in Beziehung stehende Familie @de
toolkit definition: Eine Familie, die mit einem gemeinschaftlichen Akteur in Verbindung steht. @de
toolkit label: kollektív ágenshez kapcsolódó család: @hu
toolkit definition: Egy kollektív ágenshez kapcsolódó család. @hu
label: ha come famiglia correlata di agente collettivo @it
definition: Correla un agente collettivo a una famiglia associata a un agente collettivo. @it
toolkit label: famiglia correlata di agente collettivo @it
toolkit definition: Famiglia associata a un agente collettivo. @it
toolkit label: σχετική οικογένεια του συλλογικού φορέα @el
toolkit label: famille en relation avec un agent collectif @fr
toolkit definition: Famille qui est associée à un agent collectif. @fr
label: ar grupu saistītā dzimta/ģimene @lv
definition: Sasaista grupu ar dzimtu/ģimeni, kas saistīta ar grupu. @lv
toolkit label: ar grupu saistītā dzimta/ģimene @lv
toolkit definition: Dzimta/ģimene, kas saistīta ar grupu. @lv
label: 有集体行为者的关联家族 @zh-hans
definition: 将一个集体行为者与和一个集体行为者有关的一个家族关联起来。 @zh-hans
toolkit label: 集体行为者的关联家族 @zh-hans
toolkit definition: 和一个集体行为者有关的一个家族 @zh-hans
label: kolektif temsilcinin ilgili ailesi ile ilişkilidir @tr
definition: Kolektif bir temsilciyi, bir kolektif temsilci ile bağlantılı olan bir aile ile ilişkilendirir. @tr
toolkit label: kolektif temsilciyle ilişkili aile @tr
toolkit definition: Bir kolektif temsilci ile bağlantılı olan bir aile. @tr
has subproperty: yhteistoimijan sukujäsen
has subproperty: sukuun liittyvä suku
has subproperty: yhteisöön liittyvä suku
has subproperty: P50362

henkilöön liittyvä suku
status: Published
sub property of: henkilöön liittyvä yhteistoimija
type: Property
label: has related family of person @en
lexical alias: relatedFamilyOfPerson.en
definition: Relates a person to a family who is associated with a person. @en
domain: C10004
sub property of: toimijaan liittyvä suku
label: έχει σχετική οικογένεια του φυσικού προσώπου @el
definition: Συνδέει ένα φυσικό πρόσωπο με μια οικογένεια η οποία συνδέεται με ένα περιγραφόμενο φυσικό πρόσωπο. @el
label: har familie relateret til person @da
definition: Relaterer en person til en familie, som er knyttet til en person. @da
label: té com a família relacionada amb una persona @ca
definition: Relaciona una persona amb una família que s’associa amb una persona. @ca
definition: Liittää henkilön sukuun, joka liittyy henkilöön.
toolkit label: henkilöön liittyvä suku
toolkit definition: Suku, joka liittyy henkilöön.
label: a pour famille en relation avec une personne @fr
definition: Met une personne en relation avec une famille qui est associée à une personne. @fr
toolkit label: related family of person @en
toolkit definition: A family who is associated with a person. @en
has element type: 1
label: személyhez kapcsolódó család a következő: @hu
definition: Hozzákapcsol egy személyt egy személyhez kapcsolódó családhoz. @hu
label: har familie relatert til person @no
definition: Relaterer en person til en familie som forbindes med en person. @no
toolkit label: familie relatert til person @no
toolkit definition: En familie som forbindes med en person. @no
label: heeft gerelateerde familie van persoon @nl
definition: Relateert een persoon aan een familie die geassocieerd is met een persoon. @nl
toolkit label: gerelateerde familie van persoon @nl
toolkit definition: Een familie die geassocieerd is met een persoon. @nl
label: له عائلة مرتبطة بشخص @ar
definition: يربط شخصا بعائلة مرتبطة بشخص. @ar
toolkit label: عائلة مرتبطة بشخص @ar
toolkit definition: عائلة مرتبطة بشخص. @ar
toolkit label: família relacionada amb una persona @ca
toolkit definition: Família que s’associa amb una persona. @ca
toolkit label: familie relateret til person @da
toolkit definition: Familie, som er knyttet til en person. @da
label: isikuga seotud perekond @et
definition: Seostab isiku isikuga seotud perekonnaga. @et
toolkit label: isikuga seotud perekond @et
toolkit definition: Isikuga seotud perekond. @et
label: hat mit Person in Beziehung stehende Familie @de
definition: Setzt eine Person in Beziehung zu einer Familie, die mit einer Person in Beziehung steht. @de
toolkit label: Mit Person in Beziehung stehende Familie @de
toolkit definition: Eine Familie, die mit einer Person in Verbindung steht. @de
toolkit label: személyhez kapcsolódó család: @hu
toolkit definition: Egy személyhez kapcsolódó család. @hu
label: ha come famiglia correlata di persona @it
definition: Correla una persona a una famiglia associata a una persona. @it
toolkit label: famiglia correlata di persona @it
toolkit definition: Famiglia associata a una persona. @it
toolkit label: σχετική οικογένεια του φυσικού προσώπου @el
toolkit label: famille en relation avec une personne @fr
toolkit definition: Famille qui est associée à une personne. @fr
label: ar personu saistītā dzimta/ģimene @lv
definition: Sasaista personu ar dzimtu/ģimeni, kas saistīta ar personu. @lv
toolkit label: ar personu saistītā dzimta/ģimene @lv
toolkit definition: Dzimta/ģimene, kas saistīta ar personu. @lv
label: 有个人的关联家族 @zh-hans
definition: 将一个个人与和一个个人有关的一个家族关联起来。 @zh-hans
toolkit label: 个人的关联家族 @zh-hans
toolkit definition: 和一个个人有关的一个家族 @zh-hans
label: kişinin ilgili ailesi ile ilişkilidir @tr
definition: Bir kişiyi, bir kişi ile bağlantılı olan bir aileyle ilişkilendirir. @tr
toolkit label: kişiyle ilişkili aile @tr
toolkit definition: Bir kişiyle bağlantılı olan bir aile. @tr
has subproperty: henkilöjäsen suvussa
has subproperty: P50317

yhteisöön liittyvä suku
status: Published
sub property of: yhteisöön liittyvä yhteistoimija
type: Property
label: has related family of corporate body @en
lexical alias: relatedFamilyOfCorporateBody.en
definition: Relates a corporate body to a family who is associated with a corporate body. @en
domain: C10005
sub property of: yhteistoimijaan liittyvä suku
label: έχει σχετική οικογένεια του συλλογικού οργάνου @el
definition: Συνδέει ένα συλλογικό όργανο με μια οικογένεια, η οποία συνδέεται με ένα περιγραφόμενο συλλογικό όργανο. @el
label: har familie relateret til korporation @da
definition: Relaterer en korporation til en familie, som er knyttet til en korporation. @da
label: té com a família relacionada amb una entitat corporativa @ca
definition: Relaciona una entitat corporativa amb una família que s’associa amb una entitat corporativa. @ca
definition: Liittää yhteisön sukuun, joka liittyy yhteisöön.
toolkit label: yhteisöön liittyvä suku
toolkit definition: Suku, joka liittyy yhteisöön.
label: a pour famille en relation avec une collectivité @fr
definition: Met une collectivité en relation avec une famille qui est associée à une collectivité. @fr
toolkit label: related family of corporate body @en
toolkit definition: A family who is associated with a corporate body. @en
has element type: 1
label: testülethez kapcsolódó család a következő: @hu
definition: Hozzákapcsol egy testületet egy testülethez kapcsolódó családhoz. @hu
label: har familie relatert til korporasjon @no
definition: Relaterer en korporasjon til en familie som forbindes med en korporasjon. @no
toolkit label: familie relatert til korporasjon @no
toolkit definition: En familie som forbindes med en korporasjon. @no
label: heeft gerelateerde familie van corporatie @nl
definition: Relateert een corporatie aan een familie die geassocieerd is met een corporatie. @nl
toolkit label: gerelateerde familie van corporatie @nl
toolkit definition: Een familie die geassocieerd is met een corporatie. @nl
label: له عائلة مرتبطة بهيئة @ar
definition: يربط هيئة بعائلة ذات صلة بهيئة. @ar
toolkit label: عائلة مرتبطة بهيئة @ar
toolkit definition: عائلة ذات صلة بهيئة. @ar
toolkit label: família relacionada amb una entitat corporativa @ca
toolkit definition: Família que s’associa amb una entitat corporativa. @ca
toolkit label: familie relateret til korporation @da
toolkit definition: Familie, som er knyttet til en korporation. @da
label: asutusega seotud perekond @et
definition: Seostab asutuse asutusega seotud perekonnaga. @et
toolkit label: asutusega seotud perekond @et
toolkit definition: Asutusega seotud perekond. @et
label: hat mit Körperschaft in Beziehung stehende Familie @de
definition: Setzt eine Körperschaft in Beziehung zu einer Familie, die mit einer Körperschaft in Verbindung steht. @de
toolkit label: mit Körperschaft in Beziehung stehende Familie @de
toolkit definition: Eine Familie, die mit einer Körperschaft in Verbindung steht. @de
toolkit label: testülethez kapcsolódó család: @hu
toolkit definition: Egy testülethez kapcsolódó család. @hu
label: ha come famiglia correlata a un ente @it
definition: Correla un ente a una famiglia associata a un ente. @it
toolkit label: famiglia correlata di ente @it
toolkit definition: Famiglia associata a un ente. @it
toolkit label: σχετική οικογένεια του συλλογικού οργάνου @el
toolkit label: famille en relation avec une collectivité @fr
toolkit definition: Famille qui est associée à une collectivité. @fr
label: ar institūciju saistītā dzimta/ģimene @lv
definition: Sasaista institūciju ar dzimtu/ģimeni, kas saistīta ar institūciju. @lv
toolkit label: ar institūciju saistītā dzimta/ģimene @lv
toolkit definition: Dzimta/ģimene, kas saistīta ar institūciju. @lv
label: 有团体的关联家族 @zh-hans
definition: 将一个团体与和一个团体有关的一个家族关联起来。 @zh-hans
toolkit label: 团体的关联家族 @zh-hans
toolkit definition: 和一个团体有关的一个家族 @zh-hans
label: tüzel kişinin ilgili ailesi ile ilişkilidir @tr
definition: Bir tüzel kişiyi, tüzel kişiliğe bağlı bir aileyle ilişkilendirir. @tr
toolkit label: tüzel kişilikle ilişkili aile @tr
toolkit definition: Bir tüzel kişilikle bağlantısı olan bir aile. @tr
has subproperty: yhteisöjäsen suvussa
has subproperty: yhteisön sukujäsen
has subproperty: yhteisön perustanut suku
has subproperty: yhteisöä sponsoroiva suku
has subproperty: P50335

toimijaan liittyvä paikka
status: Published
sub property of: toimijaan liittyvä RDA-entiteetti
type: Property
label: has related place of agent @en
lexical alias: relatedPlaceOfAgent.en
definition: Relates an agent to a place that is associated with an agent. @en
domain: C10002
label: έχει σχετικό τόπο του φορέα @el
definition: Συνδέει έναν φορέα με έναν τόπο που συνδέεται με έναν φορέα. @el
label: har sted relateret til agent @da
definition: Relaterer en agent til et sted, som er knyttet til en agent. @da
label: té com a lloc relacionat amb un agent @ca
definition: Relaciona un agent amb un lloc que s’associa amb un agent. @ca
definition: Liittää toimijan paikkaan, joka liittyy toimijaan.
toolkit label: toimijaan liittyvä paikka
toolkit definition: Paikka, joka liittyy toimijaan.
label: a pour lieu en relation avec un agent @fr
definition: Met un agent en relation avec un lieu qui est associé à un agent. @fr
toolkit label: related place of agent @en
toolkit definition: A place that is associated with an agent. @en
has element type: 1
sub property of: P00010
label: ágenshez kapcsolódó hely a következő: @hu
definition: Hozzákapcsol egy ágenst egy ágenshez kapcsolódó helyhez. @hu
label: har sted relatert til agent @no
definition: Relaterer en agent til et sted som forbindes med en agent. @no
toolkit label: sted relatert til agent @no
toolkit definition: Et sted som forbindes med en agent. @no
label: heeft gerelateerde plaats van actor @nl
definition: Relateert een actor aan een plaats die geassocieerd is met een actor. @nl
toolkit label: gerelateerde plaats van actor @nl
toolkit definition: Een plaats die geassocieerd is met een actor. @nl
label: له مكان مرتبط بوكيل @ar
definition: يربط وكيلا بمكان ذي صلة بوكيل. @ar
toolkit label: مكان مرتبط بوكيل @ar
toolkit definition: مكان مرتبط بوكيل. @ar
toolkit label: lloc relacionat amb un agent @ca
toolkit definition: Lloc que s’associa amb un agent. @ca
toolkit label: sted relateret til agent @da
toolkit definition: Sted, som er knyttet til en agent. @da
label: tegijaga seotud koht @et
definition: Seostab tegija tegijaga seotud kohaga. @et
toolkit label: tegijaga seotud koht @et
toolkit definition: Tegijaga seotud koht. @et
label: hat mit Akteur in Beziehung stehendes Geografikum @de
definition: Setzt einen Akteur in Beziehung zu einem Geografikum, das mit einem Akteur in Verbindung steht. @de
toolkit label: Mit Akteur in Beziehung stehendes Geografikum @de
toolkit definition: Ein Geografikum, das mit einem Akteur in Verbindung steht. @de
toolkit label: ágenshez kapcsolódó hely: @hu
toolkit definition: Egy ágenshez kapcsolódó hely. @hu
label: ha come luogo correlato di agente @it
definition: Correla un agente a un luogo associato a un agente. @it
toolkit label: luogo correlato di agente @it
toolkit definition: Luogo associato a un agente. @it
toolkit label: σχετικός τόπος του φορέα @el
toolkit label: lieu en relation avec un agent @fr
toolkit definition: Lieu qui est associé à un agent. @fr
label: ar aģentu saistītā vieta @lv
definition: Sasaista aģentu ar vietu, kas saistīta ar aģentu. @lv
toolkit label: ar aģentu saistītā vieta @lv
toolkit definition: Vieta, kas saistīta ar aģentu. @lv
label: 有行为者的关联地点 @zh-hans
definition: 将一个行为者与和一个行为者有关的一个地点关联起来。 @zh-hans
toolkit label: 行为者的关联地点 @zh-hans
toolkit definition: 和一个行为者有关的一个地点 @zh-hans
label: temsilcinin ilgili yeri ile ilişkilidir @tr
definition: Bir temsilciyi, temsilciyle bağlantılı olan bir yerle ilişkilendirir. @tr
toolkit label: temsilciyle ilişkili yer @tr
toolkit definition: Bir temsilciyle bağlantılı olan bir yer. @tr
has subproperty: yhteistoimijaan liittyvä paikka
has subproperty: henkilöön liittyvä paikka
has subproperty: P50338

sukuun liittyvä paikka
status: Published
sub property of: sukuun liittyvä RDA-entiteetti
type: Property
label: has related place of family @en
lexical alias: relatedPlaceOfFamily.en
definition: Relates a family to a place that is associated with a family. @en
domain: C10008
sub property of: yhteistoimijaan liittyvä paikka
label: έχει σχετικό τόπο της οικογένειας @el
definition: Συνδέει μια οικογένεια με έναν τόπο που συνδέεται με μια οικογένεια. @el
label: har sted relateret til familie @da
definition: Relaterer en familie til et sted, som er knyttet til en familie. @da
label: té com a lloc relacionat amb una família @ca
definition: Relaciona una família amb un lloc que s’associa amb una família. @ca
definition: Liittää suvun paikkaan, joka liittyy sukuun.
toolkit label: sukuun liittyvä paikka
toolkit definition: Paikka, joka liittyy sukuun.
label: a pour lieu en relation avec une famille @fr
definition: Met une famille en relation avec un lieu qui est associé à une famille. @fr
toolkit label: related place of family @en
toolkit definition: A place that is associated with a family. @en
has element type: 1
label: családhoz kapcsolódó hely a következő: @hu
definition: Hozzákapcsol egy családot egy családhoz kapcsolódó helyhez. @hu
alternative label: place associated with family @en
label: har sted relatert til familie @no
definition: Relaterer en familie til et sted som forbindes med en familie. @no
alternative label: sted forbundet med familie @no
toolkit label: sted relatert til familie @no
toolkit definition: Et sted som forbindes med en familie. @no
label: heeft gerelateerde plaats van familie @nl
definition: Relateert een familie aan een plaats die geassocieerd is met een familie. @nl
toolkit label: gerelateerde plaats van familie @nl
toolkit definition: Een plaats die geassocieerd is met een familie. @nl
alternative label: paikka, joka liittyy sukuun
label: لها مكان مرتبط بعائلة @ar
definition: يربط عائلة بمكان ذي صلة بعائلة. @ar
alternative label: مكان مرتبط بعائلة @ar
toolkit label: مكان مرتبط بعائلة @ar
toolkit definition: مكان ذو صلة بعائلة. @ar
alternative label: lloc associat amb una família @ca
toolkit label: lloc relacionat amb una família @ca
toolkit definition: Lloc que s’associa amb una família. @ca
alternative label: sted, som er knyttet til familie @da
toolkit label: sted relateret til familie @da
toolkit definition: Sted, som er knyttet til en familie. @da
label: perekonnaga seotud koht @et
definition: Seostab perekonna perekonnaga seotud kohaga. @et
toolkit label: perekonnaga seotud koht @et
toolkit definition: Perekonnaga seotud koht. @et
label: hat mit Familie in Beziehung stehendes Geografikum @de
definition: Setzt eine Familie in Beziehung zu einem Geografikum, das mit einer Familie in Verbindung steht. @de
alternative label: Ort, der mit einer Familie in Verbindung steht @de
toolkit label: Mit Familie in Beziehung stehendes Geografikum @de
toolkit definition: Ein Geografikum, das mit einer Familie in Verbindung steht. @de
alternative label: családhoz társított hely: @hu
toolkit label: családhoz kapcsolódó hely: @hu
toolkit definition: Egy családhoz kapcsolódó hely. @hu
label: ha come luogo correlato di famiglia @it
definition: Correla una famiglia a un luogo associato a una famiglia. @it
alternative label: luogo associato a famiglia @it
toolkit label: luogo correlato di famiglia @it
toolkit definition: Luogo associato a una famiglia. @it
alternative label: τόπος σχετικός με την οικογένεια @el
toolkit label: σχετικός τόπος της οικογένειας @el
alternative label: lieu associé à une famille @fr
toolkit label: lieu en relation avec une famille @fr
toolkit definition: Lieu qui est associé à une famille. @fr
label: ar dzimtu/ģimeni saistītā vieta @lv
definition: Sasaista dzimtu/ģimeni ar vietu, kas saistīta ar dzimtu/ģimeni. @lv
toolkit label: ar dzimtu/ģimeni saistītā vieta @lv
toolkit definition: Vieta, kas saistīta ar dzimtu/ģimeni. @lv
alternative label: 和家族有关的地点 @zh-hans
label: 有家族的关联地点 @zh-hans
toolkit label: 家族的关联地点 @zh-hans
toolkit definition: 和一个家族有关的一个地点 @zh-hans
toolkit label: aileyle ilişkili yer @tr
toolkit definition: Bir aileyle bağlantılı olan bir yer. @tr
has subproperty: sukuun liittyvä paikka
has subproperty: P50354

yhteistoimijaan liittyvä paikka
status: Published
sub property of: yhteistoimijaan liittyvä RDA-entiteetti
type: Property
label: has related place of collective agent @en
lexical alias: relatedPlaceOfCollectiveAgent.en
definition: Relates a collective agent to a place that is associated with a collective agent. @en
domain: C10011
sub property of: toimijaan liittyvä paikka
label: έχει σχετικό τόπο του συλλογικού φορέα @el
definition: Συνδέει έναν συλλογικό φορέα με έναν τόπο που συνδέεται με έναν συλλογικό φορέα. @el
label: har sted relateret til kollektiv agent @da
definition: Relaterer en kollektiv agent til et sted, som er knyttet til en kollektiv agent. @da
label: té com a lloc relacionat amb un agent col·lectiu @ca
definition: Relaciona un agent col·lectiu amb un lloc que s’associa amb un agent col·lectiu. @ca
definition: Liittää yhteistoimijan paikkaan, joka liittyy yhteistoimijaan.
toolkit label: yhteistoimijaan liittyvä paikka
toolkit definition: Paikka, joka liittyy yhteistoimijaan.
label: a pour lieu en relation avec un agent collectif @fr
definition: Met un agent collectif en relation avec un lieu qui est associé à un agent collectif. @fr
toolkit label: related place of collective agent @en
toolkit definition: A place that is associated with a collective agent. @en
has element type: 1
label: kollektív ágenshez kapcsolódó hely a következő: @hu
definition: Hozzákapcsol egy kollektív ágenst egy kollektív ágenshez kapcsolódó helyhez. @hu
label: har sted relatert til kollektiv agent @no
definition: Relaterer en kollektiv agent til et sted som forbindes med en kollektiv agent. @no
toolkit label: sted relatert til kollektiv agent @no
toolkit definition: Et sted som forbindes med en kollektiv agent. @no
label: heeft gerelateerde plaats van collectieve actor @nl
definition: Relateert een collectieve actor aan een plaats die geassocieerd is met een collectieve actor. @nl
toolkit label: gerelateerde plaats van collectieve actor @nl
toolkit definition: Een plaats die geassocieerd is met een collectieve actor. @nl
label: له مكان مرتبط بوكيل جماعي @ar
definition: يربط وكيلا جماعيا بمكان مرتبط بوكيل جماعي. @ar
toolkit label: مكان مرتبط بوكيل جماعي @ar
toolkit definition: مكان مرتبط بوكيل جماعي. @ar
toolkit label: lloc relacionat amb un agent col·lectiu @ca
toolkit definition: Lloc que s’associa amb un agent col·lectiu. @ca
toolkit label: sted relateret til kollektiv agent @da
toolkit definition: Sted, som er knyttet til en kollektiv agent. @da
label: kollektiiviga seotud koht @et
definition: Seostab kollektiivi kollektiiviga seotud kohaga. @et
toolkit label: kollektiiviga seotud koht @et
toolkit definition: Kollektiiviga seotud koht. @et
label: hat mit gemeinschaftlichem Akteur in Beziehung stehendes Geografikum @de
definition: Setzt einen gemeinschaftlichen Akteur in Beziehung zu einem Geografikum, das mit einem gemeinschaftlichen Akteur in Verbindung steht. @de
toolkit label: Mit gemeinschaftlichem Akteur in Beziehung stehendes Geografikum @de
toolkit definition: Ein Geografikum, das mit einem gemeinschaftlichen Akteur in Verbindung steht. @de
toolkit label: kollektív ágenshez kapcsolódó hely: @hu
toolkit definition: Egy kollektív ágenshez kapcsolódó hely. @hu
label: ha come luogo correlato di agente collettivo @it
definition: Correla un agente collettivo a un luogo associato a una agente collettivo. @it
toolkit label: luogo correlato di agente collettivo @it
toolkit definition: Luogo associato a una agente collettivo. @it
toolkit label: σχετικός τόπος του συλλογικού φορέα @el
toolkit label: lieu en relation avec un agent collectif @fr
toolkit definition: Lieu qui est associé à un agent collectif. @fr
label: ar grupu saistītā vieta @lv
definition: Sasaista grupu ar vietu, kas saistīta ar grupu. @lv
toolkit label: ar grupu saistītā vieta @lv
toolkit definition: Vieta, kas saistīta ar grupu. @lv
label: 有集体行为者的关联地点 @zh-hans
definition: 将一个集体行为者与和一个集体行为者有关的一个地点关联起来。 @zh-hans
toolkit label: 集体行为者的关联地点 @zh-hans
toolkit definition: 和一个集体行为者有关的一个地点 @zh-hans
label: kolektif temsilcinin ilgili yeri ile ilişkilidir @tr
definition: Kolektif bir temsilciyi, kolektif temsilciyle bağlantılı bir yerle ilişkilendirir. @tr
toolkit label: kolektif temsilciyle ilişkili yer @tr
toolkit definition: Bir kolektif temsilci ile bağlantılı olan bir yer. @tr
has subproperty: sukuun liittyvä paikka
has subproperty: yhteisöön liittyvä paikka
has subproperty: P50342

henkilöön liittyvä paikka
status: Published
sub property of: henkilöön liittyvä RDA-entiteetti
type: Property
label: has related place of person @en
lexical alias: relatedPlaceOfPerson.en
definition: Relates a person to a place that is associated with a person. @en
domain: C10004
sub property of: toimijaan liittyvä paikka
label: έχει σχετικό τόπο του φυσικού προσώπου @el
definition: Συνδέει ένα φυσικό πρόσωπο με έναν τόπο που συνδέεται με ένα φυσικό πρόσωπο. @el
label: har sted relateret til person @da
definition: Relaterer en person til et sted, som er knyttet til en person. @da
label: té com a lloc relacionat amb una persona @ca
definition: Relaciona una persona amb un lloc que s’associa amb una persona. @ca
definition: Liittää henkilön paikkaan, joka liittyy henkilöön.
toolkit label: henkilöön liittyvä paikka
toolkit definition: Paikka, joka liittyy henkilöön.
label: a pour lieu en relation avec une personne @fr
definition: Met une personne en relation avec un lieu qui est associé à une personne. @fr
toolkit label: related place of person @en
toolkit definition: A place that is associated with a person. @en
has element type: 1
label: személyhez kapcsolódó hely a következő: @hu
definition: Hozzákapcsol egy személyt egy személyhez kapcsolódó helyhez. @hu
label: har sted relatert til person @no
definition: Relaterer en person til et sted som forbindes med en person. @no
toolkit label: sted relatert til person @no
toolkit definition: Et sted som forbindes med en person. @no
label: heeft gerelateerde plaats van persoon @nl
definition: Relateert een persoon aan een plaats die geassocieerd is met een persoon. @nl
toolkit label: gerelateerde plaats van persoon @nl
toolkit definition: Een plaats die geassocieerd is met een persoon. @nl
label: له مكان مرتبط بشخص @ar
definition: يربط شخصا بمكان مرتبط بشخص. @ar
toolkit label: مكان مرتبط بشخص @ar
toolkit definition: مكان مرتبط بشخص. @ar
toolkit label: lloc relacionat amb una persona @ca
toolkit definition: Lloc que s’associa amb una persona. @ca
toolkit label: sted relateret til person @da
toolkit definition: Sted, som er knyttet til en person. @da
label: isikuga seotud koht @et
definition: Seostab isiku isikuga seotud kohaga. @et
toolkit label: isikuga seotud koht @et
toolkit definition: Isikuga seotud koht. @et
label: hat mit Person in Beziehung stehendes Geografikum @de
definition: Setzt eine Person in Beziehung zu einem Geografikum, das mit einer Person in Verbindung steht. @de
toolkit label: Mit Person in Beziehung stehendes Geografikum @de
toolkit definition: Ein Geografikum, das mit einer Person in Verbindung steht. @de
toolkit label: személyhez kapcsolódó hely: @hu
toolkit definition: Egy személyhez kapcsolódó hely. @hu
label: ha come luogo correlato di persona @it
definition: Correla una persona a un luogo associato a una persona. @it
toolkit label: luogo correlato di persona @it
toolkit definition: Luogo associato a una persona. @it
toolkit label: σχετικός τόπος του φυσικού προσώπου @el
toolkit label: lieu en relation avec une personne @fr
toolkit definition: Lieu qui est associé à une personne. @fr
label: ar personu saistītā vieta @lv
definition: Sasaista personu ar vietu, kas saistīta ar personu. @lv
toolkit label: ar personu saistītā vieta @lv
toolkit definition: Vieta, kas saistīta ar personu. @lv
label: 有个人的关联地点 @zh-hans
definition: 将一个个人与和一个个人有关的一个地点关联起来。 @zh-hans
toolkit label: 个人的关联地点 @zh-hans
toolkit definition: 和一个个人有关的一个地点 @zh-hans
label: kişinin ilgili yeri ile ilişkilidir @tr
definition: Bir kişiyi, kişiyle bağlantılı olan bir yerle ilişkilendirir. @tr
toolkit label: kişiyle ilişkili yer @tr
toolkit definition: Bir kişiyle bağlantılı olan bir yer. @tr
has subproperty: kuolinpaikka
has subproperty: asuinpaikka
has subproperty: henkilöön liittyvä maa
has subproperty: syntymäpaikka
has subproperty: P50346

yhteisöön liittyvä paikka
status: Published
sub property of: yhteisöön liittyvä RDA-entiteetti
type: Property
label: has related place of corporate body @en
lexical alias: relatedPlaceOfCorporateBody.en
definition: Relates a corporate body to a place that is associated with a corporate body. @en
domain: C10005
sub property of: yhteistoimijaan liittyvä paikka
label: έχει σχετικό τόπο του συλλογικού οργάνου @el
definition: Συνδέει ένα συλλογικό όργανο με έναν τόπο που συνδέεται με ένα συλλογικό όργανο. @el
label: har sted relateret til korporation @da
definition: Relaterer en korporation til et sted, som er knyttet til en korporation. @da
label: té com a lloc relacionat amb una entitat corporativa @ca
definition: Relaciona una entitat corporativa amb un lloc que s’associa amb una entitat corporativa. @ca
definition: Liittää yhteisön paikkaan, joka liittyy yhteisöön.
toolkit label: yhteisöön liittyvä paikka
toolkit definition: Paikka, joka liittyy yhteisöön.
label: a pour lieu en relation avec une collectivité @fr
definition: Met une collectivité en relation avec un lieu qui est associé à une collectivité. @fr
toolkit label: related place of corporate body @en
toolkit definition: A place that is associated with a corporate body. @en
has element type: 1
label: testülethez kapcsolódó hely a következő: @hu
definition: Hozzákapcsol egy testületet egy testülethez kapcsolódó helyhez. @hu
alternative label: place associated with corporate body @en
alternative label: other place associated with corporate body @en
label: har sted relatert til korporasjon @no
definition: Relaterer en korporasjon til et sted som forbindes med en korporasjon. @no
alternative label: sted forbundet med korporasjon @no
alternative label: annet sted forbundet med korporasjon @no
toolkit label: sted relatert til korporasjon @no
toolkit definition: Et sted som forbindes med en korporasjon. @no
label: heeft gerelateerde plaats van corporatie @nl
definition: Relateert een corporatie aan een plaats die geassocieerd is met een corporatie. @nl
toolkit label: gerelateerde plaats van corporatie @nl
toolkit definition: Een plaats die geassocieerd is met een corporatie. @nl
label: لها مكان مرتبط بهيئة @ar
definition: يربط هيئة بمكان ذي صلة بهيئة. @ar
alternative label: مكان آخر مرتبط باسم هيئة @ar
toolkit label: مكان مرتبط بهيئة @ar
toolkit definition: مكان ذو صلة بهيئة. @ar
toolkit label: lloc relacionat amb una entitat corporativa @ca
toolkit definition: Lloc que s’associa amb una entitat corporativa. @ca
alternative label: andet sted knyttet til korporation @da
toolkit label: sted relateret til korporation @da
toolkit definition: Sted, som er knyttet til en korporation. @da
label: asutusega seotud koht @et
definition: Seostab asutuse asutusega seotud kohaga. @et
alternative label: teine asutusega seotud koht @et
toolkit label: asutusega seotud koht @et
toolkit definition: Asutusega seotud koht. @et
label: hat mit Körperschaft in Beziehung stehendes Geografikum @de
definition: Setzt eine Körperschaft in Beziehung zu einem Geografikum, das mit einer Körperschaft in Verbindung steht. @de
alternative label: Sonstiger Ort, der mit einer Körperschaft in Verbindung steht @de
toolkit label: Mit Körperschaft in Beziehung stehendes Geografikum @de
toolkit definition: Ein Geografikum, das mit einer Körperschaft in Verbindung steht. @de
toolkit label: testülethez kapcsolódó hely: @hu
toolkit definition: Egy testülethez kapcsolódó hely. @hu
label: ha come luogo correlato di ente @it
definition: Correla un ente a un luogo associato a un ente. @it
alternative label: altro luogo associato a ente @it
toolkit label: luogo correlato di ente @it
toolkit definition: Luogo associato a un ente. @it
alternative label: τόπος σχετικός με το συλλογικό όργανο @el
alternative label: άλλος τόπος σχετικός με το συλλογικό όργανο @el
toolkit label: σχετικό τόπο του συλλογικού οργάνου @el
alternative label: lieu associé à une collectivité @fr
alternative label: autre lieu associé à une collectivité @fr
toolkit label: lieu en relation avec une collectivité @fr
toolkit definition: Lieu qui est associé à une collectivité. @fr
label: ar institūciju saistītā vieta @lv
definition: Sasaista institūciju ar vietu, kas saistīta ar institūciju. @lv
toolkit label: ar institūciju saistītā vieta @lv
toolkit definition: Vieta, kas saistīta ar institūciju. @lv
toolkit label: 团体的关联地点 @zh-hans
toolkit definition: 和一个团体有关的一个地点 @zh-hans
toolkit label: tüzel kişilikle ilişkili yer @tr
toolkit definition: Tüzel bir kişilikle bağlantılı olan bir yer. @tr
has subproperty: julkishallinnollisen yhteisön hallintoalue
has subproperty: konferenssin paikka

toimijaan liittyvä ajanjakso
status: Published
sub property of: toimijaan liittyvä RDA-entiteetti
type: Property
label: has related timespan of agent @en
lexical alias: relatedTimespanOfAgent.en
definition: Relates an agent to a timespan that is associated with an agent. @en
domain: C10002
label: έχει σχετικό χρονικό διάστημα του φορέα @el
definition: Συνδέει έναν φορέα με ένα χρονικό διάστημα που συνδέεται με έναν φορέα. @el
label: har tidsperiode relateret til agent @da
definition: Relaterer en agent til en tidsperiode, som er knyttet til en agent. @da
label: té com a interval de temps relacionat amb un agent @ca
definition: Relaciona un agent amb un interval de temps que s’associa amb un agent. @ca
definition: Liittää toimijan ajanjaksoon, joka liittyy toimijaan.
toolkit label: toimijaan liittyvä ajanjakso
toolkit definition: Ajanjakso, joka liittyy toimijaan.
label: a pour laps de temps en relation avec un agent @fr
definition: Met un agent en relation avec un laps de temps qui est associé à un agent. @fr
toolkit label: related timespan of agent @en
toolkit definition: A timespan that is associated with an agent. @en
has element type: 1
sub property of: P00011
label: ágenshez kapcsolódó időtartam a következő: @hu
definition: Hozzákapcsol egy ágenst egy ágenshez kapcsolódó időtartamhoz. @hu
label: har tidsrom relatert til agent @no
definition: Relaterer en agent til et tidsrom som forbindes med en agent. @no
toolkit label: tidsrom relatert til agent @no
toolkit definition: Et tidsrom som forbindes med en agent. @no
label: heeft gerelateerde tijdspanne van actor @nl
definition: Relateert een actor aan een tijdspanne die geassocieerd is met een actor. @nl
toolkit label: gerelateerde tijdspanne van actor @nl
toolkit definition: Een tijdspanne die geassocieerd is met een actor. @nl
label: له فترة زمنية مرتبطة بوكيل @ar
definition: يربط وكيلا بفترة زمنية مرتبطة بوكيل. @ar
toolkit label: فترة زمنية مرتبطة بوكيل @ar
toolkit definition: فترة زمنية مرتبطة بوكيل. @ar
toolkit label: interval de temps relacionat amb un agent @ca
toolkit definition: Interval de temps que s’associa amb un agent. @ca
toolkit label: tidsperiode relateret til agent @da
toolkit definition: Tidsperiode, som er knyttet til en agent. @da
label: tegijaga seotud ajavahemik @et
definition: Seostab tegija tegijaga seotud ajavahemikuga. @et
toolkit label: tegijaga seotud ajavahemik @et
toolkit definition: Tegijaga seotud ajavahemik. @et
label: hat mit Akteur in Beziehung stehenden Zeitraum @de
definition: Setzt einen Akteur in Beziehung zu einem Zeitraum, der mit einem Akteur in Verbindung steht. @de
toolkit label: Mit Akteur in Beziehung stehender Zeitraum @de
toolkit definition: Ein Zeitraum, der mit einem Akteur in Verbindung steht. @de
toolkit label: ágenshez kapcsolódó időtartam: @hu
toolkit definition: Egy ágenshez kapcsolódó időtartam. @hu
label: ha come arco di tempo correlato di agente @it
definition: Correla un agente collettivo a un arco di tempo associato a un agente. @it
toolkit label: arco di tempo correlato di agente @it
toolkit definition: Arco di tempo associato a un agente. @it
toolkit label: σχετικό χρονικό διάστημα του φορέα @el
toolkit label: laps de temps en relation avec un agent @fr
toolkit definition: Laps de temps qui est associé à un agent. @fr
label: ar aģentu saistītais laikposms @lv
definition: Sasaista aģentu ar laikposmu, kas saistīts ar aģentu. @lv
toolkit label: ar aģentu saistītais laikposms @lv
toolkit definition: Laikposms, kas saistīts ar aģentu. @lv
label: 有行为者的关联时间段 @zh-hans
definition: 将一个行为者与和一个行为者有关的一个时间段关联起来。 @zh-hans
toolkit label: 行为者的关联时间段 @zh-hans
toolkit definition: 和一个行为者有关的一个时间段 @zh-hans
label: temsilcinin ilgili zaman aralığı ile ilişkilidir @tr
definition: Bir temsilciyi, temsilciyle bağlantılı olan bir zaman aralığıyla ilişkilendirir. @tr
toolkit label: Temsilcinin zaman aralığıyla ilişkisi @tr
toolkit definition: Bir temsilciyle bağlantılı olan bir zaman aralığı. @tr
has subproperty: yhteistoimijaan liittyvä ajanjakso
has subproperty: henkilöön liittyvä ajanjakso
has subproperty: toimijan toiminta-aika
has subproperty: P50339

sukuun liittyvä ajanjakso
status: Published
sub property of: sukuun liittyvä RDA-entiteetti
type: Property
label: has related timespan of family @en
lexical alias: relatedTimespanOfFamily.en
definition: Relates a family to a timespan that is associated with a family. @en
domain: C10008
sub property of: yhteistoimijaan liittyvä ajanjakso
label: έχει σχετικό χρονικό διάστημα της οικογένειας @el
definition: Συνδέει μια οικογένεια με ένα χρονικό διάστημα που συνδέεται με μια οικογένεια. @el
label: har tidsperiode relateret til familie @da
definition: Relaterer en familie til en tidsperiode, som er knyttet til en familie. @da
label: té com a interval de temps relacionat amb una família @ca
definition: Relaciona una família amb un interval de temps que s’associa amb una família. @ca
definition: Liittää suvun ajanjaksoon, joka liittyy sukuun.
toolkit label: sukuun liittyvä ajanjakso
toolkit definition: Ajanjakso, joka liittyy sukuun.
label: a pour laps de temps en relation avec une famille @fr
definition: Met une famille en relation avec un laps de temps qui est associé à une famille. @fr
toolkit label: related timespan of family @en
toolkit definition: A timespan that is associated with a family. @en
has element type: 1
label: családhoz kapcsolódó időtartam a következő: @hu
definition: Hozzákapcsol egy családot egy családhoz kapcsolódó időtartamhoz. @hu
alternative label: date associated with family @en
alternative label: sukuun liittyvä ajankohta
label: har tidsrom relatert til familie @no
definition: Relaterer en familie til et tidsrom som forbindes med en familie. @no
alternative label: dato forbundet med familie @no
toolkit label: tidsrom relatert til familie @no
toolkit definition: Et tidsrom som forbindes med en familie. @no
label: heeft gerelateerde tijdspanne van familie @nl
definition: Relateert een familie aan een tijdspanne die geassocieerd is met een familie. @nl
toolkit label: gerelateerde tijdspanne van familie @nl
toolkit definition: Een tijdspanne die geassocieerd is met een familie. @nl
label: لها فترة زمنية مرتبطة بعائلة @ar
definition: يربط عائلة بفترة زمنية ذات صلة بعائلة. @ar
alternative label: تاريخ مرتبط بعائلة @ar
toolkit label: فترة زمنية مرتبطة بعائلة @ar
toolkit definition: فترة زمنية ذات صلة بعائلة. @ar
alternative label: data associada amb una família @ca
toolkit label: interval de temps relacionat amb una família @ca
toolkit definition: Interval de temps que s’associa amb una família. @ca
alternative label: dato, som er knyttet til familie @da
toolkit label: tidsperiode relateret til familie @da
toolkit definition: Tidsperiode, som er knyttet til en familie. @da
label: perekonnaga seotud ajavahemik @et
definition: Seostab perekonna perekonnaga seotud ajavahemikuga. @et
alternative label: perekonnaga seotud daatum @et
toolkit label: perekonnaga seotud ajavahemik @et
toolkit definition: Perekonnaga seotud ajavahemik. @et
label: hat mit Familie in Beziehung stehenden Zeitraum @de
definition: Setzt eine Familie in Beziehung zu einem Zeitraum, der mit einer Familie in Verbindung steht. @de
alternative label: Datum, das mit einer Familie in Verbindung steht @de
toolkit label: Mit Familie in Beziehung stehender Zeitraum @de
toolkit definition: Ein Zeitraum, der mit einer Familie in Verbindung steht. @de
alternative label: családhoz társított időpont: @hu
toolkit label: családhoz kapcsolódó időtartam: @hu
toolkit definition: Egy családhoz kapcsolódó időtartam. @hu
label: ha come arco di tempo correlato di famiglia @it
definition: Correla una famiglia a un arco di tempo associato a una famiglia. @it
alternative label: data associata a famiglia @it
toolkit label: arco di tempo correlato di famiglia @it
toolkit definition: Arco di tempo associato a una famiglia. @it
alternative label: χρονολογία σχετική με την οικογένεια @el
toolkit label: σχετικό χρονικό διάστημα της οικογένειας @el
alternative label: date associée à une famille @fr
toolkit label: laps de temps en relation avec une famille @fr
toolkit definition: Laps de temps qui est associé à une famille. @fr
label: ar dzimtu/ģimeni saistītais laikposms @lv
definition: Sasaista dzimtu/ģimeni ar laikposmu, kas saistīts ar dzimtu/ģimeni. @lv
toolkit label: ar dzimtu/ģimeni saistītais laikposms @lv
toolkit definition: Laikposms, kas saistīts ar dzimtu/ģimeni. @lv
alternative label: 和一个家族有关的日期 @zh-hans
toolkit label: 家族的关联时间段 @zh-hans
toolkit definition: 和一个家族有关的一个时间段 @zh-hans
toolkit label: Ailenin zaman aralığıyla ilişkisi @tr
toolkit definition: Bir aile ile bağlantılı olan bir zaman aralığı. @tr
has subproperty: sukuun liittyvä ajankohta
has subproperty: suvun toiminta-aika

yhteistoimijaan liittyvä ajanjakso
status: Published
sub property of: yhteistoimijaan liittyvä RDA-entiteetti
type: Property
label: has related timespan of collective agent @en
lexical alias: relatedTimespanOfCollectiveAgent.en
definition: Relates a collective agent to a timespan that is associated with a collective agent. @en
domain: C10011
sub property of: toimijaan liittyvä ajanjakso
label: έχει σχετικό χρονικό διάστημα του συλλογικού φορέα @el
definition: Συνδέει έναν συλλογικό φορέα με ένα χρονικό διάστημα που συνδέεται με έναν συλλογικό φορέα. @el
label: har tidsperiode relateret til kollektiv agent @da
definition: Relaterer en kollektiv agent til en tidsperiode, som er knyttet til en kollektiv agent. @da
label: té com a interval de temps relacionat amb un agent col·lectiu @ca
definition: Relaciona un agent col·lectiu amb un interval de temps que s’associa amb un agent col·lectiu. @ca
definition: Liittää yhteistoimijan ajanjaksoon, joka liittyy yhteistoimijaan.
toolkit label: yhteistoimijaan liittyvä ajanjakso
toolkit definition: Ajanjakso, joka liittyy yhteistoimijaan.
label: a pour laps de temps en relation avec un agent collectif @fr
definition: Met un agent collectif en relation avec un laps de temps qui est associé à un agent collectif. @fr
toolkit label: related timespan of collective agent @en
toolkit definition: A timespan that is associated with a collective agent. @en
has element type: 1
label: kollektív ágenshez kapcsolódó időtartam a következő: @hu
definition: Hozzákapcsol egy kollektív ágenst egy kollektív ágenshez kapcsolódó időtartamhoz. @hu
label: har tidsrom relatert til kollektiv agent @no
definition: Relaterer en kollektiv agent til et tidsrom som forbindes med en kollektiv agent. @no
toolkit label: tidsrom relatert til kollektiv agent @no
toolkit definition: Et tidsrom som forbindes med en kollektiv agent. @no
label: heeft gerelateerde tijdspanne van collectieve actor @nl
definition: Relateert een collectieve actor aan een tijdspanne die geassocieerd is met een collectieve actor. @nl
toolkit label: gerelateerde tijdspanne van collectieve actor @nl
toolkit definition: Een tijdspanne die geassocieerd is met een collectieve actor. @nl
label: له فترة زمنية مرتبطة بوكيل جماعي @ar
definition: يربط وكيلا جماعيا بفترة زمنية مرتبطة بوكيل جماعي. @ar
toolkit label: فترة زمنية مرتبطة بوكيل جماعي @ar
toolkit definition: فترة زمنية مرتبطة بوكيل جماعي. @ar
toolkit label: interval de temps relacionat amb un agent col·lectiu @ca
toolkit definition: Interval de temps que s’associa amb un agent col·lectiu. @ca
toolkit label: tidsperiode relateret til kollektiv agent @da
toolkit definition: Tidsperiode, som er knyttet til en kollektiv agent. @da
label: kollektiiviga seotud ajavahemik @et
definition: Seostab kollektiivi kollektiiviga seotud ajavahemikuga. @et
toolkit label: kollektiiviga seotud ajavahemik @et
toolkit definition: Kollektiiviga seotud ajavahemik. @et
label: hat mit gemeinschaftlichem Akteur in Beziehung stehenden Zeitraum @de
definition: Setzt einen gemeinschaftlichen Akteur in Beziehung zu einem Zeitraum, der mit einem gemeinschaftlichen Akteur in Verbindung steht. @de
toolkit label: Mit gemeinschaftlichem Akteur in Beziehung stehender Zeitraum @de
toolkit definition: Ein Zeitraum, der mit einem gemeinschaftlichen Akteur in Verbindung steht. @de
toolkit label: kollektív ágenshez kapcsolódó időtartam: @hu
toolkit definition: Egy kollektív ágenshez kapcsolódó időtartam. @hu
label: ha come arco di tempo correlato di agente collettivo @it
definition: Correla un agente collettivo a un arco di tempo associato a un agente collettivo. @it
toolkit label: arco di tempo correlato di agente collettivo @it
toolkit definition: Arco di tempo associato a un agente collettivo. @it
toolkit label: σχετικό χρονικό διάστημα του συλλογικού φορέα @el
toolkit label: laps de temps en relation avec un agent collectif @fr
toolkit definition: Laps de temps qui est associé à un agent collectif. @fr
label: ar grupu saistītais laikposms @lv
definition: Sasaista grupu ar laikposmu, kas saistīts ar grupu. @lv
toolkit label: ar grupu saistītais laikposms @lv
toolkit definition: Laikposms, kas saistīts ar grupu. @lv
label: 有集体行为者的关联时间段 @zh-hans
definition: 将一个集体行为者与和一个集体行为者有关的一个时间段关联起来。 @zh-hans
toolkit label: 集体行为者的关联时间段 @zh-hans
toolkit definition: 和一个集体行为者有关的一个时间段 @zh-hans
label: kolektif temsilcinin ilgili zaman aralığı ile ilişkilidir @tr
definition: Kolektif bir temsilciyi, kolektif temsilciyle bağlantılı bir zaman aralığıyla ilişkilendirir. @tr
toolkit label: kolektif temsilcinin zaman aralığıyla ilişkisi @tr
toolkit definition: Bir kolektif temsilciyle bağlantılı olan bir zaman aralığı. @tr
has subproperty: sukuun liittyvä ajanjakso
has subproperty: yhteisöön liittyvä ajanjakso
has subproperty: yhteistoimijan toiminta-aika
has subproperty: P50343

henkilöön liittyvä ajanjakso
status: Published
sub property of: henkilöön liittyvä RDA-entiteetti
type: Property
label: has related timespan of person @en
lexical alias: relatedTimespanOfPerson.en
definition: Relates a person to a timespan that is associated with a person. @en
domain: C10004
sub property of: toimijaan liittyvä ajanjakso
label: έχει σχετικό χρονικό διάστημα του φυσικού προσώπου @el
definition: Συνδέει ένα φυσικό πρόσωπο με ένα χρονικό διάστημα που συνδέεται με ένα φυσικό πρόσωπο. @el
label: har tidsperiode relateret til person @da
definition: Relaterer en person til en tidsperiode, som er knyttet til en person. @da
label: té com a interval de temps relacionat amb una persona @ca
definition: Relaciona una persona amb un interval de temps que s’associa amb una persona. @ca
definition: Liittää henkilön ajanjaksoon, joka liittyy henkilöön.
toolkit label: henkilöön liittyvä ajanjakso
toolkit definition: Ajanjakso, joka liittyy henkilöön.
label: a pour laps de temps en relation avec une personne @fr
definition: Met une personne en relation avec un laps de temps qui est associé à une personne. @fr
toolkit label: related timespan of person @en
toolkit definition: A timespan that is associated with a person. @en
has element type: 1
label: személyhez kapcsolódó időtartam a következő: @hu
definition: Hozzákapcsol egy személyt egy személyhez kapcsolódó időtartamhoz. @hu
alternative label: date associated with person @en
alternative label: henkilöön liittyvä ajankohta
label: har tidsrom relatert til person @no
definition: Relaterer en person til et tidsrom som forbindes med en person. @no
alternative label: dato forbundet med person @no
toolkit label: tidsrom relatert til person @no
toolkit definition: Et tidsrom som forbindes med en person. @no
label: heeft gerelateerde tijdspanne van persoon @nl
definition: Relateert een persoon aan een tijdspanne die geassocieerd is met een persoon. @nl
toolkit label: gerelateerde tijdspanne van persoon @nl
toolkit definition: Een tijdspanne die geassocieerd is met een persoon. @nl
label: له فترة زمنية مرتبطة بشخص @ar
definition: يربط شخصا بفترة زمنية مرتبطة بشخص. @ar
alternative label: تاريخ مرتبط بشخص @ar
toolkit label: فترة زمنية مرتبطة بشخص @ar
toolkit definition: فترة زمنية مرتبطة بشخص. @ar
alternative label: data associada amb una persona @ca
toolkit label: interval de temps relacionat amb una persona @ca
toolkit definition: Interval de temps que s’associa amb una persona. @ca
alternative label: dato, som er knyttet til person @da
toolkit label: tidsperiode relateret til person @da
toolkit definition: Tidsperiode, som er knyttet til en person. @da
label: isikuga seotud ajavahemik @et
definition: Seostab isiku isikuga seotud ajavahemikuga. @et
alternative label: isikuga seotud daatum @et
toolkit label: isikuga seotud ajavahemik @et
toolkit definition: Isikuga seotud ajavahemik. @et
label: hat mit Person in Beziehung stehenden Zeitraum @de
definition: Setzt eine Person in Beziehung zu einem Zeitraum, der mit einer Person in Verbindung steht. @de
alternative label: Datum, das mit einer Person in Verbindung steht @de
toolkit label: Mit Person in Beziehung stehender Zeitraum @de
toolkit definition: Ein Zeitraum, der mit einer Person in Verbindung steht. @de
alternative label: személyhez kapcsolódó időpont: @hu
toolkit label: személyhez kapcsolódó időtartam: @hu
toolkit definition: Egy személyhez kapcsolódó időtartam. @hu
label: ha come arco di tempo correlato di persona @it
definition: Correla una persona a un arco di tempo associato a una persona. @it
alternative label: data associata a persona @it
toolkit label: arco di tempo correlato di persona @it
toolkit definition: Arco di tempo associato a una persona. @it
alternative label: χρονολογία σχετικό με το φυσικό πρόσωπο @el
toolkit label: σχετικό χρονικό διάστημα του φυσικού προσώπου @el
alternative label: date associée à une personne @fr
toolkit label: laps de temps en relation avec une personne @fr
toolkit definition: Laps de temps qui est associé à une personne. @fr
label: ar personu saistītais laikposms @lv
definition: Sasaista personu ar laikposmu, kas saistīts ar personu. @lv
toolkit label: ar personu saistītais laikposms @lv
toolkit definition: Laikposms, kas saistīts ar personu. @lv
alternative label: 和个人有关的日期 @zh-hans
toolkit label: 个人的关联时间段 @zh-hans
toolkit definition: 和一个个人有关的一个时间段 @zh-hans
toolkit label: Kişinin zaman aralığıyla ilişkisi @tr
toolkit definition: Bir kişiyle bağlantılı olan bir zaman aralığı. @tr
has subproperty: kuolinaika
has subproperty: henkilöön liittyvä ajankohta

yhteisöön liittyvä ajanjakso
status: Published
sub property of: yhteisöön liittyvä RDA-entiteetti
type: Property
label: has related timespan of corporate body @en
lexical alias: relatedTimespanOfCorporateBody.en
definition: Relates a corporate body to a timespan that is associated with a corporate body. @en
domain: C10005
sub property of: yhteistoimijaan liittyvä ajanjakso
label: έχει σχετικό χρονικό διάστημα του συλλογικού οργάνου @el
definition: Συνδέει ένα συλλογικό όργανο με ένα χρονικό διάστημα που συνδέεται με ένα συλλογικό όργανο. @el
label: har tidsperiode relateret til korporation @da
definition: Relaterer en korporation til en tidsperiode, som er knyttet til en korporation. @da
label: té com a interval de temps relacionat amb una entitat corporativa @ca
definition: Relaciona una entitat corporativa amb un interval de temps que s’associa amb una entitat corporativa. @ca
definition: Liittää yhteisön ajanjaksoon, joka liittyy yhteisöön.
toolkit label: yhteisöön liittyvä ajanjakso
toolkit definition: Ajanjakso, joka liittyy yhteisöön.
label: a pour laps de temps en relation avec une collectivité @fr
definition: Met une collectivité en relation avec un laps de temps qui est associé à une collectivité. @fr
toolkit label: related timespan of corporate body @en
toolkit definition: A timespan that is associated with a corporate body. @en
has element type: 1
label: testülethez kapcsolódó időtartam a következő: @hu
definition: Hozzákapcsol egy testületet egy testülethez kapcsolódó időtartamhoz. @hu
alternative label: date associated with corporate body @en
alternative label: yhteisöön liittyvä ajankohta
label: har tidsrom relatert til korporasjon @no
definition: Relaterer en korporasjon til et tidsrom som forbindes med en korporasjon. @no
alternative label: dato forbundet med korporasjon @no
toolkit label: tidsrom relatert til korporasjon @no
toolkit definition: Et tidsrom som forbindes med en korporasjon. @no
label: heeft gerelateerde tijdspanne van corporatie @nl
definition: Relateert een corporatie aan een tijdspanne die geassocieerd is met een corporatie. @nl
toolkit label: gerelateerde tijdspanne van corporatie @nl
toolkit definition: Een tijdspanne die geassocieerd is met een corporatie. @nl
label: لها فترة زمنية مرتبطة بهيئة @ar
definition: يربط هيئة بفترة زمنية مرتبطة بهيئة. @ar
alternative label: تاريخ مرتبط بهيئة @ar
toolkit label: فترة زمنية مرتبطة بهيئة @ar
toolkit definition: فترة زمنية ذات صلة بهيئة. @ar
alternative label: data assocada amb una entitat corporativa @ca
toolkit label: interval de temps relacionat amb una entitat corporativa @ca
toolkit definition: Interval de temps que s’associa amb una entitat corporativa. @ca
alternative label: dato, som er knyttet til korporation @da
toolkit label: tidsperiode relateret til korporation @da
toolkit definition: Tidsperiode, som er knyttet til en korporation. @da
label: asutusega seotud ajavahemik @et
definition: Seostab asutuse asutusega seotud ajavahemikuga. @et
alternative label: asutusega seotud daatum @et
toolkit label: asutusega seotud ajavahemik @et
toolkit definition: Asutusega seotud ajavahemik. @et
label: hat mit Körperschaft in Beziehung stehenden Zeitraum @de
definition: Setzt eine Körperschaft in Beziehung zu einem Zeitraum, der mit einer Körperschaft in Verbindung steht. @de
alternative label: Datum, das mit einer Körperschaft in Verbindung steht @de
toolkit label: Mit Körperschaft in Beziehung stehender Zeitraum @de
toolkit definition: Ein Zeitraum, der mit einer Körperschaft in Verbindung steht. @de
alternative label: testülethez társított időpont: @hu
toolkit label: testülethez kapcsolódó időtartam: @hu
toolkit definition: Egy testülethez kapcsolódó időtartam. @hu
label: ha come arco di tempo correlato di ente @it
definition: Correla un ente a un arco di tempo associato a un ente. @it
alternative label: data associata a ente @it
toolkit label: arco di tempo correlato di ente @it
toolkit definition: Arco di tempo associato a un ente. @it
alternative label: χρονολογία σχετική με το συλλογικό όργανο @el
toolkit label: σχετικό χρονικό διάστημα του συλλογικού οργάνου @el
alternative label: date associée à une collectivité @fr
toolkit label: laps de temps en relation avec une collectivité @fr
toolkit definition: Laps de temps qui est associé à une collectivité. @fr
label: ar institūciju saistītais laikposms @lv
definition: Sasaista institūciju ar laikposmu, kas saistīts ar institūciju. @lv
toolkit label: ar institūciju saistītais laikposms @lv
toolkit definition: Laikposms, kas saistīts ar institūciju. @lv
alternative label: 和团体有关的一个日期 @zh-hans
toolkit label: 团体的关联时间段 @zh-hans
toolkit definition: 和一个团体有关的一个时间段 @zh-hans
toolkit label: tüzel kişiliğin zaman aralığıyla ilişkisi @tr
toolkit definition: Bir tüzel kişiyle bağlantılı olan bir zaman aralığı. @tr
has subproperty: perustamisajankohta
has subproperty: konferenssin ajankohta

yhteisöön liittyvä laitos
status: Deprecated
label: has associated institution (Deprecated) @en
definition: Relates a corporate body to an institution commonly associated with a corporate body. (Deprecated) @en
type: Property
domain: C10005
lexical alias: associatedInstitution.en
instruction number: 11.5
toolkit label: associated institution (Deprecated) @en
toolkit definition: An institution commonly associated with a corporate body. (Deprecated) @en
label: a pour institution associée @fr
definition: Met une collectivité en relation avec une institution communément associée à une collectivité. @fr
toolkit label: institution associée @fr
toolkit definition: Institution communément associée à une collectivité. @fr
toolkit label: institución asociada @es
toolkit definition: Una institución comúnmente asociada con una entidad corporativa. @es
label: har samhörande institution @sv
toolkit label: samhörande institution @sv
label: έχει συνδεδεμένο ίδρυμα @el
definition: Συνδέει ένα συλλογικό όργανο με ένα ίδρυμα ευρέως συνδεδεμένο με ένα συλλογικό όργανο. @el
toolkit label: συνδεδεμένο ίδρυμα @el
toolkit definition: Ένα ίδρυμα ευρέως συνδεδεμένο με ένα συλλογικό όργανο. @el
definition: Setzt eine Körperschaft mit einer Institution, die üblicherweise mit einer Körperschaft in Verbindung gebracht wird, in Beziehung. @de
toolkit label: In Verbindung stehende Institution @de
toolkit definition: Eine Institution, die üblicherweise mit einer Körperschaft in Verbindung gebracht wird. @de
label: har tilknyttet institution @da
definition: Relaterer en korporation til en institution der almindeligvis opfattes knyttet til en korporation @da
toolkit label: tilknyttet institution @da
toolkit definition: Institution, der almindeligvis opfattes knyttet til en korporation. @da
label: té com a institució associada @ca
definition: Relaciona una entitat corporativa amb una institució associada normalment amb una entitat corporativa. @ca
toolkit label: institució associada @ca
toolkit definition: Institució associada normalment amb una entitat corporativa. @ca
definition: Liittää yhteisön tiettyyn yhteisöön yleisesti liitettyyn laitokseen.
toolkit label: yhteisöön liittyvä laitos
toolkit definition: Tiettyyn yhteisöön yleisesti liitetty laitos.
toolkit label: assosiert institusjon @no
toolkit definition: En institusjon som vanligvis forbindes med en korporasjon. @no
label: hat in Verbindung stehende Institution @de
sub property of: yhteisöön liittyvä yhteisö
has element type: 2
label: van kapcsolódó intézménye @hu
definition: Egy testületet hozzákapcsol egy testülethez általában kötődő intézményhez. @hu
toolkit label: társintézmény @hu
toolkit definition: Egy testülethez általában kötődő intézmény. @hu
has subproperty: P50034

toimijaan liittyvä ekspressio
status: Published
sub property of: toimijaan liittyvä RDA-entiteetti
type: Property
label: has related expression of agent @en
lexical alias: relatedExpressionOfAgent.en
definition: Relates an agent to an expression that is associated with an agent. @en
domain: C10002
label: έχει σχετική έκφραση του φορέα @el
definition: Συνδέει έναν φορέα με μια έκφραση η οποία συνδέεται με έναν περιγραφόμενο φορέα. @el
label: har udtryk relateret til agent @da
definition: Relaterer en agent til et udtryk, som er knyttet til en agent. @da
label: té com a expressió relacionada amb un agent @ca
definition: Relaciona un agent amb una expressió que s’associa amb un agent. @ca
definition: Liittää toimijan ekspressioon, joka liittyy toimijaan.
toolkit label: toimijaan liittyvä ekspressio
toolkit definition: Ekspressio, joka liittyy toimijaan.
label: a pour expression en relation avec un agent @fr
definition: Met un agent en relation avec une expression qui est associée à un agent. @fr
toolkit label: related expression of agent @en
toolkit definition: An expression that is associated with an agent. @en
has element type: 1
sub property of: P00003
label: ágenshez kapcsolódó kifejezési forma a következő: @hu
definition: Hozzákapcsol egy ágenst egy ágenshez kapcsolódó kifejezési formához. @hu
label: har uttrykk relatert til agent @no
definition: Relaterer en agent til et uttrykk som forbindes med en agent. @no
toolkit label: uttrykk relatert til agent @no
toolkit definition: Et uttrykk som forbindes med en agent. @no
label: heeft gerelateerde expressie van actor @nl
definition: Relateert een actor aan een expressie die is geassocieerd met een actor. @nl
toolkit label: gerelateerde expressie van actor @nl
toolkit definition: Een expressie die is geassocieerd met een actor. @nl
label: له تعبيرة مرتبطة بوكيل @ar
definition: يربط وكيلا بتعبيرة مرتبطة بوكيل. @ar
toolkit label: تعبيرة مرتبطة بوكيل @ar
toolkit definition: تعبيرة مرتبطة بوكيل. @ar
toolkit label: expressió relacionada amb un agent @ca
toolkit definition: Expressió que s’associa amb un agent. @ca
toolkit label: udtryk relateret til agent @da
toolkit definition: Udtryk, som er knyttet til en agent. @da
label: tegijaga seotud väljendus @et
definition: Seostab tegija tegijaga seotud väljendusega. @et
toolkit label: tegijaga seotud väljendus @et
toolkit definition: Tegijaga seotud väljendus. @et
label: hat mit Akteur in Beziehung stehende Expression @de
definition: Setzt einen Akteur in Beziehung zu einer Expression, die mit einem Akteur in Verbindung steht. @de
toolkit label: Mit Akteur in Beziehung stehende Expression @de
toolkit definition: Eine Expression, die mit einem Akteur in Verbindung steht. @de
toolkit label: ágenshez kapcsolódó kifejezési forma: @hu
toolkit definition: Egy ágenshez kapcsolódó kifejezési forma. @hu
label: ha come espressione correlata di agente @it
definition: Correla un agente a un'espressione associata a un agente. @it
toolkit label: espressione correlata di agente @it
toolkit definition: Espressione associata a un agente. @it
toolkit label: σχετική έκφραση του φορέα @el
toolkit definition: Μια έκφραση που συνδέεται με έναν φορέα. @el
toolkit label: expression en relation avec un agent @fr
toolkit definition: Expression qui est associée à un agent. @fr
label: ar aģentu saistītā izteiksme @lv
definition: Sasaista aģentu ar izteiksmi, kas ir saistīta ar aģentu. @lv
toolkit label: ar aģentu saistītā izteiksme @lv
toolkit definition: Izteiksme, kas ir saistīta ar aģentu. @lv
label: 有行为者的关联内容表达 @zh-hans
definition: 将一个行为者与和一个行为者有关的一种内容表达关联起来。 @zh-hans
toolkit label: 行为者的关联内容表达 @zh-hans
toolkit definition: 和一个行为者有关的一种内容表达 @zh-hans
label: temsilcinin ilgili anlatımı ile ilişkilidir @tr
definition: Bir temsilciyi, bir temsilciyle bağlantılı olan bir anlatımla ilişkilendirir. @tr
toolkit label: temsilcinin ilişkili anlatımı @tr
toolkit definition: Bir temsilciyle bağlantılı olan bir anlatım. @tr
has subproperty: ekspression tekijä (toimija) ekspressiossa
has subproperty: yhteistoimijaan liittyvä ekspressio
has subproperty: henkilöön liittyvä ekspressio
has subproperty: P50306

sukuun liittyvä ekspressio
status: Published
sub property of: sukuun liittyvä RDA-entiteetti
type: Property
label: has related expression of family @en
lexical alias: relatedExpressionOfFamily.en
definition: Relates a family to an expression that is associated with a family. @en
domain: C10008
sub property of: yhteistoimijaan liittyvä ekspressio
label: έχει σχετική έκφραση της οικογένειας @el
definition: Συνδέει μια οικογένεια με μια έκφραση η οποία συνδέεται με μια περιγραφόμενη οικογένεια. @el
label: har udtryk relateret til familie @da
definition: Relaterer en familie til et udtryk, som er knyttet til en familie. @da
label: té com a expressió relacionada amb una família @ca
definition: Relaciona una família amb una expressió que s’associa amb una família. @ca
definition: Liittää suvun ekspressioon, joka liittyy sukuun.
toolkit label: sukuun liittyvä ekspressio
toolkit definition: Ekspressio, joka liittyy sukuun.
label: a pour expression en relation avec une famille @fr
definition: Met une famille en relation avec une expression qui est associée à une famille. @fr
toolkit label: related expression of family @en
toolkit definition: An expression that is associated with a family. @en
has element type: 1
label: családhoz kapcsolódó kifejezési forma a következő: @hu
definition: Hozzákapcsol egy családot egy családhoz kapcsolódó kifejezési formához. @hu
label: har uttrykk relatert til familie @no
definition: Relaterer en familie til et uttrykk som forbindes med en familie. @no
toolkit label: uttrykk relatert til familie @no
toolkit definition: Et uttrykk som forbindes med en familie. @no
label: heeft gerelateerde expressie van familie @nl
definition: Relateert een familie aan een expressie die geassocieerd is met een familie. @nl
toolkit label: gerelateerde expressie van familie @nl
toolkit definition: Een expressie die geassocieerd is met een familie. @nl
label: له تعبيرة مرتبطة بعائلة @ar
definition: يربط عائلة بتعبيرة مرتبطة بعائلة. @ar
toolkit label: تعبيرة مرتبطة بعائلة @ar
toolkit definition: تعبيرة مرتبطة بعائلة. @ar
toolkit label: expressió relacionada amb una família @ca
toolkit definition: Expressió que s’associa amb una família. @ca
toolkit label: udtryk relateret til familie @da
toolkit definition: Udtryk, som er knyttet til en familie. @da
label: perekonnaga seotud väljendus @et
definition: Seostab perekonna perekonnaga seotud väljendusega. @et
toolkit label: perekonnaga seotud väljendus @et
toolkit definition: Perekonnaga seotud väljendus. @et
label: hat mit Familie in Beziehung stehende Expression @de
definition: Setzt eine Familie in Beziehung zu einer Expression, die mit einer Familie in Verbindung steht. @de
toolkit label: Mit Familie in Beziehung stehende Expression @de
toolkit definition: Eine Expression, die mit einer Familie in Verbindung steht. @de
toolkit label: családhoz kapcsolódó kifejezési forma: @hu
toolkit definition: Egy családhoz kapcsolódó kifejezési forma. @hu
label: ha come espressione correlata di famiglia @it
definition: Correla una famiglia a un'espressione associata a una famiglia. @it
toolkit label: espressione correlata di famiglia @it
toolkit definition: Espressione associata a una famiglia. @it
toolkit label: σχετική έκφραση της οικογένειας @el
toolkit label: expression en relation avec une famille @fr
toolkit definition: Expression qui est associée à une famille. @fr
label: ar dzimtu/ģimeni saistītā izteiksme @lv
definition: Sasaista dzimtu/ģimeni ar izteiksmi, kas ir saistīta ar dzimtu/ģimeni. @lv
toolkit label: ar dzimtu/ģimeni saistītā izteiksme @lv
toolkit definition: Izteiksme, kas ir saistīta ar dzimtu/ģimeni. @lv
label: 有家族的关联内容表达 @zh-hans
definition: 将一个家族与和一个家族有关的一种内容表达关联起来。 @zh-hans
toolkit label: 家族的关联内容表达 @zh-hans
toolkit definition: 和一个家族有关的一种内容表达 @zh-hans
label: ailenin ilgili anlatımı ile ilişkilidir @tr
definition: Bir aileyi, aileyle bağlantılı bir anlatımla ilişkilendirir. @tr
toolkit label: ailenin ilişkili olduğu anlatım @tr
toolkit definition: Bir aileyle bağlantılı olan bir anlatım. @tr
has subproperty: ekspression tekijä (suku) ekspressiossa
has subproperty: P50321

yhteistoimijaan liittyvä ekspressio
status: Published
sub property of: yhteistoimijaan liittyvä RDA-entiteetti
type: Property
label: has related expression of collective agent @en
lexical alias: relatedExpressionOfCollectiveAgent.en
definition: Relates a collective agent to an expression that is associated with a collective agent. @en
domain: C10011
sub property of: toimijaan liittyvä ekspressio
label: έχει σχετική έκφραση του συλλογικού φορέα @el
definition: Συνδέει έναν συλλογικό φορέα με μια έκφραση η οποία συνδέεται με έναν συλλογικό φορέα. @el
label: har udtryk relateret til kollektiv agent @da
definition: Relaterer en kollektiv agent til et udtryk, som er knyttet til en kollektiv agent. @da
label: té com a expressió relacionada amb un agent col·lectiu @ca
definition: Relaciona un agent col·lectiu amb una expressió que s’associa amb un agent col·lectiu. @ca
definition: Liittää yhteistoimijan ekspressioon, joka liittyy yhteistoimijaan.
toolkit label: yhteistoimijaan liittyvä ekspressio
toolkit definition: Ekspressio, joka liittyy yhteistoimijaan.
label: a pour expression en relation avec un agent collectif @fr
definition: Met un agent collectif en relation avec une expression qui est associée à un agent collectif. @fr
toolkit label: related expression of collective agent @en
toolkit definition: An expression that is associated with a collective agent. @en
has element type: 1
label: kollektív ágenshez kapcsolódó kifejezési forma a következő: @hu
definition: Hozzákapcsol egy kollektív ágenst egy kollektív ágenshez kapcsolódó kifejezési formához. @hu
label: har uttrykk relatert til kollektiv agent @no
definition: Relaterer en kollektiv agent til et uttrykk som forbindes med en kollektiv agent. @no
toolkit label: uttrykk relatert til kollektiv agent @no
toolkit definition: Et uttrykk som forbindes med en kollektiv agent. @no
label: heeft gerelateerde expressie van collectieve actor @nl
definition: Relateert een collectieve actor aan een expressie die geassocieerd is met een collectieve actor. @nl
toolkit label: gerelateerde expressie van collectieve actor @nl
toolkit definition: Een expressie die geassocieerd is met een collectieve actor. @nl
label: له تعبيرة مرتبطة بوكيل جماعي @ar
definition: يربط وكيلا جماعيا بتعبيرة ذات صلة بوكيل جماعي. @ar
toolkit label: تعبيرة مرتبطة بوكيل جماعي @ar
toolkit definition: تعبيرة ذات صلة بوكيل جماعي. @ar
toolkit label: expressió relacionada amb un agent col·lectiu @ca
toolkit definition: Expressió que s’associa amb un agent col·lectiu. @ca
toolkit label: udtryk relateret til kollektiv agent @da
toolkit definition: Udtryk, som er knyttet til en kollektiv agent. @da
label: kollektiiviga seotud väljendus @et
definition: Seostab kollektiivi kollektiiviga seotud väljendusega. @et
toolkit label: kollektiiviga seotud väljendus @et
toolkit definition: Kollektiiviga seotud väljendus. @et
label: hat mit gemeinschaftlichem Akteur in Beziehung stehende Expression @de
definition: Setzt einen gemeinschaftlichen Akteur in Beziehung zu einer Expression, die mit einem gemeinschaftlichen Akteur in Verbindung steht. @de
toolkit label: Mit gemeinschaftlichem Akteur in Beziehung stehende Expression @de
toolkit definition: Eine Expression, die mit einem gemeinschaftlichen Akteur in Verbindung steht. @de
toolkit label: kollektív ágenshez kapcsolódó kifejezési forma: @hu
toolkit definition: Egy kollektív ágenshez kapcsolódó kifejezési forma. @hu
label: ha come espressione correlata di agente collettivo @it
definition: Correla un agente collettivo a un'espressione associata a un agente collettivo. @it
toolkit label: espressione correlata di agente collettivo @it
toolkit definition: Espressione associata a un agente collettivo. @it
toolkit label: σχετική έκφραση του συλλογικού φορέα @el
toolkit label: expression en relation avec un agent collectif @fr
toolkit definition: Expression qui est associée à un agent collectif. @fr
label: ar grupu saistītā izteiksme @lv
definition: Sasaista grupu ar izteiksmi, kas ir saistīta ar grupu. @lv
toolkit label: ar grupu saistītā izteiksme @lv
toolkit definition: Izteiksme, kas ir saistīta ar grupu. @lv
label: 有集体行为者的关联内容表达 @zh-hans
definition: 将一个集体行为者与和一个集体行为者有关的一种内容表达关联起来。 @zh-hans
toolkit label: 集体行为者的关联内容表达 @zh-hans
toolkit definition: 和一个集体行为者有关的一种内容表达 @zh-hans
label: kolektif temsilicinin ilgili anlatımı ile ilişkilidir @tr
definition: Kolektif temsilciyi, kolektif temsilciyle bağlantılı bir anlatımla ilişkilendirir. @tr
toolkit label: kolektif temsilcinin ilişkili anlatımı @tr
toolkit definition: Bir kolektif temsilciyle bağlantılı olan bir anlatım. @tr
has subproperty: ekspression tekijä (yhteistoimija) ekspressiossa
has subproperty: sukuun liittyvä ekspressio
has subproperty: yhteisöön liittyvä ekspressio
has subproperty: P50361

henkilöön liittyvä ekspressio
status: Published
sub property of: henkilöön liittyvä RDA-entiteetti
type: Property
label: has related expression of person @en
lexical alias: relatedExpressionOfPerson.en
definition: Relates a person to an expression that is associated with a person. @en
domain: C10004
sub property of: toimijaan liittyvä ekspressio
label: έχει σχετική έκφραση του φυσικού προσώπου @el
definition: Συνδέει ένα φυσικό πρόσωπο με μια έκφραση η οποία συνδέεται με ένα περιγραφόμενο φυσικό πρόσωπο. @el
label: har udtryk relateret til person @da
definition: Relaterer en person til et udtryk, som er knyttet til en person. @da
label: té com a expressió relacionada amb una persona @ca
definition: Relaciona una persona amb una expressió que s’associa amb una persona. @ca
definition: Liittää henkilön ekspressioon, joka liittyy henkilöön.
toolkit label: henkilöön liittyvä ekspressio
toolkit definition: Ekspressio, joka liittyy henkilöön.
label: a pour expression en relation avec une personne @fr
definition: Met une personne en relation avec une expression qui est associée à une personne. @fr
toolkit label: related expression of person @en
toolkit definition: An expression that is associated with a person. @en
has element type: 1
label: személyhez kapcsolódó kifejezési forma a következő: @hu
definition: Hozzákapcsol egy személyt egy személyhez kapcsolódó kifejezési formához. @hu
label: har uttrykk relatert til person @no
definition: Relaterer en person til et uttrykk som forbindes med en person. @no
toolkit label: uttrykk relatert til person @no
toolkit definition: Et uttrykk som forbindes med en person. @no
label: heeft gerelateerde expressie van persoon @nl
definition: Relateert een persoon aan een expressie die geassocieerd is met een persoon. @nl
toolkit label: gerelateerde expressie van persoon @nl
toolkit definition: Een expressie die geassocieerd is met een persoon. @nl
label: لها تعبيرة مرتبطة بشخص @ar
definition: يربط شخصا بتعبيرة مرتبطة بشخص. @ar
toolkit label: تعبيرة مرتبطة بشخص @ar
toolkit definition: تعبيرة مرتبطة بشخص. @ar
toolkit label: expressió relacionada amb una persona @ca
toolkit definition: Expressió que s’associa amb una persona. @ca
toolkit label: udtryk relateret til person @da
toolkit definition: Udtryk, som er knyttet til en person. @da
label: isikuga seotud väljendus @et
definition: Seostab isiku isikuga seotud väljendusega. @et
toolkit label: isikuga seotud väljendus @et
toolkit definition: Isikuga seotud väljendus. @et
label: hat mit Person in Beziehung stehende Expression @de
definition: Setzt eine Person in Beziehung zu einer Expression, die mit einer Person in Verbindung steht. @de
toolkit label: Mit Person in Beziehung stehende Expression @de
toolkit definition: Eine Expression, die mit einer Person in Verbindung steht. @de
toolkit label: személyhez kapcsolódó kifejezési forma: @hu
toolkit definition: Személyhez kapcsolódó kifejezési forma. @hu
label: ha come espressione correlata di persona @it
definition: Correla una persona a un'espressione associata a una persona. @it
toolkit label: espressione correlata di persona @it
toolkit definition: Espressione associata a una persona. @it
toolkit label: σχετική έκφραση του φυσικού προσώπου @el
toolkit label: expression en relation avec une personne @fr
toolkit definition: Expression qui est associée à une personne. @fr
label: ar personu saistītā izteiksme @lv
definition: Sasaista personu ar izteiksmi, kas ir saistīta ar personu. @lv
toolkit label: ar personu saistītā izteiksme @lv
toolkit definition: Izteiksme, kas ir saistīta ar personu. @lv
label: 有个人的关联内容表达 @zh-hans
definition: 将一个个人与和一个个人有关的一种内容表达关联起来。 @zh-hans
toolkit label: 个人的关联内容表达 @zh-hans
toolkit definition: 和一个个人有关的一种内容表达 @zh-hans
label: kişinin ilgili anlatımı ile ilişkilidir @tr
definition: Bir kişiyi, bir kişiyle bağlantılı olan bir anlatımla ilişkilendirir. @tr
toolkit label: kişiyle ilişkili anlatım @tr
toolkit definition: Bir kişiyle bağlantılı olan bir anlatım. @tr
has subproperty: ekspression tekijä (henkilö) ekspressiossa
has subproperty: P50312

yhteisöön liittyvä ekspressio
status: Published
sub property of: yhteisöön liittyvä RDA-entiteetti
type: Property
label: has related expression of corporate body @en
lexical alias: relatedExpressionOfCorporateBody.en
definition: Relates a corporate body to an expression that is associated with a corporate body. @en
domain: C10005
sub property of: yhteistoimijaan liittyvä ekspressio
label: έχει σχετική έκφραση του συλλογικού οργάνου @el
definition: Συνδέει ένα συλλογικό όργανο με μια έκφραση η οποία συνδέεται με ένα περιγραφόμενο συλλογικό όργανο. @el
label: har udtryk relateret til korporation @da
definition: Relaterer en korporation til et udtryk, som er knyttet til en korporation. @da
label: té com a expressió relacionada amb una entitat corporativa @ca
definition: Relaciona una entitat corporativa amb una expressió que s’associa amb una entitat corporativa. @ca
definition: Liittää yhteisön ekspressioon, joka liittyy yhteisöön.
toolkit label: yhteisöön liittyvä ekspressio
toolkit definition: Ekspressio, joka liittyy yhteisöön.
label: a pour expression en relation avec une collectivité @fr
definition: Met une collectivité en relation avec une expression qui est associée à une collectivité. @fr
toolkit label: related expression of corporate body @en
toolkit definition: An expression that is associated with a corporate body. @en
has element type: 1
label: testülethez kapcsolódó kifejezési forma a következő: @hu
definition: Hozzákapcsol egy testületet egy testülethez kapcsolódó kifejezési formához. @hu
label: har uttrykk relatert til korporasjon @no
definition: Relaterer en korporasjon til et uttrykk som forbindes med en korporasjon. @no
toolkit label: uttrykk relatert til korporasjon @no
toolkit definition: Et uttrykk som forbindes med en korporasjon. @no
label: heeft gerelateerde expressie van corporatie @nl
definition: Relateert een corporatie aan een expressie die geassocieerd is met een corporatie. @nl
toolkit label: gerelateerde expressie van corporatie @nl
toolkit definition: Een expressie die geassocieerd is met een corporatie. @nl
label: له تعبيرة مرتبطة بهيئة @ar
definition: يربط هيئة بتعبيرة ذات صلة بهيئة. @ar
toolkit label: تعبيرة مرتبطة بهيئة @ar
toolkit definition: تعبيرة ذات صلة بهيئة. @ar
toolkit label: expressió relacionada amb una entitat corporativa @ca
toolkit definition: Expressió que s’associa amb una entitat corporativa. @ca
toolkit label: udtryk relateret til korporation @da
toolkit definition: Udtryk, som er knyttet til en korporation. @da
label: asutusega seotud väljendus @et
definition: Seostab asutuse asutusega seotud väljendusega. @et
toolkit label: asutusega seotud väljendus @et
toolkit definition: Asutusega seotud väljendus. @et
label: hat mit Körperschaft in Beziehung stehende Expression @de
definition: Setzt eine Körperschaft in Beziehung zu einer Expression, die mit einer Körperschaft in Verbindung steht. @de
toolkit label: Mit Körperschaft in Beziehung stehende Expression @de
toolkit definition: Eine Expression, die mit einer Körperschaft in Verbindung steht. @de
toolkit label: testülethez kapcsolódó kifejezési forma: @hu
toolkit definition: Egy testülethez kapcsolódó kifejezési forma. @hu
label: ha come espressione correlata di ente @it
definition: Correla un ente a un'espressione associata a un ente. @it
toolkit label: espressione correlata di ente @it
toolkit definition: Espressione associata a un ente. @it
toolkit label: σχετική έκφραση του συλλογικού οργάνου @el
toolkit label: expression en relation avec une collectivité @fr
toolkit definition: Expression qui est associée à une collectivité. @fr
label: ar institūciju saistītā izteiksme @lv
definition: Sasaista institūciju ar izteiksmi, kas ir saistīta ar institūciju. @lv
toolkit label: ar institūciju saistītā izteiksme @lv
toolkit definition: Izteiksme, kas ir saistīta ar institūciju. @lv
label: 有团体的关联内容表达 @zh-hans
definition: 将一个团体与和一个团体有关的一种内容表达关联起来。 @zh-hans
toolkit label: 团体的关联内容表达 @zh-hans
toolkit definition: 和一个团体有关的一种内容表达 @zh-hans
label: tüzel kişinin ilgili anlatımı ile ilişkilidir @tr
definition: Bir tüzel kişiyi, tüzel kişilikle alakalı bir anlatımla ilişkilendirir. @tr
toolkit label: tüzel kişiliğin ilişkili olduğu anlatım @tr
toolkit definition: Bir tüzel kişilikle bağlantılı olan bir anlatım. @tr
has subproperty: ekspression tekijä (yhteisö) ekspressiossa
has subproperty: P50330

toimijaan liittyvä yhteistoimija
status: Published
sub property of: toimijaan liittyvä toimija
type: Property
label: has related collective agent of agent @en
lexical alias: relatedCollectiveAgentOfAgent.en
definition: Relates an agent to a collective agent who is associated with an agent. @en
domain: C10002
label: έχει σχετικό συλλογικό φορέα του φορέα @el
definition: Συνδέει έναν φορέα με έναν συλλογικό φορέα που συνδέεται με έναν φορέα. @el
label: har kollektiv agent relateret til agent @da
definition: Relaterer en agent til en kollektiv agent, som er knyttet til en agent. @da
label: té com a agent col·lectiu relacionat amb un agent @ca
definition: Relaciona un agent amb un agent col·lectiu que s’associa amb un agent. @ca
definition: Liittää toimijan yhteistoimijaan, joka liittyy toimijaan.
toolkit label: toimijaan liittyvä yhteistoimija
toolkit definition: Yhteistoimija, joka liittyy toimijaan.
label: a pour agent collectif en relation avec un agent @fr
definition: Met un agent en relation avec un agent collectif qui est associé à un agent. @fr
toolkit label: related collective agent of agent @en
toolkit definition: A collective agent who is associated with an agent. @en
has element type: 1
sub property of: P00012
label: ágenshez kapcsolódó kollektív ágens a következő: @hu
definition: Hozzákapcsol egy ágenst egy ágenshez kapcsolódó kollektív ágenshez. @hu
label: har kollektiv agent relatert til agent @no
definition: Relaterer en agent til en kollektiv agent som forbindes med en agent. @no
toolkit label: kollektiv agent relatert til agent @no
toolkit definition: En kollektiv agent som forbindes med en agent. @no
label: heeft gerelateerde collectieve actor van actor @nl
definition: Relateert een actor aan een collectieve actor die geassocieerd is met een actor. @nl
toolkit label: gerelateerde collectieve actor van actor @nl
toolkit definition: Een collectieve actor die geassocieerd is met een actor. @nl
label: له وكيل جماعي مرتبط بوكيل @ar
definition: يربط وكيلا بوكيل جماعي ذي صلة بوكيل. @ar
toolkit label: وكيل جماعي مرتبط بوكيل @ar
toolkit definition: وكيل جماعي ذو صلة بوكيل. @ar
toolkit label: agent col·lectiu relacionat amb un agent @ca
toolkit definition: Agent col·lectiu que s’associa amb un agent. @ca
toolkit label: kollektiv agent relateret til agent @da
toolkit definition: Kollektiv agent, som er knyttet til en agent. @da
label: tegijaga seotud kollektiiv @et
definition: Seostab tegija tegijaga seotud kollektiiviga. @et
toolkit label: tegijaga seotud kollektiiv @et
toolkit definition: Tegijaga seotud kollektiiv. @et
label: hat mit Akteur in Beziehung stehenden gemeinschaftlichen Akteur @de
definition: Setzt einen Akteur in Beziehung zu einem gemeinschaftlichen Akteur, der mit einem Akteur in Verbindung steht. @de
toolkit label: Mit Akteur in Beziehung stehender gemeinschaftlicher Akteur @de
toolkit definition: Ein gemeinschaftlicher Akteur, der mit einem Akteur in Verbindung steht. @de
toolkit label: ágenshez kapcsolódó kollektív ágens: @hu
toolkit definition: Egy ágenshez kapcsolódó kollektív ágens. @hu
label: ha come agente collettivo correlato di agente @it
definition: Correla un agente a un agente collettivo associato a un agente. @it
toolkit label: agente collettivo correlato di agente @it
toolkit definition: Agente collettivo associato a un agente. @it
toolkit label: σχετικός συλλογικός φορέας του φορέα @el
toolkit label: agent collectif en relation avec un agent @fr
toolkit definition: Agent collectif qui est associé à un agent. @fr
label: ar aģentu saistītā grupa @lv
definition: Sasaista aģentu ar grupu, kas saistīta ar aģentu. @lv
toolkit label: ar aģentu saistītā grupa @lv
toolkit definition: Grupa, kas saistīta ar aģentu. @lv
label: 有行为者的关联集体行为者 @zh-hans
definition: 将一个行为者与和一个行为者有关的一个集体行为者关联起来。 @zh-hans
toolkit label: 行为者的关联集体行为者 @zh-hans
toolkit definition: 和一个行为者有关的一个集体行为者 @zh-hans
label: temsilcinin ilgili kolektif temsilcisi ile ilişkilidir @tr
definition: Bir temsilciyi, bir temsilciyle bağlantılı olan kolektif bir temsilciyle ilişkilendirir. @tr
toolkit label: Temsilcinin kolektif temsilciyle ilişkisi @tr
toolkit definition: Bir temsilci ile ilişkilendirilen kolektif bir temsilci. @tr
has subproperty: toimijaan liittyvä suku
has subproperty: yhteistoimijaan liittyvä yhteistoimija
has subproperty: henkilöön liittyvä yhteistoimija
has subproperty: toimijaan liittyvä yhteisö
has subproperty: P50337

sukuun liittyvä yhteistoimija
status: Published
sub property of: sukuun liittyvä toimija
type: Property
label: has related collective agent of family @en
lexical alias: relatedCollectiveAgentOfFamily.en
definition: Relates a family to a collective agent who is associated with a family. @en
domain: C10008
sub property of: yhteistoimijaan liittyvä yhteistoimija
label: έχει σχετικό συλλογικό φορέα της οικογένειας @el
definition: Συνδέει μια οικογένεια με έναν συλλογικό φορέα που συνδέεται με μια οικογένεια. @el
label: har kollektiv agent relateret til familie @da
definition: Relaterer en familie til en kollektiv agent, som er knyttet til en familie. @da
label: té com a agent col·lectiu relacionat amb una família @ca
definition: Relaciona una família amb un agent col·lectiu que s’associa amb una família. @ca
definition: Liittää suvun yhteistoimijaan, joka liittyy sukuun.
toolkit label: sukuun liittyvä yhteistoimija
toolkit definition: Yhteistoimija, joka liittyy sukuun.
label: a pour agent collectif en relation avec une famille @fr
definition: Met une famille en relation avec un agent collectif qui est associé à une famille. @fr
toolkit label: related collective agent of family @en
toolkit definition: A collective agent who is associated with a family. @en
has element type: 1
label: családhoz kapcsolódó kollektív ágens a következő: @hu
definition: Hozzákapcsol egy családot egy családhoz kapcsolódó ágenshez. @hu
label: har kollektiv agent relatert til familie @no
definition: Relaterer en familie til en kollektiv agent som forbindes med en familie. @no
toolkit label: kollektiv agent relatert til familie @no
toolkit definition: En kollektiv agent som forbindes med en familie. @no
label: heeft gerelateerde collectieve actor van familie @nl
definition: Relateert een familie aan een collectieve actor die geassocieerd is met een familie. @nl
toolkit label: gerelateerde collectieve actor van familie @nl
toolkit definition: Een collectieve actor die geassocieerd is met een familie. @nl
label: لها وكيل جماعي مرتبط بعائلة @ar
definition: يربط عائلة بوكيل جماعي ذي صلة بعائلة. @ar
toolkit label: وكيل جماعي مرتبط بعائلة @ar
toolkit definition: وكيل جماعي ذو صلة بعائلة. @ar
toolkit label: agent col·lectiu relacionat amb una família @ca
toolkit definition: Agent col·lectiu que s’associa amb una família. @ca
toolkit label: kollektiv agent relateret til familie @da
toolkit definition: Kollektiv agent, som er knyttet til en familie. @da
label: perekonnaga seotud kollektiiv @et
definition: Seostab perekonna perekonnaga seotud kollektiiviga. @et
toolkit label: perekonnaga seotud kollektiiv @et
toolkit definition: Perekonnaga seotud kollektiiv. @et
label: hat mit Familie in Beziehung stehenden gemeinschaftlichen Akteur @de
definition: Setzt eine Familie in Beziehung zu einem gemeinschaftlichen Akteur, der mit einer Familie in Verbindung steht. @de
toolkit label: Mit Familie in Beziehung stehender gemeinschaftlicher Akteur @de
toolkit definition: Ein gemeinschaftlicher Akteur, der mit einer Familie in Verbindung steht. @de
toolkit label: családhoz kapcsolódó kollektív ágens: @hu
toolkit definition: Egy családhoz kapcsolódó kollektív ágens. @hu
label: ha come agente collettivo correlato di famiglia @it
definition: Correla una famiglia a un agente collettivo associato a una famiglia. @it
toolkit label: agente collettivo correlato di famiglia @it
toolkit definition: Agente collettivo associato a una famiglia. @it
toolkit label: σχετικός συλλογικός φορέας της οικογένειας @el
toolkit label: agent collectif en relation avec une famille @fr
toolkit definition: Agent collectif qui est associé à une famille. @fr
label: ar dzimtu/ģimeni saistītā grupa @lv
definition: Sasaista dzimtu/ģimeni ar grupu, kas saistīta ar dzimtu/ģimeni. @lv
toolkit label: ar dzimtu/ģimeni saistītā grupa @lv
toolkit definition: Grupa, kas saistīta ar dzimtu/ģimeni. @lv
label: 有家族的关联集体行为者 @zh-hans
definition: 将一个家族与和一个家族有关的集体行为者关联起来。 @zh-hans
toolkit label: 家族的关联集体行为者 @zh-hans
toolkit definition: 和一个家族有关的集体行为者 @zh-hans
label: ailenin ilgili kolektif temsilcisi ile ilişkilidir @tr
definition: Bir aileyi, aileyle bağlantılı bir kolektif temsilciyle ilişkilendirir. @tr
toolkit label: Ailenin kolektif temsilciyle ilişkisi @tr
toolkit definition: Bir aileyle ilişkilendirilen kolektif bir temsilci. @tr
has subproperty: sukujäsen yhteistoimijassa
has subproperty: sukuun liittyvä suku
has subproperty: sukuun liittyvä yhteisö
has subproperty: P50353

yhteistoimijaan liittyvä yhteistoimija
status: Published
sub property of: yhteistoimijaan liittyvä toimija
type: Property
label: has related collective agent of collective agent @en
lexical alias: relatedCollectiveAgentOfCollectiveAgent.en
definition: Relates a collective agent to a collective agent who is associated with a collective agent. @en
domain: C10011
sub property of: toimijaan liittyvä yhteistoimija
label: έχει σχετικό συλλογικό φορέα του συλλογικού φορέα @el
definition: Συνδέει έναν συλλογικό φορέα με έναν συλλογικό φορέα που συνδέεται με έναν συλλογικό φορέα. @el
label: har kollektiv agent relateret til kollektiv agent @da
definition: Relaterer en kollektiv agent til kollektiv agent, som er knyttet til en kollektiv agent. @da
label: té com a agent col·lectiu relacionat amb un agent col·lectiu @ca
definition: Relaciona un agent col·lectiu amb un agent col·lectiu que s’associa amb un agent col·lectiu. @ca
definition: Liittää yhteistoimijan yhteistoimijaan, joka liittyy yhteistoimijaan.
toolkit label: yhteistoimijaan liittyvä yhteistoimija
toolkit definition: Yhteistoimija, joka liittyy yhteistoimijaan.
label: a pour agent collectif en relation avec un agent collectif @fr
definition: Met un agent collectif en relation avec un agent collectif qui est associé à un agent collectif. @fr
toolkit label: related collective agent of collective agent @en
toolkit definition: A collective agent who is associated with a collective agent. @en
has element type: 1
label: kollektív ágenshez kapcsolódó kollektív ágens a következő: @hu
definition: Hozzákapcsol egy kollektív ágenst egy kollektív ágenshez kapcsolódó kollektív ágenshez. @hu
label: har kollektiv agent relatert til kollektiv agent @no
definition: Relaterer en kollektiv agent til en kollektiv agent som forbindes med en kollektiv agent. @no
toolkit label: kollektiv agent relatert til kollektiv agent @no
toolkit definition: En kollektiv agent som forbindes med en kollektiv agent. @no
label: heeft gerelateerde collectieve actor van collectieve actor @nl
definition: Relateert een collectieve actor aan een collectieve actor die geassocieerd is met een collectieve actor. @nl
toolkit label: gerelateerde collectieve actor van collectieve actor @nl
toolkit definition: Een collectieve actor die geassocieerd is met een collectieve actor. @nl
label: له وكيل جماعي مرتبط بوكيل جماعي @ar
definition: يربط وكيلا جماعيا بوكيل جماعي مرتبط بوكيل جماعي. @ar
toolkit label: وكيل جماعي مرتبط بوكيل جماعي @ar
toolkit definition: وكيل جماعي مرتبط بوكيل جماعي. @ar
toolkit label: agent col·lectiu relacionat amb un agent col·lectiu @ca
toolkit definition: Agent col·lectiu que s’associa amb un agent col·lectiu. @ca
toolkit label: kollektiv agent relateret til kollektiv agent @da
toolkit definition: Kollektiv agent, som er knyttet til en kollektiv agent. @da
label: kollektiiviga seotud kollektiiv @et
definition: Seostab kollektiivi kollektiiviga seotud kollektiiviga. @et
toolkit label: kollektiiviga seotud kollektiiv @et
toolkit definition: Kollektiiviga seotud kollektiiv. @et
label: hat mit gemeinschaftlichem Akteur in Beziehung stehenden gemeinschaftlichen Akteur @de
definition: Setzt einen gemeinschaftlichen Akteur in Beziehung zu einem gemeinschaftlichen Akteur, der mit einem gemeinschaftlichen Akteur in Verbindung steht. @de
toolkit label: Mit gemeinschaftlichem Akteur in Beziehung stehender gemeinschaftlicher Akteur @de
toolkit definition: Ein gemeinschaftlicher Akteur, der mit einem gemeinschaftlichen Akteur in Verbindung steht. @de
toolkit label: kollektív ágenshez kapcsolódó kollektív ágens: @hu
toolkit definition: Egy kollektív ágenshez kapcsolódó kollektív ágens. @hu
label: ha come agente collettivo correlato di agente collettivo @it
definition: Correla un agente collettivo a un agente collettivo associato a un agente collettivo. @it
toolkit label: agente collettivo correlato di agente collettivo @it
toolkit definition: Agente collettivo associato a un agente collettivo. @it
toolkit label: σχετικός συλλογικός φορέας του συλλογικού φορέα @el
toolkit label: agent collectif en relation avec un agent collectif @fr
toolkit definition: Agent collectif qui est associé à un agent collectif. @fr
label: ar grupu saistītā grupa @lv
definition: Sasaista grupu ar grupu, kas saistīta ar grupu. @lv
toolkit label: ar grupu saistītā grupa @lv
toolkit definition: Grupa, kas saistīta ar grupu. @lv
label: 有集体行为者的关联集体行为者 @zh-hans
definition: 将一个集体行为者与和一个集体行为者有关的一个集体行为者关联起来。 @zh-hans
toolkit label: 集体行为者的关联集体行为者 @zh-hans
toolkit definition: 和一个集体行为者有关的一个集体行为者 @zh-hans
label: kolektif temsilcinin ilgili kolektif temsilcisi ile ilişkilidir @tr
definition: Kolektif bir temsilciyi, kolektif bir temsilciyle bağlantılı olan bir kolektif temsilciyle ilişkilendirir. @tr
toolkit label: kolektif temsilcinin kolektif temsilciyle ilişkisi @tr
toolkit definition: Bir kolektif temsilciyle ilişkilendirilmiş bir kolektif temsilci. @tr
has subproperty: yhteistoimijaan liittyvä suku
has subproperty: sukuun liittyvä yhteistoimija
has subproperty: yhteisöön liittyvä yhteistoimija
has subproperty: yhteistoimijaan liittyvä yhteisö
has subproperty: yhteistoimijan edeltäjä
has subproperty: yhteistoimijan seuraaja
has subproperty: P50341

henkilöön liittyvä yhteistoimija
status: Published
sub property of: henkilöön liittyvä toimija
type: Property
label: has related collective agent of person @en
lexical alias: relatedCollectiveAgentOfPerson.en
definition: Relates a person to a collective agent who is associated with a person. @en
domain: C10004
sub property of: toimijaan liittyvä yhteistoimija
label: έχει σχετικό συλλογικό φορέα του φυσικού προσώπου @el
definition: Συνδέει ένα φυσικό πρόσωπο με έναν συλλογικό φορέα που συνδέεται με ένα φυσικό πρόσωπο. @el
label: har kollektiv agent relateret til person @da
definition: Relaterer en person til en kollektiv agent, som er knyttet til en person. @da
label: té com a agent col·lectiu relacionat amb una persona @ca
definition: Relaciona una persona amb un agent col·lectiu que s’associa amb una persona. @ca
definition: Liittää henkilön yhteistoimijaan, joka liittyy henkilöön.
toolkit label: henkilöön liittyvä yhteistoimija
toolkit definition: Yhteistoimija, joka liittyy henkilöön.
label: a pour agent collectif en relation avec une personne @fr
definition: Met une personne en relation avec un agent collectif qui est associé à une personne. @fr
toolkit label: related collective agent of person @en
toolkit definition: A collective agent who is associated with a person. @en
has element type: 1
label: személyhez kapcsolódó kollektív ágens a következő: @hu
definition: Hozzákapcsol egy személyt egy személyhez kapcsolódó kollektív ágenshez. @hu
label: har kollektiv agent relatert til person @no
definition: Relaterer en person til en kollektiv agent som forbindes med en person. @no
toolkit label: kollektiv agent relatert til person @no
toolkit definition: En kollektiv agent som forbindes med en person. @no
label: heeft gerelateerde collectieve actor van persoon @nl
definition: Relateert een persoon aan een collectieve actor die geassocieerd is met een persoon. @nl
toolkit label: gerelateerde collectieve actor van persoon @nl
toolkit definition: Een collectieve actor die geassocieerd is met een persoon. @nl
label: له وكيل جماعي مرتبط بشخص @ar
definition: يربط شخصا بوكيل جماعي مرتبط بشخص. @ar
toolkit label: وكيل جماعي مرتبط بشخص @ar
toolkit definition: وكيل جماعي مرتبط بشخص. @ar
toolkit label: agent col·lectiu relacionat amb una persona @ca
toolkit definition: Agent col·lectiu que s’associa amb una persona. @ca
toolkit label: kollektiv agent relateret til person @da
toolkit definition: Kollektiv agent, som er knyttet til en person. @da
label: isikuga seotud kollektiiv @et
definition: Seostab isiku isikuga seotud kollektiiviga. @et
toolkit label: isikuga seotud kollektiiv @et
toolkit definition: Isikuga seotud kollektiiv. @et
label: hat mit Person in Beziehung stehenden gemeinschaftlichen Akteur @de
definition: Setzt eine Person in Beziehung zu einem gemeinschaftlichen Akteur, der mit einer Person in Verbindung steht. @de
toolkit label: Mit Person in Beziehung stehender gemeinschaftlicher Akteur @de
toolkit definition: Ein gemeinschaftlicher Akteur, der mit einer Person in Verbindung steht. @de
toolkit label: személyhez kapcsolódó kollektív ágens: @hu
toolkit definition: Egy személyhez kapcsolódó kollektív ágens. @hu
label: ha come agente collettivo correlato di persona @it
definition: Correla una persona a un agente collettivo associato a una persona. @it
toolkit label: agente collettivo correlato di persona @it
toolkit definition: Agente collettivo associato a una persona. @it
toolkit label: σχετικός συλλογικός φορέας του φυσικού προσώπου @el
toolkit label: agent collectif en relation avec une personne @fr
toolkit definition: Agent collectif qui est associé à une personne. @fr
label: ar personu saistītā grupa @lv
definition: Sasaista personu ar grupu, kas saistīta ar personu. @lv
toolkit label: ar personu saistītā grupa @lv
toolkit definition: Grupa, kas saistīta ar personu. @lv
label: 有个人的关联集体行为者 @zh-hans
definition: 将一个个人与和一个个人有关的一个集体行为者关联起来。 @zh-hans
toolkit label: 个人的关联集体行为者 @zh-hans
toolkit definition: 和一个个人有关的一个集体行为者 @zh-hans
label: kişinin ilgili kolektif temsilcisi ile ilişkilidir @tr
definition: Bir kişiyi, kişiyle bağlantılı olan bir kolektif temsilciyle ilişkilendirir. @tr
toolkit label: Kişinin kolektif temsilciyle ilişkisi @tr
toolkit definition: Bir kişiyle ilişkilendirilen kolektif bir temsilci. @tr
has subproperty: henkilöön liittyvä suku
has subproperty: henkilöön liittyvä yhteisö
has subproperty: henkilöjäsen yhteistoimijassa
has subproperty: P50345

yhteisöön liittyvä yhteistoimija
status: Published
sub property of: yhteisöön liittyvä toimija
type: Property
label: has related collective agent of corporate body @en
lexical alias: relatedCollectiveAgentOfCorporateBody.en
definition: Relates a corporate body to a collective agent who is associated with a corporate body. @en
domain: C10005
sub property of: yhteistoimijaan liittyvä yhteistoimija
label: έχει σχετικό συλλογικό φορέα του συλλογικού οργάνου @el
definition: Συνδέει ένα συλλογικό όργανο με έναν συλλογικό φορέα που συνδέεται με ένα συλλογικό όργανο. @el
label: har kollektiv agent relateret til korporation @da
definition: Relaterer en korporation til en kollektiv agent, som er knyttet til en korporation. @da
label: té com a agent col·lectiu relacionat amb una entitat corporativa @ca
definition: Relaciona una entitat corporativa amb un agent col·lectiu que s’associa amb una entitat corporativa. @ca
definition: Liittää yhteisön yhteistoimijaan, joka liittyy yhteisöön.
toolkit label: yhteisöön liittyvä yhteistoimija
toolkit definition: Yhteistoimija, joka liittyy yhteisöön.
label: a pour agent collectif en relation avec une collectivité @fr
definition: Met une collectivité en relation avec un agent collectif qui est associé à une collectivité. @fr
toolkit label: related collective agent of corporate body @en
toolkit definition: A collective agent who is associated with a corporate body. @en
has element type: 1
label: testülethez kapcsolódó kollektív ágens a következő: @hu
definition: Hozzákapcsol egy testületet egy testülethez kapcsolódó kollektív ágenshez. @hu
label: har kollektiv agent relatert til korporasjon @no
definition: Relaterer en korporasjon til en kollektiv agent som forbindes med en korporasjon. @no
toolkit label: kollektiv agent relatert til korporasjon @no
toolkit definition: En kollektiv agent som forbindes med en korporasjon. @no
label: heeft gerelateerde collectieve actor van corporatie @nl
definition: Relateert een corporatie aan een collectieve actor die geassocieerd is met een corporatie. @nl
toolkit label: gerelateerde collectieve actor van corporatie @nl
toolkit definition: Een collectieve actor die geassocieerd is met een corporatie. @nl
label: لها وكيل جماعي مرتبط بهيئة @ar
definition: يربط هيئة بوكيل جماعي ذي صلة بهيئة. @ar
toolkit label: وكيل جماعي مرتبط بهيئة @ar
toolkit definition: وكيل جماعي ذو صلة بهيئة. @ar
toolkit label: agent col·lectiu relacionat amb una entitat corporativa @ca
toolkit definition: Agent col·lectiu que s’associa amb una entitat corporativa. @ca
toolkit label: kollektiv agent relateret til korporation @da
toolkit definition: kollektiv agent, som er knyttet til en korporation. @da
label: asutusega seotud kollektiiv @et
definition: Seostab asutuse asutusega seotud kollektiiviga. @et
toolkit label: asutusega seotud kollektiiv @et
toolkit definition: Asutusega seotud kollektiiv. @et
label: hat mit Körperschaft in Beziehung stehenden gemeinschaftlichen Akteur @de
definition: Setzt eine Körperschaft in Beziehung zu einem gemeinschaftlichen Akteur, der mit einer Körperschaft in Verbindung steht. @de
toolkit label: Mit Körperschaft in Beziehung stehender gemeinschaftlicher Akteur @de
toolkit definition: Ein gemeinschaftlicher Akteur, der mit einer Körperschaft in Verbindung steht. @de
toolkit label: testülethez kapcsolódó kollektív ágens: @hu
toolkit definition: Egy testülethez kapcsolódó kollektív ágens. @hu
label: ha come agente collettivo correlato di ente @it
definition: Correla un ente a un agente collettivo associato a un ente. @it
toolkit label: agente collettivo correlato di ente @it
toolkit definition: Agente collettivo associato a un ente. @it
toolkit label: σχετικός συλλογικός φορέας του συλλογικού οργάνου @el
toolkit label: agent collectif en relation avec une collectivité @fr
toolkit definition: Agent collectif qui est associé à une collectivité. @fr
label: ar institūciju saistītā grupa @lv
definition: Sasaista institūciju ar grupu, kas saistīta ar institūciju. @lv
toolkit label: ar institūciju saistītā grupa @lv
toolkit definition: Grupa, kas saistīta ar institūciju. @lv
label: 有团体的关联集体行为者 @zh-hans
definition: 将一个团体与和一个团体有关的一个集体行为者关联起来。 @zh-hans
toolkit label: 团体的关联集体行为者 @zh-hans
toolkit definition: 和一个团体有关的一个集体行为者 @zh-hans
label: tüzel kişinin ilgili kolektif temsilcisi ile ilişkilidir @tr
definition: Bir tüzel kişiyi, tüzel kişilikle bağlantılı bir kolektif temsilci ile ilişkilendirir. @tr
toolkit label: tüzel kişiliğin kolektif temsilciyle ilişkisi @tr
toolkit definition: Bir tüzel kişilikle ilişkilendirilen kolektif bir temsilci. @tr
has subproperty: yhteisöjäsen yhteistoimijassa
has subproperty: yhteisön perustanut yhteistoimija
has subproperty: yhteisöön liittyvä suku
has subproperty: yhteisöön liittyvä yhteisö
has subproperty: yhteisöä sponsoroiva yhteistoimija
has subproperty: P50349

toimijaan liittyvä manifestaatio
status: Published
sub property of: toimijaan liittyvä RDA-entiteetti
type: Property
label: has related manifestation of agent @en
lexical alias: relatedManifestationOfAgent.en
definition: Relates an agent to a manifestation that is associated with an agent. @en
domain: C10002
label: έχει σχετική εκδήλωση του φορέα @el
definition: Συνδέει έναν φορέα με μια εκδήλωση η οποία συνδέεται με έναν περιγραφόμενο φορέα. @el
label: har manifestation relateret til agent @da
definition: Relaterer en agent til en manifestation, som er knyttet til en agent. @da
label: té com a manifestació relacionada amb un agent @ca
definition: Relaciona un agent amb una manifestació que s’associa amb un agent. @ca
definition: Liittää toimijan manifestaatioon, joka liittyy toimijaan.
toolkit label: toimijaan liittyvä manifestaatio
toolkit definition: Manifestaatio, joka liittyy toimijaan.
label: a pour manifestation en relation avec un agent @fr
definition: Met un agent en relation avec une manifestation qui est associée à un agent. @fr
toolkit label: related manifestation of agent @en
toolkit definition: A manifestation that is associated with an agent. @en
has element type: 1
sub property of: P00004
label: ágenshez kapcsolódó megjelenési forma a következő: @hu
definition: Hozzákapcsol egy ágenst egy ágenshez kapcsolódó megjelenési formához. @hu
alternative label: other agent associated with manifestation of @en
label: har manifestasjon relatert til agent @no
definition: Relaterer en agent til en manifestasjon som forbindes med en agent. @no
toolkit label: manifestasjon relatert til agent @no
toolkit definition: En manifestasjon som forbindes med en agent. @no
label: heeft gerelateerde manifestatie van actor @nl
definition: Relateert een actor aan een manifestatie die is geassocieerd met een actor. @nl
toolkit label: gerelateerde manifestatie van actor @nl
toolkit definition: Een manifestatie die is geassocieerd met een actor. @nl
label: له تجسيدة مرتبطة بوكيل @ar
definition: يربط وكيلا بتجسيدة مرتبطة بوكيل. @ar
toolkit label: تجسيدة مرتبطة بوكيل @ar
toolkit definition: تجسيدة مرتبطة بوكيل. @ar
toolkit label: manifestació relacionada amb un agent @ca
toolkit definition: Manifestació que s’associa amb un agent. @ca
toolkit label: manifestation relateret til agent @da
toolkit definition: Manifestation, som er knyttet til en agent. @da
label: tegijaga seotud kehastus @et
definition: Seostab tegija tegijaga seotud kehastusega. @et
toolkit label: tegijaga seotud kehastus @et
toolkit definition: Tegijaga seotud kehastus. @et
label: hat mit Akteur in Beziehung stehende Manifestation @de
definition: Setzt einen Akteur in Beziehung zu einer Manifestation, die mit einem Akteur in Verbindung steht. @de
toolkit label: Mit Akteur in Beziehung stehende Manifestation @de
toolkit definition: Eine Manifestation, die mit einem Akteur in Verbindung steht. @de
toolkit label: ágenshez kapcsolódó megjelenési forma: @hu
toolkit definition: Egy ágenshez kapcsolódó megjelenési forma. @hu
label: ha come manifestazione correlata di agente @it
definition: Correla un agente a una manifestazione associata a un agente. @it
toolkit label: manifestazione correlata di agente @it
toolkit definition: Manifestazione associata a un agente. @it
toolkit label: σχετική εκδήλωση του φορέα @el
toolkit definition: Μια εκδήλωση που συνδέεται με έναν φορέα. @el
toolkit label: manifestation en relation avec un agent @fr
toolkit definition: Manifestation qui est associée à un agent. @fr
label: ar aģentu saistītā manifestācija @lv
definition: Sasaista aģentu ar manifestāciju, kas ir saistīta ar aģentu. @lv
toolkit label: ar aģentu saistītā manifestācija @lv
toolkit definition: Manifestācija, kas ir saistīta ar aģentu. @lv
alternative label: manifestaatioon liittyvä muu toimija manifestaatiossa
alternative label: وكيل آخر مرتبط بتجسيدة @ar
alternative label: anden agent knyttet til manifestation af @da
alternative label: Sonstiger Akteur, der mit einer Manifestation in Verbindung steht von @de
alternative label: altre agent associat amb una manifestació de @ca
alternative label: 其他与……的载体表现有关的行为者 @zh-hans
label: 有行为者的关联载体表现 @zh-hans
definition: 将一个行为者与和一个行为者有关的一种载体表现关联起来。 @zh-hans
toolkit label: 行为者的关联载体表现 @zh-hans
toolkit definition: 和一个行为者有关的一种载体表现 @zh-hans
alternative label: otro agente asociado con manifestación de @es
alternative label: autre agent associé à une manifestation de @fr
alternative label: a következő megjelenési formához kapcsolódó egyéb ágens: @hu
alternative label: Gösterim ile bağlantılı diğer temsilcisi @tr
toolkit label: Temsilcinin ilişkili gösterimi @tr
toolkit definition: Bir temsilciyle bağlantılı olan bir gösterim. @tr
has subproperty: aggregaattiin osallinen toimija manifestaatiossa

sukuun liittyvä manifestaatio
status: Published
sub property of: sukuun liittyvä RDA-entiteetti
type: Property
label: has related manifestation of family @en
lexical alias: relatedManifestationOfFamily.en
definition: Relates a family to a manifestation that is associated with a family. @en
domain: C10008
sub property of: yhteistoimijaan liittyvä manifestaatio
label: έχει σχετική εκδήλωση της οικογένειας @el
definition: Συνδέει μια οικογένεια με μια εκδήλωση η οποία συνδέεται με μια περιγραφόμενη οικογένεια. @el
label: har manifestation relateret til familie @da
definition: Relaterer en familie til en manifestation, som er knyttet til en familie. @da
label: té com a manifestació relacionada amb una família @ca
definition: Relaciona una família amb una manifestació que s’associa amb una família. @ca
definition: Liittää suvun manifestaatioon, joka liittyy sukuun.
toolkit label: sukuun liittyvä manifestaatio
toolkit definition: Manifestaatio, joka liittyy sukuun.
label: a pour manifestation en relation avec une famille @fr
definition: Met une famille en relation avec une manifestation qui est associée à une famille. @fr
toolkit label: related manifestation of family @en
toolkit definition: A manifestation that is associated with a family. @en
has element type: 1
label: családhoz kapcsolódó megjelenési forma a következő: @hu
definition: Hozzákapcsol egy családot egy családhoz kapcsolódó megjelenési formához. @hu
label: har manifestasjon relatert til familie @no
definition: Relaterer en familie til en manifestasjon som forbindes med en familie. @no
toolkit label: manifestasjon relatert til familie @no
toolkit definition: En manifestasjon som forbindes med en familie. @no
label: heeft gerelateerde manifestatie van familie @nl
definition: Relateert een familie aan een manifestatie die geassocieerd is met een familie. @nl
toolkit label: gerelateerde manifestatie van familie @nl
toolkit definition: Een manifestatie die geassocieerd is met een familie. @nl
label: له تجسيدة مرتبطة بعائلة @ar
definition: يربط عائلة بتجسيدة مرتبطة بشخص. @ar
toolkit label: تجسيدة مرتبطة بعائلة @ar
toolkit definition: تجسيدة ذات صلة بعائلة. @ar
toolkit label: manifestació relacionada amb una família @ca
toolkit definition: Manifestació que s’associa amb una família. @ca
toolkit label: manifestation relateret til familie @da
toolkit definition: Manifestation, som er knyttet til en familie. @da
label: perekonnaga seotud kehastus @et
definition: Seostab perekonna perekonnaga seotud kehastusega. @et
toolkit label: perekonnaga seotud kehastus @et
toolkit definition: Perekonnaga seotud kehastus. @et
label: hat mit Familie in Beziehung stehende Manifestation @de
definition: Setzt eine Familie in Beziehung zu einer Manifestation, die mit einer Familie in Verbindung steht. @de
toolkit label: Mit Familie in Beziehung stehende Manifestation @de
toolkit definition: Eine Manifestation, die mit einer Familie in Verbindung steht. @de
toolkit label: családhoz kapcsolódó megjelenési forma: @hu
toolkit definition: Egy családhoz kapcsolódó megjelenési forma. @hu
label: ha come manifestazione correlata di famiglia @it
definition: Correla una famiglia a una manifestazione associata a una famiglia. @it
toolkit label: manifestazione correlata di famiglia @it
toolkit definition: Manifestazione associata a una famiglia. @it
toolkit label: σχετική εκδήλωση της οικογένειας @el
toolkit label: manifestation en relation avec une famille @fr
toolkit definition: Manifestation qui est associée à une famille. @fr
label: ar dzimtu/ģimeni saistītā manifestācija @lv
definition: Sasaista dzimtu/ģimeni ar manifestāciju, kas ir saistīta ar dzimtu/ģimeni. @lv
toolkit label: ar dzimtu/ģimeni saistītā manifestācija @lv
toolkit definition: Manifestācija, kas ir saistīta ar dzimtu/ģimeni. @lv
label: 有家族的关联载体表现 @zh-hans
definition: 将一个家族与和一个家族有关的一种载体表现关联起来。 @zh-hans
toolkit label: 家族的关联载体表现 @zh-hans
toolkit definition: 和一个家族有关的一种载体表现 @zh-hans
label: ailenin ilgili gösterimi ile ilişkilidir @tr
definition: Bir aileyi, aileyle bağlantılı bir gösterimle ilişkilendirir. @tr
toolkit label: Ailenin ilişkili gösterimi @tr
toolkit definition: Bir aile ile bağlantılı olan bir gösterim. @tr
has subproperty: aggregaattiin osallinen suku manifestaatiossa
has subproperty: manifestaation tekijä (suku) manifestaatiossa
has subproperty: jakelija (suku) manifestaatiossa
has subproperty: valmistaja (suku) manifestaatiossa
has subproperty: paperinvalmistaja (suku) manifestaatiossa
has subproperty: P50322

yhteistoimijaan liittyvä manifestaatio
status: Published
sub property of: yhteistoimijaan liittyvä RDA-entiteetti
type: Property
label: has related manifestation of collective agent @en
lexical alias: relatedManifestationOfCollectiveAgent.en
definition: Relates a collective agent to a manifestation that is associated with a collective agent. @en
domain: C10011
sub property of: toimijaan liittyvä manifestaatio
label: έχει σχετική εκδήλωση του συλλογικού φορέα @el
definition: Συνδέει έναν συλλογικό φορέα με μια εκδήλωση η οποία συνδέεται με έναν συλλογικό φορέα. @el
label: har manifestation relateret til kollektiv agent @da
definition: Relaterer en kollektiv agent til en manifestation, som er knyttet til en kollektiv agent. @da
label: té com a manifestació relacionada amb un agent col·lectiu @ca
definition: Relaciona un agent col·lectiu amb una manifestació que s’associa amb un agent col·lectiu. @ca
definition: Liittää yhteistoimijan manifestaatioon, joka liittyy yhteistoimijaan.
toolkit label: yhteistoimijaan liittyvä manifestaatio
toolkit definition: Manifestaatio, joka liittyy yhteistoimijaan.
label: a pour manifestation en relation avec un agent collectif @fr
definition: Met un agent collectif en relation avec une manifestation qui est associée à un agent collectif. @fr
toolkit label: related manifestation of collective agent @en
toolkit definition: A manifestation that is associated with a collective agent. @en
has element type: 1
label: kollektív ágenshez kapcsolódó megjelenési forma a következő: @hu
definition: Hozzákapcsol egy kollektív ágenst egy kollektív ágenshez kapcsolódó megjelenési formához. @hu
label: har manifestasjon relatert til kollektiv agent @no
definition: Relaterer en kollektiv agent til en manifestasjon som forbindes med en kollektiv agent. @no
toolkit label: manifestasjon relatert til kollektiv agent @no
toolkit definition: En manifestasjon som forbindes med en kollektiv agent. @no
label: heeft gerelateerde manifestatie van collectieve actor @nl
definition: Relateert een collectieve actor aan een manifestatie die is geassocieerd met een collectieve actor. @nl
toolkit label: gerelateerde manifestatie van collectieve actor @nl
toolkit definition: Een manifestatie die is geassocieerd met een collectieve actor. @nl
label: له تجسيدة مرتبطة بوكيل جماعي @ar
definition: يربط وكيلا جماعيا بتجسيدة مرتبطة بوكيل جماعي. @ar
toolkit label: تجسيدة مرتبطة بوكيل جماعي @ar
toolkit definition: تجسيدة ذات صلة بوكيل جماعي. @ar
toolkit label: manifestació relacionada amb un agent col·lectiu @ca
toolkit definition: Manifestació que s’associa amb un agent col·lectiu. @ca
toolkit label: manifestation relateret til kollektiv agent @da
toolkit definition: Manifestation, som er knyttet til en kollektiv agent. @da
label: kollektiiviga seotud kehastus @et
definition: Seostab kollektiivi kollektiiviga seotud kehastusega. @et
toolkit label: kollektiiviga seotud kehastus @et
toolkit definition: Kollektiiviga seotud kehastus. @et
label: hat mit gemeinschaftlichem Akteur in Beziehung stehende Manifestation @de
definition: Setzt einen gemeinschaftlichen Akteur in Beziehung zu einer Manifestation, die mit einem gemeinschaftlichen Akteur in Verbindung steht. @de
toolkit label: Mit gemeinschaftlichem Akteur in Beziehung stehende Manifestation @de
toolkit definition: Eine Manifestation, die mit einem gemeinschaftlichen Akteur in Verbindung steht. @de
toolkit label: kollektív ágenshez kapcsolódó megjelenési forma: @hu
toolkit definition: Egy kollektív ágenshez kapcsolódó megjelenési forma. @hu
label: ha come manifestazione correlata di agente collettivo @it
definition: Correla un agente collettivo a una manifestazione associata a un agente collettivo. @it
toolkit label: manifestazione correlata di agente collettivo @it
toolkit definition: Manifestazione associata a un agente collettivo. @it
toolkit label: σχετική εκδήλωση του συλλογικού φορέα @el
toolkit label: manifestation en relation avec un agent collectif @fr
toolkit definition: Manifestation qui est associée à un agent collectif. @fr
label: ar grupu saistītā manifestācija @lv
definition: Sasaista grupu ar manifestāciju, kas ir saistīta ar grupu. @lv
toolkit label: ar grupu saistītā manifestācija @lv
toolkit definition: Manifestācija, kas ir saistīta ar grupu. @lv
label: 有集体行为者的关联载体表现 @zh-hans
definition: 将一个集体行为者与和一个集体行为者有关的一种载体表现关联起来。 @zh-hans
toolkit label: 集体行为者的关联载体表现 @zh-hans
toolkit definition: 和一个集体行为者有关的一种载体表现 @zh-hans
label: kolektif temsilcinin ilgili gösterimi ile ilişkilidir @tr
definition: Kolektif bir temsilciyi, kolektif temsilciyle bağlantılı bir gösterimle ilişkilendirir. @tr
toolkit label: kolektif temsilcinin ilişkili gösterimi @tr
toolkit definition: Kolektif bir temsilciyle bağlantılı olan bir gösterim. @tr
has subproperty: aggregaattiin osallinen yhteistoimija manifestaatiossa
has subproperty: manifestaation tekijä (yhteistoimija) manifestaatiossa
has subproperty: jakelija (yhteistoimija) manifestaatiossa
has subproperty: sukuun liittyvä manifestaatio
has subproperty: yhteisöön liittyvä manifestaatio
has subproperty: valmistaja (yhteistoimija) manifestaatiossa
has subproperty: paperinvalmistaja (yhteistoimija) manifestaatiossa
has subproperty: P50364

henkilöön liittyvä manifestaatio
status: Published
sub property of: henkilöön liittyvä RDA-entiteetti
type: Property
label: has related manifestation of person @en
lexical alias: relatedManifestationOfPerson.en
definition: Relates a person to a manifestation that is associated with a person. @en
domain: C10004
sub property of: toimijaan liittyvä manifestaatio
label: έχει σχετική εκδήλωση του φυσικού προσώπου @el
definition: Συνδέει ένα φυσικό πρόσωπο με μια εκδήλωση η οποία συνδέεται με ένα περιγραφόμενο φυσικό πρόσωπο. @el
label: har manifestation relateret til person @da
definition: Relaterer en person til en manifestation, som er knyttet til en person. @da
label: té com a manifestació relacionada amb una persona @ca
definition: Relaciona una persona amb una manifestació que s’associa amb una persona. @ca
definition: Liittää henkilön manifestaatioon, joka liittyy henkilöön.
toolkit label: henkilöön liittyvä manifestaatio
toolkit definition: Manifestaatio, joka liittyy henkilöön.
label: a pour manifestation en relation avec une personne @fr
definition: Met une personne en relation avec une manifestation qui est associée à une personne. @fr
toolkit label: related manifestation of person @en
toolkit definition: A manifestation that is associated with a person. @en
has element type: 1
label: személyhez kapcsolódó megjelenési forma a következő: @hu
definition: Hozzákapcsol egy személyt egy személyhez kapcsolódó megjelenési formához. @hu
label: har manifestasjon relatert til person @no
definition: Relaterer en person til en manifestasjon som forbindes med en person. @no
toolkit label: manifestasjon relatert til person @no
toolkit definition: En manifestasjon som forbindes med en person. @no
label: heeft gerelateerde manifestatie van persoon @nl
definition: Relateert een persoon aan een manifestatie die geassocieerd is met een persoon. @nl
toolkit label: gerelateerde manifestatie van persoon @nl
toolkit definition: Een manifestatie die geassocieerd is met een persoon. @nl
label: لها تجسيدة مرتبطة بشخص @ar
definition: يربط شخصا بتجسيدة مرتبطة بشخص. @ar
toolkit label: تجسيدة مرتبطة بشخص @ar
toolkit definition: تجسيدة مرتبطة بشخص. @ar
toolkit label: manifestació relacionada amb una persona @ca
toolkit definition: Manifestació que s’associa amb una persona. @ca
toolkit label: manifestation relateret til person @da
toolkit definition: Manifestation, som er knyttet til en person. @da
label: isikuga seotud kehastus @et
definition: Seostab isiku isikuga seotud kehastusega. @et
toolkit label: isikuga seotud kehastus @et
toolkit definition: Isikuga seotud kehastus. @et
label: hat mit Person in Beziehung stehende Manifestation @de
definition: Setzt eine Person in Beziehung zu einer Manifestation, die mit einer Person in Verbindung steht. @de
toolkit label: Mit Person in Beziehung stehende Manifestation @de
toolkit definition: Eine Manifestation, die mit einer Person in Verbindung steht. @de
toolkit label: személyhez kapcsolódó megjelenési forma: @hu
toolkit definition: Egy személyhez kapcsolódó megjelenési forma. @hu
label: ha come manifestazione correlata di persona @it
definition: Correla una persona a una manifestazione associata a una persona. @it
toolkit label: manifestazione correlata di persona @it
toolkit definition: Manifestazione associata a una persona. @it
toolkit label: σχετική εκδήλωση του φυσικού προσώπου @el
toolkit label: manifestation en relation avec une personne @fr
toolkit definition: Manifestation qui est associée à une personne. @fr
label: ar personu saistītā manifestācija @lv
definition: Sasaista personu ar manifestāciju, kas ir saistīta ar personu. @lv
toolkit label: ar personu saistītā manifestācija @lv
toolkit definition: Manifestācija, kas ir saistīta ar personu. @lv
label: 有个人的关联载体表现 @zh-hans
definition: 将一个个人与和一个个人有关的一种载体表现关联起来。 @zh-hans
toolkit label: 个人的关联单件 @zh-hans
toolkit definition: 和一个个人有关的一种载体表现 @zh-hans
label: kişinin ilgili gösterimi ile ilişkilidir @tr
definition: Bir kişiyi, bir kişiyle bağlantılı olan bir gösterimle ilişkilendirir. @tr
toolkit label: Kişinin ilişkili gösterimi @tr
toolkit definition: Bir kişiyle bağlantılı olan bir gösterim. @tr
has subproperty: aggregaattiin osallinen henkilö manifestaatiossa
has subproperty: manifestaation tekijä (henkilö) manifestaatiossa
has subproperty: jakelija (henkilö) manifestaatiossa
has subproperty: valmistaja (henkilö) manifestaatiossa
has subproperty: paperinvalmistaja (henkilö) manifestaatiossa
has subproperty: P50313

yhteisöön liittyvä manifestaatio
status: Published
sub property of: yhteisöön liittyvä RDA-entiteetti
type: Property
label: has related manifestation of corporate body @en
lexical alias: relatedManifestationOfCorporateBody.en
definition: Relates a corporate body to a manifestation that is associated with a corporate body. @en
domain: C10005
sub property of: yhteistoimijaan liittyvä manifestaatio
label: έχει σχετική εκδήλωση του συλλογικού οργάνου @el
definition: Συνδέει ένα συλλογικό όργανο με μια εκδήλωση η οποία συνδέεται με ένα περιγραφόμενο συλλογικό όργανο. @el
label: har manifestation relateret til korporation @da
definition: Relaterer en korporation til en manifestation, som er knyttet til en korporation. @da
label: té com a manifestació relacionada amb una entitat corporativa @ca
definition: Relaciona una entitat corporativa amb una manifestació que s’associa amb una entitat corporativa. @ca
definition: Liittää yhteisön manifestaatioon, joka liittyy yhteisöön.
toolkit label: yhteisöön liittyvä manifestaatio
toolkit definition: Manifestaatio, joka liittyy yhteisöön.
label: a pour manifestation en relation avec une collectivité @fr
definition: Met une collectivité en relation avec une manifestation qui est associée à une collectivité. @fr
toolkit label: related manifestation of corporate body @en
toolkit definition: A manifestation that is associated with a corporate body. @en
has element type: 1
label: testülethez kapcsolódó megjelenési forma a következő: @hu
definition: Hozzákapcsol egy testületet egy testülethez kapcsolódó megjelenési formához. @hu
label: har manifestasjon relatert til korporasjon @no
definition: Relaterer en korporasjon til en manifestasjon som forbindes med en korporasjon. @no
toolkit label: manifestasjon relatert til korporasjon @no
toolkit definition: En manifestasjon som forbindes med en korporasjon. @no
label: heeft gerelateerde manifestatie van corporatie @nl
definition: Relateert een corporatie aan een manifestatie die geassocieerd is met een corporatie. @nl
toolkit label: gerelateerde manifestatie van corporatie @nl
toolkit definition: Een manifestatie die geassocieerd is met een corporatie. @nl
label: له تجسيدة مرتبطة بهيئة @ar
definition: يربط هيئة بتجسيدة ذات صلة بهيئة. @ar
toolkit label: تجسيدة مرتبطة بهيئة @ar
toolkit definition: تجسيدة ذات صلة بهيئة. @ar
toolkit label: manifestació relacionada amb una entitat corporativa @ca
toolkit definition: Manifestació que s’associa amb una entitat corporativa. @ca
toolkit label: manifestation relateret til korporation @da
toolkit definition: Manifestation, som er knyttet til en korporation. @da
label: asutusega seotud kehastus @et
definition: Seostab asutuse asutusega seotud kehastusega. @et
toolkit label: asutusega seotud kehastus @et
toolkit definition: Asutusega seotud kehastus. @et
label: hat mit Körperschaft in Beziehung stehende Manifestation @de
definition: Setzt eine Körperschaft in Beziehung zu einer Manifestation, die mit einer Körperschaft in Verbindung steht. @de
toolkit label: Mit Körperschaft in Beziehung stehende Manifestation @de
toolkit definition: Eine Manifestation, die mit einer Körperschaft in Verbindung steht. @de
toolkit label: testülethez kapcsolódó megjelenési forma: @hu
toolkit definition: Egy testülethez kapcsolódó megjelenési forma. @hu
label: ha come manifestazione correlata di ente @it
definition: Correla un ente a una manifestazione associata a un ente. @it
toolkit label: manifestazione correlata di ente @it
toolkit definition: Manifestazione associata a un ente. @it
toolkit label: σχετική εκδήλωση του συλλογικού οργάνου @el
toolkit label: manifestation en relation avec une collectivité @fr
toolkit definition: Manifestation qui est associée à une collectivité. @fr
label: ar institūciju saistītā manifestācija @lv
definition: Sasaista institūciju ar manifestāciju, kas ir saistīta ar institūciju. @lv
toolkit label: ar institūciju saistītā manifestācija @lv
toolkit definition: Manifestācija, kas ir saistīta ar institūciju. @lv
label: 有团体的关联载体表现 @zh-hans
definition: 将一个团体与和一个团体有关的一种载体表现关联起来。 @zh-hans
toolkit label: 团体的关联载体表现 @zh-hans
toolkit definition: 和一个团体有关的一种载体表现 @zh-hans
label: tüzel kişinin ilgili gösterimi ile ilişkilidir @tr
definition: Bir tüzel kişiyi, tüzel kişilikle alakalı bir gösterimle ilişkilendirir. @tr
toolkit label: tüzel kişiliğinilişkili gösterimi @tr
toolkit definition: Tüzel bir kişiyle bağlantılı olan bir gösterim. @tr
has subproperty: aggregaattiin osallinen yhteisö manifestaatiossa
has subproperty: manifestaation tekijä (yhteisö) manifestaatiossa
has subproperty: jakelija (yhteisö) manifestaatiossa
has subproperty: valmistaja (yhteisö) manifestaatiossa
has subproperty: paperinvalmistaja (yhteisö) manifestaatiossa
has subproperty: P50331

toimijaan liittyvä teos
status: Published
sub property of: toimijaan liittyvä RDA-entiteetti
type: Property
label: has related work of agent @en
lexical alias: relatedWorkOfAgent.en
definition: Relates an agent to a work that is associated with an agent. @en
domain: C10002
label: έχει σχετικό έργο του φορέα @el
definition: Συνδέει έναν φορέα με ένα έργο το οποίο συνδέεται με έναν περιγραφόμενο φορέα. @el
label: har værk relateret til agent @da
definition: Relaterer en agent til et værk, som er knyttet til en agent. @da
label: té com a obra relacionada amb un agent @ca
definition: Relaciona un agent amb una obra que s’associa amb un agent. @ca
definition: Liittää toimijan teokseen, joka liittyy toimijaan.
toolkit label: toimijaan liittyvä teos
toolkit definition: Teos, joka liittyy toimijaan.
label: a pour œuvre en relation avec un agent @fr
definition: Met un agent en relation avec une œuvre qui est associée à un agent. @fr
toolkit label: related work of agent @en
toolkit definition: A work that is associated with an agent. @en
has element type: 1
sub property of: P00002
label: ágenshez kapcsolódó mű a következő: @hu
definition: Hozzákapcsol egy ágenst egy ágenshez kapcsolódó műhöz. @hu
alternative label: other agent associated with work of @en
label: har verk relatert til agent @no
definition: Relaterer en agent til et verk som forbindes med en agent. @no
toolkit label: verk relatert til agent @no
toolkit definition: Et verk som forbindes med en agent. @no
label: heeft gerelateerd werk van actor @nl
definition: Relateert een actor aan een werk dat is geassocieerd met een actor. @nl
toolkit label: gerelateerd werk van actor @nl
toolkit definition: Een werk dat is geassocieerd met een actor. @nl
label: له عمل مرتبط بوكيل @ar
definition: يربط وكيلا بعمل مرتبط بوكيل. @ar
toolkit label: عمل مرتبط بوكيل @ar
toolkit definition: عمل مرتبط بوكيل. @ar
toolkit label: obra relacionada amb un agent @ca
toolkit definition: Obra que s’associa amb un agent. @ca
toolkit label: værk relateret til agent @da
toolkit definition: Værk, som er knyttet til en agent. @da
label: tegijaga seotud teos @et
definition: Seostab tegija tegijaga seotud teosega. @et
toolkit label: tegijaga seotud teos @et
toolkit definition: Tegijaga seotud teos. @et
label: hat mit Akteur in Beziehung stehendes Werk @de
definition: Setzt einen Akteur in Beziehung zu einem Werk, das mit einem Akteur in Verbindung steht. @de
toolkit label: Mit Akteur in Beziehung stehendes Werk @de
toolkit definition: Ein Werk, das mit einem Akteur in Verbindung steht. @de
toolkit label: ágenshez kapcsolódó mű: @hu
toolkit definition: Egy ágenshez kapcsolódó mű. @hu
label: ha come opera correlata di agente @it
definition: Correla un agente a un'opera associata a un agente. @it
toolkit label: opera correlata di agente @it
toolkit definition: Opera associata a un agente. @it
toolkit label: σχετικό έργο του φορέα @el
toolkit definition: Ένα έργο που συνδέεται με έναν φορέα. @el
toolkit label: œuvre en relation avec un agent @fr
toolkit definition: Œuvre qui est associée à un agent. @fr
label: ar aģentu saistītais darbs @lv
definition: Sasaista aģentu ar darbu, kas saistīts ar aģentu. @lv
toolkit label: ar aģentu saistītais darbs @lv
toolkit definition: Darbs, kas saistīts ar aģentu. @lv
alternative label: teokseen liittyvä muu toimija teokselle
alternative label: Sonstiger Akteur, der mit einem Werk in Verbindung steht von @de
alternative label: altre agent associat amb una obra de @ca
alternative label: 和……的作品有关的其他行为者 @zh-hans
label: 有行为者的关联作品 @zh-hans
definition: 将一个行为者与和一个行为者有关的一种作品关联起来。 @zh-hans
toolkit label: 行为者的关联作品 @zh-hans
toolkit definition: 和一个行为者有关的一种作品 @zh-hans
alternative label: otro agente asociado con obra de @es
alternative label: autre agent associé à une œuvre de @fr
alternative label: a következő műhöz kapcsolódó egyéb ágens: @hu
alternative label: Eser ile bağlantılı diğer temsilci @tr
label: temsilcinin ilgili eseri ile ilişkilidir @tr
definition: Bir temsilciyi, bir temsilciyle bağlantılı olan bir eserle ilişkilendirir. @tr
toolkit label: temsilciyle ilişkli eser @tr
toolkit definition: Bir temsilciyle bağlantılı olan bir eser. @tr
has subproperty: vastaanottaja (toimija) teoksessa

sukuun liittyvä teos
status: Published
sub property of: sukuun liittyvä RDA-entiteetti
type: Property
label: has related work of family @en
lexical alias: relatedWorkOfFamily.en
definition: Relates a family to a work that is associated with a family. @en
domain: C10008
sub property of: yhteistoimijaan liittyvä teos
label: έχει σχετικό έργο της οικογένειας @el
definition: Συνδέει μια οικογένεια με ένα έργο το οποίο συνδέεται με μια περιγραφόμενη οικογένεια. @el
label: har værk relateret til familie @da
definition: Relaterer en familie til et værk, som er knyttet til en familie. @da
label: té com a obra relacionada amb una família @ca
definition: Relaciona una família amb una obra que s’associa amb una família. @ca
definition: Liittää suvun teokseen, joka liittyy sukuun.
toolkit label: sukuun liittyvä teos
toolkit definition: Teos, joka liittyy sukuun.
label: a pour œuvre en relation avec une famille @fr
definition: Met une famille en relation avec une œuvre qui est associée à une famille. @fr
toolkit label: related work of family @en
toolkit definition: A work that is associated with a family. @en
has element type: 1
label: családhoz kapcsolódó mű a következő: @hu
definition: Hozzákapcsol egy családot egy családhoz kapcsolódó műhöz. @hu
label: har verk relatert til familie @no
definition: Relaterer en familie til et verk som forbindes med en familie. @no
toolkit label: verk relatert til familie @no
toolkit definition: Et verk som forbindes med en familie. @no
label: heeft gerelateerd werk van familie @nl
definition: Relateert een familie aan een werk dat geassocieerd is met een familie. @nl
toolkit label: gerelateerd werk van familie @nl
toolkit definition: Een werk dat geassocieerd is met een familie. @nl
label: له عمل مرتبط بعائلة @ar
definition: يربط عائلة بعمل مرتبط بعائلة. @ar
toolkit label: عمل مرتبط بعائلة @ar
toolkit definition: عمل ذو صلة بعائلة. @ar
toolkit label: obra relacionada amb una família @ca
toolkit definition: Obra que s’associa amb una família. @ca
toolkit label: værk relateret til familie @da
toolkit definition: Værk, som er knyttet til en familie. @da
label: perekonnaga seotud teos @et
definition: Seostab perekonna perekonnaga seotud teosega. @et
toolkit label: perekonnaga seotud teos @et
toolkit definition: Perekonnaga seotud teos. @et
label: hat mit Familie in Beziehung stehendes Werk @de
definition: Setzt eine Familie in Beziehung zu einem Werk, das mit einer Familie in Verbindung steht. @de
toolkit label: Mit Familie in Beziehung stehendes Werk @de
toolkit definition: Ein Werk, das mit einer Familie in Verbindung steht. @de
toolkit label: családhoz kapcsolódó mű: @hu
toolkit definition: Egy családhoz kapcsolódó mű. @hu
label: ha come opera correlata di famiglia @it
definition: Correla una famiglia a un'opera associata a una famiglia. @it
toolkit label: opera correlata di famiglia @it
toolkit definition: Opera associata a una famiglia. @it
toolkit label: σχετικό έργο της οικογένειας @el
toolkit label: œuvre en relation avec une famille @fr
toolkit definition: Œuvre qui est associée à une famille. @fr
label: ar dzimtu/ģimeni saistītais darbs @lv
definition: Sasaista dzimtu/ģimeni ar darbu, kas saistīts ar dzimtu/ģimeni. @lv
toolkit label: ar dzimtu/ģimeni saistītais darbs @lv
toolkit definition: Darbs, kas saistīts ar dzimtu/ģimeni. @lv
label: 有家族的关联作品 @zh-hans
definition: 将一个家族与和一个家族有关的一种作品关联起来。 @zh-hans
toolkit label: 家族的关联作品 @zh-hans
toolkit definition: 和一个家族有关的一种作品 @zh-hans
label: ailenin ilgili eseri ile ilişkilidir @tr
definition: Bir aileyi, aileyle bağlantılı bir eserle ilişkilendirir. @tr
toolkit label: aileyle ilişkili eser @tr
toolkit definition: Bir aileyle bağlantılı olan bir eser. @tr
has subproperty: vastaanottaja (suku) teoksessa
has subproperty: toimeksiantaja (suku) teoksessa
has subproperty: asiantuntija (suku) teoksessa
has subproperty: teoksen tekijä (suku) teoksessa
has subproperty: suku aiheena teoksessa
has subproperty: teoksen omistuksen kohde (suku) teoksessa
has subproperty: omistuskirjoituksen tekijä (suku) teoksessa
has subproperty: ohjaaja (suku) teoksessa
has subproperty: kuvaaja (suku) teoksessa
has subproperty: toimituspäällikkö (suku) teoksessa

yhteistoimijaan liittyvä teos
status: Published
sub property of: yhteistoimijaan liittyvä RDA-entiteetti
type: Property
label: has related work of collective agent @en
lexical alias: relatedWorkOfCollectiveAgent.en
definition: Relates a collective agent to a work that is associated with a collective agent. @en
domain: C10011
sub property of: toimijaan liittyvä teos
label: έχει σχετικό έργο του συλλογικού φορέα @el
definition: Συνδέει έναν συλλογικό φορέα με ένα έργο το οποίο συνδέεται με έναν περιγραφόμενο συλλογικό φορέα. @el
label: har værk relateret til kollektiv agent @da
definition: Relaterer en kollektiv agent til et værk, som er knyttet til en kollektiv agent. @da
label: té com a obra relacionada amb un agent col·lectiu @ca
definition: Relaciona un agent col·lectiu amb una obra que s’associa amb un agent col·lectiu. @ca
definition: Liittää yhteistoimijan teokseen, joka liittyy yhteistoimijaan.
toolkit label: yhteistoimijaan liittyvä teos
toolkit definition: Teos, joka liittyy yhteistoimijaan.
label: a pour œuvre en relation avec un agent collectif @fr
definition: Met un agent collectif en relation avec une œuvre qui est associée à un agent collectif. @fr
toolkit label: related work of collective agent @en
toolkit definition: A work that is associated with a collective agent. @en
has element type: 1
label: kollektív ágenshez kapcsolódó mű a következő: @hu
definition: Hozzákapcsol egy kollektív ágenst egy kollektív ágenshez kapcsolódó műhöz. @hu
label: har verk relatert til kollektiv agent @no
definition: Relaterer en kollektiv agent til et verk som forbindes med en kollektiv agent. @no
toolkit label: verk relatert til kollektiv agent @no
toolkit definition: Et verk som forbindes med en kollektiv agent. @no
label: heeft gerelateerd werk van collectieve actor @nl
definition: Relateert een collectieve actor aan een werk dat geassocieerd is met een collectieve actor. @nl
toolkit label: gerelateerd werk van collectieve actor @nl
toolkit definition: Een werk dat geassocieerd is met een collectieve actor. @nl
label: له عمل مرتبط بوكيل جماعي @ar
definition: يربط وكيلا جماعيا بعمل ذي صلة بوكيل جماعي. @ar
toolkit label: عمل مرتبط بوكيل جماعي @ar
toolkit definition: عمل ذو صلة بوكيل جماعي. @ar
toolkit label: obra relacionada amb un agent col·lectiu @ca
toolkit definition: Obra que s’associa amb un agent col·lectiu. @ca
toolkit label: værk relateret til kollektiv agent @da
toolkit definition: Værk, som er knyttet til en kollektiv agent. @da
label: kollektiiviga seotud teos @et
definition: Seostab kollektiivi kollektiiviga seotud teosega. @et
toolkit label: kollektiiviga seotud teos @et
toolkit definition: Kollektiiviga seotud teos. @et
label: hat mit gemeinschaftlichem Akteur in Beziehung stehendes Werk @de
definition: Setzt einen gemeinschaftlichen Akteur in Beziehung zu einem Werk, das mit einem gemeinschaftlichen Akteur in Verbindung steht. @de
toolkit label: Mit gemeinschaftlichem Akteur in Beziehung stehendes Werk @de
toolkit definition: Ein Werk, das mit einem gemeinschaftlichen Akteur in Verbindung steht. @de
toolkit label: kollektív ágenshez kapcsolódó mű: @hu
toolkit definition: Egy kollektív ágenshez kapcsolódó mű. @hu
label: ha come opera correlata di agente collettivo @it
definition: Correla un agente collettivo a un'opera associata a un agente collettivo. @it
toolkit label: opera correlata di agente collettivo @it
toolkit definition: Opera associata a un agente collettivo. @it
toolkit label: σχετικό έργο του συλλογικού φορέα @el
toolkit label: œuvre en relation avec un agent collectif @fr
toolkit definition: Œuvre qui est associée à un agent collectif. @fr
label: ar grupu saistītais darbs @lv
definition: Sasaista grupu ar darbu, kas saistīts ar grupu. @lv
toolkit label: ar grupu saistītais darbs @lv
toolkit definition: Darbs, kas saistīts ar grupu. @lv
label: 有集体行为者的关联作品 @zh-hans
definition: 将一个行为者与和一个集体行为者有关的一种作品关联起来。 @zh-hans
toolkit label: 集体行为者的关联作品 @zh-hans
toolkit definition: 和一个集体行为者有关的一种作品 @zh-hans
label: kolektif temsilcinin ilgili eseri ile ilişkilidir @tr
definition: Kolektif bir temsilciyi, kolektif temsilciyle bağlantılı bir çalışmayla ilişkilendirir. @tr
toolkit label: kolektif temsilciyle ilişkili eser @tr
toolkit definition: Bir kolektif temsilci ile bağlantılı olan bir eser. @tr
has subproperty: vastaanottaja (yhteistoimija) teoksessa
has subproperty: toimeksiantaja (yhteistoimija) teoksessa
has subproperty: asiantuntija (yhteistoimija) teoksessa
has subproperty: teoksen tekijä (yhteistoimija) teoksessa
has subproperty: teoksen omistuksen kohde (yhteistoimija) teoksessa
has subproperty: omistuskirjoituksen tekijä (yhteistoimija) teoksessa
has subproperty: ohjaaja (yhteistoimija) teoksessa
has subproperty: kuvaaja (yhteistoimija) teoksessa
has subproperty: toimituspäällikkö (yhteistoimija) teoksessa
has subproperty: teoksen perustaja (yhteistoimija) teoksessa

henkilöön liittyvä teos
status: Published
sub property of: henkilöön liittyvä RDA-entiteetti
type: Property
label: has related work of person @en
lexical alias: relatedWorkOfPerson.en
definition: Relates a person to a work that is associated with a person. @en
domain: C10004
sub property of: toimijaan liittyvä teos
label: έχει σχετικό έργο του φυσικού προσώπου @el
definition: Συνδέει ένα φυσικό πρόσωπο με ένα έργο το οποίο συνδέεται με ένα περιγραφόμενο φυσικό πρόσωπο. @el
label: har værk relateret til person @da
definition: Relaterer en person til et værk, som er knyttet til en person. @da
label: té com a obra relacionada amb una persona @ca
definition: Relaciona una persona amb una obra que s’associa amb una persona. @ca
definition: Liittää henkilön teokseen, joka liittyy henkilöön.
toolkit label: henkilöön liittyvä teos
toolkit definition: Teos, joka liittyy henkilöön.
label: a pour œuvre en relation avec une personne @fr
definition: Met une personne en relation avec une œuvre qui est associée à une personne. @fr
toolkit label: related work of person @en
toolkit definition: A work that is associated with a person. @en
has element type: 1
label: személyhez kapcsolódó mű a következő: @hu
definition: Hozzákapcsol egy személyt egy személyhez kapcsolódó műhöz. @hu
label: har verk relatert til person @no
definition: Relaterer en person til et verk som forbindes med en person. @no
toolkit label: verk relatert til person @no
toolkit definition: Et verk som forbindes med en person. @no
label: heeft gerelateerd werk van persoon @nl
definition: Relateert een persoon aan een werk dat geassocieerd is met een persoon. @nl
toolkit label: gerelateerd werk van persoon @nl
toolkit definition: Een werk dat geassocieerd is met een persoon. @nl
label: له عمل مرتبط بشخص @ar
definition: يربط شخصا عمل مرتبط بشخص. @ar
toolkit label: عمل مرتبط بشخص @ar
toolkit definition: عمل مرتبط بشخص. @ar
toolkit label: obra relacionada amb una persona @ca
toolkit definition: Obra que s’associa amb una persona. @ca
toolkit label: værk relateret til person @da
toolkit definition: Værk, som er knyttet til en person. @da
label: isikuga seotud teos @et
definition: Seostab isiku isikuga seotud teosega. @et
toolkit label: isikuga seotud teos @et
toolkit definition: Isikuga seotud teos. @et
label: hat mit Person in Beziehung stehendes Werk @de
definition: Setzt eine Person in Beziehung zu einem Werk, das mit einer Person in Verbindung steht. @de
toolkit label: Mit Person in Beziehung stehendes Werk @de
toolkit definition: Ein Werk, das mit einer Person in Verbindung steht. @de
toolkit label: személyhez kapcsolódó mű: @hu
toolkit definition: Egy személyhez kapcsolódó mű. @hu
label: ha come opera correlata di persona @it
definition: Correla una persona a un'opera associata a una persona. @it
toolkit label: opera correlata di persona @it
toolkit definition: Opera associata a una persona. @it
toolkit label: σχετικό έργο του φυσικού προσώπου @el
toolkit label: œuvre en relation avec une personne @fr
toolkit definition: Œuvre qui est associée à une personne. @fr
label: ar personu saistītais darbs @lv
definition: Sasaista personu ar darbu, kas saistīts ar personu. @lv
toolkit label: ar personu saistītais darbs @lv
toolkit definition: Darbs, kas saistīts ar personu. @lv
label: 有个人的关联作品 @zh-hans
definition: 将一个个人与和一个个人有关的一种作品关联起来。 @zh-hans
toolkit label: 个人的关联作品 @zh-hans
toolkit definition: 和一个个人有关的一种作品 @zh-hans
definition: Bir kişiyi, bir kişiyle ilişkilendirilen bir eserle ilişkilendirir. @tr
toolkit label: Kişiyle ilişkili eser @tr
toolkit definition: Bir kişi ile bağlantılı olan bir eser. @tr
label: kişinin ilgili eseri ile ilişkilidir @tr
has subproperty: akateeminen ohjaaja teoksessa
has subproperty: vastaanottaja (henkilö) teoksessa
has subproperty: toimeksiantaja (henkilö) teoksessa
has subproperty: asiantuntija (henkilö) teoksessa
has subproperty: teoksen tekijä (henkilö) teoksessa
has subproperty: teoksen omistuksen kohde (henkilö) teoksessa
has subproperty: omistuskirjoituksen tekijä (henkilö) teoksessa
has subproperty: ohjaaja (henkilö) teoksessa
has subproperty: kuvaaja (henkilö) teoksessa
has subproperty: toimituspäällikkö (henkilö) teoksessa

yhteisöön liittyvä teos
status: Published
type: Property
label: has related work of corporate body @en
lexical alias: relatedWorkOfCorporateBody.en
definition: Relates a corporate body to a work that is associated with a corporate body. @en
domain: C10005
sub property of: yhteisöön liittyvä RDA-entiteetti
label: έχει σχετικό έργο του συλλογικού οργάνου @el
definition: Συνδέει ένα συλλογικό όργανο με ένα έργο το οποίο συνδέεται με ένα περιγραφόμενο συλλογικό όργανο. @el
label: har værk relateret til korporation @da
definition: Relaterer en korporation til et værk, som er knyttet til en korporation. @da
label: té com a obra relacionada amb una entitat corporativa @ca
definition: Relaciona una entitat corporativa amb una obra que s’associa amb una entitat corporativa. @ca
definition: Liittää yhteisön teokseen, joka liittyy yhteisöön.
toolkit label: yhteisöön liittyvä teos
toolkit definition: Teos, joka liittyy yhteisöön.
label: a pour œuvre en relation avec une collectivité @fr
definition: Met une collectivité en relation avec une œuvre qui est associée à une collectivité. @fr
toolkit label: related work of corporate body @en
toolkit definition: A work that is associated with a corporate body. @en
has element type: 1
sub property of: yhteistoimijaan liittyvä teos
label: testülethez kapcsolódó mű a következő: @hu
definition: Hozzákapcsol egy testületet egy testülethez kapcsolódó műhöz. @hu
label: har verk relatert til korporasjon @no
definition: Relaterer en korporasjon til et verk som forbindes med en korporasjon. @no
toolkit label: verk relatert til korporasjon @no
toolkit definition: Et verk som forbindes med en korporasjon. @no
label: heeft gerelateerd werk van corporatie @nl
definition: Relateert een corporatie aan een werk dat geassocieerd is met een corporatie. @nl
toolkit label: gerelateerd werk van corporatie @nl
toolkit definition: Een werk dat geassocieerd is met een corporatie. @nl
label: له عمل مرتبط بهيئة @ar
definition: يربط هيئة بعمل ذي صلة بهيئة. @ar
toolkit label: عمل مرتبط بهيئة @ar
toolkit definition: عمل ذو صلة بهيئة. @ar
toolkit label: obra relacionada amb una entitat corporativa @ca
toolkit definition: Obra que s’associa amb una entitat corporativa. @ca
toolkit label: værk relateret til korporation @da
toolkit definition: Værk, som er knyttet til en korporation. @da
label: asutusega seotud teos @et
definition: Seostab asutuse asutusega seotud teosega. @et
toolkit label: asutusega seotud teos @et
toolkit definition: Asutusega seotud teos. @et
label: hat mit Körperschaft in Beziehung stehendes Werk @de
definition: Setzt eine Körperschaft in Beziehung zu einem Werk, das mit einer Körperschaft in Verbindung steht. @de
toolkit label: Mit Körperschaft in Beziehung stehendes Werk @de
toolkit definition: Ein Werk, das mit einer Körperschaft in Verbindung steht. @de
toolkit label: testülethez kapcsolódó mű: @hu
toolkit definition: Egy testülethez kapcsolódó mű. @hu
label: ha come opera correlata di ente @it
definition: Correla un ente a un'opera associata a un ente. @it
toolkit label: opera correlata di ente @it
toolkit definition: Opera associata a un ente. @it
toolkit label: σχετικό έργο του συλλογικού οργάνου @el
toolkit label: œuvre en relation avec une collectivité @fr
toolkit definition: Œuvre qui est associée à une collectivité. @fr
label: ar institūciju saistītais darbs @lv
definition: Sasaista institūciju ar darbu, kas saistīts ar institūciju. @lv
toolkit label: ar institūciju saistītais darbs @lv
toolkit definition: Darbs, kas saistīts ar institūciju. @lv
label: 有团体的关联作品 @zh-hans
definition: 将一个团体与和一个团体有关的一种作品关联起来。 @zh-hans
toolkit label: 团体的关联作品 @zh-hans
toolkit definition: 和一个团体有关的一种作品 @zh-hans
label: tüzel kişinin ilgili eseri ile ilişkilidir @tr
definition: Bir tüzel kişiyi, tüzel kişilikle bağlantılı bir eserle ilişkilendirir. @tr
toolkit label: tüzel kişilikle ilişkili eser @tr
toolkit definition: Bir tüzel kişi ile bağlantılı olan bir eser. @tr
has subproperty: vastaanottaja (yhteisö) teoksessa
has subproperty: toimeksiantaja (yhteisö) teoksessa
has subproperty: teoksen tekijä (yhteisö) teoksessa
has subproperty: teoksen omistuksen kohde (yhteisö) teoksessa
has subproperty: kuvaaja (yhteisö) teoksessa
has subproperty: teoksella kunnioitettu yhteisö teoksessa
has subproperty: isäntäorganisaatio teoksessa
has subproperty: julkaisija (yhteisö) teokselle
has subproperty: yhteisön sponsoroima teos
has subproperty: yhteisö aiheena teoksessa

toimijaan liittyvä nomen
status: Published
sub property of: toimijaan liittyvä RDA-entiteetti
type: Property
label: has related nomen of agent @en
lexical alias: relatedNomenOfAgent.en
definition: Relates an agent to a nomen that is associated with an agent. @en
domain: C10002
label: έχει σχετικό όνομα του φορέα @el
definition: Συνδέει έναν φορέα με ένα όνομα που συνδέεται με έναν φορέα. @el
label: har nomen relateret til agent @da
definition: Relaterer en agent til et nomen, som er knyttet til en agent. @da
label: té com a nomen relacionat amb un agent @ca
definition: Relaciona un agent amb un nomen que s’associa amb un agent. @ca
definition: Liittää toimijan nomeniin, joka liittyy toimijaan.
toolkit label: toimijaan liittyvä nomen
toolkit definition: Nomen, joka liittyy toimijaan.
label: a pour nomen en relation avec un agent @fr
definition: Met un agent en relation avec un nomen qui est associé à un agent. @fr
toolkit label: related nomen of agent @en
toolkit definition: A nomen that is associated with an agent. @en
has element type: 1
sub property of: P00013
label: ágenshez kapcsolódó nomen a következő: @hu
definition: Hozzákapcsol egy ágenst egy ágenshez kapcsolódó nomenhez. @hu
label: har nomen relatert til agent @no
definition: Relaterer en agent til et nomen som forbindes med en agent. @no
toolkit label: nomen relatert til agent @no
toolkit definition: Et nomen som forbindes med en agent. @no
label: heeft gerelateerde nomen van actor @nl
definition: Relateert een actor aan een nomen dat geassocieerd is met een actor. @nl
toolkit label: gerelateerde nomen van actor @nl
toolkit definition: Een nomen dat geassocieerd is met een actor. @nl
label: له تسمية مرتبطة بوكيل @ar
definition: يربط وكيلا بتسمية مرتبطة بوكيل. @ar
toolkit label: تسمية مرتبطة بوكيل @ar
toolkit definition: تسمية مرتبط بوكيل. @ar
toolkit label: nomen relacionat amb un agent @ca
toolkit definition: Nomen que s’associa amb un agent. @ca
toolkit label: nomen relateret til agent @da
toolkit definition: Nomen, som er knyttet til en agent. @da
label: tegijaga seotud nomen @et
definition: Seostab tegija tegijaga seotud nomen'iga. @et
toolkit label: tegijaga seotud nomen @et
toolkit definition: Tegijaga seotud nomen. @et
label: hat mit Akteur in Beziehung stehendes Nomen @de
definition: Setzt einen Akteur in Beziehung zu einem Nomen, das mit einem Akteur in Verbindung steht. @de
toolkit label: Mit Akteur in Beziehung stehendes Nomen @de
toolkit definition: Ein Nomen, das mit einem Akteur in Verbindung steht. @de
toolkit label: ágenshez kapcsolódó nomen: @hu
toolkit definition: Egy ágenshez kapcsolódó nomen. @hu
label: ha come nomen correlato di agente @it
definition: Correla un agente a un nomen associato a un agente. @it
toolkit label: nome correlato di agente @it
toolkit definition: Nomen associato a un agente. @it
toolkit label: σχετικό όνομα του φορέα @el
toolkit label: nomen en relation avec un agent @fr
toolkit definition: Nomen qui est associé à un agent. @fr
label: ar aģentu saistītais nomens @lv
definition: Sasaista aģentu ar nomenu, kas saistīts ar aģentu. @lv
toolkit label: ar aģentu saistītais nomens @lv
toolkit definition: Nomens, kas saistīts ar aģentu. @lv
label: 有行为者的关联命名 @zh-hans
definition: 将一个行为者与和一个行为者有关的一个命名关联起来。 @zh-hans
toolkit label: 行为者的关联命名 @zh-hans
toolkit definition: 和一个行为者有关的一个命名 @zh-hans
label: temsilcinin ilgili ismi ile ile ilişkilidir @tr
definition: Bir temsilciyi, temsilciyle bağlantılı olan bir isimle ilişkilendirir. @tr
toolkit label: Temsilcinin ilişkili ismi @tr
toolkit definition: Bir temsilciyle bağlantılı olan bir isim. @tr
has subproperty: toimijan nimitys
has subproperty: toimijan antama nomen
has subproperty: yhteistoimijaan liittyvä nomen
has subproperty: henkilöön liittyvä nomen
has subproperty: P50340

sukuun liittyvä nomen
status: Published
sub property of: sukuun liittyvä RDA-entiteetti
type: Property
label: has related nomen of family @en
lexical alias: relatedNomenOfFamily.en
definition: Relates a family to a nomen that is associated with a family. @en
domain: C10008
sub property of: yhteistoimijaan liittyvä nomen
label: έχει σχετικό όνομα της οικογένειας @el
definition: Συνδέει μια οικογένεια με ένα όνομα που συνδέεται με μια οικογένεια. @el
label: har nomen relateret til familie @da
definition: Relaterer en familie til et nomen, som er knyttet til en familie. @da
label: té com a nomen relacionat amb una família @ca
definition: Relaciona una família amb un nomen que s’associa amb una família. @ca
definition: Liittää suvun nomeniin, joka liittyy sukuun.
toolkit label: sukuun liittyvä nomen
toolkit definition: Nomen, joka liittyy sukuun.
label: a pour nomen en relation avec une famille @fr
definition: Met une famille en relation avec un nomen qui est associé à une famille. @fr
toolkit label: related nomen of family @en
toolkit definition: A nomen that is associated with a family. @en
has element type: 1
label: családhoz kapcsolódó nomen a következő: @hu
definition: Hozzákapcsol egy családot egy családhoz kapcsolódó nomenhez. @hu
label: har nomen relatert til familie @no
definition: Relaterer en familie til et nomen som forbindes med en familie. @no
toolkit label: nomen relatert til familie @no
toolkit definition: Et nomen som forbindes med en familie. @no
label: heeft gerelateerde nomen van familie @nl
definition: Relateert een familie aan een nomen dat geassocieerd is met een familie. @nl
toolkit label: gerelateerde nomen van familie @nl
toolkit definition: Een nomen dat geassocieerd is met een familie. @nl
label: لها تسمية مرتبطة بعائلة @ar
definition: يربط عائلة بتسمية ذات صلة بعائلة. @ar
toolkit label: تسمية مرتبطة بعائلة @ar
toolkit definition: تسمية ذات صلة بعائلة. @ar
toolkit label: nomen relacionat amb una família @ca
toolkit definition: Nomen que s’associa amb una família. @ca
toolkit label: nomen relateret til familie @da
toolkit definition: Nomen, som er knyttet til en familie. @da
label: perekonnaga seotud nomen @et
definition: Seostab perekonna perekonnaga seotud nomen'iga. @et
toolkit label: perekonnaga seotud nomen @et
toolkit definition: Perekonnaga seotud nomen. @et
label: hat mit Familie in Beziehung stehendes Nomen @de
definition: Setzt eine Familie in Beziehung zu einem Nomen, das mit einer Familie in Verbindung steht. @de
toolkit label: Mit Familie in Beziehung stehendes Nomen @de
toolkit definition: Ein Nomen, das mit einer Familie in Verbindung steht. @de
toolkit label: családhoz kapcsolódó nomen: @hu
toolkit definition: Egy családhoz kapcsolódó nomen. @hu
label: ha come nomen correlato di famiglia @it
definition: Correla una famiglia a un nomen associato a una famiglia. @it
toolkit label: nomen correlato di famiglia @it
toolkit definition: Nomen associato a una famiglia. @it
toolkit label: σχετικό όνομα της οικογένειας @el
toolkit label: nomen en relation avec une famille @fr
toolkit definition: Nomen qui est associé à une famille. @fr
label: ar dzimtu/ģimeni saistītais nomens @lv
definition: Sasaista dzimtu/ģimeni ar nomenu, kas saistīts ar dzimtu/ģimeni. @lv
toolkit label: ar dzimtu/ģimeni saistītais nomens @lv
toolkit definition: Nomens, kas saistīts ar dzimtu/ģimeni. @lv
label: 有家族的关联命名 @zh-hans
definition: 将一个家族与和一个家族有关的一个命名关联起来。 @zh-hans
toolkit label: 关联命名 @zh-hans
toolkit definition: 和一个家族有关的一个命名 @zh-hans
label: ailenin ilgili ismi ile ilişkilidir @tr
definition: Bir aileyi, aileyle bağlantılı bir isimle ilişkilendirir. @tr
toolkit label: ailenin ilişkili ismi @tr
toolkit definition: Bir aileyle bağlantılı olan bir isim. @tr
has subproperty: suvun nimitys
has subproperty: suvun antama nomen
has subproperty: P50356

yhteistoimijaan liittyvä nomen
status: Published
sub property of: yhteistoimijaan liittyvä RDA-entiteetti
type: Property
label: has related nomen of collective agent @en
lexical alias: relatedNomenOfCollectiveAgent.en
definition: Relates a collective agent to a nomen that is associated with a collective agent. @en
domain: C10011
sub property of: toimijaan liittyvä nomen
label: έχει σχετικό όνομα του συλλογικού φορέα @el
definition: Συνδέει έναν συλλογικό φορέα με ένα όνομα που συνδέεται με έναν συλλογικό φορέα. @el
label: har nomen relateret til kollektiv agent @da
definition: Relaterer en kollektiv agent til et nomen, som er knyttet til en kollektiv agent. @da
label: té com a nomen relacionat amb un agent col·lectiu @ca
definition: Relaciona un agent col·lectiu amb un nomen que s’associa amb un agent col·lectiu. @ca
definition: Liittää yhteistoimijan nomeniin, joka liittyy yhteistoimijaan.
toolkit label: yhteistoimijaan liittyvä nomen
toolkit definition: Nomen, joka liittyy yhteistoimijaan.
label: a pour nomen en relation avec un agent collectif @fr
definition: Met un agent collectif en relation avec un nomen qui est associé à un agent collectif. @fr
toolkit label: related nomen of collective agent @en
toolkit definition: A nomen that is associated with a collective agent. @en
has element type: 1
label: kollektív ágenshez kapcsolódó nomen a következő: @hu
definition: Hozzákapcsol egy kollektív ágenst egy kollektív ágenshez kapcsolódó nomenhez. @hu
label: har nomen relatert til kollektiv agent @no
definition: Relaterer en kollektiv agent til et nomen som forbindes med en kollektiv agent. @no
toolkit label: nomen relatert til kollektiv agent @no
toolkit definition: Et nomen som forbindes med en kollektiv agent. @no
label: heeft gerelateerde nomen van collectieve actor @nl
definition: Relateert een collectieve actor aan een nomen dat geassocieerd is met een collectieve actor. @nl
toolkit label: gerelateerde nomen van collectieve actor @nl
toolkit definition: Een nomen dat geassocieerd is met een collectieve actor. @nl
label: له تسمية مرتبطة بوكيل جماعي @ar
definition: يربط وكيلا جماعيا بتسمية مرتبطة بوكيل جماعي. @ar
toolkit label: تسمية مرتبطة بوكيل جماعي @ar
toolkit definition: تسمية مرتبطة بوكيل جماعي. @ar
toolkit label: nomen relacionat amb un agent col·lectiu @ca
toolkit definition: Nomen que s’associa amb un agent col·lectiu. @ca
toolkit label: nomen relateret til kollektiv agent @da
toolkit definition: Nomen, som er knyttet til en kollektiv agent. @da
label: kollektiiviga seotud nomen @et
definition: Seostab kollektiivi kollektiiviga seotud nomen'iga. @et
toolkit label: kollektiiviga seotud nomen @et
toolkit definition: Kollektiiviga seotud nomen. @et
label: hat mit gemeinschaftlichem Akteur in Beziehung stehendes Nomen @de
definition: Setzt einen gemeinschaftlichen Akteur in Beziehung zu einem Nomen, das mit einem gemeinschaftlichen Akteur in Verbindung steht. @de
toolkit label: Mit gemeinschaftlichem Akteur in Beziehung stehendes Nomen @de
toolkit definition: Ein Nomen, das mit einem gemeinschaftlichen Akteur in Verbindung steht. @de
toolkit label: kollektív ágenshez kapcsolódó nomen: @hu
toolkit definition: Egy kollektív ágenshez kapcsolódó nomen. @hu
label: ha come nomen correlato di agente collettivo @it
definition: Correla un agente collettivo a un nomen associato a un agente collettivo. @it
toolkit label: nomen correlato di agente collettivo @it
toolkit definition: Nomen associato a un agente collettivo. @it
toolkit label: σχετικό όνομα του συλλογικού φορέα @el
toolkit label: nomen en relation avec un agent collectif @fr
toolkit definition: Nomen qui est associé à un agent collectif. @fr
label: ar grupu saistītais nomens @lv
definition: Sasaista grupu ar nomenu, kas saistīts ar grupu. @lv
toolkit label: ar grupu saistītais nomens @lv
toolkit definition: Nomens, kas saistīts ar grupu. @lv
label: 有集体行为者的关联命名 @zh-hans
definition: 将一个集体行为者与和一个集体行为者有关的一个命名关联起来。 @zh-hans
toolkit label: 集体行为者的关联命名 @zh-hans
toolkit definition: 和一个集体行为者有关的一个命名 @zh-hans
label: kolektif temsilcinin ilgili ismi ile ilişkilidir @tr
definition: Kolektif bir temsilciyi, kolektif bir temsilciyle bağlantılı bir isimle ilişkilendirir. @tr
toolkit label: kolektif temsilcinin ilişkili ismi @tr
toolkit definition: Kolektif bir temsilciyle bağlantılı olan bir isim. @tr
has subproperty: yhteistoimijan nimitys
has subproperty: yhteistoimijan antama nomen
has subproperty: sukuun liittyvä nomen
has subproperty: yhteisöön liittyvä nomen
has subproperty: P50344

henkilöön liittyvä nomen
status: Published
sub property of: henkilöön liittyvä RDA-entiteetti
type: Property
label: has related nomen of person @en
lexical alias: relatedNomenOfPerson.en
definition: Relates a person to a nomen that is associated with a person. @en
domain: C10004
sub property of: toimijaan liittyvä nomen
label: έχει σχετικό όνομα του φυσικού προσώπου @el
definition: Συνδέει ένα φυσικό πρόσωπο με ένα όνομα που συνδέεται με ένα φυσικό πρόσωπο. @el
label: har nomen relateret til person @da
definition: Relaterer en person til et nomen, som er knyttet til en person. @da
label: té com a nomen relacionat amb una persona @ca
definition: Relaciona una persona amb un nomen que s’associa amb una persona. @ca
definition: Liittää henkilön nomeniin, joka liittyy henkilöön.
toolkit label: henkilöön liittyvä nomen
toolkit definition: Nomen, joka liittyy henkilöön.
label: a pour nomen en relation avec une personne @fr
definition: Met une personne en relation avec un nomen qui est associé à une personne. @fr
toolkit label: related nomen of person @en
toolkit definition: A nomen that is associated with a person. @en
has element type: 1
label: személyhez kapcsolódó nomen a következő: @hu
definition: Hozzákapcsol egy személyt egy személyhez kapcsolódó nomenhez. @hu
label: har nomen relatert til person @no
definition: Relaterer en person til et nomen som forbindes med en person. @no
toolkit label: nomen relatert til person @no
toolkit definition: Et nomen som forbindes med en person. @no
label: heeft gerelateerde nomen van persoon @nl
definition: Relateert een persoon aan een nomen dat geassocieerd is met een persoon. @nl
toolkit label: gerelateerde nomen van persoon @nl
toolkit definition: Een nomen dat geassocieerd is met een persoon. @nl
label: له تسمية مرتبطة بشخص @ar
definition: يربط شخصا بتسمية مرتبطة بشخص. @ar
toolkit label: تسمية مرتبطة بشخص @ar
toolkit definition: تسمية مرتبطة بشخص. @ar
toolkit label: nomen relacionat amb una persona @ca
toolkit definition: Nomen que s’associa amb una persona. @ca
toolkit label: nomen relateret til person @da
toolkit definition: Nomen, som er knyttet til en person. @da
label: isikuga seotud nomen @et
definition: Seostab isiku isikuga seotud nomen'iga. @et
toolkit label: isikuga seotud nomen @et
toolkit definition: Isikuga seotud nomen. @et
label: hat mit Person in Beziehung stehendes Nomen @de
definition: Setzt eine Person in Beziehung zu einem Nomen, das mit einer Person in Verbindung steht. @de
toolkit label: Mit Person in Beziehung stehendes Nomen @de
toolkit definition: Ein Nomen, das mit einer Person in Verbindung steht. @de
toolkit label: személyhez kapcsolódó nomen: @hu
toolkit definition: Egy személyhez kapcsolódó nomen. @hu
label: ha come nomen correlato di persona @it
definition: Correla una persona a un nomen associato a una persona. @it
toolkit label: nomen correlato di persona @it
toolkit definition: Nomen associato a una persona. @it
toolkit label: σχετικό όνομα του φυσικού προσώπου @el
toolkit label: nomen en relation avec une personne @fr
toolkit definition: Nomen qui est associé à une personne. @fr
label: ar personu saistītais nomens @lv
definition: Sasaista personu ar nomenu, kas saistīts ar personu. @lv
toolkit label: ar personu saistītais nomens @lv
toolkit definition: Nomens, kas saistīts ar personu. @lv
label: 有个人的关联命名 @zh-hans
definition: 将一个个人与和一个个人有关的一个命名关联起来。 @zh-hans
toolkit label: 个人的关联命名 @zh-hans
toolkit definition: 和一个个人有关的一个命名 @zh-hans
label: kişinin ilgili ismi ile ilişkilidir @tr
definition: Bir kişiyi, kişiyle bağlantılı olan bir isimle ilişkilendirir. @tr
toolkit label: kişinin ilişkili ismi @tr
toolkit definition: Bir kişiyle bağlantılı olan bir isim. @tr
has subproperty: henkilön toinen identiteetti
has subproperty: henkilön nimitys
has subproperty: henkilön antama nomen
has subproperty: henkilön todellinen identiteetti
has subproperty: P50348

yhteisöön liittyvä nomen
status: Published
sub property of: yhteisöön liittyvä RDA-entiteetti
type: Property
label: has related nomen of corporate body @en
lexical alias: relatedNomenOfCorporateBody.en
definition: Relates a corporate body to a nomen that is associated with a corporate body. @en
domain: C10005
sub property of: yhteistoimijaan liittyvä nomen
label: έχει σχετικό όνομα του συλλογικού οργάνου @el
definition: Συνδέει ένα συλλογικό όργανο με ένα όνομα που συνδέεται με ένα συλλογικό όργανο. @el
label: har nomen relateret til korporation @da
definition: Relaterer en korporation til et nomen, som er knyttet til en korporation. @da
label: té com a nomen relacionat amb una entitat corporativa @ca
definition: Relaciona una entitat corporativa amb un nomen que s’associa amb una entitat corporativa. @ca
definition: Liittää yhteisön nomeniin, joka liittyy yhteisöön.
toolkit label: yhteisöön liittyvä nomen
toolkit definition: Nomen, joka liittyy yhteisöön.
label: a pour nomen en relation avec une collectivité @fr
definition: Met une collectivité en relation avec un nomen qui est associé à une collectivité. @fr
toolkit label: related nomen of corporate body @en
toolkit definition: A nomen that is associated with a corporate body. @en
has element type: 1
label: testülethez kapcsolódó nomen a következő: @hu
definition: Hozzákapcsol egy testületet egy testülethez kapcsolódó nomenhez. @hu
label: har nomen relatert til korporasjon @no
definition: Relaterer en korporasjon til et nomen som forbindes med en korporasjon. @no
toolkit label: nomen relatert til korporasjon @no
toolkit definition: Et nomen som forbindes med en korporasjon. @no
label: heeft gerelateerde nomen van corporatie @nl
definition: Relateert een corporatie aan een nomen dat geassocieerd is met een corporatie. @nl
toolkit label: gerelateerde nomen van corporatie @nl
toolkit definition: Een nomen dat geassocieerd is met een corporatie. @nl
label: له تسمية ذات صلة بهيئة @ar
definition: يربط هيئة بتسمية ذات صلة بهيئة. @ar
toolkit label: تسمية مرتبطة بهيئة @ar
toolkit definition: تسمية ذات صلة بهيئة. @ar
toolkit label: nomen relacionat amb una entitat corporativa @ca
toolkit definition: Nomen que s’associa amb una entitat corporativa. @ca
toolkit label: nomen relateret til korporation @da
toolkit definition: Nomen, som er knyttet til en korporation. @da
label: asutusega seotud nomen @et
definition: Seostab asutuse asutusega seotud nomen'iga. @et
toolkit label: asutusega seotud nomen @et
toolkit definition: Asutusega seotud nomen. @et
label: hat mit Körperschaft in Beziehung stehendes Nomen @de
definition: Setzt eine Körperschaft in Beziehung zu einem Nomen, das mit einer Körperschaft in Verbindung steht. @de
toolkit label: Mit Körperschaft in Beziehung stehendes Nomen @de
toolkit definition: Ein Nomen, das einer Körperschaft in Verbindung steht. @de
toolkit label: testülethez kapcsolódó nomen: @hu
toolkit definition: Egy testülethez kapcsolódó nomen. @hu
label: ha come nomen correlato di ente @it
definition: Correla un ente a un nomen associato a un ente. @it
toolkit label: nome correlato di ente @it
toolkit definition: Nomen associato a un ente. @it
toolkit label: σχετικό όνομα του συλλογικού οργάνου @el
toolkit label: nomen en relation avec une collectivité @fr
toolkit definition: Nomen qui est associé à une collectivité. @fr
label: ar institūciju saistītais nomens @lv
definition: Sasaista institūciju ar nomenu, kas saistīts ar institūciju. @lv
toolkit label: ar institūciju saistītais nomens @lv
toolkit definition: Nomens, kas saistīts ar institūciju. @lv
label: 有团体的关联命名 @zh-hans
definition: 将一个团体与和一个团体有关的一个命名关联起来。 @zh-hans
toolkit label: 团体的关联命名 @zh-hans
toolkit definition: 和一个团体有关的一个命名 @zh-hans
label: tüzel kişinin ilgili ismi ile ilişkilidir @tr
definition: Bir tüzel kişiliği, tüzel kişilikle bağlantılı bir isimle ilişkilendirir. @tr
toolkit label: tüzel kişiliğin ilişkili ismi @tr
toolkit definition: Bir tüzel kişilikle bağlantılı olan bir isim. @tr
has subproperty: yhteisön nimitys
has subproperty: yhteisön antama nomen
has subproperty: P50352

toimijaan liittyvä kappale
status: Published
sub property of: toimijaan liittyvä RDA-entiteetti
type: Property
label: has related item of agent @en
lexical alias: relatedItemOfAgent.en
definition: Relates an agent to an item that is associated with an agent. @en
domain: C10002
label: έχει σχετικό αντίτυπο του φορέα @el
definition: Συνδέει έναν φορέα με ένα αντίτυπο το οποίο συνδέεται με έναν περιγραφόμενο φορέα. @el
label: har eksemplar relateret til agent @da
definition: Relaterer en agent til et eksemplar, som er knyttet til en agent. @da
label: té com a ítem relacionat amb un agent @ca
definition: Relaciona un agent amb un ítem que s’associa amb un agent. @ca
definition: Liittää toimijan kappaleeseen, joka liittyy toimijaan.
toolkit label: toimijaan liittyvä kappale
toolkit definition: Kappale, joka liittyy toimijaan.
label: a pour item en relation avec un agent @fr
definition: Met un agent en relation avec un item qui est associé à un agent. @fr
toolkit label: related item of agent @en
toolkit definition: An item that is associated with an agent. @en
has element type: 1
sub property of: P00005
label: ágenshez kapcsolódó példány a következő: @hu
definition: Hozzákapcsol egy ágenst egy ágenshez kapcsolódó példányhoz. @hu
alternative label: other agent associated with item of @en
label: har eksemplar relatert til agent @no
definition: Relaterer en agent til et eksemplar som forbindes med en agent. @no
toolkit label: eksemplar relatert til agent @no
toolkit definition: Et eksemplar som forbindes med en agent. @no
label: heeft gerelateerd item van actor @nl
definition: Relateert een actor aan een item dat is geassocieerd met een actor. @nl
toolkit label: gerelateerd item van actor @nl
toolkit definition: Een item dat is geassocieerd met een actor. @nl
label: لها مفردة مرتبطة بوكيل @ar
definition: يربط وكيلا بمفردة مرتبطة بوكيل. @ar
toolkit label: مفردة مرتبطة بوكيل @ar
toolkit definition: مفردة مرتبطة بوكيل. @ar
toolkit label: ítem relacionat amb un agent @ca
toolkit definition: Ítem que s’associa amb un agent. @ca
toolkit label: eksemplar relateret til agent @da
toolkit definition: Eksemplar, som er knyttet til en agent. @da
label: tegijaga seotud eksemplar @et
definition: Seostab tegija tegijaga seotud eksemplariga. @et
toolkit label: tegijaga seotud eksemplar @et
toolkit definition: Tegijaga seotud eksemplar. @et
label: hat mit Akteur in Beziehung stehendes Exemplar @de
definition: Setzt einen Akteur in Beziehung zu einem Exemplar, das mit einem Akteur in Verbindung steht. @de
toolkit label: Mit Akteur in Beziehung stehendes Exemplar @de
toolkit definition: Ein Exemplar, das mit einem Akteur in Verbindung steht. @de
toolkit label: ágenshez kapcsolódó példány: @hu
toolkit definition: Egy ágenshez kapcsolódó példány. @hu
label: ha come item correlato di agente @it
definition: Correla un agente a un item associato a un agente. @it
toolkit label: item correlato a un agente @it
toolkit definition: Item associato a un agente. @it
toolkit label: σχετικό αντίτυπο του φορέα @el
toolkit definition: Ένα αντίτυπο που συνδέεται με έναν φορέα. @el
toolkit label: item en relation avec un agent @fr
toolkit definition: Item qui est associé à un agent. @fr
label: ar aģentu saistītā vienība @lv
definition: Sasaista aģentu ar vienību, kas ir saistīta ar aģentu. @lv
toolkit label: ar aģentu saistītā vienība @lv
toolkit definition: Vienība, kas ir saistīta ar aģentu. @lv
alternative label: kappaleeseen liittyvä muu toimija kappaleessa
alternative label: وكيل آخر مرتبط مفردة @ar
alternative label: Sonstiger Akteur, der mit einem Exemplar in Verbindung steht von @de
alternative label: altre agent associat amb un ítem de @ca
alternative label: 其他和……的单件有关的行为者 @zh-hans
label: 有行为者的关联单件 @zh-hans
definition: 将一个行为者与和一个行为者有关的一个单件关联起来。 @zh-hans
toolkit label: 行为者的关联单件 @zh-hans
toolkit definition: 和一个行为者有关的一个单件 @zh-hans
alternative label: otro agente asociado con ítem de @es
alternative label: autre agent associé à un item de @fr
alternative label: a következő példányhoz kapcsolódó egyéb ágens: @hu
alternative label: öğeyle bağlantılı diğer temsilcisi @tr
label: temsilcinin ilgili kopyası ile ilişkilidir @tr
toolkit label: temsilciyle ilişkili kopya @tr
toolkit definition: Bir temsilciyle bağlantılı olan bir kopya. @tr
has subproperty: sitoja (toimija) kappaleessa

sukuun liittyvä kappale
status: Published
sub property of: sukuun liittyvä RDA-entiteetti
type: Property
label: has related item of family @en
lexical alias: relatedItemOfFamily.en
definition: Relates a family to an item that is associated with a family. @en
domain: C10008
sub property of: yhteistoimijaan liittyvä kappale
label: έχει σχετικό αντίτυπο της οικογένειας @el
definition: Συνδέει μια οικογένεια με ένα αντίτυπο το οποίο συνδέεται με μια περιγραφόμενη οικογένεια. @el
label: har eksemplar relateret til familie @da
definition: Relaterer en familie til et eksemplar, som er knyttet til en familie. @da
label: té com a ítem relacionat amb una família @ca
definition: Relaciona una família amb un ítem que s’associa amb una família. @ca
definition: Liittää suvun kappaleeseen, joka liittyy sukuun.
toolkit label: sukuun liittyvä kappale
toolkit definition: Kappale, joka liittyy sukuun.
label: a pour item en relation avec une famille @fr
definition: Met une famille en relation avec un item qui est associé à une famille. @fr
toolkit label: related item of family @en
toolkit definition: An item that is associated with a family. @en
has element type: 1
label: családhoz kapcsolódó példány a következő: @hu
definition: Hozzákapcsol egy családot egy családhoz kapcsolódó példányhoz. @hu
label: har eksemplar relatert til familie @no
definition: Relaterer en familie til et eksemplar som forbindes med en familie. @no
toolkit label: eksemplar relatert til familie @no
toolkit definition: Et eksemplar som forbindes med en familie. @no
label: heeft gerelateerd item van familie @nl
definition: Relateert een familie aan een item dat is geassocieerd met een familie. @nl
toolkit label: gerelateerd item van familie @nl
toolkit definition: Een item dat is geassocieerd met een familie. @nl
label: له مفردة مرتبطة بعائلة @ar
definition: يربط عائلة بمفردة ذات صلة بعائلة. @ar
toolkit label: مفردة مرتبطة بعائلة @ar
toolkit definition: مفردة ذات صلة بعائلة. @ar
toolkit label: ítem relacionat amb una família @ca
toolkit definition: Ítem que s’associa amb una família. @ca
toolkit label: eksemplar relateret til familie @da
toolkit definition: Eksemplar, som er knyttet til en familie. @da
label: perekonnaga seotud eksemplar @et
definition: Seostab perekonna perekonnaga seotud eksemplariga. @et
toolkit label: perekonnaga seotud eksemplar @et
toolkit definition: Perekonnaga seotud eksemplar. @et
label: hat mit Familie in Beziehung stehendes Exemplar @de
definition: Setzt eine Familie in Beziehung zu einem Exemplar, das mit einer Familie in Verbindung steht. @de
toolkit label: Mit Familie in Beziehung stehendes Exemplar @de
toolkit definition: Ein Exemplar, das mit einer Familie in Verbindung steht. @de
toolkit label: családhoz kapcsolódó példány: @hu
toolkit definition: Egy családhoz kapcsolódó példány. @hu
label: ha come item correlato di famiglia @it
definition: Correla una famiglia a un item associata a una famiglia. @it
toolkit label: item correlato di famiglia @it
toolkit definition: Item associata a una famiglia. @it
toolkit label: σχετικό αντίτυπο της οικογένειας @el
toolkit label: item en relation avec une famille @fr
toolkit definition: Item qui est associé à une famille. @fr
label: ar dzimtu/ģimeni saistītā vienība @lv
definition: Sasaista dzimtu/ģimeni ar vienību, kas ir saistīta ar dzimtu/ģimeni. @lv
toolkit label: ar dzimtu/ģimeni saistītā vienība @lv
toolkit definition: Vienība, kas ir saistīta ar dzimtu/ģimeni. @lv
label: 有家族的关联单件 @zh-hans
definition: 将一个家族与和一个家族有关的一个单件关联起来。 @zh-hans
toolkit label: 家族的关联单件 @zh-hans
toolkit definition: 和一个家族有关的一个单件 @zh-hans
label: ailenin ilgili kopyası ile ilişkilidir @tr
definition: Bir aileyi, aileyle bağlantılı bir kopyayla ilişkilendirir. @tr
toolkit label: aileyle ilişkili kopya @tr
toolkit definition: Bir aileyle bağlantılı olan bir kopya. @tr
has subproperty: sitoja (suku) kappaleessa
has subproperty: kuraattori (suku) kappaleessa
has subproperty: säilyttäjä (suku) kappaleessa
has subproperty: kappaleen omistuksen kohde (suku) kappaleessa
has subproperty: kappaleella kunnioitettu suku kappaleessa
has subproperty: illuminoinnin tekijä (suku) kappaleessa
has subproperty: muokkaaja (suku) kappaleessa
has subproperty: omistaja (suku) kappaleessa
has subproperty: kappaleen entisöijä (suku) kappaleessa
has subproperty: P50323

yhteistoimijaan liittyvä kappale
status: Published
sub property of: yhteistoimijaan liittyvä RDA-entiteetti
type: Property
label: has related item of collective agent @en
lexical alias: relatedItemOfCollectiveAgent.en
definition: Relates a collective agent to an item that is associated with a collective agent. @en
domain: C10011
sub property of: toimijaan liittyvä kappale
label: έχει σχετικό αντίτυπο του συλλογικού φορέα @el
definition: Συνδέει έναν συλλογικό φορέα με ένα αντίτυπο το οποίο συνδέεται με έναν συλλογικό φορέα. @el
label: har eksemplar relateret til kollektiv agent @da
definition: Relaterer en kollektiv agent til et eksemplar, som er knyttet til en kollektiv agent. @da
label: té com a ítem relacionat amb un agent col·lectiu @ca
definition: Relaciona un agent col·lectiu amb un ítem que s’associa amb un agent col·lectiu. @ca
definition: Liittää yhteistoimijan kappaleeseen, joka liittyy yhteistoimijaan.
toolkit label: yhteistoimijaan liittyvä kappale
toolkit definition: Kappale, joka liittyy yhteistoimijaan.
label: a pour item en relation avec un agent collectif @fr
definition: Met un agent collectif en relation avec un item qui est associé à un agent collectif. @fr
toolkit label: related item of collective agent @en
toolkit definition: An item that is associated with a collective agent. @en
has element type: 1
label: kollektív ágenshez kapcsolódó példány a következő: @hu
definition: Hozzákapcsol egy kollektív ágenst egy kollektív ágenshez kapcsolódó példányhoz. @hu
label: har eksemplar relatert til kollektiv agent @no
definition: Relaterer en kollektiv agent til et eksemplar som forbindes med en kollektiv agent. @no
toolkit label: eksemplar relatert til kollektiv agent @no
toolkit definition: Et eksemplar som forbindes med en kollektiv agent. @no
label: heeft gerelateerd item van collectieve actor @nl
definition: Relateert een collectieve actor aan een item dat is geassocieerd met een collectieve actor. @nl
toolkit label: gerelateerd item van collectieve actor @nl
toolkit definition: Een item dat is geassocieerd met een collectieve actor. @nl
label: له مفردة مرتبطة بوكيل جماعي @ar
definition: يربط وكيلا جماعيا بمفردة ذات صلة بوكيل جماعي. @ar
toolkit label: مفردة مرتبطة بوكيل جماعي @ar
toolkit definition: مفردة مرتبطة بوكيل جماعي. @ar
toolkit label: ítem relacionat amb un agent col·lectiu @ca
toolkit definition: Ítem que s’associa amb un agent col·lectiu. @ca
toolkit label: eksemplar relateret til kollektiv agent @da
toolkit definition: Eksemplar, som er knyttet til en kollektiv agent. @da
label: kollektiiviga seotud eksemplar @et
definition: Seostab kollektiivi kollektiiviga seotud eksemplariga. @et
toolkit label: kollektiiviga seotud eksemplar @et
toolkit definition: Kollektiiviga seotud eksemplar. @et
label: hat mit gemeinschaftlichem Akteur in Beziehung stehendes Exemplar @de
definition: Setzt einen gemeinschaftlichen Akteur in Beziehung zu einem Exemplar, das mit einem gemeinschaftlichen Akteur in Verbindung steht. @de
toolkit label: Mit gemeinschaftlichem Akteur in Beziehung stehendes Exemplar @de
toolkit definition: Ein Exemplar, das mit einem gemeinschaftlichen Akteur in Verbindung steht. @de
toolkit label: kollektív ágenshez kapcsolódó példány: @hu
toolkit definition: Egy kollektív ágenshez kapcsolódó példány. @hu
label: ha come item correlato di agente collettivo @it
definition: Correla un agente collettivo a un item associato a un agente collettivo. @it
toolkit label: item correlato di agente collettivo @it
toolkit definition: Item associato a un agente collettivo. @it
toolkit label: σχετικό αντίτυπο του συλλογικού φορέα @el
toolkit label: item en relation avec un agent collectif @fr
toolkit definition: Item qui est associé à un agent collectif. @fr
label: ar grupu saistītā vienība @lv
definition: Sasaista grupu ar vienību, kas ir saistīta ar grupu. @lv
toolkit label: ar grupu saistītā vienība @lv
toolkit definition: Vienība, kas ir saistīta ar grupu. @lv
label: 有集体行为者的关联单件 @zh-hans
definition: 将一个集体行为者与和一个集体行为者有关的一个单件关联起来。 @zh-hans
toolkit label: 集体行为者的关联单件 @zh-hans
toolkit definition: 和一个集体行为者有关的一个单件 @zh-hans
label: kolektif temsilcinin ilgili kopyası ile ilişkilidir @tr
definition: Kolektif bir temsilciyi, kolektif temsilciyle bağlantılı bir kopyayla ilişkilendirir @tr
toolkit label: kolektif temsilciyle ilişkili kopya @tr
toolkit definition: Bir kolektif temsilciyle bağlantılı olan bir kopya. @tr
has subproperty: sitoja (yhteistoimija) kappaleessa
has subproperty: kuraattori (yhteistoimija) kappaleessa
has subproperty: säilyttäjä (yhteistoimija) kappaleessa
has subproperty: kappaleen omistuksen kohde (yhteistoimija) kappaleessa
has subproperty: kappaleella kunnioitettu yhteistoimija kappaleessa
has subproperty: illuminoinnin tekijä (yhteistoimija) kappaleessa
has subproperty: sukuun liittyvä kappale
has subproperty: yhteisöön liittyvä kappale
has subproperty: muokkaaja (yhteistoimija) kappaleessa
has subproperty: omistaja (yhteistoimija) kappaleessa

henkilöön liittyvä kappale
status: Published
sub property of: henkilöön liittyvä RDA-entiteetti
type: Property
label: has related item of person @en
lexical alias: relatedItemOfPerson.en
definition: Relates a person to an item that is associated with a person. @en
domain: C10004
sub property of: toimijaan liittyvä kappale
label: έχει σχετικό αντίτυπο του φυσικού προσώπου @el
definition: Συνδέει ένα φυσικό πρόσωπο με ένα αντίτυπο το οποίο συνδέεται με ένα περιγραφόμενο φυσικό πρόσωπο. @el
label: har eksemplar relateret til person @da
definition: Relaterer en person til et eksemplar, som er knyttet til en person. @da
label: té com a ítem relacionat amb una persona @ca
definition: Relaciona una persona amb un ítem que s’associa amb una persona. @ca
definition: Liittää henkilön kappaleeseen, joka liittyy henkilöön.
toolkit label: henkilöön liittyvä kappale
toolkit definition: Kappale, joka liittyy henkilöön.
label: a pour item en relation avec une personne @fr
definition: Met une personne en relation avec un item qui est associé à une personne. @fr
toolkit label: related item of person @en
toolkit definition: An item that is associated with a person. @en
has element type: 1
label: személyhez kapcsolódó példány a következő: @hu
definition: Hozzákapcsol egy személyt egy személyhez kapcsolódó példányhoz. @hu
label: har eksemplar relatert til person @no
definition: Relaterer en person til et eksemplar som forbindes med en person. @no
toolkit label: eksemplar relatert til person @no
toolkit definition: Et eksemplar som forbindes med en person. @no
label: heeft gerelateerd item van persoon @nl
definition: Relateert een persoon aan een item dat is geassocieerd met een persoon. @nl
toolkit label: gerelateerd item van persoon @nl
toolkit definition: Een item dat is geassocieerd met een persoon. @nl
label: له مفردة مرتبطة بشخص @ar
definition: يربط شخصا بمفردة مرتبطة بشخص. @ar
toolkit label: مفردة مرتبطة بشخص @ar
toolkit definition: مفردة مرتبطة بشخص. @ar
toolkit label: ítem relacionat amb una persona @ca
toolkit definition: Ítem que s’associa amb una persona. @ca
toolkit label: eksemplar relateret til person @da
toolkit definition: Eksemplar, som er knyttet til en person. @da
label: isikuga seotud eksemplar @et
definition: Seostab isiku isikuga seotud eksemplariga. @et
toolkit label: isikuga seotud eksemplar @et
toolkit definition: Isikuga seotud eksemplar. @et
label: hat mit Person in Beziehung stehendes Exemplar @de
definition: Setzt eine Person in Beziehung zu einem Exemplar, das mit einer Person in Verbindung steht. @de
toolkit label: Mit Person in Beziehung stehendes Exemplar @de
toolkit definition: Ein Exemplar, das mit einer Person in Verbindung steht. @de
toolkit label: személyhez kapcsolódó példány: @hu
toolkit definition: Egy személyhez kapcsolódó példány. @hu
label: ha come item correlato di persona @it
definition: Correla una persona a un item associato a una persona. @it
toolkit label: item correlato di persona @it
toolkit definition: Item associato a una persona. @it
toolkit label: σχετικό αντίτυπο του φυσικού προσώπου @el
toolkit label: item en relation avec une personne @fr
toolkit definition: Item qui est associé à une personne. @fr
label: ar personu saistītā vienība @lv
definition: Sasaista personu ar vienību, kas ir saistīta ar personu. @lv
toolkit label: ar personu saistītā vienība @lv
toolkit definition: Vienība, kas ir saistīta ar personu. @lv
label: 有个人的关联单件 @zh-hans
definition: 将一个个人与和一个个人有关的一个单件关联起来。 @zh-hans
toolkit label: 个人的关联行为者 @zh-hans
toolkit definition: 和一个个人有关的一个单件 @zh-hans
label: kişinin ilgili kopyası ile ilişkilidir @tr
definition: Bir kişiyi, bir kişiyle bağlantılı olan bir kopyayla ilişkilendirir. @tr
toolkit label: kişiyle ilişkili kopya @tr
toolkit definition: Bir kişiyle bağlantılı olan bir kopya. @tr
has subproperty: sitoja (henkilö) kappaleessa
has subproperty: kuraattori (henkilö) kappaleessa
has subproperty: säilyttäjä (henkilö) kappaleessa
has subproperty: kappaleen omistuksen kohde (henkilö) kappaleessa
has subproperty: kappaleella kunnioitettu henkilö kappaleessa
has subproperty: illuminoinnin tekijä (henkilö) kappaleessa
has subproperty: muokkaaja (henkilö) kappaleessa
has subproperty: omistaja (henkilö) kappaleessa
has subproperty: kappaleen entisöijä (henkilö) kappaleessa
has subproperty: P50314

yhteisöön liittyvä kappale
status: Published
sub property of: yhteisöön liittyvä RDA-entiteetti
type: Property
label: has related item of corporate body @en
lexical alias: relatedItemOfCorporateBody.en
definition: Relates a corporate body to an item that is associated with a corporate body. @en
domain: C10005
sub property of: yhteistoimijaan liittyvä kappale
label: έχει σχετικό αντίτυπο του συλλογικού οργάνου @el
definition: Συνδέει ένα συλλογικό όργανο με ένα αντίτυπο το οποίο συνδέεται με ένα περιγραφόμενο συλλογικό όργανο. @el
label: har eksemplar relateret til korporation @da
definition: Relaterer en korporation til et eksemplar, som er knyttet til en korporation. @da
label: té com a ítem relacionat amb una entitat corporativa @ca
definition: Relaciona una entitat corporativa amb un ítem que s’associa amb una entitat corporativa. @ca
definition: Liittää yhteisön kappaleeseen, joka liittyy yhteisöön.
toolkit label: yhteisöön liittyvä kappale
toolkit definition: Kappale, joka liittyy yhteisöön.
label: a pour item en relation avec une collectivité @fr
definition: Met une collectivité en relation avec un item qui est associé à une collectivité. @fr
toolkit label: related item of corporate body @en
toolkit definition: An item that is associated with a corporate body. @en
has element type: 1
label: testülethez kapcsolódó példány a következő: @hu
definition: Hozzákapcsol egy testületet egy testülethez kapcsolódó példányhoz. @hu
label: har eksemplar relatert til korporasjon @no
definition: Relaterer en korporasjon til et eksemplar som forbindes med en korporasjon. @no
toolkit label: eksemplar relatert til korporasjon @no
toolkit definition: Et eksemplar som forbindes med en korporasjon. @no
label: heeft gerelateerd item van corporatie @nl
definition: Relateert een corporatie aan een item dat is geassocieerd met een corporatie. @nl
toolkit label: gerelateerd item van corporatie @nl
toolkit definition: Een item dat is geassocieerd met een corporatie. @nl
label: له مفردة مرتبطة بهيئة @ar
definition: يربط هيئة بمفردة ذات صلة بهيئة. @ar
toolkit label: مفردة مرتبطة بهيئة @ar
toolkit definition: مفردة ذات صلة بهيئة. @ar
toolkit label: ítem relacionat amb una entitat corporativa @ca
toolkit definition: Ítem que s’associa amb una entitat corporativa. @ca
toolkit label: eksemplar relateret til korporation @da
toolkit definition: Eksemplar, som er knyttet til en korporation. @da
label: asutusega seotud eksemplar @et
definition: Seostab asutuse asutusega seotud eksemplariga. @et
toolkit label: asutusega seotud eksemplar @et
toolkit definition: Asutusega seotud eksemplar. @et
label: hat mit Körperschaft in Beziehung stehendes Exemplar @de
definition: Setzt eine Körperschaft in Beziehung zu einem Exemplar, das mit einer Körperschaft in Verbindung steht. @de
toolkit label: Mit Körperschaft in Beziehung stehendes Exemplar @de
toolkit definition: Ein Exemplar, das mit einer Körperschaft in Verbindung steht. @de
toolkit label: testülethez kapcsolódó példány: @hu
toolkit definition: Egy testülethez kapcsolódó példány. @hu
label: ha come item correlata di ente @it
definition: Correla un ente a un item associato a un ente. @it
toolkit label: item correlata di ente @it
toolkit definition: Item associato a un ente. @it
toolkit label: σχετικό αντίτυπο του συλλογικού οργάνου @el
toolkit label: item en relation avec une collectivité @fr
toolkit definition: Item qui est associé à une collectivité. @fr
label: ar institūciju saistītā vienība @lv
definition: Sasaista institūciju ar vienību, kas ir saistīta ar institūciju. @lv
toolkit label: ar institūciju saistītā vienība @lv
toolkit definition: Vienība, kas ir saistīta ar institūciju. @lv
label: 有团体的关联单件 @zh-hans
definition: 将一个团体与和一个团体有关的一个单件关联起来。 @zh-hans
toolkit label: 团体的关联单件 @zh-hans
toolkit definition: 和一个团体有关的一个单件 @zh-hans
label: tüzel kişinin ilgili kopyası ile ilişkilidir @tr
definition: Bir tüzel kişiyi, tüzel kişilikle alakalı bir kopyayla ilişkilendirir. @tr
toolkit label: tüzel kişilikle ilişkili kopya @tr
toolkit definition: Bir tüzel kişiyle bağlantılı olan bir kopya. @tr
has subproperty: sitoja (yhteisö) kappaleessa
has subproperty: kuraattori (yhteisö) kappaleessa
has subproperty: säilyttäjä (yhteisö) kappaleessa
has subproperty: kappaleen omistuksen kohde (yhteisö) kappaleessa
has subproperty: kappaleella kunnioitettu yhteisö kappaleessa
has subproperty: illuminoinnin tekijä (yhteisö) kappaleessa
has subproperty: muokkaaja (yhteisö) kappaleessa
has subproperty: omistaja (yhteisö) kappaleessa
has subproperty: kappaleen entisöijä (yhteisö) kappaleessa
has subproperty: P50332

sukuun liittyvä henkilö
status: Published
sub property of: sukuun liittyvä toimija
type: Property
label: has related person of family @en
lexical alias: relatedPersonOfFamily.en
definition: Relates a family to a person who is associated with a family. @en
domain: C10008
sub property of: yhteistoimijaan liittyvä henkilö
label: έχει σχετικό φυσικό πρόσωπο της οικογένειας @el
definition: Συνδέει μια οικογένεια με ένα φυσικό πρόσωπο το οποίο συνδέεται με μια περιγραφόμενη οικογένεια. @el
label: har person relateret til familie @da
definition: Relaterer en familie til en person, som er knyttet til en familie. @da
label: té com a persona relacionada amb una família @ca
definition: Relaciona una família amb una persona que s’associa amb una família. @ca
definition: Liittää suvun henkilöön, joka liittyy sukuun.
toolkit label: sukuun liittyvä henkilö
toolkit definition: Henkilö, joka liittyy sukuun.
label: a pour personne en relation avec une famille @fr
definition: Met une famille en relation avec une personne qui est associée à une famille. @fr
toolkit label: related person of family @en
toolkit definition: A person who is associated with a family. @en
has element type: 1
label: családhoz kapcsolódó személy a következő: @hu
definition: Hozzákapcsol egy családot egy családhoz kapcsolódó személyhez. @hu
label: har person relatert til familie @no
definition: Relaterer en familie til en person som forbindes med en familie. @no
toolkit label: person relatert til familie @no
toolkit definition: En person som forbindes med en familie. @no
label: heeft gerelateerde persoon van familie @nl
definition: Relateert een familie aan een persoon die geassocieerd is met een familie. @nl
toolkit label: gerelateerde persoon van familie @nl
toolkit definition: Een persoon die geassocieerd is met een familie. @nl
label: له شخص مرتبط بعائلة @ar
definition: يربط عائلة بشخص مرتبط بعائلة. @ar
toolkit label: شخص مرتبط بعائلة @ar
toolkit definition: شخص ذو صلة بعائلة. @ar
toolkit label: persona relacionada amb una família @ca
toolkit definition: Persona que s’associa amb una família. @ca
toolkit label: person relateret til familie @da
toolkit definition: Person, som er knyttet til en familie. @da
label: perekonnaga seotud isik @et
definition: Seostab perekonna perekonnaga seotud isikuga. @et
toolkit label: perekonnaga seotud isik @et
toolkit definition: Perekonnaga seotud isik. @et
label: hat mit Familie in Beziehung stehende Person @de
definition: Setzt eine Familie in Beziehung zu einer Person, die mit einer Familie in Verbindung steht. @de
toolkit label: Mit Familie in Beziehung stehende Person @de
toolkit definition: Ein Person, die mit einer Familie in Verbindung steht. @de
toolkit label: családhoz kapcsolódó személy: @hu
toolkit definition: Egy családhoz kapcsolódó személy. @hu
label: ha come personacorrelata di famiglia @it
definition: Correla una famiglia a una persona associata a una famiglia. @it
toolkit label: persona correlata di famiglia @it
toolkit definition: Persona associata a una famiglia. @it
toolkit label: σχετικό φυσικό πρόσωπο της οικογένειας @el
toolkit label: personne en relation avec une famille @fr
toolkit definition: Personne qui est associée à une famille. @fr
label: ar dzimtu/ģimeni saistītā persona @lv
definition: Sasaista dzimtu/ģimeni ar personu, kura saistīta ar dzimtu/ģimeni. @lv
toolkit label: ar dzimtu/ģimeni saistītā persona @lv
toolkit definition: Persona, kura saistīta ar dzimtu/ģimeni. @lv
label: 有家族的关联个人 @zh-hans
definition: 将一个家族与和一个家族有关的一个个人关联起来。 @zh-hans
toolkit label: 家族的关联个人 @zh-hans
toolkit definition: 和一个家族有关的一个个人 @zh-hans
label: ailenin ilgili kişisi ile ilişkilidir @tr
definition: Bir aileyi, aileyle bağlantılı bir kişiyle ilişkilendirir. @tr
toolkit label: aileyle ilişkili kişi @tr
toolkit definition: Bir aileyle bağlantılı olan bir kişi. @tr
has subproperty: suvun henkilöjäsen
has subproperty: P50325

toimijaan liittyvä henkilö
status: Published
label: has related person of agent @en
definition: Relates an agent to a person who is associated with an agent being identified. @en
type: Property
domain: C10002
lexical alias: relatedPersonOfAgent.en
sub property of: toimijaan liittyvä toimija
label: έχει σχετικό φυσικό πρόσωπο του φορέα @el
definition: Συνδέει έναν φορέα με ένα φυσικό πρόσωπο που συνδέεται με έναν ταυτοποιημένο φορέα. @el
label: har person relateret til agent @da
definition: Relaterer en agent til en person, som er knyttet til en agent, som identificeres. @da
label: té com a persona relacionada amb un agent @ca
definition: Relaciona un agent amb una persona que s’associa amb un agent que s’identifica. @ca
definition: Liittää toimijan henkilöön, johon identifioitavana oleva toimija liittyy.
toolkit label: toimijaan liittyvä henkilö
toolkit definition: Henkilö, johon identifioitavana oleva toimija liittyy.
label: a pour personne en relation avec un agent @fr
definition: Met un agent en relation avec une personne qui est associée à un agent en cours d’identification. @fr
toolkit label: related person of agent @en
toolkit definition: A person who is associated with an agent being identified. @en
has element type: 1
sub property of: P00007
label: ágenshez kapcsolódó személy a következő: @hu
definition: Hozzákapcsol egy ágenst egy azonosított ágenshez kapcsolódó személyhez. @hu
label: har person relatert til agent @no
definition: Relaterer en agent til en person som forbindes med en identifisert agent. @no
toolkit label: person relatert til agent @no
toolkit definition: En person som forbindes med en identifisert agent. @no
label: heeft gerelateerde persoon van actor @nl
definition: Relateert een actor aan een persoon die geassocieerd is met een actor die wordt geïdentificeerd. @nl
toolkit label: gerelateerde persoon van actor @nl
toolkit definition: Een persoon die geassocieerd is met een actor die wordt geïdentificeerd. @nl
label: له شخص مرتبط بوكيل @ar
definition: يربط وكيلا بشخص مرتبط بوكيل معروف الهوية @ar
toolkit label: شخص مرتبط بوكيل @ar
toolkit definition: شخص مرتبط بوكيل معروف الهوية. @ar
toolkit label: persona relacionada amb un agent @ca
toolkit definition: Persona que s’associa amb un agent que s’identifica. @ca
toolkit label: person relateret til agent @da
toolkit definition: Person, som er knyttet til en agent, som identificeres. @da
label: tegijaga seotud isik @et
definition: Seostab tegija isikuga, kes on seotud identifitseeritava tegijaga. @et
toolkit label: tegijaga seotud isik @et
toolkit definition: Isik, kes on seotud identifitseeritava tegijaga. @et
label: hat mit Akteur in Beziehung stehende Person @de
definition: Setzt einen Akteur in Beziehung zu einer Person, die mit einem Akteur in Verbindung steht. @de
toolkit label: mit Akteur in Beziehung stehende Person @de
toolkit definition: Eine Person, die mit einem Akteur in Verbindung steht. @de
toolkit label: ágenshez kapcsolódó személy: @hu
toolkit definition: Egy azonosított ágenshez kapcsolódó személy. @hu
label: ha come persona correlata di agente @it
definition: Correla un agente a una persona associata all'agente che si sta identificando. @it
toolkit label: persona correlata di agente @it
toolkit definition: Persona associata all'agente che si sta identificando. @it
toolkit label: σχετικό φυσικό πρόσωπο του φορέα @el
toolkit definition: Ένα φυσικό πρόσωπο που συνδέεται με τον προσδιοριζόμενο φορέα. @el
toolkit label: personne en relation avec un agent @fr
toolkit definition: Personne qui est associée à un agent en cours d’identification. @fr
label: ar aģentu saistītā persona @lv
definition: Sasaista aģentu ar personu, kura saistīta ar aģentu. @lv
toolkit label: ar aģentu saistītā persona @lv
toolkit definition: Persona, kura saistīta ar aģentu. @lv
label: 有行为者的相关个人 @zh-hans
definition: 将一个行为者与和所标识的一个行为者相关的一个个人关联起来。 @zh-hans
toolkit label: 行为者的相关个人 @zh-hans
toolkit definition: 和所标识的一个行为者相关的一个个人 @zh-hans
label: temsilcinin ilgili kişisi ile ilişkilidir @tr
definition: Bir temsilciyi, tanımlanan bir temsilciyle bağlantılı olan bir kişiyle ilişkilendirir. @tr
toolkit label: temsilciyle ilişkili kişi @tr
toolkit definition: Tanımlanan bir temsilciyle bağlantılı olan bir kişi. @tr
has subproperty: yhteistoimijaan liittyvä henkilö
has subproperty: henkilöön liittyvä henkilö
has subproperty: P50220

yhteistoimijaan liittyvä henkilö
status: Published
sub property of: yhteistoimijaan liittyvä toimija
type: Property
label: has related person of collective agent @en
lexical alias: relatedPersonOfCollectiveAgent.en
definition: Relates a collective agent to a person who is associated with a collective agent. @en
domain: C10011
sub property of: toimijaan liittyvä henkilö
label: έχει σχετικό φυσικό πρόσωπο του συλλογικού φορέα @el
definition: Συνδέει έναν συλλογικό φορέα με ένα φυσικό πρόσωπο το οποίο συνδέεται με έναν συλλογικό φορέα. @el
label: har person relateret til kollektiv agent @da
definition: Relaterer en kollektiv agent til en person, som er knyttet til en kollektiv agent. @da
label: té com a persona relacionada amb un agent col·lectiu @ca
definition: Relaciona un agent col·lectiu amb una persona que s’associa amb un agent col·lectiu. @ca
definition: Liittää yhteistoimijan henkilöön, joka liittyy yhteistoimijaan.
toolkit label: yhteistoimijaan liittyvä henkilö
toolkit definition: Henkilö, joka liittyy yhteistoimijaan.
label: a pour personne en relation avec un agent collectif @fr
definition: Met un agent collectif en relation avec une personne qui est associée à un agent collectif. @fr
toolkit label: related person of collective agent @en
toolkit definition: A person who is associated with a collective agent. @en
has element type: 1
label: kollektív ágenshez kapcsolódó személy a következő: @hu
definition: Hozzákapcsol egy kollektív ágenst egy kollektív ágenshez kapcsolódó személyhez. @hu
label: har person relatert til kollektiv agent @no
definition: Relaterer en kollektiv agent til en person som forbindes med en kollektiv agent. @no
toolkit label: person relatert til kollektiv agent @no
toolkit definition: En person som forbindes med en kollektiv agent. @no
label: heeft gerelateerde persoon van collectieve actor @nl
definition: Relateert een collectieve actor aan een persoon die geassocieerd is met een collectieve actor. @nl
toolkit label: gerelateerde persoon van collectieve actor @nl
toolkit definition: Een persoon die geassocieerd is met een collectieve actor. @nl
label: له شخص مرتبط بوكيل جماعي @ar
definition: يربط وكيلا جماعيا بشخص ذي صلة بوكيل جماعي. @ar
toolkit label: شخص مرتبط بوكيل جماعي @ar
toolkit definition: شخص مرتبط بوكيل جماعي. @ar
toolkit label: persona relacionada amb un agent col·lectiu @ca
toolkit definition: Persona que s’associa amb un agent col·lectiu. @ca
toolkit label: person relateret til kollektiv agent @da
toolkit definition: Person, som er knyttet til en kollektiv agent. @da
label: kollektiiviga seotud isik @et
definition: Seostab kollektiivi kollektiiviga seotud isikuga. @et
toolkit label: kollektiiviga seotud isik @et
toolkit definition: Kollektiiviga seotud isik. @et
label: hat mit gemeinschaftlichem Akteur in Beziehung stehende Person @de
definition: Setzt einen gemeinschaftlichen Akteur in Beziehung zu einer Person, die mit einem gemeinschaftlichen Akteur in Verbindung steht. @de
toolkit label: Mit gemeinschaftlichem Akteur in Beziehung stehende Person @de
toolkit definition: Eine Person, die mit einem gemeinschaftlichen Akteur in Verbindung steht. @de
toolkit label: kollektív ágenshez kapcsolódó személy: @hu
toolkit definition: Egy kollektív ágenshez kapcsolódó személy. @hu
label: ha come persona correlata di agente collettivo @it
definition: Correla un agente collettivo a una persona associata a un agente collettivo. @it
toolkit label: persona correlata di agente collettivo @it
toolkit definition: Persona associata a un agente collettivo. @it
toolkit label: σχετικό φυσικό πρόσωπο του συλλογικού φορέα @el
toolkit label: personne en relation avec un agent collectif @fr
toolkit definition: Personne qui est associée à un agent collectif. @fr
label: ar grupu saistītā persona @lv
definition: Sasaista grupu ar personu, kura saistīta ar grupu. @lv
toolkit label: ar grupu saistītā persona @lv
toolkit definition: Persona, kura saistīta ar grupu. @lv
label: 有集体行为者的关联个人 @zh-hans
definition: 将一个集体行为者与和一个集体行为者有关的一个个人关联起来。 @zh-hans
toolkit label: 集体行为者的关联个人 @zh-hans
toolkit definition: 和一个集体行为者有关的一个个人 @zh-hans
label: kolektif temsilcinin ilgili kişisi ile ilişkilidir @tr
definition: Kolektif bir temsilciyi, kolektif temsilciyle bağlantılı bir kişiyle ilişkilendirir. @tr
toolkit label: kolektif temsilciyle ilişkili kişi @tr
toolkit definition: Bir kolektif temsilciyle bağlantılı olan bir kişi. @tr
has subproperty: sukuun liittyvä henkilö
has subproperty: yhteisöön liittyvä henkilö
has subproperty: yhteistoimijan henkilöjäsen
has subproperty: P50365

henkilöön liittyvä henkilö
status: Published
sub property of: henkilöön liittyvä toimija
type: Property
label: has related person of person @en
lexical alias: relatedPersonOfPerson.en
definition: Relates a person to a person who is associated with a person. @en
domain: C10004
sub property of: toimijaan liittyvä henkilö
label: έχει σχετικό φυσικό πρόσωπο του φυσικού προσώπου @el
definition: Συνδέει ένα φυσικό πρόσωπο με ένα φυσικό πρόσωπο το οποίο συνδέεται με ένα περιγραφόμενο φυσικό πρόσωπο. @el
label: har person relateret til person @da
definition: Relaterer en person til en person, som er knyttet til en person. @da
label: té com a persona relacionada amb una persona @ca
definition: Relaciona una persona amb una persona que s’associa amb una persona. @ca
definition: Liittää henkilön henkilöön, joka liittyy henkilöön.
toolkit label: henkilöön liittyvä henkilö
toolkit definition: Henkilö, joka liittyy henkilöön.
label: a pour personne en relation avec une personne @fr
definition: Met une personne en relation avec une personne qui est associée à une personne. @fr
toolkit label: related person of person @en
toolkit definition: A person who is associated with a person. @en
has element type: 1
label: személyhez kapcsolódó személy a következő: @hu
definition: Hozzákapcsol egy személyt egy személyhez kapcsoldódó személyhez. @hu
label: har person relatert til person @no
definition: Relaterer en person til en person som forbindes med en person. @no
toolkit label: person relatert til person @no
toolkit definition: En person som forbindes med en person. @no
label: heeft gerelateerde persoon van persoon @nl
definition: Relateert een persoon aan een persoon die geassocieerd is met een persoon. @nl
toolkit label: gerelateerde persoon van persoon @nl
toolkit definition: Een persoon die geassocieerd is met een persoon. @nl
label: له شخص مرتبط بشخص @ar
definition: يربط شخصا بشخص مرتبط بشخص. @ar
toolkit label: شخص مرتبط بشخص @ar
toolkit definition: شخص مرتبط بشخص. @ar
toolkit label: persona relacionada amb una persona @ca
toolkit definition: Persona que s’associa amb una persona. @ca
toolkit label: person relateret til person @da
toolkit definition: Person, som er knyttet til en person. @da
label: isikuga seotud isik @et
definition: Seostab isiku isikuga seotud isikuga. @et
toolkit label: isikuga seotud isik @et
toolkit definition: Isikuga seotud isik. @et
label: hat mit Person in Beziehung stehende Person @de
definition: Setzt eine Person in Beziehung zu einer Person, die mit einer Person in Verbindung steht. @de
toolkit label: Mit Person in Beziehung stehende Person @de
toolkit definition: Eine Person, die mit einer Person in Verbindung steht. @de
toolkit label: személyhez kapcsolódó személy: @hu
toolkit definition: Egy személyhez kapcsolódó személy. @hu
label: ha come persona correlata di persona @it
definition: Correla una persona a una persona associata a una persona. @it
toolkit label: persona correlata di persona @it
toolkit definition: Persona associata a una persona. @it
toolkit label: σχετικό φυσικό πρόσωπο του φυσικού προσώπου @el
toolkit label: personne en relation avec une personne @fr
toolkit definition: Personne qui est associée à une personne. @fr
label: ar personu saistītā persona @lv
definition: Sasaista personu ar personu, kura saistīta ar personu. @lv
toolkit label: ar personu saistītā persona @lv
toolkit definition: Persona, kura saistīta ar personu. @lv
label: 有个人的关联个人 @zh-hans
definition: 将一个个人与和一个个人有关的一个个人关联起来。 @zh-hans
toolkit label: 个人的关联个人 @zh-hans
toolkit definition: 和一个个人有关的一个个人 @zh-hans
label: kişinin ilgili kişisi ile ilişkilidir @tr
definition: Bir kişiyi, bir kişiyle bağlantılı olan bir kişiyle ilişkilendirir. @tr
toolkit label: kişiyle ilişkili kişi @tr
toolkit definition: Bir kişi ile bağlantılı olan kişidir. @tr
has subproperty: ystävä
has subproperty: oppilas
has subproperty: opiskelutoveri
has subproperty: kollega
has subproperty: opettaja
has subproperty: P50316

yhteisöön liittyvä henkilö
status: Published
sub property of: yhteisöön liittyvä toimija
type: Property
label: has related person of corporate body @en
lexical alias: relatedPersonOfCorporateBody.en
definition: Relates a corporate body to a person who is associated with a corporate body. @en
domain: C10005
sub property of: yhteistoimijaan liittyvä henkilö
label: έχει σχετικό φυσικό πρόσωπο του συλλογικού οργάνου @el
definition: Συνδέει ένα συλλογικό όργανο με ένα φυσικό πρόσωπο το οποίο συνδέεται με ένα περιγραφόμενο συλλογικό όργανο. @el
label: har person relateret til korporation @da
definition: Relaterer en korporation til en person, som er knyttet til en korporation. @da
label: té com a persona relacionada amb una entitat corporativa @ca
definition: Relaciona una entitat corporativa amb una persona que s’associa amb una entitat corporativa. @ca
definition: Liittää yhteisön henkilöön, joka liittyy yhteisöön.
toolkit label: yhteisöön liittyvä henkilö
toolkit definition: Henkilö, joka liittyy yhteisöön.
label: a pour personne en relation avec une collectivité @fr
definition: Met une collectivité en relation avec une personne qui est associée à une collectivité. @fr
toolkit label: related person of corporate body @en
toolkit definition: A person who is associated with a corporate body. @en
has element type: 1
label: testülethez kapcsolódó személy a következő: @hu
definition: Hozzákapcsol egy testületet egy testülethez kapcsolódó személyhez. @hu
label: har person relatert til korporasjon @no
definition: Relaterer en korporasjon til en person som forbindes med en korporasjon. @no
toolkit label: person relatert til korporasjon @no
toolkit definition: En person som forbindes med en korporasjon. @no
label: heeft gerelateerde persoon van corporatie @nl
definition: Relateert een corporatie aan een persoon die geassocieerd is met een corporatie. @nl
toolkit label: gerelateerde persoon van corporatie @nl
toolkit definition: Een persoon die geassocieerd is met een corporatie. @nl
label: له شخص مرتبط بهيئة @ar
definition: يربط هيئة بشخص ذي صلة بهيئة. @ar
toolkit label: شخص مرتبط بهيئة @ar
toolkit definition: شخص ذو صلة بهيئة. @ar
toolkit label: persona relacionada amb una entitat corporativa @ca
toolkit definition: Persona que s’associa amb una entitat corporativa. @ca
toolkit label: person relateret til korporation @da
toolkit definition: Person, som er knyttet til en korporation. @da
label: asutusega seotud isik @et
definition: Seostab asutuse asutusega seotud isikuga. @et
toolkit label: asutusega seotud isik @et
toolkit definition: Asutusega seotud isik. @et
label: hat mit Körperschaft in Beziehung stehende Person @de
definition: Setzt eine Körperschaft in Beziehung zu einer Person, die mit einer Körperschaft in Verbindung steht. @de
toolkit label: Mit Körperschaft in Beziehung stehende Person @de
toolkit definition: Eine Person, die mit einer Körperschaft in Verbindung steht. @de
toolkit label: testülethez kapcsolódó személy: @hu
toolkit definition: Egy testülethez kapcsolódó személy. @hu
label: ha come persona correlata di ente @it
definition: Correla un ente a una persona associata a un ente. @it
toolkit label: persona correlata di ente @it
toolkit definition: Persona associata a un ente. @it
toolkit label: σχετικό φυσικό πρόσωπο του συλλογικού οργάνου @el
toolkit label: personne en relation avec une collectivité @fr
toolkit definition: Personne qui est associée à une collectivité. @fr
label: ar institūciju saistītā persona @lv
definition: Sasaista institūciju ar personu, kura saistīta ar institūciju. @lv
toolkit label: ar institūciju saistītā persona @lv
toolkit definition: Persona, kura saistīta ar institūciju. @lv
label: 有团体的关联个人 @zh-hans
definition: 将一个团体与和一个团体有关的一个个人关联起来。 @zh-hans
toolkit label: 团体的关联个人 @zh-hans
toolkit definition: 和一个团体有关的一个个人 @zh-hans
label: tüzel kişinin ilgili kişisi ile ilişkilidir @tr
definition: Bir tüzel kişiyi, tüzel kişilikle bağlantılı bir kişiyle ilişkilendirir. @tr
toolkit label: tüzel kişilikle ilişkili kişi @tr
toolkit definition: Bir tüzel kişilikle bağlantılı olan kişi. @tr
has subproperty: opiskelija
has subproperty: loppututkinnon suorittanut
has subproperty: yhteisön perustanut henkilö
has subproperty: yhteisöä sponsoroiva henkilö
has subproperty: yhteisön henkilöjäsen
has subproperty: toimihenkilö
has subproperty: P50334

yhteisöön liittyvä toimija
status: Published
sub property of: yhteisöön liittyvä RDA-entiteetti
type: Property
label: has related agent of corporate body @en
lexical alias: relatedAgentOfCorporateBody.en
definition: Relates a corporate body to an agent who is associated with a corporate body. @en
domain: C10005
sub property of: yhteistoimijaan liittyvä toimija
label: έχει σχετικό φορέα του συλλογικού οργάνου @el
definition: Συνδέει ένα συλλογικό όργανο με έναν φορέα ο οποίος συνδέεται με ένα περιγραφόμενο συλλογικό όργανο. @el
label: har agent relateret til korporation @da
definition: Relaterer en korporation til en agent, som er knyttet til en korporation. @da
label: té com a agent relacionat amb una entitat corporativa @ca
definition: Relaciona una entitat corporativa amb un agent que s’associa amb una entitat corporativa. @ca
definition: Liittää yhteisön toimijaan, joka liittyy yhteisöön.
toolkit label: yhteisöön liittyvä toimija
toolkit definition: Toimija, joka liittyy yhteisöön.
label: a pour agent en relation avec une collectivité @fr
definition: Met une collectivité en relation avec un agent qui est associé à une collectivité. @fr
toolkit label: related agent of corporate body @en
toolkit definition: An agent who is associated with a corporate body. @en
has element type: 1
label: testülethez kapcsolódó ágens a következő: @hu
definition: Hozzákapcsol egy testületet egy testülethez kapcsolódó ágenshez. @hu
label: har agent relatert til korporasjon @no
definition: Relaterer en korporasjon til en agent som forbindes med en korporasjon. @no
toolkit label: agent relatert til korporasjon @no
toolkit definition: En agent som forbindes med en korporasjon. @no
label: heeft gerelateerde actor van corporatie @nl
definition: Relateert een corporatie aan een actor die geassocieerd is met een corporatie. @nl
toolkit label: gerelateerde actor van corporatie @nl
toolkit definition: Een actor die geassocieerd is met een corporatie. @nl
label: له وكيل مرتبط بهيئة @ar
definition: يربط هيئة بوكيل ذي صلة بهيئة. @ar
toolkit label: وكيل مرتبط بهيئة @ar
toolkit definition: وكيل ذو صلة بهيئة. @ar
toolkit label: agent relacionat amb una entitat corporativa @ca
toolkit definition: Agent que s’associa amb una entitat corporativa. @ca
toolkit label: agent relateret til korporation @da
toolkit definition: Agent, som er knyttet til en korporation. @da
label: asutusega seotud tegija @et
definition: Seostab asutuse asutusega seotud tegijaga. @et
toolkit label: asutusega seotud tegija @et
toolkit definition: Asutusega seotud tegija. @et
label: hat mit Körperschaft in Beziehung stehenden Akteur @de
definition: Setzt eine Körperschaft in Beziehung zu einem Akteur, der mit einer Körperschaft in Verbindung steht. @de
toolkit label: Mit Körperschaft in Beziehung stehender Akteur @de
toolkit definition: Ein Akteur, der mit einer Körperschaft in Verbindung steht. @de
toolkit label: testülethez kapcsolódó ágens: @hu
toolkit definition: Egy testülethez kapcsolódó ágens. @hu
label: ha come agente correlato di ente @it
definition: Correla un ente a un agente associato a un ente. @it
toolkit label: agente correlato di ente @it
toolkit definition: Agente associato a un ente. @it
toolkit label: σχετικός φορέας του συλλογικού οργάνου @el
toolkit label: agent en relation avec une collectivité @fr
toolkit definition: Agent qui est associé à une collectivité. @fr
label: ar institūciju saistītais aģents @lv
definition: Sasaista institūciju ar arģentu, kurš saistīts ar institūciju. @lv
toolkit label: ar institūciju saistītais aģents @lv
toolkit definition: Aģents, kas saistīts ar institūciju. @lv
label: 有团体的关联行为者 @zh-hans
definition: 将一个团体与和一个团体有关的一个行为者关联起来。 @zh-hans
toolkit label: 团体的关联行为者 @zh-hans
toolkit definition: 和一个团体有关的一个行为者 @zh-hans
label: tüzel kişinin ilgili temsilcisi ile ilişkilidir @tr
definition: Bir tüzel kişiyi, tüzel kişiliğe ilişkili bir temsilciyle ilişkilendirir. @tr
toolkit label: tüzel kişilikle ilişkili temsilci @tr
toolkit definition: Bir tüzel kişilikle bağlantılı olan bir temsilci. @tr
has subproperty: yhteisön perustanut toimija
has subproperty: yhteisöön liittyvä yhteistoimija
has subproperty: yhteisöön liittyvä henkilö
has subproperty: yhteisöä sponsoroiva toimija
has subproperty: P50333

sukuun liittyvä yhteisö
status: Published
sub property of: sukuun liittyvä yhteistoimija
type: Property
label: has related corporate body of family @en
lexical alias: relatedCorporateBodyOfFamily.en
definition: Relates a family to a corporate body who is associated with a family. @en
domain: C10008
sub property of: yhteistoimijaan liittyvä yhteisö
label: έχει σχετικό συλλογικό όργανο της οικογένειας @el
definition: Συνδέει μια οικογένεια με ένα συλλογικό όργανο το οποίο συνδέεται με μια περιγραφόμενη οικογένεια. @el
label: har korporation relateret til familie @da
definition: Relaterer en familie til en korporation, som er knyttet til en familie. @da
label: té com a entitat corporativa relacionada amb una família @ca
definition: Relaciona una família amb una entitat corporativa que s’associa amb una família. @ca
definition: Liittää suvun yhteisöön, joka liittyy sukuun.
toolkit label: sukuun liittyvä yhteisö
toolkit definition: Yhteisö, joka liittyy sukuun.
label: a pour collectivité en relation avec une famille @fr
definition: Met une famille en relation avec une collectivité qui est associée à une famille. @fr
toolkit label: related corporate body of family @en
toolkit definition: A corporate body who is associated with a family. @en
has element type: 1
label: családhoz kapcsolódó testület a következő: @hu
definition: Hozzákapcsol egy családot egy családhoz kapcsolódó testülethez. @hu
label: har korporasjon som forbindes med familie @no
definition: Relaterer en familie til en korporasjon som forbindes med en familie. @no
toolkit label: korporasjon som forbindes med familie @no
toolkit definition: En korporasjon som forbindes med en familie. @no
label: heeft gerelateerde corporatie van familie @nl
definition: Relateert een familie aan een corporatie die geassocieerd is met een familie. @nl
toolkit label: gerelateerde corporatie van familie @nl
toolkit definition: Een corporatie die geassocieerd is met een familie. @nl
label: له هيئة مرتبطة بعائلة @ar
definition: يربط عائلة بهيئة ذات صلة بعائلة. @ar
toolkit label: هيئة مرتبطة بعائلة @ar
toolkit definition: هيئة ذات صلة بعائلة. @ar
toolkit label: entitat corporativa relacionada amb una família @ca
toolkit definition: Entitat corporativa que s’associa amb una família. @ca
toolkit label: korporation relateret til familie @da
toolkit definition: Korporation, som er knyttet til en familie. @da
label: perekonnaga seotud asutus @et
definition: Seostab perekonna perekonnaga seotud asutusega. @et
toolkit label: perekonnaga seotud asutus @et
toolkit definition: Perekonnaga seotud asutus. @et
label: hat mit Familie in Beziehung stehende Körperschaft @de
definition: Setzt eine Familie in Beziehung zu einer Körperschaft, die mit einer Familie in Verbindung steht. @de
toolkit label: Mit Familie in Beziehung stehende Körperschaft @de
toolkit definition: Eine Körperschaft, die mit einer Familie in Verbindung steht. @de
toolkit label: családhoz kapcsolódó testület: @hu
toolkit definition: Egy családhoz kapcsolódó testület. @hu
label: ha come ente correlato di famiglia @it
definition: Correla una famiglia a un ente associato a una famiglia. @it
toolkit label: ente correlato di famiglia @it
toolkit definition: Ente associato a una famiglia. @it
toolkit label: σχετικό συλλογικό όργανο της οικογένειας @el
toolkit label: collectivité en relation avec une famille @fr
toolkit definition: Collectivité qui est associée à une famille. @fr
label: ar dzimtu/ģimeni saistītā institūcija @lv
definition: Sasaista dzimtu/ģimeni ar institūciju, kas saistīta ar dzimtu/ģimeni. @lv
toolkit label: ar dzimtu/ģimeni saistītā institūcija @lv
toolkit definition: Institūcija, kas saistīta ar dzimtu/ģimeni. @lv
label: 有家族的关联团体 @zh-hans
definition: 将一个家族与和一个家族有关的一个团体关联起来。 @zh-hans
toolkit label: 家族的关联团体 @zh-hans
toolkit definition: 和一个家族有关的一个团体 @zh-hans
label: ailenin ilgili tüzel kişisi ile ilişkilidir @tr
definition: Bir aileyi, aileyle bağlantılı bir tüzel kişilikle ilişkilendirir. @tr
toolkit label: ailenin tüzel kişiyle ilişkisi @tr
toolkit definition: Bir aileyle bağlantılı tüzel kişi @tr
has subproperty: suvun yhteisöjäsen
has subproperty: suvun perustama yhteisö
has subproperty: suvun sponsoroima yhteisö
has subproperty: sukujäsen yhteisössä
has subproperty: P50327

toimijaan liittyvä yhteisö
status: Published
label: has related corporate body of agent @en
definition: Relates an agent to a corporate body who is associated with an agent being identified. @en
type: Property
domain: C10002
lexical alias: relatedCorporateBodyOfAgent.en
sub property of: toimijaan liittyvä yhteistoimija
label: έχει σχετικό συλλογικό όργανο του φορέα @el
definition: Συνδέει έναν φορέα με ένα συλλογικό όργανο που συνδέεται με έναν ταυτοποιημένο φορέα. @el
label: har korporation relateret til agent @da
definition: Relaterer en agent til en korporation, som er knyttet til en agent, som identificeres. @da
label: té com a entitat corporativa relacionada amb un agent @ca
definition: Relaciona un agent amb una entitat corporativa que s’associa amb un agent que s’identifica. @ca
definition: Liittää toimijan yhteisöön, johon identifioitavana oleva toimija liittyy.
toolkit label: toimijaan liittyvä yhteisö
toolkit definition: Yhteisö, johon identifioitavana oleva toimija liittyy.
label: a pour collectivité en relation avec un agent @fr
definition: Met un agent en relation avec une collectivité qui est associée à un agent en cours d’identification. @fr
toolkit label: related corporate body of agent @en
toolkit definition: A corporate body who is associated with an agent being identified. @en
has element type: 1
sub property of: P00009
label: ágenshez kapcsolódó testület a következő: @hu
definition: Hozzákapcsol egy ágenst egy azonosított ágenshez kapcsolódó testülethez. @hu
label: har korporasjon relatert til agent @no
definition: Relaterer en agent til en korporasjon som forbindes med en identifisert agent. @no
toolkit label: korporasjon relatert til agent @no
toolkit definition: En korporasjon som forbindes med en identifisert agent. @no
label: heeft gerelateerde corporatie van actor @nl
definition: Relateert een actor aan een corporatie die geassocieerd is met een actor die wordt geïdentificeerd. @nl
toolkit label: gerelateerde corporatie van actor @nl
toolkit definition: Een corporatie die geassocieerd is met een actor die wordt geïdentificeerd. @nl
label: له هيئة مرتبطة بوكيل @ar
definition: يربط وكيلا بهيئة مرتبطة بوكيل معروف الهوية. @ar
toolkit label: هيئة مرتبطة بوكيل @ar
toolkit definition: هيئة مرتبطة بوكيل معروف الهوية @ar
toolkit label: entitat corporativa relacionada amb un agent @ca
toolkit definition: Entitat corporativa que s’associa amb un agent que s’identifica. @ca
toolkit label: korporation relateret til agent @da
toolkit definition: Korporation, som er knyttet til en agent, som identificeres. @da
label: tegijaga seotud asutus @et
definition: Seostab tegija asutusega, kes on seotud identifitseeritava tegijaga. @et
toolkit label: tegijaga seotud asutus @et
toolkit definition: Asutus, kes on seotud identifitseeritava tegijaga. @et
label: hat mit Akteur in Beziehung stehende Körperschaft @de
definition: Setzt einen Akteur in Beziehung zu einer Körperschaft, die mit einem Akteur in Verbindung steht. @de
toolkit label: mit Akteur in Beziehung stehende Körperschaft @de
toolkit definition: Eine Körperschaft, die mit einem Akteur in Verbindung steht. @de
toolkit label: ágenshez kapcsolódó testület: @hu
toolkit definition: Egy azonosított ágenshez kapcsolódó testület. @hu
label: ha come ente correlato di agente @it
definition: Correla un agente a un ente associato all'agente che si sta identificando. @it
toolkit label: ente correlato di agente @it
toolkit definition: Ente associato all'agente che si sta identificando. @it
toolkit label: σχετικό συλλογικό όργανο του φορέα @el
toolkit definition: Ένα συλλογικό όργανο που συνδέεται με τον προσδιοριζόμενο φορέα. @el
toolkit label: collectivité en relation avec un agent @fr
toolkit definition: Collectivité qui est associée à un agent en cours d’identification. @fr
label: ar aģentu saistītā institūcija @lv
definition: Sasaista aģentu ar institūciju, kas saistīta ar aģentu. @lv
toolkit label: ar aģentu saistītā institūcija @lv
toolkit definition: Institūcija, kas saistīta ar aģentu. @lv
label: 有行为者的相关团体 @zh-hans
definition: 将一个行为者与和所标识的一个行为者相关的一个团体关联起来。 @zh-hans
toolkit label: 行为者的相关团体 @zh-hans
toolkit definition: 和所标识的一个行为者相关的一个团体 @zh-hans
label: temsilcinin ilgili tüzel kişisi ile ilişkilidir @tr
definition: Bir temsilciyi, kimliği belirlenen bir temsilciyle bağlantılı olan bir tüzel kişiyle ilişkilendirir. @tr
toolkit label: Temsilcinin tüzel kişiyle ilişkisi @tr
toolkit definition: Kimliği belirlenen bir temsilciyle ilişkili olan bir tüzel kişi. @tr
has subproperty: toimijan perustama yhteisö
has subproperty: yhteistoimijaan liittyvä yhteisö
has subproperty: henkilöön liittyvä yhteisö
has subproperty: toimijan sponsoroima yhteisö
has subproperty: P50218

yhteistoimijaan liittyvä yhteisö
status: Published
sub property of: yhteistoimijaan liittyvä yhteistoimija
type: Property
label: has related corporate body of collective agent @en
lexical alias: relatedCorporateBodyOfCollectiveAgent.en
definition: Relates a collective agent to a corporate body who is associated with a collective agent. @en
domain: C10011
sub property of: toimijaan liittyvä yhteisö
label: έχει σχετικό συλλογικό όργανο του συλλογικού φορέα @el
definition: Συνδέει έναν συλλογικό φορέα με ένα συλλογικό όργανο το οποίο συνδέεται με έναν συλλογικό φορέα. @el
label: har korporation relateret til kollektiv agent @da
definition: Relaterer en kollektiv agent til en korporation, som er knyttet til en kollektiv agent. @da
label: té com a entitat corporativa relacionada amb un agent col·lectiu @ca
definition: Relaciona un agent col·lectiu amb una entitat corporativa que s’associa amb un agent col·lectiu. @ca
definition: Liittää yhteistoimijan yhteisöön, joka liittyy yhteistoimijaan.
toolkit label: yhteistoimijaan liittyvä yhteisö
toolkit definition: Yhteisö, joka liittyy yhteistoimijaan.
label: a pour collectivité en relation avec un agent collectif @fr
definition: Met un agent collectif en relation avec une collectivité qui est associée à un agent collectif. @fr
toolkit label: related corporate body of collective agent @en
toolkit definition: A corporate body who is associated with a collective agent. @en
has element type: 1
label: kollektív ágenshez kapcsolódó testület a következő: @hu
definition: Hozzákapcsol egy kollektív ágenst egy kollektív ágenshez kapcsolódó testülethez. @hu
label: har korporasjon relatert til kollektiv agent @no
definition: Relaterer en kollektiv agent til en korporasjon som forbindes med en kollektiv agent. @no
toolkit label: korporasjon relatert til kollektiv agent @no
toolkit definition: En korporasjon som forbindes med en kollektiv agent. @no
label: heeft gerelateerde corporatie van collectieve actor @nl
definition: Relateert een collectieve actor aan een corporatie die geassocieerd is met een collectieve actor. @nl
toolkit label: gerelateerde corporatie van collectieve actor @nl
toolkit definition: Een corporatie die geassocieerd is met een collectieve actor. @nl
label: له هيئة مرتبطة بوكيل جماعي @ar
definition: يربط وكيلا جماعيا بهيئة ذات صلة بوكيل جماعي. @ar
toolkit label: هيئة مرتبطة بوكيل جماعي @ar
toolkit definition: هيئة ذات صلة بوكيل جماعي. @ar
toolkit label: entitat corporativa relacionada amb un agent col·lectiu @ca
toolkit definition: Entitat corporativa que s’associa amb un agent col·lectiu. @ca
toolkit label: korporation relateret til kollektiv agent @da
toolkit definition: Korporation, som er knyttet til en kollektiv agent. @da
label: kollektiiviga seotud asutus @et
definition: Seostab kollektiivi kollektiiviga seotud asutusega. @et
toolkit label: kollektiiviga seotud asutus @et
toolkit definition: Kollektiiviga seotud asutus. @et
label: hat mit gemeinschaftlichem Akteur in Beziehung stehende Körperschaft @de
definition: Setzt einen gemeinschaftlichen Akteur in Beziehung zu einer Körperschaft, die mit einem gemeinschaftlichen Akteur in Verbindung steht. @de
toolkit label: Mit gemeinschaftlichem Akteur in Beziehung stehende Körperschaft @de
toolkit definition: Eine Körperschaft, die mit einem gemeinschaftlichen Akteur in Verbindung steht. @de
toolkit label: kollektív ágenshez kapcsolódó testület: @hu
toolkit definition: Egy kollektív ágenshez kapcsolódó testület. @hu
label: ha come ente correlato di agente collettivo @it
definition: Correla un agente collettivo a un ente associato a un agente collettivo. @it
toolkit label: ente correlato di agente collettivo @it
toolkit definition: Ente associato a un agente collettivo. @it
toolkit label: σχετικό συλλογικό όργανο του συλλογικού φορέα @el
toolkit label: collectivité en relation avec un agent collectif @fr
toolkit definition: Collectivité qui est associée à un agent collectif. @fr
label: ar grupu saistītā institūcija @lv
definition: Sasaista grupu ar institūciju, kas saistīta ar grupu. @lv
toolkit label: ar grupu saistītā institūcija @lv
toolkit definition: Institūcija, kas saistīta ar grupu. @lv
label: 有集体行为者的关联团体 @zh-hans
definition: 将一个集体行为者与和一个集体行为者有关的一个团体关联起来。 @zh-hans
toolkit label: 集体行为者的关联团体 @zh-hans
toolkit definition: 和一个集体行为者有关的一个团体 @zh-hans
label: kolektif temsilcinin ilgili tüzel kişisi ile ilişkilidir @tr
definition: Kolektif bir temsilciyi, kolektif bir temsilciyle bağlantılı olan bir tüzel kişilikle ilişkilendirir. @tr
toolkit label: kolektif temsilcinin tüzel kişiyle ilişkisi @tr
toolkit definition: Bir kolektif temsilciyle bağlantılı olan bir tüzel kişi. @tr
has subproperty: yhteistoimijan yhteisöjäsen
has subproperty: yhteistoimijan perustama yhteisö
has subproperty: sukuun liittyvä yhteisö
has subproperty: yhteisöön liittyvä yhteisö
has subproperty: yhteistoimijan sponsoroima yhteisö
has subproperty: P50359

henkilöön liittyvä yhteisö
status: Published
sub property of: henkilöön liittyvä yhteistoimija
type: Property
label: has related corporate body of person @en
lexical alias: relatedCorporateBodyOfPerson.en
definition: Relates a person to a corporate body who is associated with a person. @en
domain: C10004
sub property of: toimijaan liittyvä yhteisö
label: έχει σχετικό συλλογικό όργανο του φυσικού προσώπου @el
definition: Συνδέει ένα φυσικό πρόσωπο με ένα συλλογικό όργανο το οποίο συνδέεται με ένα περιγραφόμενο φυσικό πρόσωπο. @el
label: har korporation relateret til person @da
definition: Relaterer en person til en korporation, som er knyttet til en person. @da
label: té com a entitat corporativa relacionada amb una persona @ca
definition: Relaciona una persona amb una entitat corporativa que s’associa amb una persona. @ca
definition: Liittää henkilön yhteisöön, joka liittyy henkilöön.
toolkit label: henkilöön liittyvä yhteisö
toolkit definition: Yhteisö, joka liittyy henkilöön.
label: a pour collectivité en relation avec une personne @fr
definition: Met une personne en relation avec une collectivité qui est associée à une personne. @fr
toolkit label: related corporate body of person @en
toolkit definition: A corporate body who is associated with a person. @en
has element type: 1
label: személyhez kapcsolódó testület a következő: @hu
definition: Hozzákapcsol egy személyt egy személyhez kapcsolódó testülethez. @hu
label: har korporasjon relatert til person @no
definition: Relaterer en person til en korporasjon som forbindes med en person. @no
toolkit label: korporasjon relatert til person @no
toolkit definition: En korporasjon som forbindes med en person. @no
label: heeft gerelateerde corporatie van persoon @nl
definition: Relateert een persoon aan een corporatie die geassocieerd is met een persoon. @nl
toolkit label: gerelateerde corporatie van persoon @nl
toolkit definition: Een corporatie die geassocieerd is met een persoon. @nl
label: له هيئة مرتبطة بشخص @ar
definition: يربط شخصا بهيئة مرتبطة بشخص. @ar
toolkit label: هيئة مرتبطة بشخص @ar
toolkit definition: هيئة مرتبطة بشخص. @ar
toolkit label: entitat corporativa relacionada amb una persona @ca
toolkit definition: Entitat corporativa que s’associa amb una persona. @ca
toolkit label: korporation relateret til person @da
toolkit definition: Korporation, som er knyttet til en person. @da
label: isikuga seotud asutus @et
definition: Seostab isiku isikuga seotud asutusega. @et
toolkit label: isikuga seotud asutus @et
toolkit definition: Isikuga seotud asutus. @et
label: hat mit Person in Beziehung stehende Körperschaft @de
definition: Setzt eine Person in Beziehung zu einer Körperschaft, die mit einer Person in Verbindung steht. @de
toolkit label: Mit Person in Beziehung stehende Körperschaft @de
toolkit definition: Eine Körperschaft, die mit einer Person in Verbindung steht. @de
toolkit label: személyhez kapcsolódó testület: @hu
toolkit definition: Egy személyhez kapcsolódó testület. @hu
label: ha come ente correlato di persona @it
definition: Correla una persona a un ente associato a una persona. @it
toolkit label: ente correlato di persona @it
toolkit definition: Ente associato a una persona. @it
toolkit label: σχετικό συλλογικό όργανο του φυσικού προσώπου @el
toolkit label: collectivité en relation avec une personne @fr
toolkit definition: Collectivité qui est associée à une personne. @fr
label: ar personu saistītā institūcija @lv
definition: Sasaista personu ar institūciju, kas saistīta ar personu. @lv
toolkit label: ar personu saistītā institūcija @lv
toolkit definition: Institūcija, kas saistīta ar personu. @lv
label: 有个人的关联团体 @zh-hans
definition: 将一个个人与和一个个人有关的一个团体关联起来。 @zh-hans
toolkit label: 个人的关联团体 @zh-hans
toolkit definition: 和一个个人有关的一个团体 @zh-hans
label: kişinin ilgili tüzel kişisi ile ilişkilidir @tr
definition: Bir kişiyi, bir kişiyle bağlantılı olan bir tüzel kişilikle ilişkilendirir. @tr
toolkit label: Kişinin tüzel kişiyle ilişkisi @tr
toolkit definition: Bir kişiyle ilişkili olan tüzel kişi. @tr
has subproperty: oppilaitos
has subproperty: henkilön sponsoroima yhteisö
has subproperty: henkilön perustama yhteisö
has subproperty: henkilöjäsen yhteisössä
has subproperty: toimihenkilönä yhteisössä
has subproperty: tutkinnon myöntänyt oppilaitos
has subproperty: P50318

yhteisöön liittyvä yhteisö
status: Published
sub property of: yhteisöön liittyvä yhteistoimija
type: Property
label: has related corporate body of corporate body @en
lexical alias: relatedCorporateBodyOfCorporateBody.en
definition: Relates a corporate body to a corporate body who is associated with a corporate body. @en
domain: C10005
sub property of: yhteistoimijaan liittyvä yhteisö
label: έχει σχετικό συλλογικό όργανο του συλλογικού οργάνου @el
definition: Συνδέει ένα συλλογικό όργανο με ένα συλλογικό όργανο το οποίο συνδέεται με ένα περιγραφόμενο συλλογικό όργανο. @el
label: har korporation relateret til korporation @da
definition: Relaterer en korporation til en korporation, som er knyttet til en korporation. @da
label: té com a entitat corporativa relacionada amb una entitat corporativa @ca
definition: Relaciona una entitat corporativa amb una entitat corporativa que s’associa amb una entitat corporativa. @ca
definition: Liittää yhteisön yhteisöön, joka liittyy yhteisöön.
toolkit label: yhteisöön liittyvä yhteisö
toolkit definition: Yhteisö, joka liittyy yhteisöön.
label: a pour collectivité en relation avec une collectivité @fr
definition: Met une collectivité en relation avec une collectivité qui est associée à une collectivité. @fr
toolkit label: related corporate body of corporate body @en
toolkit definition: A corporate body who is associated with a corporate body. @en
has element type: 1
label: testülethez kapcsolódó testület a következő: @hu
definition: Hozzákapcsol egy testületet egy testülethez kapcsolódó testülethez. @hu
alternative label: associated institution @en
alternative label: liittyvä yhteisö
label: har korporasjon relatert til korporasjon @no
definition: Relaterer en korporasjon til en korporasjon som forbindes med en korporasjon. @no
toolkit label: korporasjon relatert til korporasjon @no
toolkit definition: En korporasjon som forbindes med en korporasjon. @no
label: heeft gerelateerde corporatie van corporatie @nl
definition: Relateert een corporatie aan een corporatie die geassocieerd is met een corporatie. @nl
toolkit label: gerelateerde corporatie van corporatie @nl
toolkit definition: Een corporatie die geassocieerd is met een corporatie. @nl
label: له هيئة مرتبطة بهيئة @ar
definition: يربط هيئة بهيئة ذات صلة بهيئة. @ar
alternative label: مؤسسة ذات صلة @ar
toolkit label: هيئة مرتبطة بهيئة @ar
toolkit definition: هيئة ذات صلة بهيئة. @ar
alternative label: institució associada @ca
toolkit label: entitat corporativa relacionada amb una entitat corporativa @ca
toolkit definition: Entitat corporativa que s’associa amb una entitat corporativa. @ca
alternative label: tilknyttet institution @da
toolkit label: korporation relateret til korporation @da
toolkit definition: Korporation, som er knyttet til en korporation. @da
label: asutusega seotud asutus @et
definition: Seostab asutuse asutusega seotud asutusega. @et
toolkit label: asutusega seotud asutus @et
toolkit definition: Asutusega seotud asutus. @et
label: hat mit Körperschaft in Beziehung stehende Körperschaft @de
definition: Setzt eine Körperschaft in Beziehung zu einer Körperschaft, die mit einer Körperschaft in Verbindung steht. @de
alternative label: In Verbindung stehende Institution @de
toolkit label: Mit Körperschaft in Beziehung stehende Körperschaft @de
toolkit definition: Eine Körperschaft, die mit einer Körperschaft in Verbindung steht. @de
alternative label: kapcsolódó intézmény @hu
toolkit label: testülethez kapcsolódó testület: @hu
toolkit definition: Egy testülethez kapcsolódó testület. @hu
label: ha come ente correlato di ente @it
definition: Correla un ente a un ente associato a un ente. @it
alternative label: istituzione associata @it
toolkit label: ente correlato di ente @it
toolkit definition: Ente associato a un ente. @it
alternative label: σχετικό ίδρυμα @el
toolkit label: σχετικό συλλογικό όργανο του συλλογικού οργάνου @el
alternative label: institution associée @fr
toolkit label: collectivité en relation avec une collectivité @fr
toolkit definition: Collectivité qui est associée à une collectivité. @fr
label: ar institūciju saistītā institūcija @lv
definition: Sasaista institūciju ar institūciju, kas saistīta ar institūciju. @lv
toolkit label: ar institūciju saistītā institūcija @lv
toolkit definition: Institūcija, kas saistīta ar institūciju. @lv
alternative label: 有关机构 @zh-hans
label: 有团体的关联团体 @zh-hans
definition: 将一个团体与和一个团体有关的一个团体关联起来。 @zh-hans
toolkit label: 团体的关联团体 @zh-hans
toolkit definition: 和一个团体有关的一个团体 @zh-hans
toolkit label: tüzel kişinin tüzel kişiyle ilişkisi @tr
toolkit definition: Bir tüzel kişiyle bağlantısı olan bir tüzel kişi. @tr
has subproperty: yhteisön edeltäjä
has subproperty: yhteisön perustanut yhteisö

etunimi
status: Published
type: Property
label: has given name @en
lexical alias: givenName.en
definition: Relates a person to a nomen that is a name of person given at birth or at some later point in addition to, or instead of, a surname. @en
domain: C10004
toolkit label: given name @en
toolkit definition: A nomen that is a name of person given at birth or at some later point in addition to, or instead of, a surname. @en
instruction number: 18.5
label: έχει μικρό όνομα @el
definition: Συνδέει ένα φυσικό πρόσωπο με ένα όνομα που δόθηκε σε ένα φυσικό πρόσωπο κατά τη γέννησή του ή κάποια στιγμή αργότερα επιπρόσθετα ή αντί επωνύμου. @el
toolkit label: μικρό όνομα @el
toolkit definition: Ένα όνομα που δόθηκε σε ένα φυσικό πρόσωπο κατά τη γέννησή του ή κάποια στιγμή αργότερα επιπρόσθετα ή αντί επωνύμου. @el
definition: Setzt eine Person in Beziehung zu einem Namen einer Person, der ihr bei der Geburt oder zu einem späteren Zeitpunkt, zusätzlich oder anstatt eines Nachnamens, gegeben wird. @de
toolkit label: Vorname @de
toolkit definition: Ein Name einer Person, der ihr bei der Geburt oder zu einem späteren Zeitpunkt, zusätzlich oder anstatt eines Nachnamens, gegeben wird. @de
label: har fornavn @da
definition: Relaterer en person til et nomen, som er et navn på person, som blev givet ved fødslen eller på et senere tidspunkt oveni, eller i stedet for, et efternavn. @da
toolkit label: fornavn @da
toolkit definition: Nomen, som er et navn på person, som blev givet til en person ved fødslen eller på et senere tidspunkt oveni, eller i stedet for, et efternavn. @da
label: té com a nom de pila @ca
definition: Relaciona una persona amb un nomen que és un nom de persona donat al moment del naixement o en algun moment posterior, a més de, o en lloc d’un cognom. @ca
toolkit label: nom de pila @ca
toolkit definition: Nomen que és un nom de persona donat al moment del naixement o en algun moment posterior, a més de, o en lloc d’un cognom. @ca
definition: Liittää henkilön nomeniin, joka on nimi, joka on annettu henkilölle syntymässä tai myöhempänä ajankohtana sukunimen lisäksi tai sen sijaan.
toolkit label: etunimi
toolkit definition: Nomen, joka on nimi, joka on annettu henkilölle syntymässä tai myöhempänä ajankohtana sukunimen lisäksi tai sen sijaan.
toolkit definition: Et navn på person som er gitt ved fødsel eller senere, i tillegg til, eller istedet for et etternavn. @no
label: hat Vornamen @de
label: a pour prénom @fr
definition: Met une personne en relation avec un nomen qui est un nom de personne donné à la naissance ou plus tard en plus ou au lieu d’un nom de famille. @fr
toolkit label: prénom @fr
toolkit definition: Nomen qui est un nom de personne donné à la naissance ou plus tard en plus ou au lieu d’un nom de famille. @fr
has element type: 3
label: utóneve a következő: @hu
definition: Hozzákapcsol egy személyt egy személynév nomenhez, amely a születésekor kapott utónév, vagy később felvett, vagy a vezetéknév helyett használatos. @hu
toolkit label: utóneve: @hu
toolkit definition: Egy személynév nomen, amely a születésekor kapott utónév, vagy később felvett, vagy a vezetéknév helyett használatos. @hu
sub property of: henkilön nimi
definition: Relaterer en person til et navn på person som er gitt ved fødsel eller senere, i tillegg til, eller istedet for et etternavn. @no
label: is voornaam @nl
definition: Relateert een persoon aan een nomen dat is een naam van persoon gegeven bij geboorte of op een later tijdstip ter aanvulling op, of in plaats van, een achternaam. @nl
toolkit label: voornaam @nl
toolkit definition: Een nomen dat is een naam van persoon gegeven bij geboorte of op een later tijdstip ter aanvulling op, of in plaats van, een achternaam. @nl
label: له اسم أول @ar
definition: يربط شخصا باسم أطلق على شخص عند ولادته أو لاحقا، مضافا إليه اسم العائلة أو عوضا عنه. @ar
toolkit label: اسم معطى @ar
toolkit definition: اسم أطلق على شخص عند ولادته أو لاحقا مضافا إليه اسم عائلة أو عوضا عنه. @ar
label: eesnimi @et
definition: Seostab isiku isiku nimega, mis on antud pärast sündi või hiljem perekonnanimele lisaks või selle asemel. @et
toolkit label: eesnimi @et
toolkit definition: Isiku nimi, mis on antud pärast sündi või hiljem perekonnanimele lisaks või selle asemel. @et
label: ha come nome di battesimo @it
definition: Correla una persona a un nome di persona dato alla nascita o in qualche successivo momento in aggiunta, o al posto di, un cognome. @it
toolkit label: nome di battesimo @it
toolkit definition: Nome di persona dato alla nascita o in qualche successivo momento in aggiunta, o al posto di, un cognome. @it
label: vārds [ne uzvārds] @lv
definition: Sasaista personu ar nomenu, kas ir personas vārds, kas dots personai piedzimstot vai kādā vēlākā brīdī papildus uzvārdam vai tā vietā. @lv
toolkit label: vārds [ne uzvārds] @lv
toolkit definition: Vārds, kas dots personai piedzimstot vai kādā vēlākā brīdī papildus uzvārdam vai tā vietā @lv
label: 有名 @zh-hans
definition: 将一个个人与作为个人在出生时候或之后某时候被给予、姓以外附加或替代姓的一个名称的命名关联起来。 @zh-hans
toolkit label: 名 @zh-hans
toolkit definition: 作为个人在出生时候或之后某时候被给予、姓以外附加或替代姓的一个名称的命名 @zh-hans
label: adı ile ilişkilidir @tr
definition: Bir kişiyi, doğumda veya daha sonraki bir noktada soyadına ek olarak veya onun yerine verilen bir kişinin adı olan bir isimle ilişkilendirir. @tr
toolkit label: verilen ad @tr
toolkit definition: Nomen, doğumda veya daha sonraki bir noktada soyadına ek olarak veya onun yerine verilen bir kişinin ismi. @tr
has subproperty: P50292

oheisteksti
status: Deprecated
label: is writer of supplementary textual content of (Deprecated) @en
definition: Relates an agent to an expression that includes a contribution of providing supplementary textual content such as an introduction or a preface. (Deprecated) @en
type: Property
domain: C10002
sub property of: is author of expression of (Deprecated)
lexical alias: writerOfSupplementaryTextualContentOf.en
label: est un auteur de contenu textuel supplémentaire de @fr
definition: Met un agent qui contribue à une expression d’une œuvre en fournissant du contenu textuel supplémentaire tel qu’une introduction ou une préface à une œuvre originale en relation avec une expression. @fr
toolkit label: auteur de contenu textuel supplémentaire de @fr
toolkit definition: Expression d’une œuvre qui intègre une contribution consistant à fournir du contenu textuel supplémentaire tel qu’une introduction ou une préface à une œuvre originale. @fr
toolkit label: writer of supplementary textual content of (Deprecated) @en
toolkit definition: An expression that includes a contribution of providing supplementary textual content such as an introduction or a preface. (Deprecated) @en
instruction number: 18.5
label: είναι συγγραφέας του συμπληρωματικού κειμενικού περιεχομένου του @el
definition: Συνδέει έναν φορέα, ο οποίος συνεισφέρει σε μια έκφραση ενός έργου παρέχοντας συνοδευτικό κειμενικό περιεχόμενο, όπως εισαγωγή ή πρόλογο στο πρωτότυπο έργο, με μια έκφραση. @el
toolkit label: συγγραφέας του συμπληρωματικού κειμενικού περιεχομένου του @el
toolkit definition: Μια έκφραση ενός έργου που ενσωματώνει τη συνεισφορά ενός συνοδευτικού κειμενικού περιεχομένου, όπως εισαγωγής ή προλόγου σε ένα πρωτότυπο έργο. @el
definition: Setzt einen Akteur, der an einer Expression eines Werks mitwirkt, indem er ergänzenden Text zum Originalwerk liefert, z. B. eine Einführung, ein Vorwort, mit einer Expression in Beziehung. @de
toolkit label: Verfasser von ergänzendem Text von @de
toolkit definition: Eine Expression eines Werks, bei der ein Akteur ergänzenden Text zum Originalwerk liefert, z. B. eine Einführung, ein Vorwort. @de
label: er forfatter til supplerende tekstindhold til @da
definition: Relaterer en agent, der har bidraget til et udtryk af et værk ved at sørge for supplerende tekstindhold, som fx en indledning eller et forord til et oprindeligt værk til et udtryk. @da
toolkit label: forfatter til supplerende tekstindhold til @da
toolkit definition: Udtryk af et værk der inkorporerer et bidrag ved at skrive supplerende tekstindhold, som fx en indledning eller et forord, til et oprindeligt værk. @da
label: és escriptor de contingut textual suplementari de @ca
definition: Relaciona un agent, que contribueix amb una expressió d’una obra proporcionant un contingut textual suplementari, com ara una introducció o un prefaci a una obra original, amb una expressió. @ca
toolkit label: escriptor de contingut textual suplementari de @ca
toolkit definition: Expressió d’una obra que incorpora una contribució que proporciona un contingut textual suplementari, com ara una introducció o un prefaci, a una obra original. @ca
definition: Liittää toimijan teoksen ekspressioon, joka sisältää alkuperäistä teosta täydentävää tekstiä, esim. johdannon tai esipuheen.
toolkit label: oheisteksti
toolkit definition: Teoksen ekspressio, joka sisältää alkuperäistä teosta täydentävää tekstiä, esim. johdannon tai esipuheen.
toolkit label: forfatter av supplerende tekstinnhold i @no
toolkit definition: Et uttrykk av et verk som omfatter et bidrag i form av å tilføre supplerende tekstinnhold til originalverket, for eksempel et forord eller en innledning. @no
label: ist Verfasser von ergänzendem Text von @de
has element type: 2
label: kiegészítő szövegtartalmának írója @hu
definition: Egy ágenst (személyt, családot vagy testületet), aki/amely egy mű kifejezési formájához hozzájárul azzal, hogy egy eredeti műhöz kiegészítő szöveges tartalmat, mint például bevezetést vagy előszót ad hozzá, hozzákapcsol egy kifejezési formához. @hu
toolkit label: kiegészítő szöveges tartalom írója @hu
toolkit definition: Egy mű kifejezési formája, amely hozzájárulást jelent azzal, hogy egy eredeti művet kiegészítő szöveges tartalommal, például bevezetéssel vagy előszóval lát el. @hu
has subproperty: johdantoteksti
has subproperty: esipuheen kirjoittajana ekspressiossa
has subproperty: alkusanojen kirjoittajana ekspressiossa
has subproperty: lisätty kommentaari
has subproperty: kirjoittajana lisätyssä tekstissä
has subproperty: jälkipuheen kirjoittajana ekspressiossa
has subproperty: loppusanojen kirjoittajana ekspressiossa
has subproperty: P50154

kollega
status: Published
type: Property
label: has colleague @en
lexical alias: colleague.en
definition: Relates a person to a person who is a fellow member of a profession, staff, or academic faculty. @en
domain: C10004
toolkit label: colleague @en
toolkit definition: A person who is a fellow member of a profession, staff, or academic faculty. @en
instruction number: 29.5
sub property of: henkilöön liittyvä henkilö
label: έχει συνάδελφο @el
definition: Συνδέει ένα φυσικό πρόσωπο με έναν συνάδελφο από τον επαγγελματικό χώρο, το προσωπικό ή το ακαδημαϊκό διδακτικό προσωπικό. @el
toolkit label: συνάδελφος @el
toolkit definition: Ένας συνάδελφος από τον επαγγελματικό χώρο, το προσωπικό ή το ακαδημαϊκό διδακτικό προσωπικό. . @el
definition: Setzt eine Person in Beziehung zu einer Person, die mit anderen zusammen im gleichen Beruf, im gleichen Betrieb, in der gleichen Einrichtung oder Organisation und so weiter tätig ist. @de
toolkit label: Kollegin/Kollege @de
toolkit definition: Eine Person, die mit anderen zusammen im gleichen Beruf, im gleichen Betrieb, in der gleichen Einrichtung oder Organisation und so weiter tätig ist. @de
label: har kollega @da
definition: Relaterer en person til en person, der er medlem af samme profession, personale eller akademisk fakultet. @da
toolkit label: kollega @da
toolkit definition: Person, som er medlem af samme profession, personale eller akademisk fakultet. @da
label: té com a col·lega @ca
definition: Relaciona una persona amb una persona que és un company de professió, del personal o del professorat acadèmic. @ca
toolkit label: col·lega @ca
toolkit definition: Persona que és un company de professió, del personal o del professorat acadèmic. @ca
definition: Liittää henkilön henkilöön, joka on saman ammattikunnan, henkilöstön tai tieteenalan jäsen.
toolkit definition: Henkilö, joka on saman ammattikunnan, henkilöstön tai tieteenalan jäsen.
toolkit definition: En annen person som er medlem av samme yrkesgruppe eller har samme arbeidsgiver. @no
label: hat Kollegin/Kollegen @de
label: a pour collègue @fr
definition: Met une personne en relation avec une personne qui appartient à la même profession, au même corps d’employés ou au même corps professoral qu’une autre personne. @fr
toolkit label: collègue @fr
toolkit definition: Personne qui appartient à la même profession, au même corps d’employés ou au même corps professoral qu’une autre personne. @fr
has element type: 2
label: kollégája a következő: @hu
definition: Hozzákapcsol egy személyt egy személyhez, aki ugyanannak a szakmának, személyzetnek vagy felsőoktatási karnak a tagja. @hu
toolkit label: kolléga: @hu
toolkit definition: Egy személy, aki ugyanannak a szakmának, személyzetnek vagy felsőoktatási karnak a tagja. @hu
definition: Relaterer en person til en annen person som er medlem av samme yrkesgruppe eller har samme arbeidsgiver. @no
label: heeft collega @nl
definition: Relateert een persoon aan een persoon die is een medelid van een beroep, staf of academische faculteit. @nl
toolkit label: collega @nl
toolkit definition: Een persoon die is een medelid van een beroep, staf of academische faculteit. @nl
label: له زميل @ar
definition: يربط شخصا بزميل عضو في مهنة أو في هيئة تدريس أو في كلية أكاديمية. @ar
toolkit label: زميل @ar
toolkit definition: زميل عضو في مهنة أو في هيئة تدريس أو في كلية أكاديمية. @ar
label: kolleeg @et
definition: Seostab isiku isikuga, kellel on sama elukutse, kes kuulub sama asutuse töötajaskonda või kes tegeleb sama teadusalaga. @et
toolkit label: kolleeg @et
toolkit definition: Isik, kellel on sama elukutse, kes kuulub sama asutuse töötajaskonda või kes tegeleb sama teadusalaga. @et
label: ha come collega @it
definition: Correla una persona a un collega di una professione, gruppo di lavoro o facoltà accademica. @it
toolkit definition: Collega di una professione, gruppo di lavoro o facoltà accademica. @it
label: kolēģis @lv
definition: Sasaista personu ar personu, kurš ir tās pašas profesijas, darba vietas, akadēmiskās vides pārstāvis. @lv
toolkit label: kolēģis @lv
toolkit definition: Tās pašas profesijas, darba vietas, akadēmiskās vides pārstāvis @lv
label: 有同事 @zh-hans
definition: 将一个个人与作为从业、行政或教学的同事的一个个人关联起来 @zh-hans
toolkit label: 同事 @zh-hans
toolkit definition: 作为从业、行政或教学的同事的一个个人 @zh-hans
label: meslektaş ile ilişkilidir @tr
definition: Bir kişiyi, bir mesleğin, kadronun veya akademik fakültenin üyesi olan bir kişiyle ilişkilendirir. @tr
toolkit label: meslektaş @tr
toolkit definition: Bir mesleğin, kadronun veya akademik fakültenin üyesi olan bir kişi. @tr
has subproperty: assistentti
has subproperty: assistentti henkilölle
has subproperty: työtoveri
has subproperty: kumppani
has subproperty: P50274

yhteistoimija aiheena teoksessa
status: Published
type: Property
label: is subject collective agent of @en
lexical alias: subjectCollectiveAgentOf.en
domain: C10011
definition: Relates a collective agent to a work that is about a collective agent. @en
label: είναι θέμα συλλογικός φορέας του @el
definition: Συνδέει έναν συλλογικό φορέα με ένα έργο το οποίο αναφέρεται σε έναν συλλογικό φορέα. @el
label: er kollektiv agent, som er subjekt af @da
definition: Relaterer en kollektiv agent til et værk, som handler om en kollektiv agent. @da
label: és agent col·lectiu de matèria de @ca
definition: Relaciona un agent col·lectiu amb una obra que tracta d’un agent col·lectiu. @ca
definition: Liittää yhteistoimijan teokseen, joka käsittelee yhteistoimijaa.
toolkit label: yhteistoimija aiheena teoksessa
toolkit definition: Teos, joka käsittelee yhteistoimijaa.
label: est un agent collectif sujet de @fr
definition: Met un agent collectif en relation avec une œuvre qui traite d’un agent collectif. @fr
sub property of: yhteistoimijaan liittyvä teos
toolkit label: subject collective agent of @en
toolkit definition: A work that is about a collective agent. @en
sub property of: toimija aiheena teoksessa
has element type: 2
label: kollektív ágens tárgya a következőnek: @hu
definition: Hozzákapcsol egy kollektív ágenst egy műhöz, amely egy kollektív ágensről szól. @hu
label: er kollektiv agent som emne for @no
definition: Relaterer en kollektiv agent til et verk som handler om en kollektiv agent. @no
toolkit label: kollektiv agent som emne for @no
toolkit definition: Et verk som handler om en kollektiv agent. @no
label: is collectieve actor als onderwerp van @nl
definition: Relateert een collectieve actor aan een werk dat gaat over een collectieve actor. @nl
toolkit label: collectieve actor als onderwerp van @nl
toolkit definition: Een werk dat gaat over een collectieve actor. @nl
label: هو وكيل جماعي موضوع لـ @ar
definition: يربط وكيلا جماعيا بعمل عن وكيل جماعي. @ar
toolkit label: موضوع وكيل جماعي @ar
toolkit definition: عمل عن وكيل جماعي. @ar
toolkit label: agent col·lectiu de matèria de @ca
toolkit definition: Obra que tracta d’un agent col·lectiu. @ca
toolkit label: kollektiv agent, som er subjekt af @da
toolkit definition: Værk, som handler om en kollektiv agent. @da
label: teema (kollektiiv) teoses @et
definition: Seostab kollektiivi teosega, mis on kollektiivi kohta. @et
toolkit label: teema (kollektiiv) teoses @et
toolkit definition: Teos, mis on kollektiivi kohta. @et
label: ist gemeinschaftlicher Akteur als Thema von @de
definition: Setzt einen gemeinschaftlichen Akteur in Beziehung zu einem Werk, das von einem gemeinschaftlichen Akteur handelt. @de
toolkit label: Gemeinschaftlicher Akteur als Thema von @de
toolkit definition: Ein Werk, das von einem gemeinschaftlichen Akteur handelt. @de
toolkit label: kollektív ágens tárgya: @hu
toolkit definition: Egy mű, amely egy kollektív ágensről szól. @hu
label: è soggetto collettivo agente di @it
definition: Correla un agente collettivo a un'opera che tratta di un agente collettivo. @it
toolkit label: agente collettivo soggetto di @it
toolkit definition: Opera che tratta di un agente collettivo. @it
toolkit label: θέμα συλλογικός φορέας του @el
toolkit label: agent collectif sujet de @fr
toolkit definition: Œuvre qui traite d’un agent collectif. @fr
label: ir temats (grupa) @lv
definition: Sasaista grupu ar darbu, kura temats ir grupa. @lv
toolkit label: ir temats (grupa) @lv
toolkit definition: Darbs, kura temats ir grupa. @lv
label: 是……的主题集体行为者 @zh-hans
definition: 将一个集体行为者与关于一个集体行为者的一种作品关联起来。 @zh-hans
toolkit label: ……的主题集体行为者 @zh-hans
toolkit definition: 关于一个集体行为者的一种作品 @zh-hans
label: Konunun kolektif temsilcisi @tr
definition: Kolektif bir temsilciyi, bir kolektif temsilciyi konu alan çalışma ile ilişkilendirir. @tr
toolkit label: konu alınan kolektif temsilci @tr
toolkit definition: Bir kolektif temsilci hakkındaki bir eser. @tr
has subproperty: yhteistoimijan kuvaus
has subproperty: suku aiheena teoksessa
has subproperty: yhteisö aiheena teoksessa
has subproperty: P50367

koreografina koreografiassa (ekspressio)
status: Deprecated
label: is choreographer of expression of (Deprecated) @en
definition: Relates an agent to an expression that includes a contribution of providing additional choreography, or by modifies previous choreography. (Deprecated) @en
type: Property
domain: C10002
sub property of: is contributor to aggregated content of (Deprecated)
lexical alias: choreographerOfExpressionOf.en
label: est un chorégraphe (expression) de @fr
definition: Met un agent qui contribue à une expression d’une œuvre en fournissant une chorégraphie additionnelle ou en modifiant une chorégraphie antérieure en relation avec une expression. @fr
toolkit label: chorégraphe (expression) de @fr
toolkit definition: Expression d’une œuvre qui intègre une contribution consistant à fournir une chorégraphie additionnelle ou à modifier une chorégraphie antérieure. @fr
toolkit label: choreographer of expression of (Deprecated) @en
toolkit definition: An expression that includes a contribution of providing additional choreography, or by modifies previous choreography. (Deprecated) @en
instruction number: 18.5
label: είναι χορογράφος (έκφραση) του @el
definition: Συνδέει έναν φορέα, που συνεισφέρει σε μια έκφραση ενός έργου παρέχοντας πρόσθετη χορογραφία ή τροποποιώντας την προηγούμενη χορογραφία, με μια έκφραση. @el
toolkit label: χορογράφος (έκφραση) του @el
toolkit definition: Μια έκφραση ενός έργου που ενσωματώνει τη συνεισφορά της πρόσθετης χορογραφίας ή της τροποποίησης προηγούμενης χορογραφίας. @el
definition: Setzt einen Akteur, der zu einer Expression eines Werks durch Hinzufügen einer zusätzlichen Choreografie oder durch Modifizierung der Original-Choreografie beiträgt, mit einer Expression in Beziehung. @de
toolkit label: Choreograf (Expression) von @de
toolkit definition: Eine Expression eines Werks, bei der ein Akteur durch Hinzufügen einer zusätzlichen Choreografie oder durch Modifizierung der Original-Choreografie beiträgt. @de
label: er koreograf (udtryk) til @da
definition: Relaterer en agent, der har bidraget til et udtryk af et værk ved atsørge for ekstra koreografi eller ved at modificere tidligere koreografi til et udtryk. @da
toolkit label: koreograf (udtryk) til @da
toolkit definition: Udtryk af et værk der inkorporerer et bidrag ved at tilføje ekstra koreografi, eller ved at modificere tidligere koreografi. @da
label: és coreògraf (expressió) de @ca
definition: Relaciona un agent, que contribueix a una expressió d’una obra proporcionant una coreografia addicional o modificant la coreografia anterior, amb una expressió. @ca
toolkit label: coreògraf (expressió) de @ca
toolkit definition: Expressió d’una obra que incorpora una contribució que proporciona una coreografia addicional o modificant la coreografia anterior. @ca
definition: Liittää toimijan teoksen ekspressioon, joka sisältää teoksen täydennetyn koreografian tai aiemman koreografisen teoksen muokkauksen.
toolkit label: koreografina koreografiassa (ekspressio)
toolkit definition: Teoksen ekspressio, joka sisältää teoksen täydennetyn koreografian tai aiemman koreografisen teoksen muokkauksen.
toolkit label: koreograf (uttrykk) for @no
toolkit definition: Et uttrykk av et verk som omfatter et bidrag i form av å tilføre ytterligere koreografi eller ved å endre tidligere koreografi. @no
label: ist Choreograf (Expression) von @de
has element type: 2
label: koreográfusa (kifejezési forma) @hu
definition: Egy ágenst (személyt, családot vagy testületet), aki/amely egy mű kifejezési formájához hozzájárul azzal, hogy további koreográfiát nyújt, vagy korábbi koreográfiát módosít, hozzákapcsol egy kifejezési formához. @hu
toolkit label: koreográfusa (kifejezési forma) @hu
toolkit definition: Egy mű kifejezési formája, amely hozzájárulást testesít meg azzal, hogy további koreográfiát ad hozzá vagy módosítja a korábbi koreográfiát. @hu
has subproperty: P50151

yhteiskonferenssi
status: Published
type: Property
lexical alias: jointlyHeldConference.en
definition: Relates a corporate body who is a conference to a conference that is jointly held with another conference. @en
domain: C10005
toolkit label: jointly held conference @en
toolkit definition: A corporate body who is a conference that is jointly held with another conference. @en
label: has jointly held conference @en
instruction number: 29.5
label: έχει από κοινού οργανωμένο συνέδριο @el
definition: Συνδέει ένα συνέδριο με ένα συνέδριο το οποίο διοργανώθηκε από κοινού με κάποιο άλλο συνέδριο. @el
toolkit label: από κοινού οργανωμένο συνέδριο @el
toolkit definition: Ένα συνέδριο που διοργανώνεται από κοινού με κάποιο άλλο συνέδριο. @el
definition: Setzt eine Konferenz (Körperschaft) in Beziehung zu einer Konferenz, die gemeinsam mit einer anderen Konferenz durchgeführt wird. @de
toolkit label: Gemeinsam durchgeführte Konferenz @de
toolkit definition: Eine Konferenz (Körperschaft), die gemeinsam mit einer anderen Konferenz durchgeführt wird. @de
label: har konference afholdt i fællesskab @da
definition: Relaterer en konference til en konference, som er afholdt i fællesskab med en anden konference. @da
toolkit label: konference afholdt i fællesskab @da
toolkit definition: Korporation, der er en konference, som er afholdt i fællesskab med en anden konference. @da
label: té com a congrés celebrat conjuntament @ca
definition: Relaciona una entitat corporativa que és un congrés amb un congrés que se celebra conjuntament amb un altre congrés. @ca
toolkit label: congrés celebrat conjuntament @ca
toolkit definition: Entitat corporativa que és un congrés que se celebra conjuntament amb un altre congrés. @ca
definition: Liittää yhteisön, joka on konferenssi, konferenssiin, joka järjestetään yhdessä toisen konferenssin kanssa.
toolkit label: yhteiskonferenssi
toolkit definition: Yhteisö, joka on konferenssi, joka järjestetään yhdessä toisen konferenssin kanssa.
toolkit label: konferanse arrangert sammen med annen konferanse @no
toolkit definition: En konferanse som arrangeres sammen med en annen konferanse. @no
label: hat gemeinsam durchgeführte Konferenz @de
label: a pour congrès tenu conjointement @fr
definition: Met une collectivité qui est un congrès en relation avec un congrès tenu conjointement avec un autre congrès. @fr
toolkit label: congrès tenu conjointement @fr
toolkit definition: Collectivité qui est un congrès tenu conjointement avec un autre congrès. @fr
has element type: 2
label: Egy konferencia testület, amelyet egy másik konferenciával közösen tartanak. @hu
definition: közösen tartott konferenciája a következő: @hu
toolkit label: Hozzákapcsol egy konferencia testületet egy konferencia testülethez, amelyet egy másik konferenciával közösen tartanak. @hu
toolkit definition: közösen tartott konferencia: @hu
sub property of: yhteisöön liittyvä yhteisö
label: har konferanse arrangert sammen med annen konferanse @no
definition: Relaterer en konferanse til en konferanse som arrangeres sammen med en annen konferanse. @no
label: heeft gezamenlijk gehouden conferentie @nl
definition: Relateert een conferentie aan een corporatie die is een conferentie die gezamenlijk gehouden is met een andere conferentie. @nl
toolkit label: gezamenlijk gehouden conferentie @nl
toolkit definition: Een corporatie die is een conferentie die gezamenlijk gehouden is met een andere conferentie. @nl
label: له مؤتمر يعقد بصورة مشتركة @ar
definition: يربط مؤتمرا بمؤتمر يُعقد بصورة مشتركة مع مؤتمر آخر. @ar
toolkit label: مؤتمر يُعقد بصورة مشتركة @ar
toolkit definition: مؤتمر يُعقد بالاشتراك مع مؤتمر آخر. @ar
label: ühiskonverents @et
definition: Seostab konverentsi konverentsiga, mis on peetud koos teise konverentsiga. @et
toolkit label: ühiskonverents @et
toolkit definition: Konverents, mis on peetud koos teise konverentsiga. @et
label: ha come conferenza tenuta congiuntamente @it
definition: Correla una conferenza a una conferenza che viene tenuta congiuntamente con un'altra conferenza. @it
toolkit label: conferenza tenuta congiuntamente @it
toolkit definition: Conferenza che viene tenuta congiuntamente con un'altra conferenza. @it
definition: Sasaista institūciju ar konferenci, kas organizēta vienlaicīgi ar citu konferenci. @lv
toolkit label: vienlaicīgi ar konferenci @lv
toolkit definition: Konference, kas organizēta vienlaicīgi ar citu konferenci. @lv
label: vienlaicīgi ar konferenci @lv
definition: 将一个团体与作为与另一个会议联合举行的一个会议的团体关联起来。 @zh-hans
toolkit label: 联合举行的会议 @zh-hans
toolkit definition: 作为与另一个会议联合举行的一个会议的团体 @zh-hans
label: 有联合举行的会议 @zh-hans
definition: Bir tüzel kişilik olan bir konferansı, başka bir konferansla ortaklaşa düzenlenen bir konferansla ilişkilendirir. @tr
toolkit label: ortaklaşa düzenlenen konferans @tr
toolkit definition: Başka bir konferansla ortaklaşa düzenlenen bir konferans olan tüzel kişilik. @tr
label: ortak düzenlenen konferans ile ilişkilidir @tr
has subproperty: P50303

edunvalvoja
status: Published
type: Property
label: has trustee @en
lexical alias: trustee.en
definition: Relates a corporate body to a person who is an officer granted the powers of administration in a corporate body in order to act for its benefit. @en
domain: C10005
toolkit label: trustee @en
toolkit definition: A person who is an officer granted the powers of administration in a corporate body in order to act for its benefit. @en
instruction number: 29.5
sub property of: toimihenkilö
label: έχει διαχειριστή @el
definition: Συνδέει ένα συλλογικό όργανο με έναν υπάλληλο, ο οποίος έχει εξουσιοδοτηθεί σε ένα συλλογικό όργανο να ενεργεί προς όφελός του. @el
toolkit label: διαχειριστής @el
toolkit definition: Ένας υπάλληλος που έχει εξουσιοδοτηθεί να ενεργεί προς όφελός ενός συλλογικού οργάνου. @el
definition: Setzt eine Körperschaft in Beziehung zu einer leitenden Angestellten/einem leitenden Angestellten (Person), der/dem die Verwaltungsvollmachten über eine Körperschaft übertragen wird, um zu ihrem Nutzen zu agieren. @de
toolkit label: Treuhänderin/Treuhänder @de
toolkit definition: Eine leitende Angestellte/Ein leitender Angestellter (Person), der/dem die Verwaltungsvollmachten über eine Körperschaft übertragen wird, um zu ihrem Nutzen zu agieren. @de
label: har forvalter @da
definition: Relaterer en korporation til en person, der er en embedsmand, som har fået administrationsbeføjelse i en korporation til at agere i dens interesse. @da
toolkit label: forvalter @da
toolkit definition: Person, der er en embedsmand, som har fået administrationsbeføjelse i en korporation til at agere i dens interesse. @da
label: té com a conseller @ca
definition: Relaciona una entitat corporativa amb una persona que és un directiu amb poders assignats d’administració en una entitat corporativa per tal d’actuar per al benefici d’aquesta. @ca
toolkit label: conseller @ca
toolkit definition: Persona que és un directiu amb poders assignats d’administració en una entitat corporativa per tal d’actuar per al benefici d’aquesta. @ca
definition: Liittää yhteisön henkilöön, joka on toimihenkilö, jolla on valtuudet tehdä päätöksiä yhteisön eduksi.
toolkit label: edunvalvoja
toolkit definition: Henkilö, joka on toimihenkilö, jolla on valtuudet tehdä päätöksiä yhteisön eduksi.
toolkit definition: En leder med ansvar for å forvalte en korporasjon til korporasjonens beste. @no
label: hat Treuhänderin/Treuhänder @de
label: a pour administrateur @fr
definition: Met une collectivité en relation avec une personne qui est un dirigeant investi des pouvoirs d’administration au sein d’une collectivité afin d’agir dans son intérêt. @fr
toolkit label: administrateur @fr
toolkit definition: Personne qui est un dirigeant investi des pouvoirs d’administration au sein d’une collectivité afin d’agir dans son intérêt. @fr
has element type: 2
label: vezetője a következő: @hu
definition: Hozzákapcsol egy testületet egy tisztviselő személyhez, aki adminisztratív hatalmat kap egy testületben, hogy annak javára cselekedjék. @hu
toolkit label: vezető: @hu
toolkit definition: Egy tisztviselő személy, aki adminisztratív hatalmat kap egy testületben, hogy annak javára cselekedjék. @hu
definition: Relaterer en korporasjon til en leder med ansvar for å forvalte en korporasjon til korporasjonens beste. @no
label: heeft trustee @nl
definition: Relateert een corporatie aan een persoon die is een functionaris verleend met bevoegdheden van bestuur in een corporatie met de bedoeling te handelen in haar belang. @nl
toolkit definition: Een persoon die is een functionaris verleend met bevoegdheden van bestuur in een corporatie met de bedoeling te handelen in haar belang. @nl
label: له مدير عام @ar
definition: يربط هيئة بشخص هو مسئول مُنح صلاحيات الإدارة فيها للعمل لمصلحتها. @ar
toolkit label: مشرف @ar
toolkit definition: شخص مسئول مُنح صلاحية الإدارة في هيئة للعمل لمصلحتها. @ar
label: volitatud isik @et
definition: Seostab asutuse ametnikuga, kellele on antud haldusvolitused tegutseda asutuse huvides. @et
toolkit label: volitatud isik @et
toolkit definition: Ametnik, kellele on antud haldusvolitused tegutseda asutuse huvides. @et
label: ha come fiduciario @it
definition: Collega un ente a un funzionario a cui sono assegnati i poteri di amministrazione in un ente al fine di agire in suo favore. @it
toolkit label: fiduciario @it
toolkit definition: Funzionario a cui sono assegnati i poteri di amministrazione in un ente al fine di agire in suo favore. @it
label: pilnvarotais @lv
definition: Sasaista institūciju ar personu, kura ir amatpersona, kurai institūcijas administrācija piešķīrusi pilnvaras, lai darbotos tās labā. @lv
toolkit label: pilnvarotais @lv
toolkit definition: Amatpersona, kurai institūcijas administrācija piešķīrusi pilnvaras, lai darbotos tās labā. @lv
label: 有受托人 @zh-hans
definition: 将一个个人与作为一个团体的任职者被赋予为其利益行动的权力的一个个人关联起来。 @zh-hans
toolkit label: 受托人 @zh-hans
toolkit definition: 作为一个团体的任职者被赋予为其利益行动的权力的一个个人 @zh-hans
label: yetkili ile ilişkilidir @tr
definition: Bir tüzel kişiyi, tüzel kişiliğe, onun yararına hareket etmek üzere yönetim yetkisi verilmiş olan kişiye ilişkindir. @tr
toolkit label: yetkili @tr
toolkit definition: Tüzel bir kişilikte, onun yararına hareket etmek üzere yönetim yetkisi verilen memur olan bir kişi @tr
has subproperty: P50285

edunvalvojana yhteisössä
status: Published
type: Property
label: is trustee of @en
lexical alias: trusteeOf.en
definition: Relates a person to a corporate body who grants the powers of administration to an officer in order to act for its benefit. @en
domain: C10004
toolkit label: trustee of @en
toolkit definition: A corporate body who grants the powers of administration to an officer in order to act for its benefit. @en
instruction number: 29.5
sub property of: toimihenkilönä yhteisössä
label: είναι διαχειριστής του @el
definition: Συνδέει ένα φυσικό πρόσωπο με ένα συλλογικό όργανο το οποίο εξουσιοδοτεί έναν υπάλληλο να ενεργεί προς όφελός του. @el
toolkit label: διαχειριστής του @el
toolkit definition: Ένα συλλογικό όργανο που εξουσιοδοτεί έναν υπάλληλο να ενεργεί προς όφελός του. @el
definition: Setzt eine Person in Beziehung zu einer Körperschaft, die einer leitenden Angestellten/einem leitenden Angestellten die Verwaltungsvollmachten überträgt, um zu ihrem Nutzen zu agieren. @de
toolkit label: Treuhänderin/Treuhänder von @de
toolkit definition: Eine Körperschaft, die einer leitenden Angestellten/einem leitenden Angestellten die Verwaltungsvollmachten überträgt, um zu ihrem Nutzen zu agieren. @de
label: er forvalter af @da
definition: Relaterer en person til en korporation, som giver administrationsbeføjelser til en embedsmand til at agere i dens interesse. @da
toolkit label: forvalter af @da
toolkit definition: Korporation, som giver administrationsbeføjelser til en embedsmand til at agere i dens interesse. @da
label: és conseller de @ca
definition: Relaciona una persona amb una entitat corporativa que assigna poders d’administració a un directiu per tal d’actuar per al benefici d’aquella. @ca
toolkit label: conseller de @ca
toolkit definition: Entitat corporativa que assigna poders d’administració a un directiu per tal d’actuar per al benefici d’aquella. @ca
definition: Liittää henkilön yhteisöön, jossa toimihenkilöllä on valtuudet tehdä päätöksiä yhteisön eduksi.
toolkit label: edunvalvojana yhteisössä
toolkit definition: Yhteisö, jossa toimihenkilöllä on valtuudet tehdä päätöksiä yhteisön eduksi.
toolkit label: forvalter for @no
toolkit definition: En korporasjon som gir en leder ansvar for å forvalte en korporasjon til korporasjonens beste. @no
label: ist Treuhänderin/Treuhänder von @de
label: est un administrateur de @fr
definition: Met une personne en relation avec une collectivité qui confère les pouvoirs d’administration à un dirigeant afin que celui-ci agisse dans son intérêt. @fr
toolkit label: administrateur de @fr
toolkit definition: Collectivité qui confère les pouvoirs d’administration à un dirigeant afin que celui-ci agisse dans son intérêt. @fr
has element type: 2
label: vezetője a következőnek: @hu
definition: Hozzákapcsol egy személyt egy testülethez, amely adminisztratív hatalommal ruház fel egy tisztviselőt, hogy a testület javára cselekedjen. @hu
toolkit label: vezetője: @hu
toolkit definition: Egy testület, amely adminisztratív hatalommal ruház fel egy tisztviselőt, hogy a testület javára cselekedjen. @hu
label: er forvalter for @no
definition: Relaterer en person til en korporasjon som gir en leder ansvar for å forvalte en korporasjon til korporasjonens beste. @no
label: is trustee van @nl
definition: Relateert een persoon aan een corporatie die bevoegdheden van bestuur verleent aan een functionaris met de bedoeling te handelen in haar belang. @nl
toolkit label: trustee van @nl
toolkit definition: Een corporatie die bevoegdheden van bestuur verleent aan een functionaris met de bedoeling te handelen in haar belang. @nl
label: هو مدير عام لـ @ar
definition: يربط شخصا بهيئة تمنح صلاحيات الإدارة لمسئول للعمل لمصلحتها. @ar
toolkit label: مشرف @ar
toolkit definition: هيئة تمنح صلاحية الإدارة لمسئول للعمل لمصلحتها. @ar
label: volitatud isik asutuses @et
definition: Seostab isiku asutusega, kes on andnud ametnikule haldusvolitused tegutseda asutuse huvides. @et
toolkit label: volitatud isik asutuses @et
toolkit definition: Asutus, kes on andnud ametnikule haldusvolitused tegutseda asutuse huvides. @et
label: è fiduciario di @it
definition: Correla una persona a un ente che assegna i poteri di amministrazione a un funzionario per agire in suo favore. @it
toolkit label: fiduciario di @it
toolkit definition: Ente che assegna i poteri di amministrazione a un funzionario per agire in suo favore. @it
alternative label: επίτροπος του @el
label: ir pilnvarotājs @lv
definition: Sasaista personu ar institūciju, kas piešķīrusi pilnvaras amatpersonai, lai darbotos tās labā. @lv
toolkit label: pilnvarotāja institūcija @lv
toolkit definition: Institūcija, kas piešķīrusi pilnvaras amatpersonai, lai darbotos tās labā. @lv
label: 是……的受托人 @zh-hans
definition: 将一个个人与赋予一个任职者为其利益行动的权力的一个团体关联起来。 @zh-hans
toolkit label: ……的受托人 @zh-hans
toolkit definition: 赋予一个任职者为其利益行动的权力的一个团体 @zh-hans
label: çevirmendir @tr
definition: Bir kişiyi, kendi yararına hareket etmesi için bir memura yönetim yetkilerini veren bir tüzel kişilik ile ilişkilendirir @tr
toolkit label: yetkili @tr
toolkit definition: Kendi yararına hareket etmesi için bir memura yönetim yetkilerini veren bir tüzel kişilik. @tr
has subproperty: P50287

maisema-arkkitehti (toimija) teoksessa
status: Published
label: is landscape architect agent of @en
definition: Relates an agent to a work that involves a responsibility of an agent for creating landscapes. @en
type: Property
domain: C10002
sub property of: arkkitehti (toimija) teoksessa
lexical alias: landscapeArchitectAgentOf.en
label: est un agent architecte paysagiste de @fr
definition: Met un agent en relation avec une œuvre qui comporte une responsabilité de la part d’un agent consistant à créer des paysages. @fr
toolkit label: agent architecte paysagiste de @fr
toolkit definition: Œuvre qui comporte une responsabilité de la part d’un agent consistant à créer des paysages. @fr
toolkit label: landscape architect agent of @en
toolkit definition: A work that involves a responsibility of an agent for creating landscapes. @en
instruction number: 18.5
label: είναι αρχιτέκτων τοπίου φορέας του @el
definition: Συνδέει έναν αρχιτέκτονα, υπεύθυνο για τη δημιουργία τοπίων, με ένα έργο. @el
toolkit label: αρχιτέκτων τοπίου φορέας του @el
toolkit definition: Ένα έργο τοπίου, το οποίο περιλαμβάνει την ευθύνη της αρχιτεκτονικής του. @el
definition: Setzt einen Akteur in Beziehung zu einem Werk, bei dem ein Akteur für die Schaffung von Landschaften verantwortlich ist. @de
toolkit label: Akteur als Landschaftsarchitektin/Landschaftsarchitekt von @de
toolkit definition: Ein Werk, bei dem ein Akteur für die Schaffung von Landschaften verantwortlich ist. @de
label: er agent, som er landskabsarkitekt af @da
definition: Relaterer en agent til et værk, som involverer en agents ansvar for at skabe landskaber. @da
toolkit label: agent, som er landskabsarkitekt af @da
toolkit definition: Værk, som involverer en agents ansvar for at skabe landskaber. @da
label: és agent arquitecte paisatgista de @ca
definition: Relaciona un agent amb una obra que implica una responsabilitat d’un agent en la creació de paisatges. @ca
toolkit label: agent arquitecte paisatgista de @ca
toolkit definition: Obra que implica una responsabilitat d’un agent en la creació de paisatges. @ca
definition: Liittää toimijan teokseen, jonka maisemoinnin luomisesta toimija on vastuussa.
toolkit label: maisema-arkkitehti (toimija) teoksessa
toolkit definition: Teos, jonka maisemoinnin luomisesta toimija on vastuussa.
toolkit label: landskapsarkitekt for (agent) @no
toolkit definition: Et verk som involverer ansvar for en agent i form av landskapsarkitektoniske aspekter. @no
label: ist Akteur als Landschaftsarchitektin/Landschaftsarchitekt von @de
has element type: 2
label: tájépítész ágense a következőnek: @hu
definition: Hozzákapcsol egy ágenst egy műhöz, amelyhez hozzátartozik egy ágens felelőssége a tájépítészet építészeti vonatkozásaiért. @hu
toolkit label: tájépítész ágense: @hu
toolkit definition: Egy mű, amelyhez hozzátartozik egy ágens felelőssége a tájépítészet építészeti vonatkozásaiért. @hu
alternative label: landscape architect of @en
alternative label: maisema-arkkitehtina maisemasuunnitelmassa
label: er landskapsarkitekt for (agent) @no
definition: Relaterer en agent til et verk som involverer ansvar for en agent i form av landskapsarkitektoniske aspekter. @no
alternative label: landskapsarkitekt for @no
label: is landschapsarchitect-actor van @nl
definition: Relateert een actor aan een werk dat met zich meebrengt een verantwoordelijkheid van een actor voor het creëren van landschappen. @nl
toolkit label: landschapsarchitect-actor van @nl
toolkit definition: Een werk dat met zich meebrengt een verantwoordelijkheid van een actor voor het creëren van landschappen. @nl
label: هو وكيل مهندس معماري لـ @ar
definition: يربط وكيلا بعمل يترتب عليه مسئولية وكيل عن تنسيق المواقع الخارجية. @ar
alternative label: مهندس تنسيق المواقع الخارجية @ar
toolkit label: وكيل مهندس تنسيق المواقع الخارجية @ar
toolkit definition: عمل يترتب عليه مسئولية وكيل عن تنسيق المواقع الخارجية. @ar
alternative label: arquitecte paisatgista de @ca
alternative label: landskabsarkitekt af @da
label: maastikuarhitekt (tegija) teoses @et
definition: Seostab tegija teosega, mis sisaldab tegija vastutust maastikukujunduse arhitektuursete aspektide eest. @et
alternative label: maastikuarhitekt teoses @et
toolkit label: maastikuarhitekt (tegija) teoses @et
toolkit definition: Teos, mis sisaldab tegija vastutust maastikukujunduse arhitektuursete aspektide eest. @et
alternative label: tájépítésze: @hu
label: è architetto paesaggista agente di @it
definition: Correla un agente a un'opera che implica la responsabilità di un agente per gli aspetti architettonici del paesaggio. @it
alternative label: architetto paesaggista di @it
toolkit label: architetto paesaggista agente di @it
toolkit definition: Opera che implica la responsabilità di un agente per gli aspetti architettonici del paesaggio. @it
alternative label: αρχιτέκτων τοπίου του @el
alternative label: architecte paysagiste de @fr
label: ir ainavu arhitekts (aģents) @lv
definition: Sasaista aģentu ar darbu, kas ietver aģenta atbildību par ainavu arhitektūras aspektiem. @lv
toolkit label: ir ainavu arhitekts (aģents) @lv
toolkit definition: Darbs, kas ietver aģenta atbildību par ainavu arhitektūras aspektiem. @lv
alternative label: Landschaftsarchitektin/Landschaftsarchitekt von @de
alternative label: ……的景观设计师 @zh-hans
toolkit label: ……的景观设计师行为者 @zh-hans
toolkit definition: 涉及创作景观的一个行为者的责任的一种作品 @zh-hans
toolkit label: peyzaj mimarı temsilcisidir @tr
toolkit definition: Bir temsilcinin peyzaj oluşturma sorumluluğunu içeren bir çalışma @tr
has subproperty: maisema-arkkitehti (yhteistoimija) teoksessa

maisema-arkkitehti (yhteistoimija) teoksessa
status: Published
label: is landscape architect collective agent of @en
lexical alias: landscapeArchitectCollectiveAgentOf.en
definition: Relates a collective agent to a work that involves a responsibility of a collective agent for creating landscapes. @en
toolkit label: landscape architect collective agent of @en
toolkit definition: A work that involves a responsibility of a collective agent for creating landscapes. @en
type: Property
domain: C10011
has element type: 2
sub property of: arkkitehti (yhteistoimija) teoksessa
sub property of: maisema-arkkitehti (toimija) teoksessa
definition: Liittää yhteistoimijan teokseen, jonka maisemoinnin luomisesta yhteistoimija on vastuussa.
toolkit label: maisema-arkkitehti (yhteistoimija) teoksessa
toolkit definition: Teos, jonka maisemoinnin luomisesta yhteistoimija on vastuussa.
label: er landskapsarkitekt for (kollektiv agent) @no
definition: Relaterer en kollektiv agent til et verk som involverer et ansvar for en kollektiv agent for arkitekoniske aspekter ved landskapsanlegg. @no
toolkit label: landskapsarkitekt for (kollektiv agent) @no
toolkit definition: Et verk som involverer et ansvar for en kollektiv agent for arkitekoniske aspekter ved landskapsanlegg. @no
label: is landschapsarchitect-collectieve actor van @nl
definition: Relateert een collectieve actor aan een werk dat met zich meebrengt een verantwoordelijkheid van een collectieve actor voor het creëren van landschappen. @nl
toolkit label: landschapsarchitect-collectieve actor van @nl
toolkit definition: Een werk dat met zich meebrengt een verantwoordelijkheid van een collectieve actor voor het creëren van landschappen. @nl
label: هو وكيل جماعي مهندس تنسيق المواقع الخارجية لـ @ar
definition: يربط وكيلا جماعيا بعمل يترتب عليه مسئولية وكيل جماعي عن الجوانب المعمارية لتنسيق المواقع. @ar
toolkit label: وكيل جماعي مهندس تنسيق مواقع @ar
toolkit definition: عمل يترتب عليه مسئولية وكيل جماعي عن تنسيق المواقع الخارجية. @ar
label: és agent col·lectiu arquitecte paisatgista de @ca
definition: Relaciona un agent col·lectiu amb una obra que implica una responsabilitat d’un agent col·lectiu en la creació de paisatges. @ca
toolkit label: agent col·lectiu arquitecte paisatgista de @ca
toolkit definition: Obra que implica una responsabilitat d’un agent col·lectiu en la creació de paisatges. @ca
label: er kollektiv agent, som er landskabsarkitekt af @da
definition: Relaterer en kollektiv agent til et værk, som involverer en kollektiv agents ansvar for at skabe landskaber. @da
toolkit label: kollektiv agent, som er landskabsarkitekt af @da
toolkit definition: Værk, som involverer en kollektiv agents ansvar for at skabe landskaber. @da
label: maastikuarhitekt (kollektiiv) teoses @et
definition: Seostab kollektiivi teosega, mis sisaldab kollektiivi vastutust maastikukujunduse arhitektuursete aspektide eest. @et
toolkit label: maastikuarhitekt (kollektiiv) teoses @et
toolkit definition: Teos, mis sisaldab kollektiivi vastutust maastikukujunduse arhitektuursete aspektide eest. @et
label: ist gemeinschaftlicher Akteur als Landschaftsarchitektin/Landschaftsarchitekt von @de
definition: Setzt einen gemeinschaftlichen Akteur in Beziehung zu einem Werk, bei dem ein gemeinschaftlicher Akteur für die Schaffung von Landschaften verantwortlich ist. @de
toolkit label: Gemeinschaftlicher Akteur als Landschaftsarchitektin/Landschaftsarchitekt von @de
toolkit definition: Ein Werk, bei dem ein gemeinschaftlicher Akteur für die Schaffung von Landschaften verantwortlich ist. @de
label: tájépítész kollektív ágense a következőnek: @hu
definition: Hozzákapcsol egy kollektív ágenst egy műhöz, amelyhez hozzátartozik egy kollektív ágens felelőssége a tájépítészet építészeti vonatkozásaiért. @hu
toolkit label: tájépítész kollektív ágense: @hu
toolkit definition: Egy mű, amelyhez hozzátartozik egy kollektív ágens felelőssége a tájépítészet építészeti vonatkozásaiért. @hu
label: è architetto paesaggista agente collettivo di @it
definition: Correla un agente collettivo a un'opera che implica una responsabilità di un agente collettivo per gli aspetti architettonici del paesaggio. @it
toolkit label: architetto paesaggista agente collettivo di @it
toolkit definition: Opera che implica una responsabilità di un agente collettivo per gli aspetti architettonici del paesaggio. @it
label: είναι αρχιτέκτονας τοπίου συλλογικός φορέας του @el
toolkit label: αρχιτέκτονας τοπίου συλλογικός φορέας του @el
label: est un agent collectif architecte paysagiste de @fr
definition: Met un agent collectif en relation avec une œuvre qui comporte une responsabilité de la part d’un agent collectif consistant à créer des paysages. @fr
toolkit label: agent collectif architecte paysagiste de @fr
toolkit definition: Œuvre qui comporte une responsabilité de la part d’un agent collectif consistant à créer des paysages. @fr
label: ir ainavu arhitekts (grupa) @lv
definition: Sasaista grupu ar darbu, kas ietver grupas atbildību par ainavu arhitektūras aspektiem. @lv
toolkit label: ir ainavu arhitekts (grupa) @lv
toolkit definition: Darbs, kas ietver grupas atbildību par ainavu arhitektūras aspektiem. @lv
label: 是……的景观设计师集体行为者 @zh-hans
definition: 将一个集体行为者与涉及创作景观的一个集体行为者的责任的一种作品关联起来。 @zh-hans
toolkit label: ……的景观设计师集体行为者 @zh-hans
toolkit definition: 涉及创作景观的一个集体行为者的责任的一种作品 @zh-hans
label: peyzaj mimarı kolektif temsilcisidir @tr
definition: Kolektif bir temsilciyi, kolektif bir temsilcinin peyzaj oluşturma sorumluluğunu içeren bir eserle ilişkilendirir. @tr
toolkit label: Peyzaj mimarı kolektif temsilcisi @tr
toolkit definition: Peyzaj oluşturmak için kolektif bir temsilcinin sorumluluğunu içeren bir çalışma @tr
has subproperty: maisema-arkkitehti (yhteisö) teoksessa
has subproperty: maisema-arkkitehti (suku) teoksessa
has subproperty: P50682

maisema-arkkitehti (yhteisö) teoksessa
status: Published
label: is landscape architect corporate body of @en
lexical alias: landscapeArchitectCorporateBodyOf.en
definition: Relates a corporate body to a work that involves a responsibility of a corporate body for creating landscapes. @en
toolkit label: landscape architect corporate body of @en
toolkit definition: A work that involves a responsibility of a corporate body for creating landscapes. @en
type: Property
domain: C10005
has element type: 2
sub property of: arkkitehti (yhteisö) teoksessa
sub property of: maisema-arkkitehti (yhteistoimija) teoksessa
definition: Liittää yhteisön teokseen, jonka maisemoinnin luomisesta yhteisö on vastuussa.
toolkit label: maisema-arkkitehti (yhteisö) teoksessa
toolkit definition: Teos, jonka maisemoinnin luomisesta yhteisö on vastuussa.
label: er landskapsarkitekt for (korporasjon) @no
definition: Relaterer en korporasjon til et verk som involverer et ansvar for en korporasjon for arkitekoniske aspekter ved landskapsanlegg. @no
toolkit label: landskapsarkitekt for (korporasjon) @no
toolkit definition: Et verk som involverer et ansvar for en korporasjon for arkitekoniske aspekter ved landskapsanlegg. @no
label: is landschapsarchitect-corporatie van @nl
definition: Relateert een corporatie aan een werk dat met zich meebrengt een verantwoordelijkheid van een corporatie voor het creëren van landschappen. @nl
toolkit label: landschapsarchitect-corporatie van @nl
toolkit definition: Een werk dat met zich meebrengt een verantwoordelijkheid van een corporatie voor het creëren van landschappen. @nl
label: هي هيئة مسئولة عن هندسة تنسيق المواقع الخارجية لـ @ar
definition: يربط هيئة بعمل يترتب عليه مسئولية هيئة عن تنسيق المواقع الخارجية. @ar
toolkit label: هيئة مسئولة عن هندسة تنسيق مواقع @ar
toolkit definition: عمل يترتب عليه مسئولية هيئة عن تنسيق المواقع الخارجية. @ar
label: és entitat corporativa arquitecta paisatgista de @ca
definition: Relaciona una entitat corporativa amb una obra que implica una responsabilitat d’una entitat corporativa en la creació de paisatges. @ca
toolkit label: entitat corporativa arquitecta paisatgista de @ca
toolkit definition: Obra que implica una responsabilitat d’una entitat corporativa en la creació de paisatges. @ca
label: er korporation, som er landskabsarkitekt af @da
definition: Relaterer en korporation til et værk, som involverer en korporations ansvar for at skabe landskaber. @da
toolkit label: korporation, som er landskabsarkitekt af @da
toolkit definition: Værk, som involverer en korporations ansvar for at skabe landskaber. @da
label: maastikuarhitekt (asutus) teoses @et
definition: Seostab asutuse teosega, mis sisaldab asutuse vastutust maastikukujunduse arhitektuursete aspektide eest. @et
toolkit label: maastikuarhitekt (asutus) teoses @et
toolkit definition: Teos, mis sisaldab asutuse vastutust maastikukujunduse arhitektuursete aspektide eest. @et
label: ist Körperschaft als Landschaftsarchitektin/Landschaftsarchitekt von @de
definition: Setzt eine Körperschaft in Beziehung zu einem Werk, bei dem eine Körperschaft für die Schaffung von Landschaften verantwortlich ist. @de
toolkit label: Körperschaft als Landschaftsarchitektin/Landschaftsarchitekt von @de
toolkit definition: Ein Werk, bei dem eine Körperschaft für die Schaffung von Landschaften verantwortlich ist. @de
label: tájépítész testülete a következőnek: @hu
definition: Hozzákapcsol egy testületet egy műhöz, amelyhez hozzátartozik egy testület felelőssége a tájépítészet építészeti vonatkozásaiért. @hu
toolkit label: tájépítész testülete: @hu
toolkit definition: Egy mű, amelyhez hozzátartozik egy testület felelőssége a tájépítészet építészeti vonatkozásaiért. @hu
label: è architetto paesaggista ente di @it
definition: Correla un ente a un'opera che implica una responsabilità di un ente per gli aspetti architettonici del paesaggio. @it
toolkit label: architetto paesaggista ente di @it
toolkit definition: Opera che implica una responsabilità di un ente per gli aspetti architettonici del paesaggio. @it
label: είναι αρχιτέκτονας τοπίου συλλογικό όργανο του @el
toolkit label: αρχιτέκτονας τοπίου συλλογικό όργανο του @el
label: est une collectivité architecte paysagiste de @fr
definition: Met une collectivité en relation avec une œuvre qui comporte une responsabilité de la part d’une collectivité consistant à créer des paysages. @fr
toolkit label: collectivité architecte paysagiste de @fr
toolkit definition: Œuvre qui comporte une responsabilité de la part d’une collectivité consistant à créer des paysages. @fr
label: ir ainavu arhitekts (institūcija) @lv
definition: Sasaista institūciju ar darbu, kas ietver institūcijas atbildību par ainavu arhitektūras aspektiem. @lv
toolkit label: ir ainavu arhitekts (institūcija) @lv
toolkit definition: Darbs, kas ietver institūcijas atbildību par ainavu arhitektūras aspektiem. @lv
label: 是……的景观设计师团体 @zh-hans
definition: 将一个团体与涉及创作景观的一个团体的责任的一种作品关联起来。 @zh-hans
toolkit label: ……的景观设计师团体 @zh-hans
toolkit definition: 涉及创作景观的一个团体的责任的一种作品 @zh-hans
label: peyzaj mimarı tüzel kişisidir @tr
definition: Bir tüzel kişiyi, bir tüzel kişiliğin peyzaj yaratma sorumluluğunu içeren bir eserle ilişkilendirir. @tr
toolkit label: Peyzaj mimarı tüzel kişiliğidir @tr
toolkit definition: Peyzaj oluşturmak için bir tüzel kişinin sorumluluğunu içeren bir çalışma. @tr
has subproperty: P50833

maisema-arkkitehti (suku) teoksessa
status: Published
label: is landscape architect family of @en
lexical alias: landscapeArchitectFamilyOf.en
definition: Relates a family to a work that involves a responsibility of a family for creating landscapes. @en
toolkit label: landscape architect family of @en
toolkit definition: A work that involves a responsibility of a family for creating landscapes. @en
type: Property
domain: C10008
has element type: 2
sub property of: arkkitehti (suku) teoksessa
sub property of: maisema-arkkitehti (yhteistoimija) teoksessa
definition: Liittää suvun teokseen, jonka maisemoinnin luomisesta suku on vastuussa.
toolkit label: maisema-arkkitehti (suku) teoksessa
toolkit definition: Teos, jonka maisemoinnin luomisesta suku on vastuussa.
label: er landskapsarkitekt for (familie) @no
definition: Relaterer en familie til et verk som involverer et ansvar for en familie for arkitekoniske aspekter ved landskapsanlegg. @no
toolkit label: landskapsarkitekt for (familie) @no
toolkit definition: Et verk som involverer et ansvar for en familie for arkitekoniske aspekter ved landskapsanlegg. @no
label: is landschapsarchitect-familie van @nl
definition: Relateert een familie aan een werk dat met zich meebrengt een verantwoordelijkheid van een familie voor het creëren van landschappen. @nl
toolkit label: landschapsarchitect-familie van @nl
toolkit definition: Een werk dat met zich meebrengt een verantwoordelijkheid van een familie voor het creëren van landschappen. @nl
label: هي عائلة مسئولة عن هندسة تنسيق المواقع الخارجية لـ @ar
definition: يربط عائلة بعمل يترتب عليه مسئولية عائلة عن تنسيق المواقع الخارجية. @ar
toolkit label: عائلة مسئولة عن تنسيق مواقع @ar
toolkit definition: عمل يترتب عليه مسئولية عائلة عن تنسيق المواقع الخارجية. @ar
label: és família arquitecta paisatgista de @ca
definition: Relaciona una família amb una obra que implica una responsabilitat d’una família en la creació de paisatges. @ca
toolkit label: família arquitecta paisatgista de @ca
toolkit definition: Obra que implica una responsabilitat d’una família en la creació de paisatges. @ca
label: er familie, som er landskabsarkitekt af @da
definition: Relaterer en familie til et værk, som involverer en families ansvar for at skabe landskaber. @da
toolkit label: familie, som er landskabsarkitekt af @da
toolkit definition: Værk, som involverer en families ansvar for at skabe landskaber. @da
label: maastikuarhitekt (perekond) teoses @et
definition: Seostab perekonna teosega, mis sisaldab perekonna vastutust maastikukujunduse arhitektuursete aspektide eest. @et
toolkit label: maastikuarhitekt (perekond) teoses @et
toolkit definition: Teos, mis sisaldab perekonna vastutust maastikukujunduse arhitektuursete aspektide eest. @et
label: ist Familie als Landschaftsarchitektin/Landschaftsarchitekt von @de
definition: Setzt eine Familie in Beziehung zu einem Werk, bei dem eine Familie für die Schaffung von Landschaften verantwortlich ist. @de
toolkit label: Familie als Landschaftsarchitektin/Landschaftsarchitekt von @de
toolkit definition: Ein Werk, bei dem eine Familie für die Schaffung von Landschaften verantwortlich ist. @de
label: tájépítész családja a következőnek: @hu
definition: Hozzákapcsol egy családot egy műhöz, amelyhez hozzátartozik egy család felelőssége a tájépítészet építészeti vonatkozásaiért. @hu
toolkit label: tájépítész családja: @hu
toolkit definition: Egy mű, amelyhez hozzátartozik egy család felelőssége a tájépítészet építészeti vonatkozásaiért. @hu
label: è architetto paesaggista famiglia di @it
definition: Correla una famiglia a un'opera che implica una responsabilità di una famiglia per gli aspetti architettonici del paesaggio. @it
toolkit label: architetto paesaggista famiglia di @it
toolkit definition: Opera che implica una responsabilità di una famiglia per gli aspetti architettonici del paesaggio. @it
label: είναι αρχιτέκτονας τοπίου οικογένεια του @el
toolkit label: αρχιτέκτονας τοπίου οικογένεια του @el
label: est une famille architecte paysagiste de @fr
definition: Met une famille en relation avec une œuvre qui comporte une responsabilité de la part d’une famille consistant à créer des paysages. @fr
toolkit label: famille architecte paysagiste de @fr
toolkit definition: Œuvre qui comporte une responsabilité de la part d’une famille consistant à créer des paysages. @fr
label: ir ainavu arhitekts (dzimta/ģimene) @lv
definition: Sasaista dzimtu/ģimeni ar darbu, kas ietver dzimtas/ģimenes atbildību par ainavu arhitektūras aspektiem. @lv
toolkit label: ir ainavu arhitekts (dzimta/ģimene) @lv
toolkit definition: Darbs, kas ietver dzimtas/ģimenes atbildību par ainavu arhitektūras aspektiem. @lv
label: 是……的景观设计师家族 @zh-hans
definition: 将一个家族与涉及创作景观的一个家族的责任的一种作品关联起来。 @zh-hans
toolkit label: ……的景观设计师家族 @zh-hans
toolkit definition: 涉及创作景观的一个家族的责任的一种作品 @zh-hans
label: peyzaj mimarı ailesidir @tr
definition: Bir aileyi, bir ailenin manzara yaratma sorumluluğunu içeren bir eserle ilişkilendirir. @tr
toolkit label: peyzaj mimarı ailesidir @tr
toolkit definition: Bir ailenin peyzaj oluşturma sorumluluğunu içeren bir eser. @tr
has subproperty: P50984

maisema-arkkitehti (henkilö) teoksessa
status: Published
label: is landscape architect person of @en
lexical alias: landscapeArchitectPersonOf.en
definition: Relates a person to a work that involves a responsibility of a person for creating landscapes. @en
toolkit label: landscape architect person of @en
toolkit definition: A work that involves a responsibility of a person for creating landscapes. @en
type: Property
domain: C10004
has element type: 2
sub property of: arkkitehti (henkilö) teoksessa
sub property of: maisema-arkkitehti (toimija) teoksessa
definition: Liittää henkilön teokseen, jonka maisemoinnin luomisesta henkilö on vastuussa.
toolkit label: maisema-arkkitehti (henkilö) teoksessa
toolkit definition: Teos, jonka maisemoinnin luomisesta henkilö on vastuussa.
label: er landskapsarkitekt for (person) @no
definition: Relaterer en person til et verk som involverer et ansvar for en person for arkitekoniske aspekter ved landskapsanlegg. @no
toolkit label: landskapsarkitekt for (person) @no
toolkit definition: Et verk som involverer et ansvar for en person for arkitekoniske aspekter ved landskapsanlegg. @no
label: is landschapsarchitect-persoon van @nl
definition: Relateert een persoon aan een werk dat met zich meebrengt een verantwoordelijkheid van een persoon voor het creëren van landschappen. @nl
toolkit label: landschapsarchitect-persoon van @nl
toolkit definition: Een werk dat met zich meebrengt een verantwoordelijkheid van een persoon voor het creëren van landschappen. @nl
label: هو شخص مهندس تنسيق المواقع الخارجية لـ @ar
definition: يربط شخصا بعمل يترتب عليه مسئولية شخص عن تنسيق المواقع الخارجية. @ar
toolkit label: شخص مهندس تنسيق مواقع @ar
toolkit definition: عمل يترتب عليه مسئولية شخص عن تنسيق المواقع الخارجية. @ar
label: és persona arquitecta paisatgista de @ca
definition: Relaciona una persona amb una obra que implica una responsabilitat d’una persona en la creació de paisatges. @ca
toolkit label: persona arquitecta paisatgista de @ca
toolkit definition: Obra que implica una responsabilitat d’una persona en la creació de paisatges. @ca
label: er person, som er landskabsarkitekt af @da
definition: Relaterer en person til et værk, som involverer en persons ansvar for at skabe landskaber. @da
toolkit label: person, som er landskabsarkitekt af @da
toolkit definition: Værk, som involverer en persons ansvar for at skabe landskaber. @da
label: maastikuarhitekt (isik) teoses @et
definition: Seostab isiku teosega, mis sisaldab isiku vastutust maastikukujunduse arhitektuursete aspektide eest. @et
toolkit label: maastikuarhitekt (isik) teoses @et
toolkit definition: Teos, mis sisaldab isiku vastutust maastikukujunduse arhitektuursete aspektide eest. @et
label: ist Person als Landschaftsarchitektin/Landschaftsarchitekt von @de
definition: Setzt eine Person in Beziehung zu einem Werk, bei dem eine Person für die Schaffung von Landschaften verantwortlich ist. @de
toolkit label: Person als Landschaftsarchitektin/Landschaftsarchitekt von @de
toolkit definition: Ein Werk, bei dem eine Person für die Schaffung von Landschaften verantwortlich ist. @de
label: tájépítész személye a következőnek: @hu
definition: Hozzákapcsol egy személyt egy műhöz, amelyhez hozzátartozik egy személy felelőssége a tájépítészet építészeti vonatkozásaiért. @hu
toolkit label: tájépítész személye: @hu
toolkit definition: Egy mű, amelyhez hozzátartozik egy személy felelőssége a tájépítészet építészeti vonatkozásaiért. @hu
label: è architetto paesaggista persona di @it
definition: Correla una persona a un'opera che implica una responsabilità di una persona per gli aspetti architettonici del paesaggio. @it
toolkit label: architetto paesaggista persona di @it
toolkit definition: Opera che implica una responsabilità di una persona per gli aspetti architettonici del paesaggio. @it
label: είναι αρχιτέκτονας τοπίου φυσικό πρόσωπο του @el
toolkit label: αρχιτέκτονας τοπίου φυσικό πρόσωπο του @el
label: est une personne architecte paysagiste de @fr
definition: Met une personne en relation avec une œuvre qui comporte une responsabilité de la part d’une personne consistant à créer des paysages. @fr
toolkit label: personne architecte paysagiste de @fr
toolkit definition: Œuvre qui comporte une responsabilité de la part d’une personne consistant à créer des paysages. @fr
label: ir ainavu arhitekts (persona) @lv
definition: Sasaista personu ar darbu, kas ietver personas atbildību par ainavu arhitektūras aspektiem. @lv
toolkit label: ir ainavu arhitekts (persona) @lv
toolkit definition: Darbs, kas ietver personas atbildību par ainavu arhitektūras aspektiem. @lv
label: 是……的景观设计师个人 @zh-hans
definition: 将一个个人与涉及创作景观的一个个人的责任的一种作品关联起来。 @zh-hans
toolkit label: ……的景观设计师个人 @zh-hans
toolkit definition: 涉及创作景观的一个个人的责任的一种作品 @zh-hans
label: peyzaj mimarı kişisidir @tr
definition: Bir kişiyi, bir kişinin peyzaj yaratma sorumluluğunu içeren bir eserle ilişkilendirir. @tr
toolkit label: peyzaj mimarı kişi @tr
toolkit definition: Bir kişinin peyzaj oluşturma sorumluluğunu içeren bir eser. @tr
has subproperty: P50531

toimijan käyttämä kieli
status: Published
type: Property
label: has language of agent @en
lexical alias: languageOfAgent.en
definition: Relates an agent to a language that is used by an agent in its communications. @en
domain: C10002
toolkit label: language of agent @en
toolkit definition: A language that is used by an agent in its communications. @en
has element type: 5
definition: Liittää toimijan kieleen, jota toimija käyttää viestinnässään.
toolkit label: toimijan käyttämä kieli
toolkit definition: Kieli, jota toimija käyttää viestinnässään.
label: har språk for agent @no
definition: Relaterer en agent til et språk som brukes av en agent i sin kommunikasjon. @no
toolkit label: språk for agent @no
toolkit definition: Et språk som brukes av en agent i sin kommunikasjon. @no
label: heeft taal van actor @nl
definition: Relateert een actor aan een taal die gebruikt is door een actor in zijn communicatie. @nl
toolkit label: taal van actor @nl
toolkit definition: Een taal die gebruikt is door een actor in zijn communicatie. @nl
label: له لغة لوكيل @ar
definition: يربط وكيلا بلغة يستخدمها وكيل في اتصالاته. @ar
toolkit label: لغة وكيل @ar
toolkit definition: لغة يستخدمها وكيل في اتصالاته. @ar
label: té com a llengua d’un agent @ca
definition: Relaciona un agent amb una llengua que és usada per un agent en les seves comunicacions. @ca
toolkit label: llengua d’un agent @ca
toolkit definition: Llengua que és usada per un agent en les seves comunicacions. @ca
label: har sprog for agent @da
definition: Relaterer en agent til et sprog, som en agent anvender i sin kommunikation. @da
toolkit label: sprog for agent @da
toolkit definition: Sprog, som en agent anvender i sin kommunikation. @da
label: tegija keel @et
definition: Seostab tegija keelega, mida tegija suhtluses kasutab. @et
toolkit label: tegija keel @et
toolkit definition: Keel, mida tegija suhtluses kasutab. @et
label: hat Sprache eines Akteurs @de
definition: Setzt einen Akteur in Beziehung zu einer Sprache, die ein Akteur bei seiner Kommunikation verwendet. @de
toolkit label: Sprache eines Akteurs @de
toolkit definition: Eine Sprache, die ein Akteur bei seiner Kommunikation verwendet. @de
label: ágens nyelve a következő: @hu
definition: Hozzákapcsol egy ágenst egy nyelvhez, amelyet egy ágens saját kommunikációjában használ. @hu
toolkit label: ágens nyelve: @hu
toolkit definition: Egy nyelv, amelyet egy ágens saját kommunikációjában használ. @hu
label: ha come lingua di agente @it
definition: Correla un agente a una lingua utilizzata da un agente nelle sue comunicazioni. @it
toolkit label: lingua di agente @it
toolkit definition: lingua utilizzata da un agente nelle sue comunicazioni. @it
label: έχει γλώσσα του φορέα @el
toolkit label: γλώσσα του φορέα @el
label: a pour langue d’un agent @fr
definition: Met un agent en relation avec une langue qu’un agent utilise pour sa communication. @fr
toolkit label: langue d’un agent @fr
toolkit definition: Langue qu’un agent utilise pour sa communication. @fr
label: aģenta valoda @lv
definition: Sasaista aģentu ar valodu, ko aģents lieto saziņā. @lv
toolkit label: aģenta valoda @lv
toolkit definition: Valoda, ko aģents lieto saziņā. @lv
label: 有行为者的语言 @zh-hans
definition: 有将一个行为者与一个行为者在其交流中所用的语言关联起来。 @zh-hans
toolkit label: 行为者的语言 @zh-hans
toolkit definition: 一个行为者在其交流中所用的语言 @zh-hans
label: temsilcinin dili ile ilişkilidir @tr
definition: Bir temsilciyi, bir temsilcinin iletişiminde kullandığı bir dille ilişkilendirir. @tr
toolkit label: Temsilcinin dili @tr
toolkit definition: Bir temsilninin iletişiminde kullandığı dil @tr
has subproperty: yhteistoimijan käyttämä kieli
has subproperty: henkilön käyttämä kieli
has subproperty: P50401

yhteistoimijan käyttämä kieli
status: Published
type: Property
label: has language of collective agent @en
lexical alias: languageOfCollectiveAgent.en
definition: Relates a collective agent to a language that is used by a collective agent in its communications. @en
domain: C10011
toolkit label: language of collective agent @en
toolkit definition: A language that is used by a collective agent in its communications. @en
sub property of: toimijan käyttämä kieli
has element type: 5
definition: Liittää yhteistoimijan kieleen, jota yhteistoimija käyttää viestinnässään.
toolkit label: yhteistoimijan käyttämä kieli
toolkit definition: Kieli, jota yhteistoimija käyttää viestinnässään.
label: har språk for kollektiv agent @no
definition: Relaterer en kollektiv agent til et språk som brukes av en kollektiv agent i sin kommunikasjon. @no
toolkit label: språk for kollektiv agent @no
toolkit definition: Et språk som brukes av en kollektiv agent i sin kommunikasjon. @no
label: heeft taal van collectieve actor @nl
definition: Relateert een collectieve actor aan een taal die gebruikt is door een collectieve actor in zijn communicatie. @nl
toolkit label: taal van collectieve actor @nl
toolkit definition: Een taal die gebruikt is door een collectieve actor in zijn communicatie. @nl
label: له لغة لوكيل جماعي لـ @ar
definition: يربط وكيلا جماعيا بلغة يستخدمها وكيل جماعي في اتصالاته. @ar
toolkit label: لغة وكيل جماعي @ar
toolkit definition: لغة يستخدمها وكيل جماعي في اتصالاته. @ar
label: té com a llengua d’un agent col·lectiu @ca
definition: Relaciona un agent col·lectiu amb una llengua que és usada per un agent col·lectiu en les seves comunicacions. @ca
toolkit label: llengua d’un agent col·lectiu @ca
toolkit definition: Llengua que és usada per un agent col·lectiu en les seves comunicacions. @ca
label: har sprog for kollektiv agent @da
definition: Relaterer en kollektiv agent til et sprog, som en kollektiv agent anvender i sin kommunikation. @da
toolkit label: sprog for kollektiv agent @da
toolkit definition: Sprog, som en kollektiv agent anvender i sin kommunikation. @da
label: kollektiivi keel @et
definition: Seostab kollektiivi keelega, mida kollektiiv suhtluses kasutab. @et
toolkit label: kollektiivi keel @et
toolkit definition: Keel, mida kollektiiv suhtluses kasutab. @et
label: hat Sprache eines gemeinschaftlichen Akteurs @de
definition: Setzt einen gemeinschaftlichen Akteur in Beziehung zu einer Sprache, die ein gemeinschaftlicher Akteur bei seiner Kommunikation verwendet. @de
toolkit label: Sprache eines gemeinschaftlichen Akteurs @de
toolkit definition: Eine Sprache, die ein gemeinschaftlicher Akteur bei seiner Kommunikation verwendet. @de
label: kollektív ágens nyelve a következő: @hu
definition: Hozzákapcsol egy kollektív ágenst egy nyelvhez, amelyet a kollektív ágens saját kommunikációjában használ. @hu
toolkit label: kollektív ágens nyelve: @hu
toolkit definition: Egy nyelv, amelyet egy kollektív ágens saját kommunikációjában használ. @hu
label: ha come lingua di agente collettivo @it
definition: Correla un agente collettivo a una lingua utilizzata da un agente collettivo nelle sue comunicazioni. @it
toolkit label: lingua di agente collettivo @it
toolkit definition: lingua utilizzata da un agente collettivo nelle sue comunicazioni. @it
label: έχει γλώσσα του συλλογικού φορέα @el
toolkit label: γλώσσα του συλλογικού φορέα @el
label: a pour langue d’un agent collectif @fr
definition: Met un agent collectif en relation avec une langue qu’un agent collectif utilise pour sa communication. @fr
toolkit label: langue d’un agent collectif @fr
toolkit definition: Langue qu’un agent collectif utilise pour sa communication. @fr
label: grupas valoda @lv
definition: Sasaista grupu ar valodu, ko grupa lieto saziņā. @lv
toolkit label: grupas valoda @lv
toolkit definition: Valoda, ko grupa lieto saziņā. @lv
label: 有集体行为者的语言 @zh-hans
definition: 将一个集体行为者与一个集体行为者在其交流中所用的语言关联起来。 @zh-hans
toolkit label: 集体行为者的语言 @zh-hans
toolkit definition: 一个集体行为者在其交流中所用的语言 @zh-hans
label: kolektif temsilcinin dili ile ilişkilidir @tr
definition: Kolektif bir temsilciyi, iletişimlerinde kolektif temsilcinin kullandığı bir dille ilişkilendirir. @tr
toolkit label: Kolektif temsilcinin dili @tr
toolkit definition: Bir kolektif temsilninin iletişiminde kullandığı dil @tr
has subproperty: suvun käyttämä kieli
has subproperty: yhteisön käyttämä kieli
has subproperty: P50402

sukua kuvaava teos
status: Published
type: Property
label: is family described by @en
definition: Relates a family to a work that is a description of a family. @en
domain: C10008
toolkit label: family described by @en
toolkit definition: A work that is a description of a family. @en
label: είναι οικογένεια περιγραφόμενη σε @el
definition: Συνδέει μια οικογένεια με ένα έργο το οποίο περιγράφει μια περιγραφόμενη οικογένεια. @el
toolkit label: οικογένεια περιγραφόμενη σε @el
toolkit definition: Ένα έργο που περιγράφει μια περιγραφόμενη οικογένεια. @el
definition: Setzt eine Familie in Beziehung zu einem Werk, das eine Familie beschreibt. @de
toolkit label: Familie beschrieben in @de
toolkit definition: Ein Werk, das eine Familie beschreibt. @de
label: er familie beskrevet i @da
definition: Relaterer en familie til et værk, som beskriver en familie. @da
toolkit label: familie beskrevet i @da
toolkit definition: Værk, som beskriver en familie. @da
label: és família descrita per @ca
definition: Relaciona una família amb una obra que és una descripció d’una família. @ca
toolkit label: família descrita per @ca
toolkit definition: Obra que és una descripció d’una família. @ca
definition: Liittää suvun teokseen, joka on suvun kuvaus.
toolkit label: sukua kuvaava teos
toolkit definition: Teos, joka on suvun kuvaus.
toolkit definition: Et verk som beskriver en familie. @no
label: ist Familie beschrieben in @de
label: est une famille décrite par @fr
definition: Met une famille en relation avec une œuvre qui consiste en une description d’une famille. @fr
toolkit label: famille décrite par @fr
toolkit definition: Œuvre qui consiste en une description d’une famille. @fr
sub property of: suku aiheena teoksessa
sub property of: yhteistoimijan kuvaus
has element type: 2
alternative label: described in (family) @en
label: család leírva a következőben: @hu
definition: Hozzákapcsol egy családot egy műhöz, amely egy családot ír le. @hu
alternative label: kuvattu teoksessa (suku)
definition: Relaterer en familie til et verk som beskriver en familie. @no
alternative label: beskrevet i (familie) @no
label: is familie beschreven in @nl
definition: Relateert een familie aan een werk dat een familie beschrijft. @nl
toolkit label: familie beschreven in @nl
toolkit definition: Een werk dat een familie beschrijft. @nl
label: هي عائلة موصوفة في @ar
definition: يربط عائلة بعمل يصف عائلة. @ar
alternative label: موصوف في (عائلة) @ar
toolkit label: عائلة موصوفة في @ar
toolkit definition: عمل يصف عائلة. @ar
alternative label: descrit en (família) @ca
label: perekonna kirjeldus @et
definition: Seostab perekonna teosega, milles perekonda kirjeldatakse. @et
toolkit label: perekonna kirjeldus @et
toolkit definition: Teos, milles perekonda kirjeldatakse. @et
alternative label: Beschrieben in (Familie) @de
alternative label: leírva a következőben (család): @hu
toolkit label: család leírva a következőben: @hu
toolkit definition: Egy, amely egy családot ír le. @hu
label: è famiglia descritta in @it
definition: Correla una famiglia a un'opera che descrive una famiglia. @it
alternative label: descritto in (famiglia) @it
toolkit label: famiglia descritta in @it
toolkit definition: Opera che descrive una famiglia. @it
alternative label: περιγράφεται σε (οικογένεια) @el
lexical alias: familyDescribedBy.en
label: dzimtas/ģimenes apraksts @lv
definition: Sasaista dzimtu/ģimeni ar darbu, kurā aprakstīta konkrētā dzimta/ģimene. @lv
toolkit label: dzimtas/ģimenes apraksts @lv
toolkit definition: Darbs, kurā aprakstīta konkrētā dzimta/ģimene. @lv
alternative label: 被描述于（家族） @zh-hans
label: 是被……描述的家族 @zh-hans
definition: 将一个家族与作为一个家族之描述的一种作品关联起来。 @zh-hans
toolkit label: 被……描述的家族 @zh-hans
toolkit definition: 作为一个家族之描述的一种作品 @zh-hans
alternative label: descrito en (familia) @es
alternative label: décrit dans (famille) @fr
toolkit label: tarafından açıklanan aile @tr
toolkit definition: Bir ailenin tanımı olan bir eser @tr
has subproperty: sukua metatiedoilla kuvaileva teos
has subproperty: P50370

henkilöä kuvaava teos
status: Published
type: Property
label: is person described by @en
definition: Relates a person to a work that is a description of a person. @en
domain: C10004
toolkit label: person described by @en
toolkit definition: A work that is a description of a person. @en
label: είναι φυσικό πρόσωπο περιγραφόμενο σε @el
definition: Συνδέει ένα φυσικό πρόσωπο με ένα έργο το οποίο περιγράφει ένα περιγραφόμενο φυσικό πρόσωπο. @el
toolkit label: φυσικό πρόσωπο περιγραφόμενο σε @el
toolkit definition: Ένα έργο που περιγράφει ένα περιγραφόμενο φυσικό πρόσωπο. @el
definition: Setzt eine Person in Beziehung zu einem Werk, das eine Person beschreibt. @de
toolkit label: Person beschrieben in @de
toolkit definition: Ein Werk, das eine Person beschreibt. @de
label: er person beskrevet i @da
definition: Relaterer en person til et værk, som beskriver en person. @da
toolkit label: person beskrevet i @da
toolkit definition: Værk, som beskriver en person. @da
label: és persona descrita per @ca
definition: Relaciona una persona amb una obra que és una descripció d’una persona. @ca
toolkit label: persona descrita per @ca
toolkit definition: Obra que és una descripció d’una persona. @ca
definition: Liittää henkilön teokseen, joka on henkilön kuvaus.
toolkit label: henkilöä kuvaava teos
toolkit definition: Teos, joka on henkilön kuvaus.
toolkit label: person beskrevet i @no
toolkit definition: Et verk som beskriver en person. @no
label: ist Person beschrieben in @de
label: est une personne décrite par @fr
definition: Met une personne en relation avec une œuvre qui consiste en une description d’une personne. @fr
toolkit label: personne décrite par @fr
toolkit definition: Œuvre qui consiste en une description d’une personne. @fr
sub property of: henkilö aiheena teoksessa
sub property of: toimijan kuvaus
has element type: 2
alternative label: described in (person) @en
label: személy leírva a következőben: @hu
definition: Hozzákapcsol egy személyt egy műhöz, amely egy személyt ír le. @hu
alternative label: kuvattu teoksessa (henkilö)
definition: Relaterer en person til et verk som beskriver en person. @no
alternative label: beskrevet i (person) @no
label: is persoon beschreven in @nl
definition: Relateert een persoon aan een werk dat een persoon beschrijft. @nl
toolkit label: persoon beschreven in @nl
toolkit definition: Een werk dat een persoon beschrijft. @nl
label: هو شخص موصوف في @ar
definition: يربط شخصا بعمل يصف شخصا. @ar
alternative label: موصوف في (شخص) @ar
toolkit label: شخص موصوف في @ar
toolkit definition: عمل يصف شخصا. @ar
alternative label: descrit en (persona) @ca
label: isiku kirjeldus @et
definition: Seostab isiku teosega, milles isikut kirjeldatakse. @et
toolkit label: isiku kirjeldus @et
toolkit definition: Teos, milles isikut kirjeldatakse. @et
alternative label: Beschrieben in (Person) @de
alternative label: leírva a következőben (személy): @hu
toolkit label: személy leírva a következőben: @hu
toolkit definition: Egy mű, amely leír egy személyt. @hu
label: è persona descritta in @it
definition: Correla una persona a un'opera che descrive una persona. @it
alternative label: descritto in (persona) @it
toolkit label: persona descritta in @it
toolkit definition: Opera che descrive una persona. @it
alternative label: περιγράφεται σε (φυσικό πρόσωπο) @el
lexical alias: personDescribedBy.en
label: personas apraksts @lv
definition: Sasaista personu ar darbu, kurā aprakstīta konkrētā persona. @lv
toolkit label: personas apraksts @lv
toolkit definition: Darbs, kurā aprakstīta konkrētā persona. @lv
alternative label: 被描述于（个人） @zh-hans
label: 是被……描述的个人 @zh-hans
definition: 将一个个人与作为一个个人之描述的一种作品关联起来。 @zh-hans
toolkit label: 被……描述的个人 @zh-hans
toolkit definition: 作为一个个人之描述的一种作品 @zh-hans
alternative label: descrito en (persona) @es
alternative label: décrit dans (personne) @fr
toolkit label: Tarafından tanımlanan kişi @tr
toolkit definition: Bir kişinin tanımı olan bir eser @tr
has subproperty: henkilöä metatiedoilla kuvaileva teos

yhteisöä kuvaava teos
status: Published
type: Property
label: is corporate body described by @en
definition: Relates a corporate body to a work that is a description of a corporate body. @en
domain: C10005
toolkit label: corporate body described by @en
toolkit definition: A work that is a description of a corporate body. @en
label: είναι συλλογικό όργανο περιγραφόμενο σε @el
definition: Συνδέει ένα συλλογικό όργανο με ένα έργο το οποίο περιγράφει ένα περιγραφόμενο συλλογικό όργανο. @el
toolkit label: συλλογικό όργανο περιγραφόμενο σε @el
toolkit definition: Ένα έργο που περιγράφει ένα περιγραφόμενο συλλογικό όργανο. @el
definition: Setzt eine Körperschaft in Beziehung zu einem Werk, das eine Körperschaft beschreibt. @de
toolkit label: Körperschaft beschrieben in @de
toolkit definition: Ein Werk, das eine Körperschaft beschreibt. @de
label: er korporation beskrevet i @da
definition: Relaterer en korporation til et værk, som beskriver en korporation. @da
toolkit label: korporation beskrevet i @da
toolkit definition: Værk, som beskriver en korporation. @da
label: és entitat corporativa descrita per @ca
definition: Relaciona una entitat corporativa amb una obra que és una descripció d’una entitat corporativa. @ca
toolkit label: entitat corporativa descrita per @ca
toolkit definition: Obra que és una descripció d’una entitat corporativa. @ca
definition: Liittää yhteisön teokseen, joka on yhteisön kuvaus.
toolkit label: yhteisöä kuvaava teos
toolkit definition: Teos, joka on yhteisön kuvaus.
toolkit label: korporasjon beskrevet i @no
toolkit definition: Et verk som beskriver en korporasjon. @no
label: ist Körperschaft beschrieben in @de
label: est une collectivité décrite par @fr
definition: Met une collectivité en relation avec une œuvre qui consiste en une description d’une collectivité. @fr
toolkit label: collectivité décrite par @fr
toolkit definition: Œuvre qui consiste en une description d’une collectivité. @fr
sub property of: yhteisö aiheena teoksessa
sub property of: yhteistoimijan kuvaus
has element type: 2
alternative label: described in (corporate body) @en
label: testület leírva a következőben: @hu
definition: Hozzákapcsol egy testületet egy műhöz, amely egy testületet ír le. @hu
alternative label: kuvattu teoksessa (yhteisö)
label: er korporasjon beskrevet i @no
definition: Relaterer en korporasjon til et verk som beskriver en korporasjon. @no
alternative label: beskrevet i (korporasjon) @no
label: is corporatie beschreven in @nl
definition: Relateert een corporatie aan een werk dat een corporatie beschrijft. @nl
toolkit label: corporatie beschreven in @nl
toolkit definition: Een werk dat een corporatie beschrijft. @nl
label: هي هيئة موصوفة في @ar
definition: يربط هيئة بعمل يصف هيئة. @ar
alternative label: موصوف في (هيئة) @ar
toolkit label: هيئة موصوفة في @ar
toolkit definition: عمل يصف هيئة. @ar
alternative label: descrit en (entitat corporativa) @ca
alternative label: beskrevet i (korporation) @da
label: asutuse kirjeldus @et
definition: Seostab asutuse teosega, milles asutust kirjeldatakse. @et
toolkit label: asutuse kirjeldus @et
toolkit definition: Teos, milles asutust kirjeldatakse. @et
alternative label: Beschrieben in (Körperschaft) @de
alternative label: leírva a következőben (testület): @hu
toolkit label: testület leírva a következőben: @hu
toolkit definition: Egy mű, amely egy testületet ír le. @hu
label: è ente descritto in @it
definition: Correla un ente a un'opera che descrive un ente. @it
alternative label: descritto in (ente) @it
toolkit label: ente descritto in @it
toolkit definition: Opera che descrive un ente. @it
alternative label: περιγράφεται σε (συλλογικό όργανο) @el
lexical alias: corporateBodyDescribedBy.en
label: institūcijas apraksts @lv
definition: Sasaista institūciju ar darbu, kurā aprakstīta konkrētā institūcija. @lv
toolkit label: institūcijas apraksts @lv
toolkit definition: Darbs, kurā aprakstīta konkrētā institūcija. @lv
alternative label: 被描述于（团体） @zh-hans
label: 是被……描述的团体 @zh-hans
definition: 将一个团体与作为一个团体之描述的一种作品关联起来。 @zh-hans
toolkit label: 被……描述的团体 @zh-hans
toolkit definition: 作为一个团体之描述的一种作品 @zh-hans
toolkit label: tarafından tanımlanan tüzel kişi @tr
toolkit definition: Bir tüzel kişinin tanımı olan bir eser @tr
has subproperty: yhteisöä metatiedoilla kuvaileva teos

suvun kantasuku
status: Published
type: Property
label: is descendant family of family of @en
lexical alias: descendantFamilyOfFamilyOf.en
definition: Relates a family to a family from whom another family descends. @en
domain: C10008
instruction number: 29.5
toolkit label: descendant family of family of @en
toolkit definition: A family from whom another family descends. @en
label: είναι απόγονος οικογένεια της οικογένειας του @el
definition: Συνδέει μια οικογένεια με μια οικογένεια από την οποία κατάγεται μια άλλη οικογένεια. @el
toolkit label: απόγονος οικογένεια της οικογένειας του @el
toolkit definition: Μια οικογένεια από την οποία κατάγεται μια άλλη οικογένεια. @el
definition: Setzt eine Familie in Beziehung zu einer Familie, von der eine andere Familie abstammt. @de
toolkit label: Abstammende Familie von @de
toolkit definition: Eine Familie, von der eine andere Familie abstammt. @de
label: er familie nedstammende af familie af @da
definition: Relaterer en familie til en familie, som en anden familie nedstammer fra. @da
toolkit label: familie nedstammende af familie af @da
toolkit definition: Familie, som en anden familie nedstammer fra. @da
label: és família descendent d’una família de @ca
definition: Relaciona una família amb una família de la qual una altra família descendeix. @ca
toolkit label: família descendent d’una família de @ca
toolkit definition: Família de la qual una altra família descendeix. @ca
definition: Liittää suvun sukuun, josta toinen suku polveutuu.
toolkit label: suvun kantasuku
toolkit definition: Suku, josta toinen suku polveutuu.
toolkit label: etterkommende familie av familie for @no
toolkit definition: En familie som en annen familie nedstammer fra. @no
label: ist abstammende Familie von @de
label: est une famille descendante d’une famille de @fr
definition: Met une famille en relation avec une famille de qui une autre famille descend. @fr
toolkit label: famille descendante d’une famille de @fr
toolkit definition: Famille de qui une autre famille descend. @fr
has element type: 2
label: leszármazott családja a következő családnak: @hu
definition: Hozzákapcsol egy családot egy családhoz, amelyből egy másik család származik. @hu
alternative label: descendant family of @en
alternative label: kantasuku
label: er etterkommende familie av familie for @no
definition: Relaterer en familie til en familie som en annen familie nedstammer fra. @no
sub property of: sukuhaara suvussa
label: is afstammeling-familie van familie @nl
definition: Relateert een familie aan een familie waar een andere familie van afstamt. @nl
toolkit label: afstammeling-familie van familie @nl
toolkit definition: Een familie waar een andere familie van afstamt. @nl
label: هي عائلة منحدرة من عائلة لـ @ar
definition: يربط عائلة بعائلة تنحدر منها عائلة أخرى. @ar
toolkit label: عائلة منحدرة من عائلة لـ @ar
toolkit definition: عائلة تنحدر منها عائلة أخرى. @ar
label: perekonna esivanemad (perekond) @et
definition: Seostab perekonna perekonnaga, kellest teine perekond põlvneb. @et
toolkit label: perekonna esivanemad (perekond) @et
toolkit definition: Perekond, kellest teine perekond põlvneb. @et
toolkit label: leszármazott családja a következő családnak: @hu
toolkit definition: Egy család, amelytől egy másik család származik. @hu
label: è famiglia discendente di famiglia di @it
definition: Correla una famiglia a una famiglia dalla quale discende un'altra famiglia.. @it
toolkit label: famiglia discendente di famiglia di @it
toolkit definition: Famiglia dalla quale discende un'altra famiglia.. @it
label: ir dzimtas/ģimenes pirmsācējs (dzimta/ģimene) @lv
definition: Sasaista dzimtu/ģimeni ar dzimtu/ģimeni, no kuras cēlusies cita dzimta/ģimene. @lv
toolkit label: ir dzimtas/ģimenes pirmsācējs (dzimta/ģimene) @lv
toolkit definition: Dzimta/ģimene, no kuras cēlusies cita dzimta/ģimene. @lv
alternative label: عائلة منحدرة من @ar
alternative label: Nachkommen @de
alternative label: família descendent de @ca
alternative label: ……的后裔家族 @zh-hans
label: 是……的家族的后裔家族 @zh-hans
definition: 将一个家族与另一个家族作为其后裔的一个家族关联起来。 @zh-hans
toolkit label: ……的家族的后裔家族 @zh-hans
toolkit definition: 另一个家族作为其后裔的一个家族 @zh-hans
alternative label: familia descendiente de la familia de @es
alternative label: famille descendante de @fr
alternative label: leszármazott családja: @hu
alternative label: soyundan gelen aile @tr
label: ailesinin alt soy ailesidir @tr
toolkit label: alt soy ailesi @tr
toolkit definition: Aynı aile soyundan gelen bir başka aile @tr
has subproperty: P50372

henkilöstä polveutuva suku
status: Published
label: has descendant family of person @en
definition: Relates a person to a family who descends from a particular person. @en
type: Property
domain: C10004
lexical alias: descendantFamilyOfPerson.en
toolkit label: descendant family of person @en
toolkit definition: A family who descends from a particular person. @en
label: a pour famille descendante d’une personne @fr
definition: Met une personne en relation avec une famille qui descend d’une personne particulière. @fr
toolkit label: famille descendante d’une personne @fr
toolkit definition: Famille qui descend d’une personne particulière. @fr
toolkit label: descendientes @es
toolkit definition: Una familia que desciende de una persona determinada. @es
instruction number: 29.5
label: έχει επίγονο οικογένεια του φυσικού προσώπου @el
definition: Συνδέει ένα φυσικό πρόσωπο με μια οικογένεια που κατάγεται από ένα συγκεκριμένο φυσικό πρόσωπο. @el
toolkit label: επίγονος οικογένεια του φυσικού προσώπου @el
toolkit definition: Μια οικογένεια η οποία κατάγεται από ένα συγκεκριμένο φυσικό πρόσωπο. @el
definition: Setzt eine Person in Beziehung zu einer Familie, die von einer bestimmten Person abstammt. @de
toolkit label: Nachkommen @de
toolkit definition: Eine Familie, die von einer bestimmten Person abstammt. @de
label: har familie nedstammende af person @da
definition: Relaterer en person til en familie, som nedstammer fra en bestemt person. @da
toolkit label: familie nedstammende af person @da
toolkit definition: Familie, som nedstammer fra en bestemt person. @da
label: té com a família descendent d’una persona @ca
definition: Relaciona una persona amb una família que descendeix d’una persona concreta. @ca
toolkit label: família descendent d’una persona @ca
toolkit definition: Família que descendeix d’una persona concreta. @ca
definition: Liittää henkilön sukuun, joka polveutuu tietystä henkilöstä.
toolkit label: henkilöstä polveutuva suku
toolkit definition: Suku, joka polveutuu tietystä henkilöstä.
toolkit label: etterkommende familie av person @no
toolkit definition: En familie som er etterkommere av en bestemt person. @no
label: hat Nachkommen @de
alternative label: descendants @en
has element type: 2
label: személy leszármazott családja a következő: @hu
definition: Hozzákapcsol egy személyt egy családhoz, amely egy bizonyos személytől származik. @hu
toolkit label: személy leszármazott családja: @hu
toolkit definition: Egy család, amely egy bizonyos személytől származik. @hu
alternative label: jälkeläiset
label: har etterkommende familie av person @no
definition: Relaterer en person til en familie som er etterkommere av en bestemt person. @no
alternative label: etterkommere @no
sub property of: henkilöjäsen suvussa
label: heeft afstammeling-familie van persoon @nl
definition: Relateert een persoon aan een familie die afstamt van een specifieke persoon. @nl
toolkit label: afstammeling-familie van persoon @nl
toolkit definition: Een familie die afstamt van een specifieke persoon. @nl
label: له عائلة منحدرة من شخص @ar
definition: يربط شخصا بأسرة تنحدر من شخص معين. @ar
alternative label: أحفاد @ar
toolkit label: عائلة منحدرة من شخص @ar
toolkit definition: عائلة تنحدر من شخص معين. @ar
alternative label: descendents @ca
alternative label: efterkommere @da
label: isikust põlvnev perekond @et
definition: Seostab isiku perekonnaga, kes põlvneb sellest isikust. @et
alternative label: järglased @et
toolkit label: isikust põlvnev perekond @et
toolkit definition: Perekond, kes põlvneb sellest isikust. @et
alternative label: leszármazottak: @hu
label: ha come famiglia discendente di persona @it
definition: Correla una persona a una famiglia che discende da una particolare persona. @it
alternative label: discendenti @it
toolkit label: famiglia discendente di persona @it
toolkit definition: Famiglia che discende da una particolare persona. @it
alternative label: επίγονοι @el
label: personas pēcnācējs (dzimta/ģimene) @lv
definition: Sasaista personu ar dzimtu/ģimeni, kas cēlusies no konkrētas personas. @lv
toolkit label: personas pēcnācējs (dzimta/ģimene) @lv
toolkit definition: Dzimta/ģimene, kas cēlusies no konkrētas personas. @lv
alternative label: 后代 @zh-hans
label: 有个人的后裔家族 @zh-hans
definition: 将一个个人与一个特定个人后代的家族关联起来。 @zh-hans
toolkit label: 个人的后裔家族 @zh-hans
toolkit definition: 一个特定个人的后代的家族 @zh-hans
toolkit label: kişinin alt soy ailesi @tr

tekstaaja (toimija) ekspressiossa
status: Published
type: Property
label: is letterer agent of @en
lexical alias: lettererAgentOf.en
definition: Relates an agent to an expression that includes a contribution by an agent of drawing text and graphic sound effects for a comic book, graphic novel, etc. @en
domain: C10002
label: est un agent lettreur de @fr
definition: Met un agent en relation avec une expression qui intègre une contribution de la part d’un agent consistant à dessiner le texte et les effets sonores graphiques pour une bande dessinée, un roman graphique, etc. @fr
toolkit label: agent lettreur de @fr
toolkit definition: Expression qui intègre une contribution de la part d’un agent consistant à dessiner le texte et les effets sonores graphiques pour une bande dessinée, un roman graphique, etc. @fr
toolkit label: letterer agent of @en
toolkit definition: An expression that includes a contribution by an agent of drawing text and graphic sound effects for a comic book, graphic novel, etc. @en
instruction number: 18.5
sub property of: yhdistymään osallinen toimija ekspressiossa
label: είναι σχεδιαστής γραμμάτων επιγραφών φορέας του @el
definition: Συνδέει έναν εικονογράφο που συνεισφέρει σε μια έκφραση ενός κόμικ, νουβέλας με γραφικά κ.λπ., με μια έκφραση. @el
toolkit label: σχεδιαστής γραμμάτων επιγραφών φορέας του @el
toolkit definition: Μια έκφραση ενός κόμικ, νουβέλας με γραφικά κ.λπ., η οποία ενσωματώνει τη συνεισφορά της εικονογράφησης. @el
definition: Setzt einen Akteur in Beziehung zu einer Expression, zu der ein Akteur beiträgt, indem er für ein Comicbuch, eine Graphic Novel und so weiter Text und grafische Toneffekte zeichnet. @de
toolkit label: Akteur als Letterer von @de
toolkit definition: Eine Expression, zu der ein Akteur beiträgt, indem er für ein Comicbuch, eine Graphic Novel und so weiter Text und grafische Toneffekte zeichnet. @de
label: er agent, som er bogstavtegner af @da
definition: Relaterer en agent til et udtryk, som omfatter en agents bidrag ved at tegne tekst og grafiske lydeffekter til en tegneserie, graphic novel etc. @da
toolkit label: agent, som er bogstavstegner af @da
toolkit definition: Udtryk, som omfatter en agents bidrag ved at tegne tekst og grafiske lydeffekter til en tegneserie, graphic novel etc. @da
label: és agent retolista de @ca
definition: Relaciona un agent amb una expressió que inclou una contribució d’un agent en el dibuix de text i d’efectes sonors gràfics d’un còmic, una novel·la gràfica, etc. @ca
toolkit label: agent retolista de @ca
toolkit definition: Expressió que inclou una contribució d’un agent en el dibuix de text i d’efectes sonors gràfics d’un còmic, una novel·la gràfica, etc. @ca
definition: Liittää toimijan ekspressioon, jossa toimija osallistuu sarjakuvan, sarjakuvaromaanin tms. ekspression tekemiseen piirtämällä tekstin ja graafiset äänitehosteet.
toolkit label: tekstaaja (toimija) ekspressiossa
toolkit definition: Ekspressio, jossa toimija osallistuu sarjakuvan, sarjakuvaromaanin tms. ekspression tekemiseen piirtämällä tekstin ja graafiset äänitehosteet.
toolkit label: letterer for (agent) @no
toolkit definition: Et uttrykk som inkluderer et bidrag fra en agent i form av å tegne tekst og grafiske lydeffekter for en tegneserie, tegneserieroman, etc. @no
label: ist Akteur als Letterer von @de
has element type: 2
label: betűrajzoló ágense a következőnek: @hu
definition: Hozzákapcsol egy ágenst egy kifejezési formához, amely magában foglalja egy ágens közreműködését képregény, képregényalbum stb. szövegének és grafikai hangeffektusainak rajzolásában. @hu
toolkit label: betűrajzoló ágense: @hu
toolkit definition: Egy kifejezési forma, amely magában foglalja egy ágens közreműködését képregény, képregényalbum stb. szövegének és grafikai hangeffektusainak rajzolásában. @hu
alternative label: letterer of @en
alternative label: tekstaajana ekspressiossa
label: er letterer for (agent) @no
definition: Relaterer en agent til et uttrykk som inkluderer et bidrag fra en agent i form av å tegne tekst og grafiske lydeffekter for en tegneserie, tegneserieroman, etc. @no
alternative label: letterer for @no
label: is letteraar-actor van @nl
definition: Relateert een actor aan een expressie die omvat een bijdrage door een actor door tekenen van tekst en grafische geluidseffecten voor een comic, stripboek etc. @nl
toolkit label: letteraar-actor van @nl
toolkit definition: Een expressie die omvat een bijdrage door een actor door tekenen van tekst en grafische geluidseffecten voor een comic, stripboek etc. @nl
label: هو وكيل رسّام حروف لـ @ar
definition: يربط وكيلا بتعبيرة تتضمن إسهام وكيل برسم النص وتصميم المؤثرات الصوتية المصاحبة لرسومات قصة مصورة أو رواية مصورة، إلخ. @ar
alternative label: رسّام حروف @ar
toolkit label: وكيل رسّام حروف لـ @ar
toolkit definition: تعبيرة تتضمن إسهام وكيل برسم النص وتصميم المؤثرات الصوتية المصاحبة لرسومات قصة مصورة أو رواية مصورة، إلخ. @ar
alternative label: retolista de @ca
alternative label: bogstavstegner af @da
label: tekstijoonistaja (tegija) väljenduses @et
definition: Seostab tegija väljendusega, millesse tegija on andnud panuse, joonistades teksti ja graafilisi helijäljendusi koomiksi, graafilise romaani vms jaoks. @et
alternative label: tekstijoonistaja väljenduses @et
toolkit label: tekstijoonistaja (tegija) väljenduses @et
toolkit definition: Väljendus, millesse tegija on andnud panuse, joonistades teksti ja graafilisi helijäljendusi koomiksi, graafilise romaani vms jaoks. @et
alternative label: betűrajzolója: @hu
label: è compilatore di dialoghi per fumetti agente di @it
definition: Correla un agente a un'espressione che include un contributo da parte di un agente nel disegno di testo ed effetti sonori grafici per un fumetto, graphic novel, etc. @it
alternative label: compilatore di dialoghi per fumetti di @it
toolkit label: compilatore di dialoghi per fumetti agente du @it
toolkit definition: Espressione che include un contributo da parte di un agente nel disegno di testo ed effetti sonori grafici per un fumetto, graphic novel, etc. @it
alternative label: σχεδιαστής γραμμάτων επιγραφών του @el
alternative label: lettreur de @fr
label: ir komiksa teksta rakstītājs (aģents) @lv
definition: Sasaista aģentu ar izteiksmi, kas ietver aģenta ieguldījumu, zīmējot tekstu un skaņu efektus grafiskā formā komiksu grāmatai, grafiskam romānam u.tml. @lv
toolkit label: ir komiksa teksta rakstītājs (aģents) @lv
toolkit definition: Izteiksme, kas ietver aģenta ieguldījumu, zīmējot tekstu un skaņu efektus grafiskā formā komiksu grāmatai, grafiskam romānam u.tml. @lv
alternative label: Letterer von @de
alternative label: ……的字母图案画者 @zh-hans
toolkit label: ……的字母图案画者行为者 @zh-hans
toolkit definition: 包括一个为漫画书、图解小说等绘制文字和图案声音效果的一个行为者的贡献的一种内容表达 @zh-hans
toolkit label: Hat sanatçısı temsilcisi @tr
toolkit definition: Bir çizgi roman için metin ve grafik ses efektleri çizen bir temsilcinin katkısını içeren bir anlatım. @tr
has subproperty: tekstaaja (yhteistoimija) ekspressiossa

tekstaaja (yhteistoimija) ekspressiossa
status: Published
label: is letterer collective agent of @en
lexical alias: lettererCollectiveAgentOf.en
definition: Relates a collective agent to an expression that includes a contribution by a collective agent of drawing text and graphic sound effects for a comic book, graphic novel, etc. @en
toolkit label: letterer collective agent of @en
toolkit definition: An expression that includes a contribution by a collective agent of drawing text and graphic sound effects for a comic book, graphic novel, etc. @en
type: Property
domain: C10011
has element type: 2
sub property of: yhdistymään osallinen yhteistoimija ekspressiossa
sub property of: tekstaaja (toimija) ekspressiossa
definition: Liittää yhteistoimijan ekspressioon, jossa yhteistoimija on osallisena sarjakuvan, sarjakuvaromaanin tms. ekspression tekemisessä piirtämällä tekstin ja graafiset äänitehosteet.
toolkit label: tekstaaja (yhteistoimija) ekspressiossa
toolkit definition: Ekspressio, jossa yhteistoimija on osallisena sarjakuvan, sarjakuvaromaanin tms. ekspression tekemisessä piirtämällä tekstin ja graafiset äänitehosteet.
label: er letterer for (kollektiv agent) @no
definition: Relaterer en kollektiv agent til et uttrykk som inkluderer et bidrag fra en kollektiv agent i form av å tegne tekst of grafiske lydeffekter for en tegneserie, grafisk roman etc. @no
toolkit label: letterer for (kollektiv agent) @no
toolkit definition: Et uttrykk som inkluderer et bidrag fra en kollektiv agent i form av å tegne tekst of grafiske lydeffekter for en tegneserie, grafisk roman etc. @no
label: is letteraar-collectieve actor van @nl
definition: Relateert een collectieve actor aan een expressie die omvat een bijdrage door een collectieve actor door tekenen van tekst en grafische geluidseffecten voor een comic, stripboek etc. @nl
toolkit label: letteraar-collectieve actor van @nl
toolkit definition: Een expressie die omvat een bijdrage door een collectieve actor door tekenen van tekst en grafische geluidseffecten voor een comic, stripboek etc. @nl
label: هو وكيل جماعي رسّام حروف لـ @ar
definition: يربط وكيلا جماعيا بتعبيرة تتضمن إسهام وكيل جماعي في رسم النص والمؤثرات الصوتية لرسومات قصة مصورة أو رواية مصورة، إلخ. @ar
toolkit label: وكيل جماعي رسّام حروف @ar
toolkit definition: تعبيرة تتضمن إسهام وكيل جماعي في رسم النص والمؤثرات الصوتية لرسومات قصة مصورة أو رواية مصورة، إلخ. @ar
label: és agent col·lectiu retolista de @ca
definition: Relaciona un agent col·lectiu amb una expressió que inclou una contribució d’un agent col·lectiu en el dibuix de text i d’efectes sonors gràfics d’un còmic, una novel·la gràfica, etc. @ca
toolkit label: agent col·lectiu retolista de @ca
toolkit definition: Expressió que inclou una contribució d’un agent col·lectiu en el dibuix de text i d’efectes sonors gràfics d’un còmic, una novel·la gràfica, etc. @ca
label: er kollektiv agent, som er bogstavtegner af @da
definition: Relaterer en kollektiv agent til et udtryk, som omfatter en kollektiv agents bidrag ved at tegne tekst og grafiske lydeffekter til en tegneserie, graphic novel etc. @da
toolkit label: kollektiv agent, som er bogstavtegner af @da
toolkit definition: Udtryk, som omfatter en kollektiv agents bidrag ved at tegne tekst og grafiske lydeffekter til en tegneserie, graphic novel etc. @da
label: tekstijoonistaja (kollektiiv) väljenduses @et
definition: Seostab kollektiivi väljendusega, millesse kollektiiv on andnud panuse, joonistades teksti ja graafilisi helijäljendusi koomiksi, graafilise romaani vms jaoks. @et
toolkit label: tekstijoonistaja (kollektiiv) väljenduses @et
toolkit definition: Väljendus, millesse kollektiiv on andnud panuse, joonistades teksti ja graafilisi helijäljendusi koomiksi, graafilise romaani vms jaoks. @et
label: ist gemeinschaftlicher Akteur als Letterer von @de
definition: Setzt einen gemeinschaftlichen Akteur in Beziehung zu einer Expression, zu der ein gemeinschaftlicher Akteur beiträgt, indem er für ein Comicbuch, eine Graphic Novel und so weiter Text und grafische Toneffekte zeichnet. @de
toolkit label: Gemeinschaftlicher Akteur als Letterer von @de
toolkit definition: Eine Expression, zu der ein gemeinschaftlicher Akteur beiträgt, indem er für ein Comicbuch, eine Graphic Novel und so weiter Text und grafische Toneffekte zeichnet. @de
label: betűrajzoló kollektív ágense a következőnek: @hu
definition: Hozzákapcsol egy kollektív ágenst egy kifejezési formához, amely magában foglalja egy kollektív ágens közreműködését képregény, képregényalbum stb. szövegének és grafikai hangeffektusainak rajzolásában. @hu
toolkit label: betűrajzoló kollektív ágense: @hu
toolkit definition: Egy kifejezési forma, amely magában foglalja egy kollektív ágens közreműködését képregény, képregényalbum stb. szövegének és grafikai hangeffektusainak rajzolásában. @hu
label: è letterista agente collettivo di @it
definition: Correla un agente collettivo a un'espressione che comprende un contributo di un agente collettivo nel disegno di testo ed effetti sonori grafici per un fumetto, graphic novel, etc. @it
toolkit label: letterista agente collettivo di @it
toolkit definition: Espressione che comprende un contributo di un agente collettivo nel disegno di testo ed effetti sonori grafici per un fumetto, graphic novel, etc. @it
label: είναι σχεδιαστής γραμμάτων επιγραφών συλλογικός φορέας του @el
toolkit label: σχεδιαστής γραμμάτων επιγραφών συλλογικός φορέας του @el
label: est un agent collectif lettreur de @fr
definition: Met un agent collectif en relation avec une expression qui intègre une contribution de la part d’un agent collectif consistant à dessiner le texte et les effets sonores graphiques pour une bande dessinée, un roman graphique, etc. @fr
toolkit label: agent collectif lettreur de @fr
toolkit definition: Expression qui intègre une contribution de la part d’un agent collectif consistant à dessiner le texte et les effets sonores graphiques pour une bande dessinée, un roman graphique, etc. @fr
label: ir komiksa teksta rakstītājs (grupa) @lv
definition: Sasaista grupu ar izteiksmi, kas ietver grupas ieguldījumu, zīmējot tekstu un skaņu efektus grafiskā formā komiksu grāmatai, grafiskam romānam u.tml. @lv
toolkit label: ir komiksa teksta rakstītājs (grupa) @lv
toolkit definition: Izteiksme, kas ietver grupas ieguldījumu, zīmējot tekstu un skaņu efektus grafiskā formā komiksu grāmatai, grafiskam romānam u.tml. @lv
label: 是……的字母图案画者集体行为者 @zh-hans
definition: 将一个集体行为者与包括一个为漫画书、图解小说等绘制文字和图案声音效果的一个集体行为者的贡献的一种内容表达关联起来。 @zh-hans
toolkit label: ……的字母图案画者集体行为者 @zh-hans
toolkit definition: 包括一个为漫画书、图解小说等绘制文字和图案声音效果的一个集体行为者的贡献的一种内容表达 @zh-hans
label: yazı tasarımcısı kolektif temsilcisidir @tr
definition: Kolektif bir temsilciyi, bir çizgi roman, grafik roman vb. için metin ve grafik ses efektleri çizerek katkıda bulunmasını içeren anlatımla ilişkilendirir. @tr
toolkit label: Hat sanatçısı kolekti̇f temsilci̇si @tr
toolkit definition: Bir çizgi roman için metin ve grafik ses efektleri çizilmesinde kolektif bir temsilcinin katkısını içeren bir anlatım. @tr
has subproperty: tekstaaja (yhteisö) ekspressiossa
has subproperty: tekstaaja (suku) ekspressiossa
has subproperty: P50735

tekstaaja (yhteisö) ekspressiossa
status: Published
label: is letterer corporate body of @en
lexical alias: lettererCorporateBodyOf.en
definition: Relates a corporate body to an expression that includes a contribution by a corporate body of drawing text and graphic sound effects for a comic book, graphic novel, etc. @en
toolkit label: letterer corporate body of @en
toolkit definition: An expression that includes a contribution by a corporate body of drawing text and graphic sound effects for a comic book, graphic novel, etc. @en
type: Property
domain: C10005
has element type: 2
sub property of: yhdistymään osallinen yhteisö ekspressiossa
sub property of: tekstaaja (yhteistoimija) ekspressiossa
definition: Liittää yhteisön ekspressioon, jossa yhteisö on osallisena sarjakuvan, sarjakuvaromaanin tms. ekspression tekemisessä piirtämällä tekstin ja graafiset äänitehosteet.
toolkit label: tekstaaja (yhteisö) ekspressiossa
toolkit definition: Ekspressio, jossa yhteisö on osallisena sarjakuvan, sarjakuvaromaanin tms. ekspression tekemisessä piirtämällä tekstin ja graafiset äänitehosteet.
label: er letterer for (korporasjon) @no
definition: Relaterer en korporasjon til et uttrykk som inkluderer et bidrag fra en korporasjon i form av å tegne tekst of grafiske lydeffekter for en tegneserie, grafisk roman etc. @no
toolkit label: letterer for (korporasjon) @no
toolkit definition: Et uttrykk som inkluderer et bidrag fra en korporasjon i form av å tegne tekst of grafiske lydeffekter for en tegneserie, grafisk roman etc. @no
label: is letteraar-corporatie van @nl
definition: Relateert een corporatie aan een expressie die omvat een bijdrage door een corporatie door tekenen van tekst en grafische geluidseffecten voor een comic, stripboek etc. @nl
toolkit label: letteraar-corporatie van @nl
toolkit definition: Een expressie die omvat een bijdrage door een corporatie door tekenen van tekst en grafische geluidseffecten voor een comic, stripboek etc. @nl
label: هي هيئة رسّامة حروف لـ @ar
definition: يربط هيئة بتعبيرة تتضمن إسهام هيئة في رسم النص والمؤثرات الصوتية لرسومات قصة مصورة أو رواية مصورة، إلخ. @ar
toolkit label: هيئة مسئولة عن رسم الحروف @ar
toolkit definition: تعبيرة تتضمن إسهام هيئة في رسم النص والمؤثرات الصوتية لرسومات قصة مصورة أو رواية مصورة، إلخ. @ar
label: és entitat corporativa retolista de @ca
definition: Relaciona una entitat corporativa amb una expressió que inclou una contribució d’una entitat corporativa en el dibuix de text i d’efectes sonors gràfics d’un còmic, una novel·la gràfica, etc. @ca
toolkit label: entitat corporativa retolista de @ca
toolkit definition: Expressió que inclou una contribució d’una entitat corporativa en el dibuix de text i d’efectes sonors gràfics d’un còmic, una novel·la gràfica, etc. @ca
label: er korporation, som er bogstavtegner af @da
definition: Relaterer en korporation til et udtryk, som omfatter en korporations bidrag ved at tegne tekst og grafiske lydeffekter til en tegneserie, graphic novel etc. @da
toolkit label: korporation, som er bogstavtegner af @da
toolkit definition: Udtryk, som omfatter en korporations bidrag ved at tegne tekst og grafiske lydeffekter til en tegneserie, graphic novel etc. @da
label: tekstijoonistaja (asutus) väljenduses @et
definition: Seostab asutuse väljendusega, millesse asutus on andnud panuse, joonistades teksti ja graafilisi helijäljendusi koomiksi, graafilise romaani vms jaoks. @et
toolkit label: tekstijoonistaja (asutus) väljenduses @et
toolkit definition: Väljendus, millesse asutus on andnud panuse, joonistades teksti ja graafilisi helijäljendusi koomiksi, graafilise romaani vms jaoks. @et
label: ist Körperschaft als Letterer von @de
definition: Setzt eine Körperschaft in Beziehung zu einer Expression, zu der eine Körperschaft beiträgt, indem sie für ein Comicbuch, eine Graphic Novel und so weiter Text und grafische Toneffekte zeichnet. @de
toolkit label: ist Körperschaft als Letterer von @de
toolkit definition: Eine Expression, zu der eine Körperschaft beiträgt, indem sie für ein Comicbuch, eine Graphic Novel und so weiter Text und grafische Toneffekte zeichnet. @de
label: betűrajzoló testülete a következőnek: @hu
definition: Hozzákapcsol egy testületet egy kifejezési formához, amely magában foglalja egy testület közreműködését képregény, képregényalbum stb. szövegének és grafikai hangeffektusainak rajzolásában. @hu
toolkit label: betűrajzoló testülete: @hu
toolkit definition: Egy kifejezési forma, amely magában foglalja egy testület közreműködését képregény, képregényalbum stb. szövegének és grafikai hangeffektusainak rajzolásában. @hu
label: è letterista ente di @it
definition: Correla un ente a un'espressione che comprende un contributo di un ente nel disegno di testo ed effetti sonori grafici per un fumetto, graphic novel, etc. @it
toolkit label: letterista ente di @it
toolkit definition: Espressione che comprende un contributo di un ente nel disegno di testo ed effetti sonori grafici per un fumetto, graphic novel, etc. @it
label: είναι σχεδιαστής γραμμάτων επιγραφών συλλογικό όργανο του @el
toolkit label: σχεδιαστής γραμμάτων επιγραφών συλλογικό όργανο του @el
label: est une collectivité lettreuse de @fr
definition: Met une collectivité en relation avec une expression qui intègre une contribution de la part d’une collectivité consistant à dessiner le texte et les effets sonores graphiques pour une bande dessinée, un roman graphique, etc. @fr
toolkit label: collectivité lettreuse de @fr
toolkit definition: Expression qui intègre une contribution de la part d’une collectivité consistant à dessiner le texte et les effets sonores graphiques pour une bande dessinée, un roman graphique, etc. @fr
label: ir komiksa teksta rakstītājs (institūcija) @lv
definition: Sasaista institūciju ar izteiksmi, kas ietver institūcijas ieguldījumu, zīmējot tekstu un skaņu efektus grafiskā formā komiksu grāmatai, grafiskam romānam u.tml. @lv
toolkit label: ir komiksa teksta rakstītājs (institūcija) @lv
toolkit definition: Izteiksme, kas ietver institūcijas ieguldījumu, zīmējot tekstu un skaņu efektus grafiskā formā komiksu grāmatai, grafiskam romānam u.tml. @lv
label: 是……的字母图案画者团体 @zh-hans
definition: 将一个团体与包括一个为漫画书、图解小说等绘制文字和图案声音效果的一个团体的贡献的一种内容表达关联起来。 @zh-hans
toolkit label: ……的字母图案画者团体 @zh-hans
toolkit definition: 包括一个为漫画书、图解小说等绘制文字和图案声音效果的一个团体的贡献的一种内容表达 @zh-hans
label: yazı tasarımcısı tüzel kişisidir @tr
definition: Bir tüzel kişiyi, bir çizgi roman, grafik roman vb. için çizim metni ve grafik ses efektlerine yönelik bir kurumsal gövdenin katkısını içeren bir anlatımla ilişkilendirir. @tr
toolkit label: Hat sanatçısı tüzel kişi @tr
toolkit definition: Bir çizgi roman için çizim metni ve grafik ses efektlerinin oluşmasında tüzel bir kişinin katkısını içeren bir anlatım. @tr
has subproperty: P50886

tekstaaja (suku) ekspressiossa
status: Published
label: is letterer family of @en
lexical alias: lettererFamilyOf.en
definition: Relates a family to an expression that includes a contribution by a family of drawing text and graphic sound effects for a comic book, graphic novel, etc. @en
toolkit label: letterer family of @en
toolkit definition: An expression that includes a contribution by a family of drawing text and graphic sound effects for a comic book, graphic novel, etc. @en
type: Property
domain: C10008
has element type: 2
sub property of: yhdistymään osallinen suku ekspressiossa
sub property of: tekstaaja (yhteistoimija) ekspressiossa
definition: Liittää suvun ekspressioon, jossa suku on osallisena sarjakuvan, sarjakuvaromaanin tms. ekspression tekemisessä piirtämällä tekstin ja graafiset äänitehosteet.
toolkit label: tekstaaja (suku) ekspressiossa
toolkit definition: Ekspressio, jossa suku on osallisena sarjakuvan, sarjakuvaromaanin tms. ekspression tekemisessä piirtämällä tekstin ja graafiset äänitehosteet.
label: er letterer for (familie) @no
definition: Relaterer en familie til et uttrykk som inkluderer et bidrag fra en familie i form av å tegne tekst of grafiske lydeffekter for en tegneserie, grafisk roman etc. @no
toolkit label: letterer for (familie) @no
toolkit definition: Et uttrykk som inkluderer et bidrag fra en familie i form av å tegne tekst of grafiske lydeffekter for en tegneserie, grafisk roman etc. @no
label: is letteraar-familie van @nl
definition: Relateert een familie aan een expressie die omvat een bijdrage door een familie door tekenen van tekst en grafische geluidseffecten voor een comic, stripboek etc. @nl
toolkit label: letteraar-familie van @nl
toolkit definition: Een expressie die omvat een bijdrage door een familie door tekenen van tekst en grafische geluidseffecten voor een comic, stripboek etc. @nl
label: هي عائلة رسَامة حروف لـ @ar
definition: يربط عائلة بتعبيرة تتضمن إسهام عائلة في رسم النص والمؤثرات الصوتية لرسومات قصة مصورة أو رواية مصورة، إلخ. @ar
toolkit label: عائلة رسّامة حروف @ar
toolkit definition: تعبيرة تتضمن إسهام عائلة في رسم النص والمؤثرات الصوتية لرسومات قصة مصورة أو رواية مصورة، إلخ. @ar
label: és família retolista de @ca
definition: Relaciona una família amb una expressió que inclou una contribució d’una família en el dibuix de text i d’efectes sonors gràfics d’un còmic, una novel·la gràfica, etc. @ca
toolkit label: família retolista de @ca
toolkit definition: Expressió que inclou una contribució d’una família en el dibuix de text i d’efectes sonors gràfics d’un còmic, una novel·la gràfica, etc. @ca
label: er familie, som er bogstavtegner af @da
definition: Relaterer en familie til et udtryk, som omfatter en families bidrag ved at tegne tekst og grafiske lydeffekter til en tegneserie, graphic novel etc. @da
toolkit label: familie, som er bogstavtegner af @da
toolkit definition: Udtryk, som omfatter en families bidrag ved at tegne tekst og grafiske lydeffekter til en tegneserie, graphic novel etc. @da
label: tekstijoonistaja (perekond) väljenduses @et
definition: Seostab perekonna väljendusega, millesse perekond on andnud panuse, joonistades teksti ja graafilisi helijäljendusi koomiksi, graafilise romaani vms jaoks. @et
toolkit label: tekstijoonistaja (perekond) väljenduses @et
toolkit definition: Väljendus, millesse perekond on andnud panuse, joonistades teksti ja graafilisi helijäljendusi koomiksi, graafilise romaani vms jaoks. @et
label: ist Familie als Letterer von @de
definition: Setzt eine Familie in Beziehung zu einer Expression, zu der eine Familie beiträgt, indem sie für ein Comicbuch, eine Graphic Novel und so weiter Text und grafische Toneffekte zeichnet. @de
toolkit label: Familie als Letterer von @de
toolkit definition: Eine Expression, zu der eine Familie beiträgt, indem sie für ein Comicbuch, eine Graphic Novel und so weiter Text und grafische Toneffekte zeichnet. @de
label: betűrajzoló családja a következőnek: @hu
definition: Hozzákapcsol egy családot egy kifejezési formához, amely magában foglalja egy család közreműködését képregény, képregényalbum stb. szövegének és grafikai hangeffektusainak rajzolásában. @hu
toolkit label: betűrajzoló családja: @hu
toolkit definition: Egy kifejezési forma, amely magában foglalja egy család közreműködését képregény, képregényalbum stb. szövegének és grafikai hangeffektusainak rajzolásában. @hu
label: è letterista famiglia di @it
definition: Correla una famiglia a un'espressione che comprende un contributo di una famiglia nel disegno di testo ed effetti sonori grafici per un fumetto, graphic novel, etc. @it
toolkit label: letterista famiglia di @it
toolkit definition: Espressione che comprende un contributo di una famiglia nel disegno di testo ed effetti sonori grafici per un fumetto, graphic novel, etc. @it
label: είναι σχεδιαστής γραμμάτων επιγραφών οικογένεια του @el
toolkit label: σχεδιαστής γραμμάτων επιγραφών οικογένεια του @el
label: est une famille lettreuse de @fr
definition: Met une famille en relation avec une expression qui intègre une contribution de la part d’une famille consistant à dessiner le texte et les effets sonores graphiques pour une bande dessinée, un roman graphique, etc. @fr
toolkit label: famille lettreuse de @fr
toolkit definition: Expression qui intègre une contribution de la part d’une famille consistant à dessiner le texte et les effets sonores graphiques pour une bande dessinée, un roman graphique, etc. @fr
label: ir komiksa teksta rakstītājs (dzimta/ģimene) @lv
definition: Sasaista dzimtu/ģimeni ar izteiksmi, kas ietver dzimtas/ģimenes ieguldījumu, zīmējot tekstu un skaņu efektus grafiskā formā komiksu grāmatai, grafiskam romānam u.tml. @lv
toolkit label: ir komiksa teksta rakstītājs (dzimta/ģimene) @lv
toolkit definition: Izteiksme, kas ietver dzimtas/ģimenes ieguldījumu, zīmējot tekstu un skaņu efektus grafiskā formā komiksu grāmatai, grafiskam romānam u.tml. @lv
label: 是……的字母图案画者家族 @zh-hans
definition: 将一个家族与包括一个为漫画书、图解小说等绘制文字和图案声音效果的一个家族的贡献的一种内容表达关联起来。 @zh-hans
toolkit label: ……的字母图案画者家族 @zh-hans
toolkit definition: 包括一个为漫画书、图解小说等绘制文字和图案声音效果的一个家族的贡献的一种内容表达 @zh-hans
label: yazı tasarımcısı ailesidir @tr
definition: Bir aileyi, bir çizgi roman, grafik roman vb. için metin ve grafik ses efektleri çizen bir ailenin katkısını içeren bir anlatımla ilişkilendirir. @tr
toolkit label: Hat snatçısı ailesi @tr
toolkit definition: Bir çizgi roman için metin ve grafik ses efektleri çizen bir ailenin katkısını içeren bir anlatım. @tr
has subproperty: P51037

tekstaaja (henkilö) ekspressiossa
status: Published
label: is letterer person of @en
lexical alias: lettererPersonOf.en
definition: Relates a person to an expression that includes a contribution by a person of drawing text and graphic sound effects for a comic book, graphic novel, etc. @en
toolkit label: letterer person of @en
toolkit definition: An expression that includes a contribution by a person of drawing text and graphic sound effects for a comic book, graphic novel, etc. @en
type: Property
domain: C10004
has element type: 2
sub property of: yhdistymään osallinen henkilö ekspressiossa
sub property of: tekstaaja (toimija) ekspressiossa
definition: Liittää henkilön ekspressioon, jossa henkilö on osallisena sarjakuvan, sarjakuvaromaanin tms. ekspression tekemisessä piirtämällä tekstin ja graafiset äänitehosteet.
toolkit label: tekstaaja (henkilö) ekspressiossa
toolkit definition: Ekspressio, jossa henkilö on osallisena sarjakuvan, sarjakuvaromaanin tms. ekspression tekemisessä piirtämällä tekstin ja graafiset äänitehosteet.
label: er letterer for (person) @no
definition: Relaterer en person til et uttrykk som inkluderer et bidrag fra en person i form av å tegne tekst of grafiske lydeffekter for en tegneserie, grafisk roman etc. @no
toolkit label: letterer for (person) @no
toolkit definition: Et uttrykk som inkluderer et bidrag fra en person i form av å tegne tekst of grafiske lydeffekter for en tegneserie, grafisk roman etc. @no
label: is letteraar-persoon van @nl
definition: Relateert een persoon aan een expressie die omvat een bijdrage door een persoon door tekenen van tekst en grafische geluidseffecten voor een comic, stripboek etc. @nl
toolkit label: letteraar-persoon van @nl
toolkit definition: Een expressie die omvat een bijdrage door een persoon door tekenen van tekst en grafische geluidseffecten voor een comic, stripboek etc. @nl
label: هو شخص رسّام حروف لـ @ar
definition: يربط شخصا بتعبيرة تتضمن إسهام شخص في رسم النص والمؤثرات الصوتية لرسومات قصة مصورة أو رواية مصورة، إلخ. @ar
toolkit label: شخص رسّام حروف @ar
toolkit definition: تعبيرة تتضمن إسهام شخص في رسم النص والمؤثرات الصوتية لرسومات قصة مصورة أو رواية مصورة، إلخ. @ar
label: és persona retolista de @ca
definition: Relaciona una persona amb una expressió que inclou una contribució d’una persona en el dibuix de text i d’efectes sonors gràfics d’un còmic, una novel·la gràfica, etc. @ca
toolkit label: persona retolista de @ca
toolkit definition: Expressió que inclou una contribució d’una persona en el dibuix de text i d’efectes sonors gràfics d’un còmic, una novel·la gràfica, etc. @ca
label: er person, som er bogstavtegner af @da
definition: Relaterer en person til et udtryk, som omfatter en persons bidrag ved at tegne tekst og grafiske lydeffekter til en tegneserie, graphic novel etc. @da
toolkit label: person, som er bogstavtegner af @da
toolkit definition: Udtryk, som omfatter en persons bidrag ved at tegne tekst og grafiske lydeffekter til en tegneserie, graphic novel etc. @da
label: tekstijoonistaja (isik) väljenduses @et
definition: Seostab isiku väljendusega, millesse isik on andnud panuse, joonistades teksti ja graafilisi helijäljendusi koomiksi, graafilise romaani vms jaoks. @et
toolkit label: tekstijoonistaja (isik) väljenduses @et
toolkit definition: Väljendus, millesse isik on andnud panuse, joonistades teksti ja graafilisi helijäljendusi koomiksi, graafilise romaani vms jaoks. @et
label: ist Person als Letterer von @de
definition: Setzt eine Person in Beziehung zu einer Expression, zu der eine Person beiträgt, indem sie für ein Comicbuch, eine Graphic Novel und so weiter Text und grafische Toneffekte zeichnet. @de
toolkit label: Person als Letterer von @de
toolkit definition: Eine Expression, zu der eine Person beiträgt, indem sie für ein Comicbuch, eine Graphic Novel und so weiter Text und grafische Toneffekte zeichnet. @de
label: betűrajzoló személye a következőnek: @hu
definition: Hozzákapcsol egy személyt egy kifejezési formához, amely magában foglalja egy személy közreműködését képregény, képregényalbum stb. szövegének és grafikai hangeffektusainak rajzolásában. @hu
toolkit label: betűrajzoló személye: @hu
toolkit definition: Egy kifejezési forma, amely magában foglalja egy személy közreműködését képregény, képregényalbum stb. szövegének és grafikai hangeffektusainak rajzolásában. @hu
label: è letterista persona di @it
definition: Correla una persona a un'espressione che comprende un contributo di una persona nel disegno di testo ed effetti sonori grafici per un fumetto, graphic novel, etc. @it
toolkit label: letterista persona di @it
toolkit definition: Espressione che comprende un contributo di una persona nel disegno di testo ed effetti sonori grafici per un fumetto, graphic novel, etc. @it
label: είναι σχεδιαστής γραμμάτων επιγραφών φυσικό πρόσωπο του @el
toolkit label: σχεδιαστής γραμμάτων επιγραφών φυσικό πρόσωπο του @el
label: est une personne lettreuse de @fr
definition: Met une personne en relation avec une expression qui intègre une contribution de la part d’une personne consistant à dessiner le texte et les effets sonores graphiques pour une bande dessinée, un roman graphique, etc. @fr
toolkit label: personne lettreuse de @fr
toolkit definition: Expression qui intègre une contribution de la part d’une personne consistant à dessiner le texte et les effets sonores graphiques pour une bande dessinée, un roman graphique, etc. @fr
label: ir komiksa teksta rakstītājs (persona) @lv
definition: Sasaista personu ar izteiksmi, kas ietver personas ieguldījumu, zīmējot tekstu un skaņu efektus grafiskā formā komiksu grāmatai, grafiskam romānam u.tml. @lv
toolkit label: ir komiksa teksta rakstītājs (persona) @lv
toolkit definition: Izteiksme, kas ietver personas ieguldījumu, zīmējot tekstu un skaņu efektus grafiskā formā komiksu grāmatai, grafiskam romānam u.tml. @lv
label: 是……的字母图案画者个人 @zh-hans
definition: 将一个个人与包括一个为漫画书、图解小说等绘制文字和图案声音效果的一个个人的贡献的一种内容表达关联起来。 @zh-hans
toolkit label: ……的字母图案画者个人 @zh-hans
toolkit definition: 包括一个为漫画书、图解小说等绘制文字和图案声音效果的一个个人的贡献的一种内容表达 @zh-hans
label: yazı tasarımcısı kişisidir @tr
definition: Bir kişiyi, bir çizgi roman, grafik roman vb. için metin ve grafik ses efektleri çizen bir kişinin katkısını içeren bir anlatımla ilişkilendirir. @tr
toolkit label: Hat sanatı yapan kişi @tr
toolkit definition: Bir çizgi roman için metin ve grafik ses efektleri çizen bir kişinin katkısını içeren bir anlatım. @tr
has subproperty: P50584

libretisti (toimija) teoksessa
status: Published
label: is librettist agent of @en
definition: Relates an agent to a work that involves a responsibility of an agent for authoring the words of an opera or other musical stage work, or an oratorio. @en
type: Property
domain: C10002
sub property of: kirjoittaja (toimija) teoksessa
lexical alias: librettistAgentOf.en
label: est un agent librettiste de @fr
definition: Met un agent en relation avec une œuvre qui comporte une responsabilité de la part d’un agent consistant à être l’auteur des paroles d’un opéra ou d’une autre œuvre musicale scénique ou d’un oratorio. @fr
toolkit label: agent librettiste de @fr
toolkit definition: Œuvre qui comporte une responsabilité de la part d’un agent consistant à être l’auteur des paroles d’un opéra ou d’une autre œuvre musicale scénique ou d’un oratorio. @fr
toolkit label: librettist agent of @en
toolkit definition: A work that involves a responsibility of an agent for authoring the words of an opera or other musical stage work, or an oratorio. @en
see also: sanoittaja (toimija) teoksessa
instruction number: 18.5
label: είναι λιμπρετίστας φορέας του @el
definition: Συνδέει έναν συγγραφέα των στίχων μιας όπερας ή κάποιου άλλου μουσικού σκηνικού έργου ή ενός ορατορίου, με ένα έργο. @el
toolkit label: λιμπρετίστας φορέας του @el
toolkit definition: Ένα έργο που περιλαμβάνει την ευθύνη της συγγραφής των στίχων μιας όπερας ή κάποιου άλλου μουσικού σκηνικού έργου ή ενός ορατορίου. @el
definition: Setzt einen Akteur in Beziehung zu einem Werk, bei dem ein Akteur für das Verfassen des Texts einer Oper, eines sonstigen Bühnenwerks oder eines Oratoriums verantwortlich ist. @de
toolkit label: Akteur als Librettistin/Librettist von @de
toolkit definition: Ein Werk, bei dem ein Akteur für das Verfassen des Texts einer Oper, eines sonstigen Bühnenwerks oder eines Oratoriums verantwortlich ist. @de
label: er agent, som er librettist af @da
definition: Relaterer en agent til et værk, som involverer en agents ansvar for at forfatte ordene til en opera eller andet musikalsk sceneværk eller et oratorium. @da
toolkit label: agent, som er librettist af @da
toolkit definition: Værk, som involverer an agents ansvar for at forfatte ordene til en opera eller andet musikalsk sceneværk eller oratorium. @da
label: és agent llibretista de @ca
definition: Relaciona un agent amb una obra que implica una responsabilitat d’un agent en l’autoria de les paraules d’una òpera o una altra obra escènica musical o d’un oratori. @ca
toolkit label: agent llibretista de @ca
toolkit definition: Obra que implica una responsabilitat d’un agent en l’autoria de les paraules d’una òpera o una altra obra escènica musical o d’un oratori. @ca
definition: Liittää toimijan teokseen, jossa toimija on vastuussa musiikki- tai koreografisen teoksen, kuten oopperan, baletin tai muun musiikillisen näyttämöteoksen tai oratorion sanojen kirjoittamisesta.
toolkit label: libretisti (toimija) teoksessa
toolkit definition: Teos, jossa toimija on vastuussa musiikki- tai koreografisen teoksen, kuten oopperan, baletin tai muun musiikillisen näyttämöteoksen tai oratorion sanojen kirjoittamisesta.
toolkit label: librettist for (agent) @no
toolkit definition: Et verk som involverer ansvar for en agent i form av å forfatte ordene i operaer, operetter, musikalske sceneverk eller oratorier. @no
label: ist Akteur als Librettistin/Librettist von @de
has element type: 2
label: librettista ágense a következőnek: @hu
definition: Hozzákapcsol egy ágenst egy műhöz, amelyhez hozzátartozik egy ágens felelőssége egy opera vagy más zenés színpadi mű vagy egy oratórium szövegének szerzőségéért. @hu
toolkit label: librettista ágense: @hu
toolkit definition: Egy mű, amelyhez hozzátartozik egy ágens felelőssége egy opera vagy más zenés színpadi mű vagy egy oratórium szövegének szerzőségéért. @hu
alternative label: librettist of @en
alternative label: libretistinä musiikkiteoksessa
label: er librettist for (agent) @no
definition: Relaterer en agent til et verk som involverer ansvar for en agent i form av å forfatte ordene i operaer, operetter, musikalske sceneverk eller oratorier. @no
alternative label: librettist for @no
label: is librettist-actor van @nl
definition: Relateert een actor aan een werk dat met zich meebrengt een verantwoordelijkheid van een actor voor schrijven van de woorden van een opera of ander muzikaal podiumwerk of een oratorium. @nl
toolkit label: librettist-actor van @nl
toolkit definition: Een werk dat met zich meebrengt een verantwoordelijkheid van een actor voor schrijven van de woorden van een opera of ander muzikaal podiumwerk of een oratorium. @nl
label: هو وكيل واضع كلمات الأوبر لـ @ar
definition: يربط وكيلا بعمل يترتب عليه مسئولية وكيل عن تأليف أوبرا أو عمل مسرحي موسيقي، أو موسيقى دينية. @ar
alternative label: واضع كلمات الأوبرا @ar
toolkit label: وكيل واضع كلمات الأوبرا @ar
toolkit definition: عمل يترتب عليه مسئولية وكيل عن تأليف أوبرا أو عمل مسرحي موسيقي، أو موسيقى دينية. @ar
alternative label: llibretista de @ca
alternative label: librettist af @da
label: libretist (tegija) teoses @et
definition: Seostab tegija teosega, mis sisaldab tegija vastutust ooperi või muu muusikalise lavateose või oratooriumi sõnade kirjutamise eest. @et
alternative label: libretist teoses @et
toolkit label: libretist (tegija) teoses @et
toolkit definition: Teos, mis sisaldab tegija vastutust ooperi või muu muusikalise lavateose või oratooriumi sõnade kirjutamise eest. @et
alternative label: librettistája: @hu
label: è librettista agente di @it
definition: Correla un agente a un'opera che implica la responsabilità di un agente come autore dei testi di un'opera lirica, altra opera musicale da palcoscenico o oratorio. @it
alternative label: librettista di @it
toolkit label: librettista agente di @it
toolkit definition: Opera che implica la responsabilità di un agente come autore dei testi di un'opera lirica, altra opera musicale da palcoscenico o oratorio. @it
alternative label: λιμπρετίστας του @el
alternative label: librettiste de @fr
label: ir libretists (aģents) @lv
definition: Sasaista aģentu ar darbu, kas ietver aģenta atbildību par tekstu operai vai citam muzikālam skatuves darbam, vai oratorijai. @lv
toolkit label: ir libretists (aģents) @lv
toolkit definition: Darbs, kas ietver aģenta atbildību par tekstu operai vai citam muzikālam skatuves darbam, vai oratorijai. @lv
alternative label: Librettist von @de
alternative label: ……的台本作者 @zh-hans
toolkit label: ……的台本作者行为者 @zh-hans
toolkit definition: 涉及歌剧或其他舞台音乐作品或者清唱剧的歌词的写作的一个行为者的责任的一种作品 @zh-hans
toolkit label: opera metni yazarı temsilcisi @tr
toolkit definition: Bir opera veya diğer müzikal sahne eserinin veya bir oratoryonun sözlerinin yazılmasında bir temsilcinin sorumluluğunu içeren bir eser. @tr

libretisti (yhteistoimija) teoksessa
status: Published
label: is librettist collective agent of @en
lexical alias: librettistCollectiveAgentOf.en
definition: Relates a collective agent to a work that involves a responsibility of a collective agent for authoring the words of an opera or other musical stage work, or an oratorio. @en
toolkit label: librettist collective agent of @en
toolkit definition: A work that involves a responsibility of a collective agent for authoring the words of an opera or other musical stage work, or an oratorio. @en
type: Property
domain: C10011
has element type: 2
sub property of: kirjoittaja (yhteistoimija) teoksessa
sub property of: libretisti (toimija) teoksessa
definition: Liittää yhteistoimijan teokseen, jossa yhteistoimija on vastuussa musiikki- tai koreografisen teoksen, kuten oopperan, baletin tai muun musiikillisen näyttämöteoksen tai oratorion sanojen kirjoittamisesta.
toolkit label: libretisti (yhteistoimija) teoksessa
toolkit definition: Teos, jossa yhteistoimija on vastuussa musiikki- tai koreografisen teoksen, kuten oopperan, baletin tai muun musiikillisen näyttämöteoksen tai oratorion sanojen kirjoittamisesta.
label: er librettist for (kollektiv agent) @no
definition: Relaterer en kollektiv agent til et verk som involverer et ansvar for en kollektiv agent i form av å være forfatter av ordene i en opera eller annet verk for en musikalsk scene, eller et oriatorium. @no
toolkit label: librettist for (kollektiv agent) @no
toolkit definition: Et verk som involverer et ansvar for en kollektiv agent i form av å være forfatter av ordene i en opera eller annet verk for en musikalsk scene, eller et oriatorium. @no
label: is librettist-collectieve actor van @nl
definition: Relateert een collectieve actor aan een werk dat met zich meebrengt een verantwoordelijkheid van een collectieve actor voor schrijven van de woorden van een opera of ander muzikaal podiumwerk of een oratorium. @nl
toolkit label: librettist-collectieve actor van @nl
toolkit definition: Een werk dat met zich meebrengt een verantwoordelijkheid van een collectieve actor voor schrijven van de woorden van een opera of ander muzikaal podiumwerk of een oratorium. @nl
label: هو وكيل جماعي واضع كلمات الأوبرا لـ @ar
definition: يربط وكيلا جماعيا بعمل يترتب عليه مسئولية وكيل جماعي عن تأليف كلمات الأوبرا أو غيرها من أعمال المسرح الموسيقي، أو موسيقى دينية. @ar
toolkit label: وكيل جماعي واضع كلمات الأوبرا @ar
toolkit definition: عمل يترتب عليه مسئولية وكيل جماعي عن تأليف كلمات الأوبرا أو غيرها من أعمال المسرح الموسيقي، أو موسيقى دينية. @ar
label: és agent col·lectiu llibretista de @ca
definition: Relaciona un agent col·lectiu amb una obra que implica una responsabilitat d’un agent col·lectiu en l’autoria de les paraules d’una òpera o una altra obra escènica musical o d’un oratori. @ca
toolkit label: agent col·lectiu llibretista de @ca
toolkit definition: Obra que implica una responsabilitat d’un agent col·lectiu en l’autoria de les paraules d’una òpera o una altra obra escènica musical o d’un oratori. @ca
label: er kollektiv agent, som er librettist af @da
definition: Relaterer en kollektiv agent til et værk, som involverer en kollektiv agents ansvar for at forfatte ordene til en opera eller andet musikalsk sceneværk eller et oratorium. @da
toolkit label: kollektiv agent, som er librettist af @da
toolkit definition: Værk, som involverer en kollektiv agents ansvar for at forfatte ordene til en opera eller andet musikalsk sceneværk eller et oratorium. @da
label: libretist (kollektiiv) teoses @et
definition: Seostab kollektiivi teosega, mis sisaldab kollektiivi vastutust ooperi või muu muusikalise lavateose või oratooriumi sõnade kirjutamise eest. @et
toolkit label: libretist (kollektiiv) teoses @et
toolkit definition: Teos, mis sisaldab kollektiivi vastutust ooperi või muu muusikalise lavateose või oratooriumi sõnade kirjutamise eest. @et
label: ist gemeinschaftlicher Akteur als Librettistin/Librettist von @de
definition: Setzt einen gemeinschaftlichen Akteur in Beziehung zu einem Werk, bei dem ein gemeinschaftlicher Akteur für das Verfassen des Texts einer Oper, eines sonstigen Bühnenwerks oder eines Oratoriums verantwortlich ist. @de
toolkit label: Gemeinschaftlicher Akteur als Librettistin/Librettist von @de
toolkit definition: Ein Werk, bei dem ein gemeinschaftlicher Akteur für das Verfassen des Texts einer Oper, eines sonstigen Bühnenwerks oder eines Oratoriums verantwortlich ist. @de
label: librettista kollektív ágense a következőnek: @hu
definition: Hozzákapcsol egy kollektív ágenst egy műhöz, amelyhez hozzátartozik egy kollektív ágens felelőssége egy opera vagy más zenés színpadi mű vagy egy oratórium szövegének szerzőségéért. @hu
toolkit label: librettista kollektív ágense: @hu
toolkit definition: Egy mű, amelyhez hozzátartozik egy kollektív ágens felelőssége egy opera vagy más zenés színpadi mű vagy egy oratórium szövegének szerzőségéért. @hu
label: è librettista agente collettivo di @it
definition: Correla un agente collettivo a un'opera che implica una responsabilità di un agente collettivo come autore dei testi di un'opera lirica, altra opera musicale da palcoscenico o oratorio. @it
toolkit label: librettista agente collettivo di @it
toolkit definition: Opera che implica una responsabilità di un agente collettivo come autore dei testi di un'opera lirica, altra opera musicale da palcoscenico o oratorio. @it
label: είναι λιμπρετίστας συλλογικός φορέας του @el
toolkit label: λιμπρετίστας συλλογικός φορέας του @el
label: est un agent collectif librettiste de @fr
definition: Met un agent collectif en relation avec une œuvre qui comporte une responsabilité de la part d’un agent collectif consistant à être l’auteur des paroles d’un opéra ou d’une autre œuvre musicale scénique ou d’un oratorio. @fr
toolkit label: agent collectif librettiste de @fr
toolkit definition: Œuvre qui comporte une responsabilité de la part d’un agent collectif consistant à être l’auteur des paroles d’un opéra ou d’une autre œuvre musicale scénique ou d’un oratorio. @fr
label: ir libretists (grupa) @lv
definition: Sasaista grupu ar darbu, kas ietver grupas atbildību par tekstu operai vai citam muzikālam skatuves darbam, vai oratorijai. @lv
toolkit label: ir libretists (grupa) @lv
toolkit definition: Darbs, kas ietver grupas atbildību par tekstu operai vai citam muzikālam skatuves darbam, vai oratorijai. @lv
label: 是……的台本作者集体行为者 @zh-hans
definition: 将一个集体行为者与涉及歌剧或其他舞台音乐作品或者清唱剧的歌词的写作的一个集体行为者的责任的一种作品关联起来。 @zh-hans
toolkit label: ……的台本作者集体行为者 @zh-hans
toolkit definition: 涉及歌剧或其他舞台音乐作品或者清唱剧的歌词的写作的一个集体行为者的责任的一种作品 @zh-hans
label: libretto yazarı kolektif temsilcisidir @tr
definition: Kolektif bir temsilciyi, bir operanın veya başka bir müzikal sahne eserinin ya da bir oratoryonun sözlerini yazma sorumluluğunu içeren bir eserle ilişkilendirir. @tr
toolkit label: Opera metni yazarı kolektif temsilcisi @tr
toolkit definition: Bir operanın veya başka bir müzikal sahne eserinin ya da bir oratoryonun sözlerini yazmak için kolektif bir temsilcinin sorumluluğunu içeren bir eser. @tr
has subproperty: libretisti (yhteisö) teoksessa
has subproperty: libretisti (suku) teoksessa
has subproperty: P50685

libretisti (yhteisö) teoksessa
status: Published
label: is librettist corporate body of @en
lexical alias: librettistCorporateBodyOf.en
definition: Relates a corporate body to a work that involves a responsibility of a corporate body for authoring the words of an opera or other musical stage work, or an oratorio. @en
toolkit label: librettist corporate body of @en
toolkit definition: A work that involves a responsibility of a corporate body for authoring the words of an opera or other musical stage work, or an oratorio. @en
type: Property
domain: C10005
has element type: 2
sub property of: kirjoittaja (yhteisö) teoksessa
sub property of: libretisti (yhteistoimija) teoksessa
definition: Liittää yhteisön teokseen, jossa yhteisö on vastuussa musiikki- tai koreografisen teoksen, kuten oopperan, baletin tai muun musiikillisen näyttämöteoksen tai oratorion sanojen kirjoittamisesta.
toolkit label: libretisti (yhteisö) teoksessa
toolkit definition: Teos, jossa yhteisö on vastuussa musiikki- tai koreografisen teoksen, kuten oopperan, baletin tai muun musiikillisen näyttämöteoksen tai oratorion sanojen kirjoittamisesta.
label: er librettist for (korporasjon) @no
definition: Relaterer en korporasjon til et verk som involverer et ansvar for en korporasjon i form av å være forfatter av ordene i en opera eller annet verk for en musikalsk scene, eller et oriatorium. @no
toolkit label: librettist for (korporasjon) @no
toolkit definition: Et verk som involverer et ansvar for en korporasjon i form av å være forfatter av ordene i en opera eller annet verk for en musikalsk scene, eller et oriatorium. @no
label: is librettist-corporatie van @nl
definition: Relateert een corporatie aan een werk dat met zich meebrengt een verantwoordelijkheid van een corporatie voor schrijven van de woorden van een opera of ander muzikaal podiumwerk of een oratorium. @nl
toolkit label: librettist-corporatie van @nl
toolkit definition: Een werk dat met zich meebrengt een verantwoordelijkheid van een corporatie voor schrijven van de woorden van een opera of ander muzikaal podiumwerk of een oratorium. @nl
label: هي هيئة مسئولة عن وضع كلمات الأوبرا لـ @ar
definition: يربط هيئة بعمل يترتب عليه مسئولية هيئة عن تأليف كلمات الأوبرا أو غيرها من أعمال المسرح الموسيقي، أو موشحات دينية. @ar
toolkit label: هيئة مسئولة عن وضع لكلمات الأوبرا @ar
toolkit definition: عمل يترتب عليه مسئولية هيئة عن تأليف كلمات الأوبرا أو غيرها من أعمال المسرح الموسيقي، أو موشحات دينية. @ar
label: és entitat corporativa llibretista de @ca
definition: Relaciona una entitat corporativa amb una obra que implica una responsabilitat d’una entitat corporativa en l’autoria de les paraules d’una òpera o una altra obra escènica musical o d’un oratori. @ca
toolkit label: entitat corporativa llibretista de @ca
toolkit definition: Obra que implica una responsabilitat d’una entitat corporativa en l’autoria de les paraules d’una òpera o una altra obra escènica musical o d’un oratori. @ca
label: er korporation, som er librettist af @da
definition: Relaterer en korporation til et værk, som involverer en korporations ansvar for at forfatte ordene til en opera eller andet musikalsk sceneværk eller et oratorium. @da
toolkit label: korporation, som er librettist af @da
toolkit definition: Værk, som involverer en korporations ansvar for at forfatte ordene til en opera eller andet musikalsk sceneværk eller et oratorium. @da
label: libretist (asutus) teoses @et
definition: Seostab asutuse teosega, mis sisaldab asutuse vastutust ooperi või muu muusikalise lavateose või oratooriumi sõnade kirjutamise eest. @et
toolkit label: libretist (asutus) teoses @et
toolkit definition: Teos, mis sisaldab asutuse vastutust ooperi või muu muusikalise lavateose või oratooriumi sõnade kirjutamise eest. @et
label: ist Körperschaft als Librettistin/Librettist von @de
definition: Setzt eine Körperschaft in Beziehung zu einem Werk, bei dem eine Körperschaft für das Verfassen des Texts einer Oper, eines sonstigen Bühnenwerks oder eines Oratoriums verantwortlich ist. @de
toolkit label: Körperschaft als Librettistin/Librettist von @de
toolkit definition: Ein Werk, bei dem eine Körperschaft für das Verfassen des Texts einer Oper, eines sonstigen Bühnenwerks oder eines Oratoriums verantwortlich ist. @de
label: librettista testülete a következőnek: @hu
definition: Hozzákapcsol egy testületet egy műhöz, amelyhez hozzátartozik egy testület felelőssége egy opera vagy más zenés színpadi mű vagy egy oratórium szövegének szerzőségéért. @hu
toolkit label: librettista testülete: @hu
toolkit definition: Egy mű, amelyhez hozzátartozik egy testület felelőssége egy opera vagy más zenés színpadi mű vagy egy oratórium szövegének szerzőségéért. @hu
label: è librettista ente di @it
definition: Correla un ente a un'opera che implica una responsabilità di un ente come autore dei testi di un'opera lirica, altra opera musicale da palcoscenico o oratorio. @it
toolkit label: librettista ente di @it
toolkit definition: Opera che implica una responsabilità di un ente come autore dei testi di un'opera lirica, altra opera musicale da palcoscenico o oratorio. @it
label: είναι λιμπρετίστας συλλογικό όργανο του @el
toolkit label: λιμπρετίστας συλλογικό όργανο του @el
label: est une collectivité librettiste de @fr
definition: Met une collectivité en relation avec une œuvre qui comporte une responsabilité de la part d’une collectivité consistant à être l’auteur des paroles d’un opéra ou d’une autre œuvre musicale scénique ou d’un oratorio. @fr
toolkit label: collectivité librettiste de @fr
toolkit definition: Œuvre qui comporte une responsabilité de la part d’une collectivité consistant à être l’auteur des paroles d’un opéra ou d’une autre œuvre musicale scénique ou d’un oratorio. @fr
label: ir libretists (institūcija) @lv
definition: Sasaista institūciju ar darbu, kas ietver institūcijas atbildību par tekstu operai vai citam muzikālam skatuves darbam, vai oratorijai. @lv
toolkit label: ir libretists (institūcija) @lv
toolkit definition: Darbs, kas ietver institūcijas atbildību par tekstu operai vai citam muzikālam skatuves darbam, vai oratorijai. @lv
label: 是……的台本作者团体 @zh-hans
definition: 将一个团体与涉及歌剧或其他舞台音乐作品或者清唱剧的歌词的写作的一个团体的责任的一种作品关联起来。 @zh-hans
toolkit label: ……的台本作者团体 @zh-hans
toolkit definition: 涉及歌剧或其他舞台音乐作品或者清唱剧的歌词的写作的一个团体的责任的一种作品 @zh-hans
label: libretto yazarı tüzel kişisidir @tr
definition: Bir tüzel kişiyi, Bir opera veya diğer müzikal sahne eserinin veya bir oratoryonun sözlerinin yazılmasında bir tüzel kişinin sorumluluğunu içeren bir eserle ilişkilendirir. @tr
toolkit label: Opera metni yazarı tüzel kişisi @tr
toolkit definition: Bir opera veya diğer müzikal sahne eserinin veya bir oratoryonun sözlerinin yazılmasında bir tüzel kişinin sorumluluğunu içeren bir eser. @tr
has subproperty: P50836

libretisti (suku) teoksessa
status: Published
label: is librettist family of @en
lexical alias: librettistFamilyOf.en
definition: Relates a family to a work that involves a responsibility of a family for authoring the words of an opera or other musical stage work, or an oratorio. @en
toolkit label: librettist family of @en
toolkit definition: A work that involves a responsibility of a family for authoring the words of an opera or other musical stage work, or an oratorio. @en
type: Property
domain: C10008
has element type: 2
sub property of: kirjoittaja (suku) teoksessa
sub property of: libretisti (yhteistoimija) teoksessa
definition: Liittää suvun teokseen, jossa suku on vastuussa musiikki- tai koreografisen teoksen, kuten oopperan, baletin tai muun musiikillisen näyttämöteoksen tai oratorion sanojen kirjoittamisesta.
toolkit label: libretisti (suku) teoksessa
toolkit definition: Teos, jossa suku on vastuussa musiikki- tai koreografisen teoksen, kuten oopperan, baletin tai muun musiikillisen näyttämöteoksen tai oratorion sanojen kirjoittamisesta.
label: er librettist for (familie) @no
definition: Relaterer en familie til et verk som involverer et ansvar for en familie i form av å være forfatter av ordene i en opera eller annet verk for en musikalsk scene, eller et oriatorium. @no
toolkit label: librettist for (familie) @no
toolkit definition: Et verk som involverer et ansvar for en familie i form av å være forfatter av ordene i en opera eller annet verk for en musikalsk scene, eller et oriatorium. @no
label: is librettist-familie van @nl
definition: Relateert een familie aan een werk dat met zich meebrengt een verantwoordelijkheid van een familie voor schrijven van de woorden van een opera of ander muzikaal podiumwerk of een oratorium. @nl
toolkit label: librettist-familie van @nl
toolkit definition: Een werk dat met zich meebrengt een verantwoordelijkheid van een familie voor schrijven van de woorden van een opera of ander muzikaal podiumwerk of een oratorium. @nl
label: هي عائلة مسئولة عن وضع كلمات الأوبرا لـ @ar
definition: يربط عائلة بعمل يترتب عليه مسئولية عائلة عن تأليف كلمات الأوبرا أو غيرها من أعمال المسرح الموسيقي، أو تواشيح دينية. @ar
toolkit label: عائلة مسئولة عن وضع كلمات الأوبرا @ar
toolkit definition: يترتب عليه مسئولية عائلة عن تأليف كلمات الأوبرا أو غيرها من أعمال المسرح الموسيقي، أو موسيقى دينية. @ar
label: és família llibretista de @ca
definition: Relaciona una família amb una obra que implica una responsabilitat d’una família en l’autoria de les paraules d’una òpera o una altra obra escènica musical o d’un oratori. @ca
toolkit label: família llibretista de @ca
toolkit definition: Obra que implica una responsabilitat d’una família en l’autoria de les paraules d’una òpera o una altra obra escènica musical o d’un oratori. @ca
label: er familie, som er librettist af @da
definition: Relaterer en familie til et værk, som involverer en families ansvar for at forfatte ordene til en opera eller andet musikalsk sceneværk eller et oratorium. @da
toolkit label: familie, som er librettist af @da
toolkit definition: Værk, som involverer en families ansvar for at forfatte ordene til en opera eller andet musikalsk sceneværk eller et oratorium. @da
label: libretist (perekond) teoses @et
definition: Seostab perekonna teosega, mis sisaldab perekonna vastutust ooperi või muu muusikalise lavateose või oratooriumi sõnade kirjutamise eest. @et
toolkit label: libretist (perekond) teoses @et
toolkit definition: Teos, mis sisaldab perekonna vastutust ooperi või muu muusikalise lavateose või oratooriumi sõnade kirjutamise eest. @et
label: ist Familie als Librettistin/Librettist von @de
definition: Setzt eine Familie in Beziehung zu einem Werk, bei dem eine Familie für das Verfassen des Texts einer Oper, eines sonstigen Bühnenwerks oder eines Oratoriums verantwortlich ist. @de
toolkit label: Familie als Librettistin/Librettist von @de
toolkit definition: Ein Werk, bei dem eine Familie für das Verfassen des Texts einer Oper, eines sonstigen Bühnenwerks oder eines Oratoriums verantwortlich ist. @de
label: librettista családja a következőnek: @hu
definition: Hozzákapcsol egy családot egy műhöz, amelyhez hozzátartozik egy család felelőssége egy opera vagy más zenés színpadi mű vagy egy oratórium szövegének szerzőségéért. @hu
toolkit label: librettista családja: @hu
toolkit definition: Egy mű, amelyhez hozzátartozik egy család felelőssége egy opera vagy más zenés színpadi mű vagy egy oratórium szövegének szerzőségéért. @hu
label: è librettista famiglia di @it
definition: Correla una famiglia a un'opera che implica una responsabilità di una famiglia come autore dei testi di un'opera lirica, altra opera musicale da palcoscenico o oratorio. @it
toolkit label: librettista famiglia di @it
toolkit definition: Opera che implica una responsabilità di una famiglia come autore dei testi di un'opera lirica, altra opera musicale da palcoscenico o oratorio. @it
label: είναι λιμπρετίστας οικογένεια του @el
toolkit label: λιμπρετίστας οικογένεια του @el
label: est une famille librettiste de @fr
definition: Met une famille en relation avec une œuvre qui comporte une responsabilité de la part d’une famille consistant à être l’auteur des paroles d’un opéra ou d’une autre œuvre musicale scénique ou d’un oratorio. @fr
toolkit label: famille librettiste de @fr
toolkit definition: Œuvre qui comporte une responsabilité de la part d’une famille consistant à être l’auteur des paroles d’un opéra ou d’une autre œuvre musicale scénique ou d’un oratorio. @fr
label: ir libretists (dzimta/ģimene) @lv
definition: Sasaista dzimtu/ģimeni ar darbu, kas ietver dzimtas/ģimenes atbildību par tekstu operai vai citam muzikālam skatuves darbam, vai oratorijai. @lv
toolkit label: ir libretists (dzimta/ģimene) @lv
toolkit definition: Darbs, kas ietver dzimtas/ģimenes atbildību par tekstu operai vai citam muzikālam skatuves darbam, vai oratorijai. @lv
label: 是……的台本作者家族 @zh-hans
definition: 将一个家族与涉及歌剧或其他舞台音乐作品或者清唱剧的歌词的写作的一个家族的责任的一种作品关联起来。 @zh-hans
toolkit label: ……的台本作者家族 @zh-hans
toolkit definition: 涉及歌剧或其他舞台音乐作品或者清唱剧的歌词的写作的一个家族的责任的一种作品 @zh-hans
label: libretto yazarı ailesidir @tr
definition: Bir aileyi, bir operanın veya başka bir müzikal sahne eserinin veya bir oratoryonun sözlerini yazmak için bir ailenin sorumluluğunu içeren bir eserle ilişkilendirir. @tr
toolkit label: opera metni yazarı ailesi @tr
toolkit definition: Bir opera veya diğer müzikal sahne eserinin veya bir oratoryonun sözlerinin yazılmasında bir ailenin sorumluluğunu içeren bir eser. @tr
has subproperty: P50987

libretisti (henkilö) teoksessa
status: Published
label: is librettist person of @en
lexical alias: librettistPersonOf.en
definition: Relates a person to a work that involves a responsibility of a person for authoring the words of an opera or other musical stage work, or an oratorio. @en
toolkit label: librettist person of @en
toolkit definition: A work that involves a responsibility of a person for authoring the words of an opera or other musical stage work, or an oratorio. @en
type: Property
domain: C10004
has element type: 2
sub property of: kirjoittaja (henkilö) teoksessa
sub property of: libretisti (toimija) teoksessa
definition: Liittää henkilön teokseen, jossa henkilö on vastuussa musiikki- tai koreografisen teoksen, kuten oopperan, baletin tai muun musiikillisen näyttämöteoksen tai oratorion sanojen kirjoittamisesta.
toolkit label: libretisti (henkilö) teoksessa
toolkit definition: Teos, jossa henkilö on vastuussa musiikki- tai koreografisen teoksen, kuten oopperan, baletin tai muun musiikillisen näyttämöteoksen tai oratorion sanojen kirjoittamisesta.
label: er librettist for (person) @no
definition: Relaterer en person til et verk som involverer et ansvar for en person i form av å være forfatter av ordene i en opera eller annet verk for en musikalsk scene, eller et oriatorium. @no
toolkit label: librettist for (person) @no
toolkit definition: Et verk som involverer et ansvar for en person i form av å være forfatter av ordene i en opera eller annet verk for en musikalsk scene, eller et oriatorium. @no
label: is librettist-persoon van @nl
definition: Relateert een persoon aan een werk dat met zich meebrengt een verantwoordelijkheid van een persoon voor schrijven van de woorden van een opera of ander muzikaal podiumwerk of een oratorium. @nl
toolkit label: librettist-persoon van @nl
toolkit definition: Een werk dat met zich meebrengt een verantwoordelijkheid van een persoon voor schrijven van de woorden van een opera of ander muzikaal podiumwerk of een oratorium. @nl
label: هو شخص واضع كلمات الأوبرا لـ @ar
definition: يربط شخصا بعمل يترتب عليه مسئولية شخص عن تأليف كلمات الأوبرا أو غيرها من أعمال المسرح الموسيقي، أو موشحات دينية @ar
toolkit label: شخص واضع كلمات الأوبرا @ar
toolkit definition: عمل يترتب عليه مسئولية شخص عن تأليف كلمات الأوبرا أو غيرها من أعمال المسرح الموسيقي، أو موشحات دينية. @ar
label: és persona llibretista de @ca
definition: Relaciona una persona amb una obra que implica una responsabilitat d’una persona en l’autoria de les paraules d’una òpera o una altra obra escènica musical o d’un oratori. @ca
toolkit label: persona llibretista de @ca
toolkit definition: Obra que implica una responsabilitat d’una persona en l’autoria de les paraules d’una òpera o una altra obra escènica musical o d’un oratori. @ca
label: er person, som er librettist af @da
definition: Relaterer en person til et værk, som involverer en persons ansvar for at forfatte ordene til en opera eller andet musikalsk sceneværk eller et oratorium. @da
toolkit label: person, som er librettist af @da
toolkit definition: Værk, som involverer en persons ansvar for at forfatte ordene til en opera eller andet musikalsk sceneværk eller et oratorium. @da
label: libretist (isik) teoses @et
definition: Seostab isiku teosega, mis sisaldab isiku vastutust ooperi või muu muusikalise lavateose või oratooriumi sõnade kirjutamise eest. @et
toolkit label: libretist (isik) teoses @et
toolkit definition: Teos, mis sisaldab isiku vastutust ooperi või muu muusikalise lavateose või oratooriumi sõnade kirjutamise eest. @et
label: ist Person als Librettistin/Librettist von @de
definition: Setzt eine Person in Beziehung zu einem Werk, bei dem eine Person für das Verfassen des Texts einer Oper, eines sonstigen Bühnenwerks oder eines Oratoriums verantwortlich ist. @de
toolkit label: Person als Librettistin/Librettist von @de
toolkit definition: Ein Werk, bei dem eine Person für das Verfassen des Texts einer Oper, eines sonstigen Bühnenwerks oder eines Oratoriums verantwortlich ist. @de
label: librettista személye a következőnek: @hu
definition: Hozzákapcsol egy személyt egy műhöz, amelyhez hozzátartozik egy személy felelőssége egy opera vagy más zenés színpadi mű vagy egy oratórium szövegének szerzőségéért. @hu
toolkit label: librettista személye: @hu
toolkit definition: Egy mű, amelyhez hozzátartozik egy személy felelőssége egy opera vagy más zenés színpadi mű vagy egy oratórium szövegének szerzőségéért. @hu
label: è librettista persona di @it
definition: Correla una persona a un'opera che implica una responsabilità di una persona come autore dei testi di un'opera lirica, altra opera musicale da palcoscenico o oratorio. @it
toolkit label: librettista persona di @it
toolkit definition: Opera che implica una responsabilità di una persona come autore dei testi di un'opera lirica, altra opera musicale da palcoscenico o oratorio. @it
label: είναι λιμπρετίστας φυσικό πρόσωπο του @el
toolkit label: λιμπρετίστας φυσικό πρόσωπο του @el
label: est une personne librettiste de @fr
definition: Met une personne en relation avec une œuvre qui comporte une responsabilité de la part d’une personne consistant à être l’auteur des paroles d’un opéra ou d’une autre œuvre musicale scénique ou d’un oratorio. @fr
toolkit label: personne librettiste de @fr
toolkit definition: Œuvre qui comporte une responsabilité de la part d’une personne consistant à être l’auteur des paroles d’un opéra ou d’une autre œuvre musicale scénique ou d’un oratorio. @fr
label: ir libretists (persona) @lv
definition: Sasaista personu ar darbu, kas ietver personas atbildību par tekstu operai vai citam muzikālam skatuves darbam, vai oratorijai. @lv
toolkit label: ir libretists (persona) @lv
toolkit definition: Darbs, kas ietver personas atbildību par tekstu operai vai citam muzikālam skatuves darbam, vai oratorijai. @lv
label: 是……的台本作者个人 @zh-hans
definition: 将一个个人与涉及歌剧或其他舞台音乐作品或者清唱剧的歌词的写作的一个个人的责任的一种作品关联起来。 @zh-hans
toolkit label: ……的台本作者个人 @zh-hans
toolkit definition: 涉及歌剧或其他舞台音乐作品或者清唱剧的歌词的写作的一个个人的责任的一种作品 @zh-hans
label: libretto yazarı kişisidir @tr
definition: Bir kişiyi, bir operanın veya başka bir müzikalin veya bir oratoryonun yazma sorumluluğunu içeren bir eserle ilişkilendirir @tr
toolkit label: Opera metni yazarı @tr
toolkit definition: Bir opera veya diğer müzikal sahne eserinin veya bir oratoryonun sözlerinin yazılmasında bir kişinin sorumluluğunu içeren bir eser. @tr
has subproperty: P50534

valosuunnittelija (toimija) ekspressiossa
status: Published
type: Property
label: is lighting designer agent of @en
lexical alias: lightingDesignerAgentOf.en
definition: Relates an agent to an expression that includes a contribution by an agent of designing and creating lighting components. @en
domain: C10002
toolkit label: lighting designer agent of @en
toolkit definition: An expression that includes a contribution by an agent of designing and creating lighting components. @en
instruction number: 18.5
sub property of: esitykseen osallinen toimija ekspressiossa
label: είναι σχεδιαστής φωτισμού φορέας του @el
definition: Συνδέει έναν φορέα, ο οποίος συνεισφέρει σε μια έκφραση ενός έργου μέσω του σχεδιασμού και της δημιουργίας συστατικών φωτισμού, με μια έκφραση. @el
toolkit label: σχεδιαστής φωτισμού φορέας του @el
toolkit definition: Μια έκφραση ενός έργου που ενσωματώνει τη συνεισφορά του σχεδιασμού και της δημιουργίας συστατικών φωτισμού. @el
definition: Setzt einen Akteur in Beziehung zu einer Expression, zu der ein Akteur beiträgt, indem er Lichtelemente entwirft und erstellt. @de
toolkit label: Akteur als Lichtgestalterin/Lichtgestalter von @de
toolkit definition: Eine Expression, zu der ein Akteur beiträgt, indem er Lichtelemente entwirft und erstellt. @de
label: er agent, som er belysningsdesigner af @da
definition: Relaterer en agent til et udtryk, som omfatter en agents bidrag ved at designe og skabe belysningsdele. @da
toolkit label: agent, som er belysningsdesigner af @da
toolkit definition: Udtryk, som omfatter en agents bidrag ved at designe og skabe belysningsdele. @da
label: és agent dissenyador d’il·luminació de @ca
definition: Relaciona un agent amb una expressió que inclou una contribució d’un agent en el disseny i creació de components luminotècnics. @ca
toolkit label: agent dissenyador d’il·luminació de @ca
toolkit definition: Expressió que inclou una contribució d’un agent en el disseny i creació de components luminotècnics. @ca
definition: Liittää toimijan ekspressioon, jonka tekemiseen toimija osallistuu suunnittelemalla ja luomalla valokomponentteja.
toolkit label: valosuunnittelija (toimija) ekspressiossa
toolkit definition: Ekspressio, jonka tekemiseen toimija osallistuu suunnittelemalla ja luomalla valokomponentteja.
toolkit label: lysdesigner for (agent) @no
toolkit definition: Et uttrykk som inkluderer et bidrag fra en agent som utformer og skaper lyskomponenter. @no
label: ist Akteur als Lichtgestalterin/Lichtgestalter von @de
label: est un agent éclairagiste de @fr
definition: Met un agent en relation avec une expression qui intègre une contribution de la part d’un agent consistant à concevoir et à créer des effets de lumière. @fr
toolkit label: agent éclairagiste de @fr
toolkit definition: Expression qui intègre une contribution de la part d’un agent consistant à concevoir et à créer des effets de lumière. @fr
has element type: 2
label: világítástervező ágense a következőnek: @hu
definition: Hozzákapcsol egy ágenst egy kifejezési formához, amely magában foglalja egy ágens közreműködését világítási összetevők tervezésében és létrehozásában. @hu
toolkit label: világítástervező ágense: @hu
toolkit definition: Egy kifejezési forma, amely magában foglalja egy ágens közreműködését világítási összetevők tervezésében és létrehozásában. @hu
alternative label: lighting designer of @en
alternative label: valosuunnittelijana ekspressiossa
label: er lysdesigner for (agent) @no
definition: Relaterer en agent til et uttrykk som inkluderer et bidrag fra en agent som utformer og skaper lyskomponenter. @no
alternative label: lysdesigner for @no
label: is lichtontwerper-actor van @nl
definition: Relateert een actor aan een expressie die omvat een bijdrage door een actor door ontwerpen en creëren van lichteffecten. @nl
toolkit label: lichtontwerper-actor van @nl
toolkit definition: Een expressie die omvat een bijdrage door een actor door ontwerpen en creëren van lichteffecten. @nl
label: هو وكيل مصمم إضاءة لـ @ar
definition: يربط وكيلا بتعبيرة تتضمن إسهام وكيل في تصميم عناصر الإضاءة وإنشائها. @ar
alternative label: مصمم الإضاءة @ar
toolkit label: وكيل مصمم إضاءة @ar
toolkit definition: تعبيرة تتضمن إسهام وكيل في تصميم عناصر الإضاءة وإنشائها. @ar
alternative label: dissenyador d’il·luminació de @ca
alternative label: belysningsdesigner af @da
label: valguskujundaja (tegija) väljenduses @et
definition: Seostab tegija väljendusega, millesse tegija on andnud panuse, kavandades ja luues selle valguskomponendid. @et
alternative label: valguskujundaja väljenduses @et
toolkit label: valguskujundaja (tegija) väljenduses @et
toolkit definition: Väljendus, millesse tegija on andnud panuse, kavandades ja luues selle valguskomponendid. @et
alternative label: világítástervezője: @hu
label: è progettista dell'illuminazione @it
definition: Correla un agente a un'espressione che include un contributo da parte di un agente nella progettazione e creazione di componenti per l'illuminazione. @it
alternative label: pogettista dell'illuminazione di @it
toolkit label: progettista dell'illuminazione agente @it
toolkit definition: Espressione che include un contributo da parte di un agente per progettare e creare componenti di illuminazione. @it
alternative label: σχεδιαστής φωτισμού του @el
alternative label: éclairagiste de @fr
label: ir gaismu mākslinieks (aģents) @lv
definition: Sasaista aģentu ar izteiksmi, kas ietver aģenta ieguldījumu, izstrādājot un radot apgaismojuma efektus. @lv
toolkit label: ir gaismu mākslinieks (aģents) @lv
toolkit definition: Izteiksme, kas ietver aģenta ieguldījumu, izstrādājot un radot apgaismojuma efektus. @lv
alternative label: Lichtgestalter von @de
alternative label: ……的灯光设计者 @zh-hans
toolkit label: ……的灯光设计者行为者 @zh-hans
toolkit definition: 包括设计并创作灯光组成部分的一个行为者的贡献的一种内容表达 @zh-hans
toolkit label: Işık tasarımcısı temsilcisi @tr
toolkit definition: Aydınlatma bileşenleri tasarlayan ve yaratan bir temsilcinin katkısını içeren bir anlatım. @tr
has subproperty: valosuunnittelija (yhteistoimija) ekspressiossa

valosuunnittelija (yhteistoimija) ekspressiossa
status: Published
label: is lighting designer collective agent of @en
lexical alias: lightingDesignerCollectiveAgentOf.en
definition: Relates a collective agent to an expression that includes a contribution by a collective agent of designing and creating lighting components. @en
toolkit label: lighting designer collective agent of @en
toolkit definition: An expression that includes a contribution by a collective agent of designing and creating lighting components. @en
type: Property
domain: C10011
has element type: 2
sub property of: esitykseen osallinen yhteistoimija ekspressiossa
sub property of: valosuunnittelija (toimija) ekspressiossa
definition: Liittää yhteistoimijan ekspressioon, jossa yhteistoimija on osallisena suunnittelemalla ja luomalla valokomponentteja.
toolkit label: valosuunnittelija (yhteistoimija) ekspressiossa
toolkit definition: Ekspressio, jossa yhteistoimija on osallisena suunnittelemalla ja luomalla valokomponentteja.
label: er lysdesigner for (kollektiv agent) @no
definition: Relaterer en kollektiv agent til et uttrykk som inkluderer et bidrag fra en kollektiv agent i form av å utforme og skape lyssettingskomponenter. @no
toolkit label: lysdesigner for (kollektiv agent) @no
toolkit definition: Et uttrykk som inkluderer et bidrag fra en kollektiv agent i form av å utforme og skape lyssettingskomponenter. @no
label: is lichtontwerper-collectieve actor van @nl
definition: Relateert een collectieve actor aan een expressie die omvat een bijdrage door een collectieve actor door ontwerpen en creëren van lichteffecten. @nl
toolkit label: lichtontwerper-collectieve actor van @nl
toolkit definition: Een expressie die omvat een bijdrage door een collectieve actor door ontwerpen en creëren van lichteffecten. @nl
label: هو وكيل جماعي قائد فرقة عزف لـ @ar
definition: يربط وكيلا جماعيا بتعبيرة تتضمن إسهام وكيل جماعي في إدارة فرقة عزف وقيادتها في عرض موسيقي أو درامي. @ar
toolkit label: هو وكيل جماعي قائد فرقة عزف لـ @ar
toolkit definition: تعبيرة تتضمن إسهام وكيل جماعي بوضع مكياج أومكياج ترقيعي في إنتاج صور متحركة أو في عرض موسيقي أو درامي أو ترفيهي. @ar
label: és agent col·lectiu dissenyador d’il·luminació de @ca
definition: Relaciona un agent col·lectiu amb una expressió que inclou una contribució d’un agent col·lectiu en el disseny i creació de components luminotècnics. @ca
toolkit label: agent col·lectiu dissenyador d’il·luminació de @ca
toolkit definition: Expressió que inclou una contribució d’un agent col·lectiu en el disseny i creació de components luminotècnics. @ca
label: er kollektiv agent, som er belysningsdesigner af @da
definition: Relaterer en kollektiv agent til et udtryk, som omfatter en kollektiv agents bidrag ved at designe og skabe belysningsdele. @da
toolkit label: kollektiv agent, som er belysningsdesigner af @da
toolkit definition: Udtryk, som omfatter en kollektiv agents bidrag ved at designe og skabe belysningsdele. @da
label: valguskujundaja (kollektiiv) väljenduses @et
definition: Seostab kollektiivi väljendusega, millesse kollektiiv on andnud panuse, kavandades ja luues selle valguskomponendid. @et
toolkit label: valguskujundaja (kollektiiv) väljenduses @et
toolkit definition: Väljendus, millesse kollektiiv on andnud panuse, kavandades ja luues selle valguskomponendid. @et
label: ist gemeinschaftlicher Akteur als Lichtgestalterin/Lichtgestalter von @de
definition: Setzt einen gemeinschaftlichen Akteur in Beziehung zu einer Expression, zu der ein gemeinschaftlicher Akteur beiträgt, indem er Lichtelemente entwirft und erstellt. @de
toolkit label: Gemeinschaftlicher Akteur als Lichtgestalterin/Lichtgestalter von @de
toolkit definition: Eine Expression, zu der ein gemeinschaftlicher Akteur beiträgt, indem er Lichtelemente entwirft und erstellt. @de
label: világítástervező kollektív ágense a következőnek: @hu
definition: Hozzákapcsol egy kollektív ágenst egy kifejezési formához, amely magában foglalja egy kollektív ágens közreműködését világítási összetevők tervezésében és létrehozásában. @hu
toolkit label: világítástervező kollektív ágense: @hu
toolkit definition: Egy kifejezési forma, amely magában foglalja egy kollektív ágens közreműködését világítási összetevők tervezésében és létrehozásában. @hu
label: è progettista dell'illuminazione agente collettivo di @it
definition: Correla un agente collettivo a un'espressione che comprende un contributo di un agente collettivo nella progettazione e creazione di componenti per l'illuminazione. @it
toolkit label: progettista dell'illuminazione agente collettivo di @it
toolkit definition: Espressione che comprende un contributo di un agente collettivo nella progettazione e creazione di componenti per l'illuminazione. @it
label: είναι σχεδιαστής φωτισμού συλλογικός φορέας του @el
toolkit label: σχεδιαστής φωτισμού συλλογικός φορέας του @el
label: est un agent collectif éclairagiste de @fr
definition: Met un agent collectif en relation avec une expression qui intègre une contribution de la part d’un agent collectif consistant à concevoir et à créer des effets de lumière. @fr
toolkit label: agent collectif éclairagiste de @fr
toolkit definition: Expression qui intègre une contribution de la part d’un agent collectif consistant à concevoir et à créer des effets de lumière. @fr
label: ir gaismu mākslinieks (grupa) @lv
definition: Sasaista grupu ar izteiksmi, kas ietver grupas ieguldījumu, izstrādājot un radot apgaismojuma efektus. @lv
toolkit label: ir gaismu mākslinieks (grupa) @lv
toolkit definition: Izteiksme, kas ietver grupas ieguldījumu, izstrādājot un radot apgaismojuma efektus. @lv
label: 是……的灯光设计者集体行为者 @zh-hans
definition: 将一个集体行为者与包括设计并创作灯光组成部分的一个集体行为者的贡献的一种内容表达关联起来。 @zh-hans
toolkit label: ……的灯光设计者集体行为者 @zh-hans
toolkit definition: 包括设计并创作灯光组成部分的一个集体行为者的贡献的一种内容表达 @zh-hans
label: ışık tasarımcısı kolektif temsilcisidir @tr
definition: Kolektif bir temsilciyi, aydınlatma bileşenlerini tasarlamak ve oluşturmak için kolektif bir temsilcinin katkısını içeren bir anlatımla ilişkilendirir. @tr
toolkit label: Işık tasarımcısı kollektif temsilci @tr
toolkit definition: Işıklandırma bileşenlerini tasarlama ve oluşturulmasında kolektif bir temsilcinin katkısını içeren bir anlatım. @tr
has subproperty: valosuunnittelija (yhteisö) ekspressiossa
has subproperty: valosuunnittelija (suku) ekspressiossa
has subproperty: P50730

valosuunnittelija (yhteisö) ekspressiossa
status: Published
label: is lighting designer corporate body of @en
lexical alias: lightingDesignerCorporateBodyOf.en
definition: Relates a corporate body to an expression that includes a contribution by a corporate body of designing and creating lighting components. @en
toolkit label: lighting designer corporate body of @en
toolkit definition: An expression that includes a contribution by a corporate body of designing and creating lighting components. @en
type: Property
domain: C10005
has element type: 2
sub property of: esitykseen osallinen yhteisö ekspressiossa
sub property of: valosuunnittelija (yhteistoimija) ekspressiossa
definition: Liittää yhteisön ekspressioon, jossa yhteisö on osallisena suunnittelemalla ja luomalla valokomponentteja.
toolkit label: valosuunnittelija (yhteisö) ekspressiossa
toolkit definition: Ekspressio, jossa yhteisö on osallisena suunnittelemalla ja luomalla valokomponentteja.
label: er lysdesigner for (korporasjon) @no
definition: Relaterer en korporasjon til et uttrykk som inkluderer et bidrag fra en korporasjon i form av å utforme og skape lyssettingskomponenter. @no
toolkit label: lysdesigner for (korporasjon) @no
toolkit definition: Et uttrykk som inkluderer et bidrag fra en korporasjon i form av å utforme og skape lyssettingskomponenter. @no
label: is lichtontwerper-corporatie van @nl
definition: Relateert een corporatie aan een expressie die omvat een bijdrage door een corporatie door ontwerpen en creëren van lichteffecten. @nl
toolkit label: lichtontwerper-corporatie van @nl
toolkit definition: Een expressie die omvat een bijdrage door een corporatie door ontwerpen en creëren van lichteffecten. @nl
label: هي هيئة مسئولة عن تصميم الإضاءة لـ @ar
definition: يربط هيئة بتعبيرة تتضمن إسهام هيئة في تصميم عناصرالإضاءة وإنشائها. @ar
toolkit label: هيئة مسئولة عن تصميم الإضاءة @ar
toolkit definition: تعبيرة تتضمن إسهام هيئة في تصميم عناصرالإضاءة وإنشائها. @ar
label: és entitat corporativa dissenyadora d’il·luminació de @ca
definition: Relaciona una entitat corporativa amb una expressió que inclou una contribució d’una entitat corporativa en el disseny i creació de components luminotècnics. @ca
toolkit label: entitat corporativa dissenyadora d’il·luminació de @ca
toolkit definition: Expressió que inclou una contribució d’una entitat corporativa en el disseny i creació de components luminotècnics. @ca
label: er korporation, som er belysningsdesigner af @da
definition: Relaterer en korporation til et udtryk, som omfatter en korporations bidrag ved at designe og skabe belysningsdele. @da
toolkit label: korporation, som er belysningsdesigner af @da
toolkit definition: Udtryk, som omfatter en korporations bidrag ved at designe og skabe belysningsdele. @da
label: valguskujundaja (asutus) väljenduses @et
definition: Seostab asutuse väljendusega, millesse asutus on andnud panuse, kavandades ja luues selle valguskomponendid. @et
toolkit label: valguskujundaja (asutus) väljenduses @et
toolkit definition: Väljendus, millesse asutus on andnud panuse, kavandades ja luues selle valguskomponendid. @et
label: ist Körperschaft als Lichtgestalterin/Lichtgestalter von @de
definition: Setzt eine Körperschaft in Beziehung zu einer Expression, zu der eine Körperschaft beiträgt, indem sie Lichtelemente entwirft und erstellt. @de
toolkit label: Körperschaft als Lichtgestalterin/Lichtgestalter von @de
toolkit definition: Eine Expression, zu der eine Körperschaft beiträgt, indem sie Lichtelemente entwirft und erstellt. @de
label: világítástervező testülete: @hu
definition: Hozzákapcsol egy testületet egy kifejezési formához, amely magában foglalja egy testület közreműködését világítási összetevők tervezésében és létrehozásában. @hu
toolkit label: világítástervező testülete: @hu
toolkit definition: Egy kifejezési forma, amely magában foglalja egy testület közreműködését világítási összetevők tervezésében és létrehozásában. @hu
label: è progettista dell'illuminazione ente di @it
definition: Correla un ente a un'espressione che comprende un contributo di un ente nella progettazione e creazione di componenti per l'illuminazione. @it
toolkit label: progettista dell'illuminazione ente di @it
toolkit definition: Espressione che comprende un contributo di un ente nella progettazione e creazione di componenti per l'illuminazione. @it
label: είναι σχεδιαστής φωτισμού συλλογικό όργανο του @el
toolkit label: σχεδιαστής φωτισμού συλλογικό όργανο του @el
label: est une collectivité éclairagiste de @fr
definition: Met une collectivité en relation avec une expression qui intègre une contribution de la part d’une collectivité consistant à concevoir et à créer des effets de lumière. @fr
toolkit label: collectivité éclairagiste de @fr
toolkit definition: Expression qui intègre une contribution de la part d’une collectivité consistant à concevoir et à créer des effets de lumière. @fr
label: ir gaismu mākslinieks (institūcija) @lv
definition: Sasaista institūciju ar izteiksmi, kas ietver institūcijas ieguldījumu, izstrādājot un radot apgaismojuma efektus. @lv
toolkit label: ir gaismu mākslinieks (institūcija) @lv
toolkit definition: Izteiksme, kas ietver institūcijas ieguldījumu, izstrādājot un radot apgaismojuma efektus. @lv
label: 是……的灯光设计者团体 @zh-hans
definition: 将一个团体与包括设计并创作灯光组成部分的一个团体的贡献的一种内容表达关联起来。 @zh-hans
toolkit label: ……的灯光设计者团体 @zh-hans
toolkit definition: 包括设计并创作灯光组成部分的一个团体的贡献的一种内容表达 @zh-hans
label: ışık tasarımcısı tüzel kişisidir @tr
definition: Bir tüzel kişiyi, aydınlatma bileşenlerinin tasarlanması ve oluşturulmasında bir tüzel kişinin katkısını içeren bir anlatımla ilişkilendirir. @tr
toolkit label: Işık tasarımcısı tüzel kişisi @tr
toolkit definition: Aydınlatma bileşenlerini tasarlama ve oluşturmada tüzel bir kişinin katkısını içeren bir anlatım. @tr
has subproperty: P50881

valosuunnittelija (suku) ekspressiossa
status: Published
label: is lighting designer family of @en
lexical alias: lightingDesignerFamilyOf.en
definition: Relates a family to an expression that includes a contribution by a family of designing and creating lighting components. @en
toolkit label: lighting designer family of @en
toolkit definition: An expression that includes a contribution by a family of designing and creating lighting components. @en
type: Property
domain: C10008
has element type: 2
sub property of: esitykseen osallinen suku ekspressiossa
sub property of: valosuunnittelija (yhteistoimija) ekspressiossa
definition: Liittää suvun ekspressioon, jossa suku on osallisena suunnittelemalla ja luomalla valokomponentteja.
toolkit label: valosuunnittelija (suku) ekspressiossa
toolkit definition: Ekspressio, jossa suku on osallisena suunnittelemalla ja luomalla valokomponentteja.
label: er lysdesigner for (familie) @no
definition: Relaterer en familie til et uttrykk som inkluderer et bidrag fra en familie i form av å utforme og skape lyssettingskomponenter. @no
toolkit label: lysdesigner for (familie) @no
toolkit definition: Et uttrykk som inkluderer et bidrag fra en familie i form av å utforme og skape lyssettingskomponenter. @no
label: is lichtontwerper-familie van @nl
definition: Relateert een familie aan een expressie die omvat een bijdrage door een familie door ontwerpen en creëren van lichteffecten. @nl
toolkit label: lichtontwerper-familie van @nl
toolkit definition: Een expressie die omvat een bijdrage door een familie door ontwerpen en creëren van lichteffecten. @nl
label: هي عائلة مسئولة عن تصميم الإضاءة لـ @ar
definition: يربط عائلة بتعبيرة تتضمن إسهام عائلة في تصميم عناصرالإضاءة وإنشائها. @ar
toolkit label: عائلة مسئولة عن تصميم الإضاءة @ar
toolkit definition: تعبيرة تتضمن إسهام عائلة في تصميم عناصرالإضاءة وإنشائها. @ar
label: és família dissenyadora d’il·luminació de @ca
definition: Relaciona una família amb una expressió que inclou una contribució d’una família en el disseny i creació de components luminotècnics. @ca
toolkit label: família dissenyadora d’il·luminació de @ca
toolkit definition: Expressió que inclou una contribució d’una família en el disseny i creació de components luminotècnics. @ca
label: er familie, som er belysningsdesigner af @da
definition: Relaterer en familie til et udtryk, som omfatter en families bidrag ved at designe og skabe belysningsdele. @da
toolkit label: familie, som er belysningsdesigner af @da
toolkit definition: Udtryk, som omfatter en families bidrag ved at designe og skabe belysningsdele. @da
label: valguskujundaja (perekond) väljenduses @et
definition: Seostab perekonna väljendusega, millesse perekond on andnud panuse, kavandades ja luues selle valguskomponendid. @et
toolkit label: valguskujundaja (perekond) väljenduses @et
toolkit definition: Väljendus, millesse perekond on andnud panuse, kavandades ja luues selle valguskomponendid. @et
label: ist Familie als Lichtgestalterin/Lichtgestalter von @de
definition: Setzt eine Familie in Beziehung zu einer Expression, zu der eine Familie beiträgt, indem sie Lichtelemente entwirft und erstellt. @de
toolkit label: Familie als Lichtgestalterin/Lichtgestalter von @de
toolkit definition: Eine Expression, zu der eine Familie beiträgt, indem sie Lichtelemente entwirft und erstellt. @de
label: világítástervező családja a következőnek: @hu
definition: Hozzákapcsol egy családot egy kifejezési formához, amely magában foglalja egy család közreműködését világítási összetevők tervezésében és létrehozásában. @hu
toolkit label: világítástervező családja: @hu
toolkit definition: Egy kifejezési forma, amely magában foglalja egy család közreműködését világítási összetevők tervezésében és létrehozásában. @hu
label: è progettista dell'illuminazione famiglia di @it
definition: Correla una famiglia a un'espressione che comprende un contributo di una famiglia nella progettazione e creazione di componenti per l'illuminazione. @it
toolkit label: progettista dell'illuminazione famiglia di @it
toolkit definition: Espressione che comprende un contributo di una famiglia nella progettazione e creazione di componenti per l'illuminazione. @it
label: είναι σχεδιαστής φωτισμού οικογένεια του @el
toolkit label: σχεδιαστής φωτισμού οικογένεια του @el
label: est une famille éclairagiste de @fr
definition: Met une famille en relation avec une expression qui intègre une contribution de la part d’une famille consistant à concevoir et à créer des effets de lumière. @fr
toolkit label: famille éclairagiste de @fr
toolkit definition: Expression qui intègre une contribution de la part d’une famille consistant à concevoir et à créer des effets de lumière. @fr
label: ir gaismu mākslinieks (dzimta/ģimene) @lv
definition: Sasaista dzimtu/ģimeni ar izteiksmi, kas ietver dzimtas/ģimenes ieguldījumu, izstrādājot un radot apgaismojuma efektus. @lv
toolkit label: ir gaismu mākslinieks (dzimta/ģimene) @lv
toolkit definition: Izteiksme, kas ietver dzimtas/ģimenes ieguldījumu, izstrādājot un radot apgaismojuma efektus. @lv
label: 是……的灯光设计者家族 @zh-hans
definition: 将一个家族与包括设计并创作灯光组成部分的一个家族的贡献的一种内容表达关联起来。 @zh-hans
toolkit label: ……的灯光设计者家族 @zh-hans
toolkit definition: 包括设计并创作灯光组成部分的一个家族的贡献的一种内容表达 @zh-hans
label: ışık tasarımcısı ailesidir @tr
definition: Bir aileyi, aydınlatma bileşenlerini tasarlayan ve yaratan bir ailenin katkısını içeren bir anlatımla ilişkilendirir. @tr
toolkit label: ışıklandırma tasarımcısı ailesi @tr
toolkit definition: Aydınlatma bileşenleri tasarlayan ve yaratan bir ailenin katkısını içeren bir anlatım. @tr
has subproperty: P51032

valosuunnittelija (henkilö) ekspressiossa
status: Published
label: is lighting designer person of @en
lexical alias: lightingDesignerPersonOf.en
definition: Relates a person to an expression that includes a contribution by a person of designing and creating lighting components. @en
toolkit label: lighting designer person of @en
toolkit definition: An expression that includes a contribution by a person of designing and creating lighting components. @en
type: Property
domain: C10004
has element type: 2
sub property of: esitykseen osallinen henkilö ekspressiossa
sub property of: valosuunnittelija (toimija) ekspressiossa
definition: Liittää henkilön ekspressioon, jossa henkilö on osallisena suunnittelemalla ja luomalla valokomponentteja.
toolkit label: valosuunnittelija (henkilö) ekspressiossa
toolkit definition: Ekspressio, jossa henkilö on osallisena suunnittelemalla ja luomalla valokomponentteja.
label: er lysdesigner for (person) @no
definition: Relaterer en person til et uttrykk som inkluderer et bidrag fra en person i form av å utforme og skape lyssettingskomponenter. @no
toolkit label: lysdesigner for (person) @no
toolkit definition: Et uttrykk som inkluderer et bidrag fra en person i form av å utforme og skape lyssettingskomponenter. @no
label: is lichtontwerper-persoon van @nl
definition: Relateert een persoon aan een expressie die omvat een bijdrage door een persoon door ontwerpen en creëren van lichteffecten. @nl
toolkit label: lichtontwerper-persoon van @nl
toolkit definition: Een expressie die omvat een bijdrage door een persoon door ontwerpen en creëren van lichteffecten. @nl
label: هو شخص مصمم إضاءة لـ @ar
definition: يربط شخصا بتعبيرة تتضمن إسهام شخص في تصميم عناصرالإضاءة وإنشائها. @ar
toolkit label: شخص مصمم إضاءة @ar
toolkit definition: تعبيرة تتضمن إسهام شخص في تصميم عناصرالإضاءة وإنشائها. @ar
label: és persona dissenyadora d’il·luminació de @ca
definition: Relaciona una persona amb una expressió que inclou una contribució d’una persona en el disseny i creació de components luminotècnics. @ca
toolkit label: persona dissenyadora d’il·luminació de @ca
toolkit definition: Expressió que inclou una contribució d’una persona en el disseny i creació de components luminotècnics. @ca
label: er person, som er belysningsdesigner af @da
definition: Relaterer en person til et udtryk, som omfatter en persons bidrag ved at designe og skabe belysningsdele. @da
toolkit label: person, som er belysningsdesigner af @da
toolkit definition: Udtryk, som omfatter en persons bidrag ved at designe og skabe belysningsdele. @da
label: valguskujundaja (isik) väljenduses @et
definition: Seostab isiku väljendusega, millesse isik on andnud panuse, kavandades ja luues selle valguskomponendid. @et
toolkit label: valguskujundaja (isik) väljenduses @et
toolkit definition: Väljendus, millesse isik on andnud panuse, kavandades ja luues selle valguskomponendid. @et
label: ist Person als Lichtgestalterin/Lichtgestalter von @de
definition: Setzt eine Person in Beziehung zu einer Expression, zu der eine Person beiträgt, indem sie Lichtelemente entwirft und erstellt. @de
toolkit label: Person als Lichtgestalterin/Lichtgestalter von @de
toolkit definition: Eine Expression, zu der eine Person beiträgt, indem sie Lichtelemente entwirft und erstellt. @de
label: világítástervező személye a következőnek: @hu
definition: Hozzákapcsol egy személyt egy kifejezési formához, amely magában foglalja egy személy közreműködését világítási összetevők tervezésében és létrehozásában. @hu
toolkit label: világítástervező személye: @hu
toolkit definition: Egy kifejezési forma, amely magában foglalja egy személy közreműködését világítási összetevők tervezésében és létrehozásában. @hu
label: è progettista dell'illuminazione persona di @it
definition: Correla una persona a un'espressione che comprende un contributo di una persona nella progettazione e creazione di componenti per l'illuminazione. @it
toolkit label: progettista dell'illuminazione persona di @it
toolkit definition: Espressione che comprende un contributo di una persona nella progettazione e creazione di componenti per l'illuminazione. @it
label: είναι σχεδιαστής φωτισμού φυσικό πρόσωπο του @el
toolkit label: σχεδιαστής φωτισμού φυσικό πρόσωπο του @el
label: est une personne éclairagiste de @fr
definition: Met une personne en relation avec une expression qui intègre une contribution de la part d’une personne consistant à concevoir et à créer des effets de lumière. @fr
toolkit label: personne éclairagiste de @fr
toolkit definition: Expression qui intègre une contribution de la part d’une personne consistant à concevoir et à créer des effets de lumière. @fr
label: ir gaismu mākslinieks (persona) @lv
definition: Sasaista personu ar izteiksmi, kas ietver personas ieguldījumu, izstrādājot un radot apgaismojuma efektus. @lv
toolkit label: ir gaismu mākslinieks (persona) @lv
toolkit definition: Izteiksme, kas ietver personas ieguldījumu, izstrādājot un radot apgaismojuma efektus. @lv
label: 是……的灯光设计者个人 @zh-hans
definition: 将一个个人与包括设计并创作灯光组成部分的一个个人的贡献的一种内容表达关联起来。 @zh-hans
toolkit label: ……的灯光设计者个人 @zh-hans
toolkit definition: 包括设计并创作灯光组成部分的一个个人的贡献的一种内容表达 @zh-hans
label: ışık tasarımcısı kişisidir @tr
definition: Bir kişiyi, bir kişinin aydınlatma bileşenleri tasarlama ve oluşturma katkısını içeren bir anlatımla ilişkilendirir. @tr
toolkit label: Işık tasarımcısı kişisi @tr
toolkit definition: Aydınlatma bileşenleri tasarlayan ve yaratan bir kişinin katkısını içeren bir anlatım. @tr
has subproperty: P50579

litografi (toimija) manifestaatiossa
status: Published
label: is lithographer agent of @en
definition: Relates an agent to a manifestation that involves a responsibility of an agent for preparing a stone or plate for lithographic printing. @en
type: Property
domain: C10002
lexical alias: lithographerAgentOf.en
label: est un agent lithographe de @fr
definition: Met un agent en relation avec une manifestation qui comporte une responsabilité de la part d’un agent consistant à préparer une pierre ou une plaque pour l’impression lithographique. @fr
toolkit label: agent lithographe de @fr
toolkit definition: Manifestation qui comporte une responsabilité de la part d’un agent consistant à préparer une pierre ou une plaque pour l’impression lithographique. @fr
toolkit label: lithographer agent of @en
toolkit definition: A manifestation that involves a responsibility of an agent for preparing a stone or plate for lithographic printing. @en
instruction number: 18.5
scope note: A lithographer includes a graphic artist creating a design directly on the surface from which printing will be done. @en
label: είναι λιθογράφος φορέας του @el
definition: Συνδέει έναν φορέα, ο οποίος εμπλέκεται στην κατασκευή μιας εκδήλωσης μέσω της προετοιμασίας ενός λίθου ή πλάκας για λιθογραφική εκτύπωση, περιλαμβανομένου ενός γραφίστα ο οποίος δημιουργεί κατευθείαν πάνω στην επιφάνεια ένα σχέδιο από το οποίο θα γίνει η εκτύπωση, με μια εκδήλωση. @el
toolkit label: λιθογράφος φορέας του @el
toolkit definition: Μια εκδήλωση που κατασκευάζεται από έναν φορέα υπεύθυνο για την προετοιμασία ενός λίθου ή πλάκας για λιθογραφική εκτύπωση, περιλαμβανομένου ενός γραφίστα ο οποίος δημιουργεί κατευθείαν πάνω στην επιφάνεια ένα σχέδιο από το οποίο θα γίνει η εκτύπωση. @el
definition: Setzt einen Akteur in Beziehung zu einer Manifestation, bei der ein Akteur für die Vorbereitung eines Steins oder einer Platte für lithografischen Druck verantwortlich ist. @de
scope note: Darunter fallen Grafikerinnen/Grafiker, die ein Muster direkt auf der Oberfläche erstellen, von der aus gedruckt werden soll. @de
toolkit label: Akteur als Lithografin/Lithograf von @de
toolkit definition: Eine Manifestation, bei der ein Akteur für die Vorbereitung eines Steins oder einer Platte für lithografischen Druck verantwortlich ist. @de
label: er agent, som er litograf af @da
definition: Relaterer en agent til en manifestation, som involverer en agents ansvar for at klargøre en sten eller plade til litografisk trykning. @da
scope note: En litograf omfatter en grafiker, som skaber et design direkte på overfladen, hvorfra trykning vil blive udført. @da
toolkit label: agent, som er litograf af @da
toolkit definition: Manifestation, som involverer en agents ansvar for at klargøre en sten eller plade til litografisk trykning. @da
label: és agent litògraf de @ca
definition: Relaciona un agent amb una manifestació que implica una responsabilitat d’un agent en la preparació d’una pedra o una planxa per a la impressió litogràfica. @ca
toolkit label: agent litògraf de @ca
toolkit definition: Manifestació que implica una responsabilitat d’un agent en la preparació d’una pedra o una planxa per a la impressió litogràfica. @ca
definition: Liittää toimijan manifestaatioon, jossa toimija on vastuussa litografiassa käytetyn kivilaatan tai muun painolaatan valmistamisesta.
scope note: Litografi tarkoittaa myös graafikkoa, joka tekee piirroksen suoraan painamiseen käytettävälle pinnalle.
toolkit label: litografi (toimija) manifestaatiossa
toolkit definition: Manifestaatio, jossa toimija on vastuussa litografiassa käytetyn kivilaatan tai muun painolaatan valmistamisesta.
toolkit label: litograf av (agent) @no
toolkit definition: En manifestasjon som involverer ansvar for en agent i form av å klargjøre en stein eller plate for litografisk trykk. @no
label: ist Akteur als Lithografin/Lithograf von @de
scope note: Ένας λιθογράφος περιλαμβάνει έναν καλλιτέχνη γραφικών που σχεδιάζει κατευθείαν πάνω στην επιφάνεια από την οποία θα γίνει η εκτύπωση. @el
scope note: Un lithographe comprend un artiste graphique créant un dessin directement sur la surface à partir de laquelle l’impression sera effectuée. @fr
has element type: 2
label: kőnyomatkészítő ágense a következőnek: @hu
definition: Hozzákapcsol egy ágenst egy megjelenési formához, amelyhez hozzátartozik egy ágens felelőssége egy kő vagy lemez litográfiai nyomtatáshoz történő előkészítéséért. @hu
scope note: kőnyomatkészítője: @hu
toolkit label: kőnyomatkészítő ágense: @hu
toolkit definition: Egy megjelenési forma, amelyhez hozzátartozik egy ágens felelőssége egy kő vagy lemez litográfiai nyomtatáshoz történő előkészítéséért. @hu
alternative label: lithographer of @en
alternative label: litografina painotuotteessa
label: er litograf av (agent) @no
definition: Relaterer en agent til en manifestasjon som involverer ansvar for en agent i form av å klargjøre en stein eller plate for litografisk trykk. @no
scope note: En litograf inkluderer en grafiker som skaper en form direkte på platen det senere trykkes fra. @no
alternative label: litograf av @no
label: is lithograaf-actor van @nl
definition: Relateert een actor aan een manifestatie die met zich meebrengt een verantwoordelijkheid van een actor voor het prepareren van een steen of plaat voor lithografisch drukken. @nl
scope note: Een lithograaf omvat een grafisch kunstenaar die een ontwerp creëert direct op het oppervlak vanaf welke het drukken gedaan zal worden. @nl
toolkit label: lithograaf-actor van @nl
toolkit definition: Een manifestatie die met zich meebrengt een verantwoordelijkheid van een actor voor het prepareren van een steen of plaat voor lithografisch drukken. @nl
label: هو وكيل طبّاع على حجر لـ @ar
definition: يربط وكيلا بتجسيدة تنطوي على مسئولية وكيل عن تجهيز حجر أو لوح للطباعة الحجرية. @ar
scope note: يشير مصطلح طبّاع على الحجر كذلك إلى فنان الجرافيك الذي ينشئ تصميما مباشرة على السطح الذي ستتم الطباعة منه. @ar
alternative label: طبّاع على الحجر @ar
toolkit label: وكيل طبَّاع على احجر @ar
toolkit definition: تجسيدة تنطوي على مسئولية وكيل عن تجهيز حجر أو لوح للطباعة الحجرية. @ar
scope note: Un litògraf inclou un artista gràfic que crea un disseny directament sobre la superfície a partir de la qual es farà la impressió. @ca
alternative label: litògraf de @ca
alternative label: litograf af @da
label: litograaf (tegija) kehastuses @et
definition: Seostab tegija kehastusega, mis sisaldab tegija vastutust kivi või plaadi litograafiliste tõmmiste jaoks ettevalmistamise eest. @et
scope note: Litograaf hõlmab ka graafikut, kes loob kujutise otse pinnale, millelt toimub trükkimine. @et
alternative label: litograaf kehastuses @et
toolkit label: litograaf (tegija) kehastuses @et
toolkit definition: Kehastus, mis sisaldab tegija vastutust kivi või plaadi litograafiliste tõmmiste jaoks ettevalmistamise eest. @et
alternative label: A litográfus egy grafikusművész, aki közvetlenül azon a felületen készít tervet, amelyről a nyomtatás történik. @hu
label: è litografo agente di @it
definition: Correla un agente a una manifestazione che implica la responsabilità di un agente nel preparare una pietra o lastra per la stampa litografica. @it
scope note: Un litografo comprende un artista grafico che crea un disegno direttamente sulla superficie dalla quale viene effettuata la stampa. @it
alternative label: litografo di @it
toolkit label: litografo agente di @it
toolkit definition: Manifestazione che implica la responsabilità di un agente nel preparare una pietra o lastra per la stampa litografica. @it

litografi (yhteistoimija) manifestaatiossa
status: Published
label: is lithographer collective agent of @en
lexical alias: lithographerCollectiveAgentOf.en
definition: Relates a collective agent to a manifestation that involves a responsibility of a collective agent for preparing a stone or plate for lithographic printing. @en
toolkit label: lithographer collective agent of @en
toolkit definition: A manifestation that involves a responsibility of a collective agent for preparing a stone or plate for lithographic printing. @en
type: Property
domain: C10011
has element type: 2
sub property of: litografi (toimija) manifestaatiossa
scope note: A lithographer includes a graphic artist creating a design directly on the surface from which printing will be done. @en
definition: Liittää yhteistoimijan manifestaatioon, jossa yhteistoimija on vastuussa litografiassa käytetyn kivilaatan tai muun painolaatan valmistamisesta.
scope note: Litografi tarkoittaa myös graafikkoa, joka tekee piirroksen suoraan painamiseen käytettävälle pinnalle.
toolkit label: litografi (yhteistoimija) manifestaatiossa
toolkit definition: Manifestaatio, jossa yhteistoimija on vastuussa litografiassa käytetyn kivilaatan tai muun painolaatan valmistamisesta.
label: er litograf for (kollektiv agent) @no
definition: Relaterer en kollektiv agent til en manifestasjon som involverer et ansvar for en kollektiv agent i form av å klargjøre en stein eller plate for litografisk trykk. @no
scope note: En litograf inkluderer en grafiker som skaper et design direkte på overflaten som trykkingen vil bli gjort. @no
toolkit label: litograf for (kollektiv agent) @no
toolkit definition: En manifestasjon som involverer et ansvar for en kollektiv agent i form av å klargjøre en stein eller plate for litografisk trykk. @no
label: is lithograaf-collectieve actor van @nl
definition: Relateert een collectieve actor aan een manifestatie die met zich meebrengt een verantwoordelijkheid van een collectieve actor voor het prepareren van een steen of plaat voor lithografisch drukken. @nl
scope note: Een lithograaf omvat een grafisch kunstenaar die een ontwerp creëert direct op het oppervlak vanaf welke het drukken gedaan zal worden. @nl
toolkit label: lithograaf-collectieve actor van @nl
toolkit definition: Een manifestatie die met zich meebrengt een verantwoordelijkheid van een collectieve actor voor het prepareren van een steen of plaat voor lithografisch drukken. @nl
label: هو وكيل جماعي طبّاع على الحجر لـ @ar
definition: يربط وكيلا جماعيا بتجسيدة تنطوي على مسئولية وكيل جماعي عن تجهيز حجر أو لوح للطباعة الحجرية. @ar
scope note: يشير مصطلح طبّاع على الحجر أيضا إلى فنان الجرافيك الذي ينشيء تصميما مباشرة على السطح الذي ستتم الطباعة منه @ar
toolkit label: وكيل جماعي طبّاع على الحجر @ar
toolkit definition: تجسيدة تنطوي على مسئولية وكيل جماعي عن تجهيز حجر أو لوح للطباعة الحجرية. @ar
label: és agent col·lectiu litògraf de @ca
definition: Relaciona un agent col·lectiu amb una manifestació que implica una responsabilitat d’un agent col·lectiu en la preparació d’una pedra o una planxa per a la impressió litogràfica. @ca
scope note: Un litògraf inclou un artista gràfic que crea un disseny directament sobre la superfície a partir de la qual es farà la impressió. @ca
toolkit label: agent col·lectiu litògraf de @ca
toolkit definition: Manifestació que implica una responsabilitat d’un agent col·lectiu en la preparació d’una pedra o una planxa per a la impressió litogràfica. @ca
label: er kollektiv agent, som er litograf af @da
definition: Relaterer en kollektiv agent til en manifestation, som involverer en kollektiv agents ansvar for at klargøre en sten eller plade til litografisk trykning. @da
scope note: En litograf omfatter en grafiker, som skaber et design direkte på overfladen, hvorfra trykning vil blive udført. @da
toolkit label: kollektiv agent, som er litograf af @da
toolkit definition: Manifestation, som involverer en kollektiv agents ansvar for at klargøre en sten eller plade til litografisk trykning. @da
label: litograaf (kollektiiv) kehastuses @et
definition: Seostab kollektiivi kehastusega, mis sisaldab kollektiivi vastutust kivi või plaadi litograafiliste tõmmiste jaoks ettevalmistamise eest. @et
scope note: Litograaf hõlmab ka graafikut, kes loob kujutise otse pinnale, millelt toimub trükkimine. @et
toolkit label: litograaf (kollektiiv) kehastuses @et
toolkit definition: Kehastus, mis sisaldab kollektiivi vastutust kivi või plaadi litograafiliste tõmmiste jaoks ettevalmistamise eest. @et
label: ist gemeinschaftlicher Akteur als Lithografin/Lithograf von @de
definition: Setzt einen gemeinschaftlichen Akteur in Beziehung zu einer Manifestation, bei der ein gemeinschaftlicher Akteur für die Vorbereitung eines Steins oder einer Platte für lithografischen Druck verantwortlich ist. @de
scope note: Darunter fallen Grafikerinnen/Grafiker, die ein Muster direkt auf der Oberfläche erstellen, von der aus gedruckt werden soll. @de
toolkit label: Gemeinschaftlicher Akteur als Lithografin/Lithograf von @de
toolkit definition: Eine Manifestation, bei der ein gemeinschaftlicher Akteur für die Vorbereitung eines Steins oder einer Platte für lithografischen Druck verantwortlich ist. @de
label: kőnyomatkészítő kollektív ágense a következőnek: @hu
definition: Hozzákapcsol egy kollektív ágenst egy megjelenési formához, amelyhez hozzátartozik egy kollektív ágens felelőssége egy kő vagy lemez litográfiai nyomtatáshoz történő előkészítéséért. @hu
scope note: A litográfus egy grafikusművész, aki közvetlenül azon a felületen készít tervet, amelyről a nyomtatás történik. @hu
toolkit label: kőnyomatkészítő kollektív ágense: @hu
toolkit definition: Egy megjelenési forma, amelyhez hozzátartozik egy kollektív ágens felelőssége egy kő vagy lemez litográfiai nyomtatáshoz történő előkészítéséért. @hu
label: è litografo agente collettivo di @it
definition: Correla un agente collettivo a una manifestazione che implica una responsabilità di un agente collettivo nel preparare una pietra o lastra per la stampa litografica. @it
scope note: Litografo comprende un artista grafico che crea un disegno direttamente sulla superficie da cui verrà eseguita la stampa. @it
toolkit label: litografo agente collettivo di @it
toolkit definition: Manifestazione che implica una responsabilità di un agente collettivo nel preparare una pietra o lastra per la stampa litografica. @it
label: είναι λιθογράφος συλλογικός φορέας του @el
toolkit label: λιθογράφος συλλογικός φορέας του @el
label: est un agent collectif lithographe de @fr
definition: Met un agent collectif en relation avec une manifestation qui comporte une responsabilité de la part d’un agent collectif consistant à préparer une pierre ou une plaque pour l’impression lithographique. @fr
scope note: Un lithographe comprend un artiste graphique créant un dessin directement sur la surface à partir de laquelle l’impression sera effectuée. @fr
toolkit label: agent collectif lithographe de @fr
toolkit definition: Manifestation qui comporte une responsabilité de la part d’un agent collectif consistant à préparer une pierre ou une plaque pour l’impression lithographique. @fr
label: ir litogrāfs (grupa) @lv
definition: Sasaista grupu ar manifestāciju, kas ietver grupas atbildību par akmens vai iespiedplates sagatavošanu drukāšanai litogrāfijas tehnikā. @lv
toolkit label: ir litogrāfs (grupa) @lv
toolkit definition: Manifestācija, kas ietver grupas atbildību par akmens vai iespiedplates sagatavošanu drukāšanai litogrāfijas tehnikā. @lv
scope note: Litogrāfs ir arī grafiķis, kas veido dizainu tieši uz virsmas, no kuras materiāls tiks drukāts. @lv
sub property of: kuvalaatan valmistaja (yhteistoimija) manifestaatiossa
label: 是……的平版制作者集体行为者 @zh-hans
definition: 将一个集体行为者与涉及制作用于平版印刷的石头或平版的一个集体行为者的责任的一种载体表现关联起来。 @zh-hans
toolkit label: ……的平版制作者集体行为者 @zh-hans
toolkit definition: 涉及制作用于平版印刷的石头或平版的一个集体行为者的责任的一种载体表现 @zh-hans
scope note: 平版制作者包括直接在用于印刷的表面进行设计创作的平面美术家 @zh-hans
label: taş baskı sanatçısı kolektif temsilcisidir @tr

litografi (yhteisö) manifestaatiossa
status: Published
label: is lithographer corporate body of @en
lexical alias: lithographerCorporateBodyOf.en
definition: Relates a corporate body to a manifestation that involves a responsibility of a corporate body for preparing a stone or plate for lithographic printing. @en
toolkit label: lithographer corporate body of @en
toolkit definition: A manifestation that involves a responsibility of a corporate body for preparing a stone or plate for lithographic printing. @en
type: Property
domain: C10005
has element type: 2
sub property of: litografi (yhteistoimija) manifestaatiossa
scope note: A lithographer includes a graphic artist creating a design directly on the surface from which printing will be done. @en
definition: Liittää yhteisön manifestaatioon, jossa yhteisö on vastuussa litografiassa käytetyn kivilaatan tai muun painolaatan valmistamisesta.
scope note: Litografi tarkoittaa myös graafikkoa, joka tekee piirroksen suoraan painamiseen käytettävälle pinnalle.
toolkit label: litografi (yhteisö) manifestaatiossa
toolkit definition: Manifestaatio, jossa yhteisö on vastuussa litografiassa käytetyn kivilaatan tai muun painolaatan valmistamisesta.
label: er litograf for (korporasjon) @no
definition: Relaterer en korporasjon til en manifestasjon som involverer et ansvar for en korporasjon i form av å klargjøre en stein eller plate for litografisk trykk. @no
scope note: En litograf inkluderer en grafiker som skaper et design direkte på overflaten som trykkingen vil bli gjort. @no
toolkit label: litograf for (korporasjon) @no
toolkit definition: En manifestasjon som involverer et ansvar for en korporasjon i form av å klargjøre en stein eller plate for litografisk trykk. @no
label: is lithograaf-corporatie van @nl
definition: Relateert een corporatie aan een manifestatie die met zich meebrengt een verantwoordelijkheid van een corporatie voor het prepareren van een steen of plaat voor lithografisch drukken. @nl
scope note: Een lithograaf omvat een grafisch kunstenaar die een ontwerp creëert direct op het oppervlak vanaf welke het drukken gedaan zal worden. @nl
toolkit label: lithograaf-corporatie van @nl
toolkit definition: Een manifestatie die met zich meebrengt een verantwoordelijkheid van een corporatie voor het prepareren van een steen of plaat voor lithografisch drukken. @nl
label: هي هيئة مسئولة عن الطباعة على الحجر لـ @ar
definition: يربط هيئة بتجسيدة تنطوي على مسئولية هيئة عن تجهيز حجر أو لوح للطباعة الحجرية. @ar
scope note: يشير مصطلح طبّاع على الحجر أيضا إلى فنان الجرافيك الذي ينشيء تصميما مباشرة على السطح الذي ستتم الطباعة منه @ar
toolkit label: هيئة مسئولة عن الطباعة على الحجر @ar
toolkit definition: تجسيدة تنطوي على مسئولية هيئة عن تجهيز حجر أو لوح للطباعة الحجرية. @ar
label: és entitat corporativa litògrafa de @ca
definition: Relaciona una entitat corporativa amb una manifestació que implica una responsabilitat d’una entitat corporativa en la preparació d’una pedra o una planxa per a la impressió litogràfica. @ca
scope note: Un litògraf inclou un artista gràfic que crea un disseny directament sobre la superfície a partir de la qual es farà la impressió. @ca
toolkit label: entitat corporativa litògrafa de @ca
toolkit definition: Manifestació que implica una responsabilitat d’una entitat corporativa en la preparació d’una pedra o una planxa per a la impressió litogràfica. @ca
label: er korporation, som er litograf af @da
definition: Relaterer en korporation til en manifestation, som involverer en korporations ansvar for at klargøre en sten eller plade til litografisk trykning. @da
scope note: En litograf omfatter en grafiker, som skaber et design direkte på overfladen, hvorfra trykning vil blive udført. @da
toolkit label: korporation, som er litograf af @da
toolkit definition: Manifestation, som involverer en korporations ansvar for at klargøre en sten eller plade til litografisk trykning. @da
label: litograaf (asutus) kehastuses @et
definition: Seostab asutuse kehastusega, mis sisaldab asutuse vastutust kivi või plaadi litograafiliste tõmmiste jaoks ettevalmistamise eest. @et
scope note: Litograaf hõlmab ka graafikut, kes loob kujutise otse pinnale, millelt toimub trükkimine. @et
toolkit label: litograaf (asutus) kehastuses @et
toolkit definition: Kehastus, mis sisaldab asutuse vastutust kivi või plaadi litograafiliste tõmmiste jaoks ettevalmistamise eest. @et
label: ist Körperschaft als Lithografin/Lithograf von @de
definition: Setzt eine Körperschaft in Beziehung zu einer Manifestation, bei der eine Körperschaft für die Vorbereitung eines Steins oder einer Platte für lithografischen Druck verantwortlich ist. @de
scope note: Darunter fallen Grafikerinnen/Grafiker, die ein Muster direkt auf der Oberfläche erstellen, von der aus gedruckt werden soll. @de
toolkit label: Körperschaft als Lithografin/Lithograf von @de
toolkit definition: Eine Manifestation, bei der eine Körperschaft für die Vorbereitung eines Steins oder einer Platte für lithografischen Druck verantwortlich ist. @de
label: kőnyomatkészítő testülete a következőnek: @hu
definition: Hozzákapcsol egy testületet egy megjelenési formához, amelyhez hozzátartozik egy testület felelőssége egy kő vagy lemez litográfiai nyomtatáshoz történő előkészítéséért. @hu
scope note: A litográfus egy grafikusművész, aki közvetlenül azon a felületen készít tervet, amelyről a nyomtatás történik. @hu
toolkit label: kőnyomatkészítő testülete: @hu
toolkit definition: Egy megjelenési forma, amelyhez hozzátartozik egy testület felelőssége egy kő vagy lemez litográfiai nyomtatáshoz történő előkészítéséért. @hu
label: è litografo ente di @it
definition: Correla un ente a una manifestazione che implica una responsabilità di un ente preparare una pietra o lastra per la stampa litografica. @it
scope note: Litografo comprende un artista grafico che crea un disegno direttamente sulla superficie da cui verrà eseguita la stampa. @it
toolkit label: litografo ente di @it
toolkit definition: Manifestazione che implica una responsabilità di un ente preparare una pietra o lastra per la stampa litografica. @it
label: είναι λιθογράφος συλλογικό όργανο του @el
scope note: Ένας λιθογράφος περιλαμβάνει έναν καλλιτέχνη γραφικών που σχεδιάζει κατευθείαν πάνω στην επιφάνεια από την οποία θα γίνει η εκτύπωση. @el
toolkit label: λιθογράφος συλλογικό όργανο του @el
label: est une collectivité lithographe de @fr
definition: Met une collectivité en relation avec une manifestation qui comporte une responsabilité de la part d’une collectivité consistant à préparer une pierre ou une plaque pour l’impression lithographique. @fr
scope note: Un lithographe comprend un artiste graphique créant un dessin directement sur la surface à partir de laquelle l’impression sera effectuée. @fr
toolkit label: collectivité lithographe de @fr
toolkit definition: Manifestation qui comporte une responsabilité de la part d’une collectivité consistant à préparer une pierre ou une plaque pour l’impression lithographique. @fr
label: ir litogrāfs (institūcija) @lv
definition: Sasaista institūciju ar manifestāciju, kas ietver institūcijas atbildību par akmens vai iespiedplates sagatavošanu drukāšanai litogrāfijas tehnikā. @lv
toolkit label: ir litogrāfs (institūcija) @lv
toolkit definition: Manifestācija, kas ietver institūcijas atbildību par akmens vai iespiedplates sagatavošanu drukāšanai litogrāfijas tehnikā. @lv
scope note: Litogrāfs ir arī grafiķis, kas veido dizainu tieši uz virsmas, no kuras materiāls tiks drukāts. @lv
sub property of: kuvalaatan valmistaja (yhteisö) manifestaatiossa
label: 是……的平版制作者团体 @zh-hans
definition: 将一个团体与涉及制作用于平版印刷的石头或平版的一个团体的责任的一种载体表现关联起来。 @zh-hans
toolkit label: ……的平版制作者团体 @zh-hans
toolkit definition: 涉及制作用于平版印刷的石头或平版的一个团体的责任的一种载体表现 @zh-hans
scope note: 平版制作者包括直接在用于印刷的表面进行设计创作的平面美术家 @zh-hans

litografi (suku) manifestaatiossa
status: Published
label: is lithographer family of @en
lexical alias: lithographerFamilyOf.en
definition: Relates a family to a manifestation that involves a responsibility of a family for preparing a stone or plate for lithographic printing. @en
toolkit label: lithographer family of @en
toolkit definition: A manifestation that involves a responsibility of a family for preparing a stone or plate for lithographic printing. @en
type: Property
domain: C10008
has element type: 2
sub property of: litografi (yhteistoimija) manifestaatiossa
scope note: A lithographer includes a graphic artist creating a design directly on the surface from which printing will be done. @en
definition: Liittää suvun manifestaatioon, jossa suku on vastuussa litografiassa käytetyn kivilaatan tai muun painolaatan valmistamisesta.
scope note: Litografi tarkoittaa myös graafikkoa, joka tekee piirroksen suoraan painamiseen käytettävälle pinnalle.
toolkit label: litografi (suku) manifestaatiossa
toolkit definition: Manifestaatio, jossa suku on vastuussa litografiassa käytetyn kivilaatan tai muun painolaatan valmistamisesta.
label: er litograf for (familie) @no
definition: Relaterer en familie til en manifestasjon som involverer et ansvar for en familie i form av å klargjøre en stein eller plate for litografisk trykk. @no
scope note: En litograf inkluderer en grafiker som skaper et design direkte på overflaten som trykkingen vil bli gjort. @no
toolkit label: litograf for (familie) @no
toolkit definition: En manifestasjon som involverer et ansvar for en familie i form av å klargjøre en stein eller plate for litografisk trykk. @no
label: is lithograaf-familie van @nl
definition: Relateert een familie aan een manifestatie die met zich meebrengt een verantwoordelijkheid van een familie voor het prepareren van een steen of plaat voor lithografisch drukken. @nl
scope note: Een lithograaf omvat een grafisch kunstenaar die een ontwerp creëert direct op het oppervlak vanaf welke het drukken gedaan zal worden. @nl
toolkit label: lithograaf-familie van @nl
toolkit definition: Een manifestatie die met zich meebrengt een verantwoordelijkheid van een familie voor het prepareren van een steen of plaat voor lithografisch drukken. @nl
label: هي عائلة مسئولة عن الطباعة على الحجرلـ @ar
definition: يربط عائلة بتجسيدة تنطوي على مسئولية عائلة عن تجهيز حجر أو لوح للطباعة الحجرية. @ar
scope note: يشيرمصطلح طبّاع على الحجر أيضا إلى فنان الجرافيك الذي ينشيء تصميما مباشرة على السطح الذي ستتم الطباعة منه. @ar
toolkit label: عائلة مسئولة عن الطباعة على الحجر @ar
toolkit definition: تجسيدة تنطوي على مسئولية عائلة عن تجهيز حجر أو لوح للطباعة الحجرية. @ar
label: és família litògrafa de @ca
definition: Relaciona una família amb una manifestació que implica una responsabilitat d’una família en la preparació d’una pedra o una planxa per a la impressió litogràfica. @ca
scope note: Un litògraf inclou un artista gràfic que crea un disseny directament sobre la superfície a partir de la qual es farà la impressió. @ca
toolkit label: família litògrafa de @ca
toolkit definition: Manifestació que implica una responsabilitat d’una família en la preparació d’una pedra o una planxa per a la impressió litogràfica. @ca
label: er familie, som er litograf af @da
definition: Relaterer en familie til en manifestation, som involverer en families ansvar for at klargøre en sten eller plade til litografisk trykning. @da
scope note: En litograf omfatter en grafiker, som skaber et design direkte på overfladen, hvorfra trykning vil blive udført. @da
toolkit label: familie, som er litograf af @da
toolkit definition: Manifestation, som involverer en families ansvar for at klargøre en sten eller plade til litografisk trykning. @da
label: litograaf (perekond) kehastuses @et
definition: Seostab perekonna kehastusega, mis sisaldab perekonna vastutust kivi või plaadi litograafiliste tõmmiste jaoks ettevalmistamise eest. @et
scope note: Litograaf hõlmab ka graafikut, kes loob kujutise otse pinnale, millelt toimub trükkimine. @et
toolkit label: litograaf (perekond) kehastuses @et
toolkit definition: Kehastus, mis sisaldab perekonna vastutust kivi või plaadi litograafiliste tõmmiste jaoks ettevalmistamise eest. @et
label: ist Familie als Lithografin/Lithograf von @de
definition: Setzt eine Familie in Beziehung zu einer Manifestation, bei der eine Familie für die Vorbereitung eines Steins oder einer Platte für lithografischen Druck verantwortlich ist. @de
scope note: Darunter fallen Grafikerinnen/Grafiker, die ein Muster direkt auf der Oberfläche erstellen, von der aus gedruckt werden soll. @de
toolkit label: Familie als Lithografin/Lithograf von @de
toolkit definition: Eine Manifestation, bei der eine Familie für die Vorbereitung eines Steins oder einer Platte für lithografischen Druck verantwortlich ist. @de
label: kőnyomatkészítő családja a következőnek: @hu
definition: Hozzákapcsol egy családot egy megjelenési formához, amelyhez hozzátartozik egy család felelőssége egy kő vagy lemez litográfiai nyomtatáshoz történő előkészítéséért. @hu
scope note: A litográfus egy grafikusművész, aki közvetlenül azon a felületen készít tervet, amelyről a nyomtatás történik. @hu
toolkit label: kőnyomatkészítő családja: @hu
toolkit definition: Egy megjelenési forma, amelyhez hozzátartozik egy család felelőssége egy kő vagy lemez litográfiai nyomtatáshoz történő előkészítéséért. @hu
label: è litografo famiglia di @it
definition: Correla una famiglia a una manifestazione che implica una responsabilità di una famiglia per preparare una pietra o lastra per la stampa litografica. @it
scope note: Litografo comprende un artista grafico che crea un disegno direttamente sulla superficie da cui verrà eseguita la stampa. @it
toolkit label: litografo famiglia di @it
toolkit definition: Manifestazione che implica una responsabilità di una famiglia per preparare una pietra o lastra per la stampa litografica. @it
label: είναι λιθογράφος οικογένεια του @el
scope note: Ένας λιθογράφος περιλαμβάνει έναν καλλιτέχνη γραφικών που σχεδιάζει κατευθείαν πάνω στην επιφάνεια από την οποία θα γίνει η εκτύπωση. @el
toolkit label: λιθογράφος οικογένεια του @el
label: est une famille lithographe de @fr
definition: Met une famille en relation avec une manifestation qui comporte une responsabilité de la part d’une famille consistant à préparer une pierre ou une plaque pour l’impression lithographique. @fr
scope note: Un lithographe comprend un artiste graphique créant un dessin directement sur la surface à partir de laquelle l’impression sera effectuée. @fr
toolkit label: famille lithographe de @fr
toolkit definition: Manifestation qui comporte une responsabilité de la part d’une famille consistant à préparer une pierre ou une plaque pour l’impression lithographique. @fr
label: ir litogrāfs (dzimta/ģimene) @lv
definition: Sasaista dzimtu/ģimeni ar manifestāciju, kas ietver dzimtas/ģimenes atbildību par akmens vai iespiedplates sagatavošanu drukāšanai litogrāfijas tehnikā. @lv
toolkit label: ir litogrāfs (dzimta/ģimene) @lv
toolkit definition: Manifestācija, kas ietver dzimtas/ģimenes atbildību par akmens vai iespiedplates sagatavošanu drukāšanai litogrāfijas tehnikā. @lv
scope note: Litogrāfs ir arī grafiķis, kas veido dizainu tieši uz virsmas, no kuras materiāls tiks drukāts. @lv
sub property of: kuvalaatan valmistaja (suku) manifestaatiossa
label: 是……的平版制作者家族 @zh-hans
definition: 将一个家族与涉及制作用于平版印刷的石头或平版的一个家族的责任的一种载体表现关联起来。 @zh-hans
toolkit label: ……的平版制作者家族 @zh-hans
toolkit definition: 涉及制作用于平版印刷的石头或平版的一个家族的责任的一种载体表现 @zh-hans
scope note: 平版制作者包括直接在用于印刷的表面进行设计创作的平面美术家 @zh-hans

litografi (henkilö) manifestaatiossa
status: Published
label: is lithographer person of @en
lexical alias: lithographerPersonOf.en
definition: Relates a person to a manifestation that involves a responsibility of a person for preparing a stone or plate for lithographic printing. @en
toolkit label: lithographer person of @en
toolkit definition: A manifestation that involves a responsibility of a person for preparing a stone or plate for lithographic printing. @en
type: Property
domain: C10004
has element type: 2
sub property of: litografi (toimija) manifestaatiossa
scope note: A lithographer includes a graphic artist creating a design directly on the surface from which printing will be done. @en
definition: Liittää henkilön manifestaatioon, jossa henkilö on vastuussa litografiassa käytetyn kivilaatan tai muun painolaatan valmistamisesta.
scope note: Litografi tarkoittaa myös graafikkoa, joka tekee piirroksen suoraan painamiseen käytettävälle pinnalle.
toolkit label: litografi (henkilö) manifestaatiossa
toolkit definition: Manifestaatio, jossa henkilö on vastuussa litografiassa käytetyn kivilaatan tai muun painolaatan valmistamisesta.
label: er litograf for (person) @no
definition: Relaterer en person til en manifestasjon som involverer et ansvar for en person i form av å klargjøre en stein eller plate for litografisk trykk. @no
scope note: En litograf inkluderer en grafiker som skaper et design direkte på overflaten som trykkingen vil bli gjort. @no
toolkit label: litograf for (person) @no
toolkit definition: En manifestasjon som involverer et ansvar for en person i form av å klargjøre en stein eller plate for litografisk trykk. @no
label: is lithograaf-persoon van @nl
definition: Relateert een persoon aan een manifestatie die met zich meebrengt een verantwoordelijkheid van een persoon voor het prepareren van een steen of plaat voor lithografisch drukken. @nl
scope note: Een lithograaf omvat een grafisch kunstenaar die een ontwerp creëert direct op het oppervlak vanaf welke het drukken gedaan zal worden. @nl
toolkit label: lithograaf-persoon van @nl
toolkit definition: Een manifestatie die met zich meebrengt een verantwoordelijkheid van een persoon voor het prepareren van een steen of plaat voor lithografisch drukken. @nl
label: هو شخص طباع على الحجر لـ @ar
definition: يربط شخصا بتجسيدة تنطوي على مسئولية شخص عن تجهيز حجر أو لوح للطباعة الحجرية. @ar
scope note: يشمل مصطلح طبّاع على الحجر أيضا فنان الجرافيك الذي ينشيء تصميما مباشرة على السطح الذي ستتم الطباعة منه. @ar
toolkit label: شخص طبّاع على الحجر @ar
toolkit definition: تجسيدة تنطوي على مسئولية شخص عن تجهيز حجر أو لوح للطباعة الحجرية. @ar
label: és persona litògrafa de @ca
definition: Relaciona una persona amb una manifestació que implica una responsabilitat d’una persona en la preparació d’una pedra o una planxa per a la impressió litogràfica. @ca
scope note: Un litògraf inclou un artista gràfic que crea un disseny directament sobre la superfície a partir de la qual es farà la impressió. @ca
toolkit label: persona litògrafa de @ca
toolkit definition: Manifestació que implica una responsabilitat d’una persona en la preparació d’una pedra o una planxa per a la impressió litogràfica. @ca
label: er person, som er litograf af @da
definition: Relaterer en person til en manifestation, som involverer en persons ansvar for at klargøre en sten eller plade til litografisk trykning. @da
scope note: En litograf omfatter en grafiker, som skaber et design direkte på overfladen, hvorfra trykning vil blive udført. @da
toolkit label: person, som er litograf af @da
toolkit definition: Manifestation, som involverer en persons ansvar for at klargøre en sten eller plade til litografisk trykning. @da
label: litograaf (isik) kehastuses @et
definition: Seostab isiku kehastusega, mis sisaldab isiku vastutust kivi või plaadi litograafiliste tõmmiste jaoks ettevalmistamise eest. @et
scope note: Litograaf hõlmab ka graafikut, kes loob kujutise otse pinnale, millelt toimub trükkimine. @et
toolkit label: litograaf (isik) kehastuses @et
toolkit definition: Kehastus, mis sisaldab isiku vastutust kivi või plaadi litograafiliste tõmmiste jaoks ettevalmistamise eest. @et
label: ist Person als Lithografin/Lithograf von @de
definition: Setzt eine Person in Beziehung zu einer Manifestation, bei der eine Person für die Vorbereitung eines Steins oder einer Platte für lithografischen Druck verantwortlich ist. @de
scope note: Darunter fallen Grafikerinnen/Grafiker, die ein Muster direkt auf der Oberfläche erstellen, von der aus gedruckt werden soll. @de
toolkit label: Person als Lithografin/Lithograf von @de
toolkit definition: Eine Manifestation, bei der eine Person für die Vorbereitung eines Steins oder einer Platte für lithografischen Druck verantwortlich ist. @de
label: kőnyomatkészítő személye a következőnek: @hu
definition: Hozzákapcsol egy személyt egy megjelenési formához, amelyhez hozzátartozik egy személy felelőssége egy kő vagy lemez litográfiai nyomtatáshoz történő előkészítéséért. @hu
scope note: A litográfus egy grafikusművész, aki közvetlenül azon a felületen készít tervet, amelyről a nyomtatás történik. @hu
toolkit label: kőnyomatkészítő személye: @hu
toolkit definition: Egy megjelenési forma, amelyhez hozzátartozik egy személy felelőssége egy kő vagy lemez litográfiai nyomtatáshoz történő előkészítéséért. @hu
label: è litografo persona di @it
definition: Correla una persona a una manifestazione che implica una responsabilità di una persona nel preparare una pietra o lastra per la stampa litografica. @it
scope note: Litografo comprende un artista grafico che crea un disegno direttamente sulla superficie da cui verrà eseguita la stampa. @it
toolkit label: litografo persona di @it
toolkit definition: Manifestazione che implica una responsabilità di una persona nel preparare una pietra o lastra per la stampa litografica. @it
label: είναι λιθογράφος φυσικό πρόσωπο του @el
toolkit label: λιθογράφος φυσικό πρόσωπο του @el
label: est une personne lithographe de @fr
definition: Met une personne en relation avec une manifestation qui comporte une responsabilité de la part d’une personne consistant à préparer une pierre ou une plaque pour l’impression lithographique. @fr
scope note: Un lithographe comprend un artiste graphique créant un dessin directement sur la surface à partir de laquelle l’impression sera effectuée. @fr
toolkit label: personne lithographe de @fr
toolkit definition: Manifestation qui comporte une responsabilité de la part d’une personne consistant à préparer une pierre ou une plaque pour l’impression lithographique. @fr
label: ir litogrāfs (persona) @lv
definition: Sasaista personu ar manifestāciju, kas ietver personas atbildību par akmens vai iespiedplates sagatavošanu drukāšanai litogrāfijas tehnikā. @lv
toolkit label: ir litogrāfs (persona) @lv
toolkit definition: Manifestācija, kas ietver personas atbildību par akmens vai iespiedplates sagatavošanu drukāšanai litogrāfijas tehnikā. @lv
scope note: Litogrāfs ir arī grafiķis, kas veido dizainu tieši uz virsmas, no kuras materiāls tiks drukāts. @lv
sub property of: kuvalaatan valmistaja (henkilö) manifestaatiossa
label: 是……的平版制作者个人 @zh-hans
definition: 将一个个人与涉及制作用于平版印刷的石头或平版的一个个人的责任的一种载体表现关联起来。 @zh-hans
toolkit label: ……的平版制作者个人 @zh-hans
toolkit definition: 涉及制作用于平版印刷的石头或平版的一个个人的责任的一种载体表现 @zh-hans
scope note: 平版制作者包括直接在用于印刷的表面进行设计创作的平面美术家 @zh-hans
label: taş baskı sanatçısı kişisidir @tr

has location of headquarters (Deprecated)
status: Deprecated
type: Property
toolkit definition: A country, state, province, etc., or local place in which an organization has its headquarters. (Deprecated) @en
toolkit label: location of headquarters (Deprecated) @en
definition: Relates a corporate body to a country, state, province, etc., or local place in which an organization has its headquarters. (Deprecated) @en
lexical alias: locationOfHeadquarters.en
domain: C10005

sanoittaja (toimija) teoksessa
status: Published
label: is lyricist agent of @en
definition: Relates an agent to a work that involves a responsibility of an agent for authoring the words of a popular song, including a song from a musical. @en
type: Property
domain: C10002
sub property of: kirjoittaja (toimija) teoksessa
lexical alias: lyricistAgentOf.en
label: est un agent parolier de @fr
definition: Met un agent en relation avec une œuvre qui comporte une responsabilité de la part d’un agent consistant à être l’auteur des paroles d’une chanson populaire, y compris une chanson d’une comédie musicale. @fr
toolkit label: agent parolier de @fr
toolkit definition: Œuvre qui comporte une responsabilité de la part d’un agent consistant à être l’auteur des paroles d’une chanson populaire, y compris une chanson d’une comédie musicale. @fr
toolkit label: lyricist agent of @en
toolkit definition: A work that involves a responsibility of an agent for authoring the words of a popular song, including a song from a musical. @en
see also: libretisti (toimija) teoksessa
instruction number: 18.5
label: είναι στιχουργός φορέας του @el
definition: Συνδέει έναν συγγραφέα των στίχων ενός δημοφιλούς τραγουδιού, περιλαμβανομένων του τραγουδιού ή των τραγουδιών ενός μιούζικαλ, με ένα έργο. @el
toolkit label: στιχουργός φορέας του @el
toolkit definition: Ένα έργο που περιλαμβάνει την ευθύνη της συγγραφής των στίχων ενός δημοφιλούς τραγουδιού, περιλαμβανομένων του τραγουδιού ή των τραγουδιών ενός μιούζικαλ. @el
definition: Setzt einen Akteur in Beziehung zu einem Werk, bei dem ein Akteur für das Verfassen des Texts eines populären Lieds, einschließlich eines Lieds aus einem Musical, verantwortlich ist. @de
toolkit label: Akteur als Textdichterin/Textdichter von @de
toolkit definition: Ein Werk, bei dem ein Akteur für das Verfassen des Texts eines populären Lieds, einschließlich eines Lieds aus einem Musical, verantwortlich ist. @de
label: er agent, som er tekstforfatter af @da
definition: Relaterer en agent til et værk, som involverer en agents ansvar for at forfatte ordene til en populær sang, inkl. en sang fra en musical. @da
toolkit label: agent, som er tekstforfatter af @da
toolkit definition: Værk, som involverer en agents ansvar for at forfatte ordene til en populær sang, inkl. en sang fra en musical. @da
label: és agent lletrista de @ca
definition: Relaciona un agent amb una obra que implica una responsabilitat d’un agent en l’autoria de les paraules d’una cançó popular, inclosa una cançó d’un musical. @ca
toolkit label: agent lletrista de @ca
toolkit definition: Obra que implica una responsabilitat d’un agent en l’autoria de les paraules d’una cançó popular, inclosa una cançó d’un musical. @ca
definition: Liittää toimijan teokseen, jossa toimija on vastuussa populaarimusiikkiin kuuluvan laulun (mukaan lukien musikaalilaulun) sanojen kirjoittamisesta.
toolkit label: sanoittaja (toimija) teoksessa
toolkit definition: Teos, jossa toimija on vastuussa populaarimusiikkiin kuuluvan laulun (mukaan lukien musikaalilaulun) sanojen kirjoittamisesta.
toolkit label: sangtekstforfatter av (agent) @no
toolkit definition: Et verk som involverer ansvar for en agent i form av å forfatte teksten til en populær sang, inkludert en sang fra en musikal. @no
label: ist Akteur als Textdichterin/Textdichter von @de
has element type: 2
scope note: Authoring of only the dialogue from a musical is excluded. @en
label: dalszövegíró ágense a következőnek: @hu
definition: Hozzákapcsol egy ágenst egy műhöz, amelyhez hozzátartozik egy ágens felelőssége egy könyűzenei dalszöveg szerzőségéért, musicaldalt is beleértve. @hu
toolkit label: dalszövegíró ágense: @hu
toolkit definition: Egy mű, amelyhez hozzátartozik egy ágens felelőssége egy könyűzenei dalszöveg szerzőségéért, musicaldalt is beleértve. @hu
alternative label: lyricist of @en
scope note: Ei kata pelkän musikaalin dialogin kirjoittajaa.
alternative label: sanoittajana teoksessa
label: er sangtekstforfatter av (agent) @no
definition: Relaterer en agent til et verk som involverer ansvar for en agent i form av å forfatte teksten til en populær sang, inkludert en sang fra en musikal. @no
scope note: Det å bare skrive dialogen fra en musikal, er ikke inkludert. @no
alternative label: sangtekstforfatter av @no
label: is liedtekstschrijver-actor van @nl
definition: Relateert een actor aan een werk dat met zich meebrengt een verantwoordelijkheid van een actor voor schrijven van de woorden van een populair lied, inclusief een lied uit een musical. @nl
scope note: Schrijven van enkel de dialoog van een musical is uitgesloten. @nl
toolkit label: liedtekstschrijver-actor van @nl
toolkit definition: Een werk dat met zich meebrengt een verantwoordelijkheid van een actor voor schrijven van de woorden van een populair lied, inclusief een lied uit een musical. @nl
label: هو وكيل كاتب أغاني لـ @ar
definition: يربط وكيلا بعمل يترتب عليه مسئولية وكيل عن تأليف كلمات أغنية، بما في ذلك أغنية في مَسرحية موسيقِيّة. @ar
scope note: يُستبعد تأليف الحوار فقط من مسرحية موسيقية. @ar
alternative label: كاتب أغاني لـ @ar
toolkit label: وكيل كاتب أغاني @ar
toolkit definition: عمل يترتب عليه مسئولية وكيل عن تأليف كلمات أغنية، ويشمل ذلك أغنية في مسرحية موسيقية. @ar
scope note: S’exclou l’autoria de només el diàleg d’un musical. @ca
alternative label: lletrista de @ca
scope note: At forfatte kun dialogen til en musical er ikke omfattet. @da
alternative label: sangskriver af @da
label: sõnade autor (tegija) teoses @et
definition: Seostab tegija teosega, mis sisaldab tegija vastutust levilaulu (k.a laul muusikalist) sõnade kirjutamise eest. @et
scope note: Ei hõlma üksnes muusikali dialoogide kirjutamist. @et
alternative label: sõnade autor teoses @et
toolkit label: sõnade autor (tegija) teoses @et
toolkit definition: Teos, mis sisaldab tegija vastutust levilaulu (k.a laul muusikalist) sõnade kirjutamise eest. @et
scope note: Nur das Verfassen des Dialogs eines Musicals fällt nicht darunter. @de
scope note: dalszövegírója: @hu
alternative label: Musical párbeszédeinek szerzősége nem tartozik ide. @hu
label: è paroliere agente di @it
definition: Correla un agente a un'opera che implica la responsabilità di un agente come autore delle parole di una canzone, inclusa una canzone di un musical. @it
scope note: E' esclusa la creazione del solo dialogo da un musical. @it
alternative label: paroliere di @it
toolkit label: paroliere agente di @it
toolkit definition: Opera che implica la responsabilità di un agente come come autore delle parole di una canzone, inclusa una canzone di un musical. @it

sanoittaja (yhteistoimija) teoksessa
status: Published
label: is lyricist collective agent of @en
lexical alias: lyricistCollectiveAgentOf.en
definition: Relates a collective agent to a work that involves a responsibility of a collective agent for authoring the words of a popular song, including a song from a musical. @en
toolkit label: lyricist collective agent of @en
toolkit definition: A work that involves a responsibility of a collective agent for authoring the words of a popular song, including a song from a musical. @en
type: Property
domain: C10011
has element type: 2
sub property of: kirjoittaja (yhteistoimija) teoksessa
sub property of: sanoittaja (toimija) teoksessa
scope note: Authoring of only the dialogue from a musical is excluded. @en
definition: Liittää yhteistoimijan teokseen, jossa yhteistoimija on vastuussa populaarimusiikkiin kuuluvan laulun (mukaan lukien musikaalilaulun) sanojen kirjoittamisesta.
scope note: Ei kata pelkän musikaalin dialogin kirjoittajaa.
toolkit label: sanoittaja (yhteistoimija) teoksessa
toolkit definition: Teos, jossa yhteistoimija on vastuussa populaarimusiikkiin kuuluvan laulun (mukaan lukien musikaalilaulun) sanojen kirjoittamisesta.
label: er sangtekstforfatter for (kollektiv agent) @no
definition: Relaterer en kollektiv agent til et verk som involverer et ansvar for en kollektiv agent i form av å være forfatter av teksten til en populær sang, inkludert en sang fra en musikal. @no
scope note: Det å bare skrive dialogen fra en musikal, er ikke inkludert. @no
toolkit label: sangtekstforfatter for (kollektiv agent) @no
toolkit definition: Et verk som involverer et ansvar for en kollektiv agent i form av å være forfatter av teksten til en populær sang, inkludert en sang fra en musikal. @no
label: is liedtekstschrijver-collectieve actor van @nl
definition: Relateert een collectieve actor aan een werk dat met zich meebrengt een verantwoordelijkheid van een collectieve actor voor schrijven van de woorden van een populair lied, inclusief een lied uit een musical. @nl
scope note: Schrijven van enkel de dialoog van een musical is uitgesloten. @nl
toolkit label: liedtekstschrijver-collectieve actor van @nl
toolkit definition: Een werk dat met zich meebrengt een verantwoordelijkheid van een collectieve actor voor schrijven van de woorden van een populair lied, inclusief een lied uit een musical. @nl
label: هو وكيل جماعي كاتب أغاني لـ @ar
definition: يربط وكيلا جماعيا بعمل يترتب عليه مسئولية وكيل جماعي عن تأليف كلمات الأغنية الشعبية، بما في ذلك أغنية من مَسرحية موسيقِيّة. @ar
scope note: يُستبعد تأليف الحوار فقط من مسرحية موسيقية. @ar
toolkit label: وكيل جماعي كاتب أغاني @ar
toolkit definition: عمل يترتب عليه مسئولية وكيل جماعي عن تأليف كلمات الأغنية الشعبية، بما في ذلك أغنية من مَسرحية موسيقِيّة. @ar
label: és agent col·lectiu lletrista de @ca
definition: Relaciona un agent col·lectiu amb una obra que implica una responsabilitat d’un agent col·lectiu en l’autoria d’una cançó popular, inclosa una cançó d’un musical. @ca
scope note: S’exclou l’autoria de només el diàleg d’un musical. @ca
toolkit label: agent col·lectiu lletrista de @ca
toolkit definition: Obra que implica una responsabilitat d’un agent col·lectiu en l’autoria d’una cançó popular, inclosa una cançó d’un musical. @ca
label: er kollektiv agent, som er tekstforfatter af @da
definition: Relaterer en kollektiv agent til et værk, som involverer en kollektiv agents ansvar for at forfatte ordene til en populær sang, inkl. en sang fra en musical. @da
scope note: At forfatte kun dialogen til en musical er ikke omfattet. @da
toolkit label: kollektiv agent, som er tekstforfatter af @da
toolkit definition: Værk, som involverer en kollektiv agents ansvar for at forfatte ordene til en populær sang, inkl. en sang fra en musical. @da
label: sõnade autor (kollektiiv) teoses @et
definition: Seostab kollektiivi teosega, mis sisaldab kollektiivi vastutust levilaulu (k.a laul muusikalist) sõnade kirjutamise eest. @et
scope note: Ei hõlma üksnes muusikali dialoogide kirjutamist. @et
toolkit label: sõnade autor (kollektiiv) teoses @et
toolkit definition: Teos, mis sisaldab kollektiivi vastutust levilaulu (k.a laul muusikalist) sõnade kirjutamise eest. @et
label: ist gemeinschaftlicher Akteur als Textdichterin/Textdichter von @de
definition: Setzt einen gemeinschaftlichen Akteur in Beziehung zu einem Werk, bei dem ein gemeinschaftlicher Akteur für das Verfassen des Texts eines populären Lieds, einschließlich eines Lieds aus einem Musical, verantwortlich ist. @de
scope note: Nur das Verfassen des Dialogs eines Musicals fällt nicht darunter. @de
toolkit label: Gemeinschaftlicher Akteur als Textdichterin/Textdichter von @de
toolkit definition: Ein Werk, bei dem ein gemeinschaftlicher Akteur für das Verfassen des Texts eines populären Lieds, einschließlich eines Lieds aus einem Musical, verantwortlich ist. @de
label: dalszövegíró kollektív ágense a következőnek: @hu
definition: Hozzákapcsol egy kollektív ágenst egy műhöz, amelyhez hozzátartozik egy kollektív ágens felelőssége egy könyűzenei dalszöveg szerzőségéért, musicaldalt is beleértve. @hu
scope note: Musical párbeszédeinek szerzősége nem tartozik ide. @hu
toolkit label: dalszövegíró kollektív ágense: @hu
toolkit definition: Egy mű, amelyhez hozzátartozik egy kollektív ágens felelőssége egy könyűzenei dalszöveg szerzőségéért, musicaldalt is beleértve. @hu
label: è paroliere agente collettivo di @it
definition: Correla un agente collettivo a un'opera che implica una responsabilità di un agente collettivo come autore delle parole di una canzone, inclusa una canzone di un musical. @it
scope note: È escluso l'essere autore solo del dialogo di un musical. @it
toolkit label: paroliere agente collettivo di @it
toolkit definition: Opera che implica una responsabilità di un agente collettivo come autore delle parole di una canzone, inclusa una canzone di un musical. @it
label: είναι στιχουργός συλλογικός φορέας του @el
toolkit label: στιχουργός συλλογικός φορέας του @el
label: est un agent collectif parolier de @fr
definition: Met un agent collectif en relation avec une œuvre qui comporte une responsabilité de la part d’un agent collectif consistant à être l’auteur des paroles d’une chanson populaire, y compris une chanson d’une comédie musicale. @fr
scope note: Le fait d’être l’auteur uniquement des dialogues d’une comédie musicale est exclu. @fr
toolkit label: agent collectif parolier de @fr
toolkit definition: Œuvre qui comporte une responsabilité de la part d’un agent collectif consistant à être l’auteur des paroles d’une chanson populaire, y compris une chanson d’une comédie musicale. @fr
label: ir dziesmas teksta autors (grupa) @lv
definition: Sasaista grupu ar darbu, kas ietver grupas atbildību par dziesmas vārdiem, ieskaitot dziesmas no mūzikla. @lv
toolkit label: ir dziesmas teksta autors (grupa) @lv
toolkit definition: Darbs, kas ietver grupas atbildību par dziesmas vārdiem, ieskaitot dziesmas no mūzikla. @lv
scope note: Neietver mūzikla dialogus. @lv
label: 是……的作词者集体行为者 @zh-hans
definition: 将一个集体行为者与涉及流行歌曲（包括音乐剧中的歌曲）歌词的写作的一个集体行为者的责任的一种作品关联起来。 @zh-hans
toolkit label: ……的作词者集体行为者 @zh-hans
toolkit definition: 涉及流行歌曲（包括音乐剧中的歌曲）歌词的写作的一个集体行为者的责任的一种作品 @zh-hans
scope note: 不包括音乐剧中仅是对白的写作。 @zh-hans
label: söz yazarı kolektif temsilcisidir @tr

sanoittaja (yhteisö) teoksessa
status: Published
label: is lyricist corporate body of @en
lexical alias: lyricistCorporateBodyOf.en
definition: Relates a corporate body to a work that involves a responsibility of a corporate body for authoring the words of a popular song, including a song from a musical. @en
toolkit label: lyricist corporate body of @en
toolkit definition: A work that involves a responsibility of a corporate body for authoring the words of a popular song, including a song from a musical. @en
type: Property
domain: C10005
has element type: 2
sub property of: kirjoittaja (yhteisö) teoksessa
sub property of: sanoittaja (yhteistoimija) teoksessa
scope note: Authoring of only the dialogue from a musical is excluded. @en
definition: Liittää yhteisön teokseen, jossa yhteisö on vastuussa populaarimusiikkiin kuuluvan laulun (mukaan lukien musikaalilaulun) sanojen kirjoittamisesta.
scope note: Ei kata pelkän musikaalin dialogin kirjoittajaa.
toolkit label: sanoittaja (yhteisö) teoksessa
toolkit definition: Teos, jossa yhteisö on vastuussa populaarimusiikkiin kuuluvan laulun (mukaan lukien musikaalilaulun) sanojen kirjoittamisesta.
label: er sangtekstforfatter for (korporasjon) @no
definition: Relaterer en korporasjon til et verk som involverer et ansvar for en korporasjon i form av å være forfatter av teksten til en populær sang, inkludert en sang fra en musikal. @no
scope note: Det å bare skrive dialogen fra en musikal, er ikke inkludert. @no
toolkit label: sangtekstforfatter for (korporasjon) @no
toolkit definition: Et verk som involverer et ansvar for en korporasjon i form av å være forfatter av teksten til en populær sang, inkludert en sang fra en musikal. @no
label: is liedtekstschrijver-corporatie van @nl
definition: Relateert een corporatie aan een werk dat met zich meebrengt een verantwoordelijkheid van een corporatie voor schrijven van de woorden van een populair lied, inclusief een lied uit een musical. @nl
scope note: Schrijven van enkel de dialoog van een musical is uitgesloten. @nl
toolkit label: liedtekstschrijver-corporatie van @nl
toolkit definition: Een werk dat met zich meebrengt een verantwoordelijkheid van een corporatie voor schrijven van de woorden van een populair lied, inclusief een lied uit een musical. @nl
label: هي هيئة مسئولة عن كتابة أغاني لـ @ar
definition: يربط هيئة بعمل يترتب عليه مسئولية هيئة عن تأليف كلمات أغنية شعبية، مثل أغنية من مَسرحية موسيقِيّة. @ar
scope note: يُستبعد تأليف الحوار فقط من مسرحية موسيقية. @ar
toolkit label: هيئة مسئولة عن كتابة أغاني @ar
toolkit definition: عمل يترتب عليه مسئولية هيئة عن تأليف كلمات أغنية شعبية، مثل أغنية من مَسرحية موسيقِيّة. @ar
label: és entitat corporativa lletrista de @ca
definition: Relaciona una entitat corporativa amb una obra que implica una responsabilitat d’una entitat corporativa en l’autoria d’una cançó popular, inclosa una cançó d’un musical. @ca
scope note: S’exclou l’autoria de només el diàleg d’un musical. @ca
toolkit label: entitat corporativa lletrista de @ca
toolkit definition: Obra que implica una responsabilitat d’una entitat corporativa en l’autoria d’una cançó popular, inclosa una cançó d’un musical. @ca
label: er korporation, som er tekstforfatter af @da
definition: Relaterer en korporation til et værk, som involverer en korporations ansvar for at forfatte ordene til en populær sang, inkl. en sang fra en musical. @da
scope note: At forfatte kun dialogen til en musical er ikke omfattet. @da
toolkit label: korporation, som er tekstforfatter af @da
toolkit definition: Værk, som involverer en korporations ansvar for at forfatte ordene til en populær sang, inkl. en sang fra en musical. @da
label: sõnade autor (asutus) teoses @et
definition: Seostab asutuse teosega, mis sisaldab asutuse vastutust levilaulu (k.a laul muusikalist) sõnade kirjutamise eest. @et
scope note: Ei hõlma üksnes muusikali dialoogide kirjutamist. @et
toolkit label: sõnade autor (asutus) teoses @et
toolkit definition: Teos, mis sisaldab asutuse vastutust levilaulu (k.a laul muusikalist) sõnade kirjutamise eest. @et
label: ist Körperschaft als Textdichterin/Textdichter von @de
definition: Setzt eine Körperschaft in Beziehung zu einem Werk, bei dem eine Körperschaft für das Verfassen des Texts eines populären Lieds, einschließlich eines Lieds aus einem Musical, verantwortlich ist. @de
scope note: Nur das Verfassen des Dialogs eines Musicals fällt nicht darunter. @de
toolkit label: Körperschaft als Textdichterin/Textdichter von @de
toolkit definition: Ein Werk, bei dem eine Körperschaft für das Verfassen des Texts eines populären Lieds, einschließlich eines Lieds aus einem Musical, verantwortlich ist. @de
label: dalszövegíró testülete a következőnek: @hu
definition: Hozzákapcsol egy testületet egy műhöz, amelyhez hozzátartozik egy testület felelőssége egy könyűzenei dalszöveg szerzőségéhez, musicaldalt is beleértve. @hu
scope note: Musical párbeszédeinek szerzősége nem tartozik ide. @hu
toolkit label: dalszövegíró testülete: @hu
toolkit definition: Egy mű, amelyhez hozzátartozik egy testület felelőssége egy könyűzenei dalszöveg szerzőségéhez, musicaldalt is beleértve. @hu
label: è paroliere ente di @it
definition: Correla un ente a un'opera che implica una responsabilità di un ente come autore delle parole di una canzone, inclusa una canzone di un musical. @it
scope note: È escluso l'essere autore solo del dialogo di un musical. @it
toolkit label: paroliere ente di @it
toolkit definition: Opera che implica una responsabilità di un ente come autore delle parole di una canzone, inclusa una canzone di un musical. @it
label: είναι στιχουργός συλλογικό όργανο του @el
scope note: Δεν περιλαμβάνεται μόνο η συγγραφή του διαλόγου ενός μιούζικαλ. @el
toolkit label: στιχουργός συλλογικό όργανο του @el
label: est une collectivité parolière de @fr
definition: Met une collectivité en relation avec une œuvre qui comporte une responsabilité de la part d’une collectivité consistant à être l’auteur des paroles d’une chanson populaire, y compris une chanson d’une comédie musicale. @fr
scope note: Le fait d’être l’auteur uniquement des dialogues d’une comédie musicale est exclu. @fr
toolkit label: collectivité parolière de @fr
toolkit definition: Œuvre qui comporte une responsabilité de la part d’une collectivité consistant à être l’auteur des paroles d’une chanson populaire, y compris une chanson d’une comédie musicale. @fr
label: ir dziesmas teksta autors (institūcija) @lv
definition: Sasaista institūciju ar darbu, kas ietver institūcijas atbildību par dziesmas vārdiem, ieskaitot dziesmas no mūzikla. @lv
toolkit label: ir dziesmas teksta autors (institūcija) @lv
toolkit definition: Darbs, kas ietver institūcijas atbildību par dziesmas vārdiem, ieskaitot dziesmas no mūzikla. @lv
scope note: Neietver mūzikla dialogus. @lv
label: 是……的作词者团体 @zh-hans
definition: 将一个团体与涉及流行歌曲（包括音乐剧中的歌曲）歌词的写作的一个团体的责任的一种作品关联起来。 @zh-hans
toolkit label: ……的作词者团体 @zh-hans
toolkit definition: 涉及流行歌曲（包括音乐剧中的歌曲）歌词的写作的一个团体的责任的一种作品 @zh-hans
scope note: 不包括音乐剧中仅是对白的写作。 @zh-hans

sanoittaja (suku) teoksessa
status: Published
label: is lyricist family of @en
lexical alias: lyricistFamilyOf.en
definition: Relates a family to a work that involves a responsibility of a family for authoring the words of a popular song, including a song from a musical. @en
toolkit label: lyricist family of @en
toolkit definition: A work that involves a responsibility of a family for authoring the words of a popular song, including a song from a musical. @en
type: Property
domain: C10008
has element type: 2
sub property of: kirjoittaja (suku) teoksessa
sub property of: sanoittaja (yhteistoimija) teoksessa
scope note: Authoring of only the dialogue from a musical is excluded. @en
definition: Liittää suvun teokseen, jossa suku on vastuussa populaarimusiikkiin kuuluvan laulun (mukaan lukien musikaalilaulun) sanojen kirjoittamisesta.
scope note: Ei kata pelkän musikaalin dialogin kirjoittajaa.
toolkit label: sanoittaja (suku) teoksessa
toolkit definition: Teos, jossa suku on vastuussa populaarimusiikkiin kuuluvan laulun (mukaan lukien musikaalilaulun) sanojen kirjoittamisesta.
label: er sangtekstforfatter for (familie) @no
definition: Relaterer en familie til et verk som involverer et ansvar for en familie i form av å være forfatter av teksten til en populær sang, inkludert en sang fra en musikal. @no
scope note: Det å bare skrive dialogen fra en musikal, er ikke inkludert. @no
toolkit label: sangtekstforfatter for (familie) @no
toolkit definition: Et verk som involverer et ansvar for en familie i form av å være forfatter av teksten til en populær sang, inkludert en sang fra en musikal. @no
label: is liedtekstschrijver-familie van @nl
definition: Relateert een familie aan een werk dat met zich meebrengt een verantwoordelijkheid van een familie voor schrijven van de woorden van een populair lied, inclusief een lied uit een musical. @nl
scope note: Schrijven van enkel de dialoog van een musical is uitgesloten. @nl
toolkit label: liedtekstschrijver-familie van @nl
toolkit definition: Een werk dat met zich meebrengt een verantwoordelijkheid van een familie voor schrijven van de woorden van een populair lied, inclusief een lied uit een musical. @nl
label: هي عائلة كاتبة أغاني لـ @ar
definition: يربط عائلة بعمل يترتب عليه مسئولية عائلة عن تأليف كلمات الأغنية الشعبية، بما في ذلك أغنية من مَسرحية موسيقِيّة. @ar
scope note: يُستبعد تأليف الحوار فقط من مسرحية موسيقية. @ar
toolkit label: عائلة كاتبة أغاني @ar
toolkit definition: عمل يترتب عليه مسئولية عائلة عن تأليف كلمات الأغنية الشعبية، بما في ذلك أغنية من مَسرحية موسيقِيّة. @ar
label: és família lletrista de @ca
definition: Relaciona una família amb una obra que implica una responsabilitat d’una família en l’autoria de les paraules d’una cançó popular, inclosa una cançó d’un musical. @ca
scope note: S’exclou l’autoria de només el diàleg d’un musical. @ca
toolkit label: família lletrista de @ca
toolkit definition: Obra que implica una responsabilitat d’una família en l’autoria de les paraules d’una cançó popular, inclosa una cançó d’un musical. @ca
label: er familie, som er tekstforfatter af @da
definition: Relaterer en familie til et værk, som involverer en families ansvar for at forfatte ordene til en populær sang, inkl. en sang fra en musical. @da
scope note: At forfatte kun dialogen til en musical er ikke omfattet. @da
toolkit label: familie, som er tekstforfatter af @da
toolkit definition: Værk, som involverer en families ansvar for at forfatte ordene til en populær sang, inkl. en sang fra en musical. @da
label: sõnade autor (perekond) teoses @et
definition: Seostab perekonna teosega, mis sisaldab perekonna vastutust levilaulu (k.a laul muusikalist) sõnade kirjutamise eest. @et
scope note: Ei hõlma üksnes muusikali dialoogide kirjutamist. @et
toolkit label: sõnade autor (perekond) teoses @et
toolkit definition: Teos, mis sisaldab perekonna vastutust levilaulu (k.a laul muusikalist) sõnade kirjutamise eest. @et
label: ist Familie als Textdichterin/Textdichter von @de
definition: Setzt eine Familie in Beziehung zu einem Werk, bei dem eine Familie für das Verfassen des Texts eines populären Lieds, einschließlich eines Lieds aus einem Musical, verantwortlich ist. @de
scope note: Nur das Verfassen des Dialogs eines Musicals fällt nicht darunter. @de
toolkit label: Familie als Textdichterin/Textdichter von @de
toolkit definition: Ein Werk, bei dem eine Familie für das Verfassen des Texts eines populären Lieds, einschließlich eines Lieds aus einem Musical, verantwortlich ist. @de
label: dalszövegíró családja a következőnek: @hu
definition: Hozzákapcsol egy családot egy műhöz, amelyhez hozzátartozik egy család felelőssége egy könyűzenei dalszöveg szerzőségéért, musicaldalt is beleértve. @hu
scope note: Musical párbeszédeinek szerzősége nem tartozik ide. @hu
toolkit label: dalszövegíró családja: @hu
toolkit definition: Egy mű, amelyhez hozzátartozik egy család felelőssége egy könyűzenei dalszöveg szerzőségéért, musicaldalt is beleértve. @hu
label: è paroliere famiglia di @it
definition: Correla una famiglia a un'opera che implica una responsabilità di una famiglia come autore delle parole di una canzone, inclusa una canzone di un musical. @it
scope note: È escluso l'essere autore solo del dialogo di un musical. @it
toolkit label: paroliere famiglia di @it
toolkit definition: Opera che implica una responsabilità di una famiglia come autore delle parole di una canzone, inclusa una canzone di un musical. @it
label: είναι στιχουργός οικογένεια του @el
scope note: Δεν περιλαμβάνεται μόνο η συγγραφή του διαλόγου ενός μιούζικαλ. @el
toolkit label: στιχουργός οικογένεια του @el
label: est une famille parolière de @fr
definition: Met une famille en relation avec une œuvre qui comporte une responsabilité de la part d’une famille consistant à être l’auteur des paroles d’une chanson populaire, y compris une chanson d’une comédie musicale. @fr
scope note: Le fait d’être l’auteur uniquement des dialogues d’une comédie musicale est exclu. @fr
toolkit label: famille parolière de @fr
toolkit definition: Œuvre qui comporte une responsabilité de la part d’une famille consistant à être l’auteur des paroles d’une chanson populaire, y compris une chanson d’une comédie musicale. @fr
label: ir dziesmas teksta autors (dzimta/ģimene) @lv
definition: Sasaista dzimtu/ģimeni ar darbu, kas ietver dzimtas/ģimenes atbildību par dziesmas vārdiem, ieskaitot dziesmas no mūzikla. @lv
toolkit label: ir dziesmas teksta autors (dzimta/ģimene) @lv
toolkit definition: Darbs, kas ietver dzimtas/ģimenes atbildību par dziesmas vārdiem, ieskaitot dziesmas no mūzikla. @lv
scope note: Neietver mūzikla dialogus. @lv
label: 是……的作词者家族 @zh-hans
definition: 将一个家族与涉及流行歌曲（包括音乐剧中的歌曲）歌词的写作的一个家族的责任的一种作品关联起来。 @zh-hans
toolkit label: ……的作词者家族 @zh-hans
toolkit definition: 涉及流行歌曲（包括音乐剧中的歌曲）歌词的写作的一个家族的责任的一种作品 @zh-hans
scope note: 不包括音乐剧中仅是对白的写作。 @zh-hans

sanoittaja (henkilö) teoksessa
status: Published
label: is lyricist person of @en
lexical alias: lyricistPersonOf.en
definition: Relates a person to a work that involves a responsibility of a person for authoring the words of a popular song, including a song from a musical. @en
toolkit label: lyricist person of @en
toolkit definition: A work that involves a responsibility of a person for authoring the words of a popular song, including a song from a musical. @en
type: Property
domain: C10004
has element type: 2
sub property of: kirjoittaja (henkilö) teoksessa
sub property of: sanoittaja (toimija) teoksessa
scope note: Authoring of only the dialogue from a musical is excluded. @en
definition: Liittää henkilön teokseen, jossa henkilö on vastuussa populaarimusiikkiin kuuluvan laulun (mukaan lukien musikaalilaulun) sanojen kirjoittamisesta.
scope note: Ei kata pelkän musikaalin dialogin kirjoittajaa.
toolkit label: sanoittaja (henkilö) teoksessa
toolkit definition: Teos, jossa henkilö on vastuussa populaarimusiikkiin kuuluvan laulun (mukaan lukien musikaalilaulun) sanojen kirjoittamisesta.
label: er sangtekstforfatter for (person) @no
definition: Relaterer en person til et verk som involverer et ansvar for en person i form av å være forfatter av teksten til en populær sang, inkludert en sang fra en musikal. @no
scope note: Det å bare skrive dialogen fra en musikal, er ikke inkludert. @no
toolkit label: sangtekstforfatter for (person) @no
toolkit definition: Et verk som involverer et ansvar for en person i form av å være forfatter av teksten til en populær sang, inkludert en sang fra en musikal. @no
label: is liedtekstschrijver-persoon van @nl
definition: Relateert een persoon aan een werk dat met zich meebrengt een verantwoordelijkheid van een persoon voor schrijven van de woorden van een populair lied, inclusief een lied uit een musical. @nl
scope note: Schrijven van enkel de dialoog van een musical is uitgesloten. @nl
toolkit label: liedtekstschrijver-persoon van @nl
toolkit definition: Een werk dat met zich meebrengt een verantwoordelijkheid van een persoon voor schrijven van de woorden van een populair lied, inclusief een lied uit een musical. @nl
label: هو شخص كاتب أغاني لـ @ar
definition: يربط شخصا بعمل يترتب عليه مسئولية شخص عن تأليف كلمات الأغنية الشعبية، بما في ذلك أغنية من مَسرحية موسيقِيّة. @ar
scope note: يُستبعد تأليف الحوار فقط من مسرحية موسيقية. @ar
toolkit label: شخص كاتب أغاني @ar
toolkit definition: عمل يترتب عليه مسئولية شخص عن تأليف كلمات الأغنية الشعبية، بما في ذلك أغنية من مَسرحية موسيقِيّة. @ar
label: és persona lletrista de @ca
definition: Relaciona una persona amb una obra que implica una responsabilitat d’una persona en l’autoria d’una cançó popular, inclosa una cançó d’un musical. @ca
scope note: S’exclou l’autoria de només el diàleg d’un musical. @ca
toolkit label: persona lletrista de @ca
toolkit definition: Obra que implica una responsabilitat d’una persona en l’autoria d’una cançó popular, inclosa una cançó d’un musical. @ca
label: er person, som er tekstforfatter af @da
definition: Relaterer en person til et værk, som involverer en persons ansvar for at forfatte ordene til en populær sang, inkl. en sang fra en musical. @da
scope note: At forfatte kun dialogen til en musical er ikke omfattet. @da
toolkit label: person, som er tekstforfatter af @da
toolkit definition: Værk, som involverer en persons ansvar for at forfatte ordene til en populær sang, inkl. en sang fra en musical. @da
label: sõnade autor (isik) teoses @et
definition: Seostab isiku teosega, mis sisaldab isiku vastutust levilaulu (k.a laul muusikalist) sõnade kirjutamise eest. @et
scope note: Ei hõlma üksnes muusikali dialoogide kirjutamist. @et
toolkit label: sõnade autor (isik) teoses @et
toolkit definition: Teos, mis sisaldab isiku vastutust levilaulu (k.a laul muusikalist) sõnade kirjutamise eest. @et
label: ist Person als Textdichterin/Textdichter von @de
definition: Setzt eine Person in Beziehung zu einem Werk, bei dem eine Person für das Verfassen des Texts eines populären Lieds, einschließlich eines Lieds aus einem Musical, verantwortlich ist. @de
scope note: Nur das Verfassen des Dialogs eines Musicals fällt nicht darunter. @de
toolkit label: Person als Textdichterin/Textdichter von @de
toolkit definition: Ein Werk, bei dem eine Person für das Verfassen des Texts eines populären Lieds, einschließlich eines Lieds aus einem Musical, verantwortlich ist. @de
label: dalszövegíró személye a következőnek: @hu
definition: Hozzákapcsol egy személyt egy műhöz, amelyhez hozzátartozik egy személy felelőssége egy könyűzenei dalszöveg szerzőségéért, musicaldalt is beleértve. @hu
scope note: Musical párbeszédeinek szerzősége nem tartozik ide. @hu
toolkit label: dalszövegíró személye: @hu
toolkit definition: Egy mű, amelyhez hozzátartozik egy személy felelőssége egy könyűzenei dalszöveg szerzőségéért, musicaldalt is beleértve. @hu
label: è paroliere persona di @it
definition: Correla una persona a un'opera che implica una responsabilità di una persona come autore delle parole di una canzone, inclusa una canzone di un musical. @it
scope note: È escluso l'essere autore solo del dialogo di un musical. @it
toolkit label: paroliere persona di @it
toolkit definition: Opera che implica una responsabilità di una persona come autore delle parole di una canzone, inclusa una canzone di un musical. @it
label: είναι στιχουργός φυσικό πρόσωπο του @el
toolkit label: στιχουργός φυσικό πρόσωπο του @el
label: est une personne parolière de @fr
definition: Met une personne en relation avec une œuvre qui comporte une responsabilité de la part d’une personne consistant à être l’auteur des paroles d’une chanson populaire, y compris une chanson d’une comédie musicale. @fr
scope note: Le fait d’être l’auteur uniquement des dialogues d’une comédie musicale est exclu. @fr
toolkit label: personne parolière de @fr
toolkit definition: Œuvre qui comporte une responsabilité de la part d’une personne consistant à être l’auteur des paroles d’une chanson populaire, y compris une chanson d’une comédie musicale. @fr
label: ir dziesmas teksta autors (persona) @lv
definition: Sasaista personu ar darbu, kas ietver personas atbildību par dziesmas vārdiem, ieskaitot dziesmas no mūzikla. @lv
toolkit label: ir dziesmas teksta autors (persona) @lv
toolkit definition: Darbs, kas ietver personas atbildību par dziesmas vārdiem, ieskaitot dziesmas no mūzikla. @lv
scope note: Neietver mūzikla dialogus. @lv
label: 是……的歌词作者 @zh-hans
definition: 将一个个人与涉及流行歌曲（包括音乐剧中的歌曲）歌词的写作的一个个人的责任的一种作品关联起来。 @zh-hans
toolkit label: ……的歌词作者 @zh-hans
toolkit definition: 涉及流行歌曲（包括音乐剧中的歌曲）歌词的写作的一个个人的责任的一种作品 @zh-hans
scope note: 不包括音乐剧中仅是对白的写作。 @zh-hans
label: söz yazarı kişisidir @tr

sulautunut yhteisöön
status: Published
type: Property
label: has absorbing corporate body @en
lexical alias: absorbingCorporateBody.en
definition: Relates a corporate body to a corporate body who absorbed another corporate body. @en
domain: C10005
toolkit label: absorbing corporate body @en
toolkit definition: A corporate body who absorbed another corporate body. @en
instruction number: 29.5
label: έχει απορροφητικό συλλογικό όργανο @el
definition: Συνδέει ένα συλλογικό όργανο με ένα συλλογικό όργανο το οποίο απορρόφησε κάποιο άλλο συλλογικό όργανο. @el
toolkit label: απορροφητικό συλλογικό όργανο @el
toolkit definition: Ένα συλλογικό όργανο το οποίο απορρόφησε κάποιο άλλο συλλογικό όργανο. @el
definition: Setzt eine Körperschaft in Beziehung zu einer Körperschaft, die eine andere Körperschaft übernimmt. @de
toolkit label: Übernehmende Körperschaft @de
toolkit definition: Eine Körperschaft, die eine andere Körperschaft übernimmt. @de
label: har indlemmende korporation @da
definition: Relaterer en korporation til en korporation, som indlemmede en anden korporation. @da
toolkit label: indlemmende korporation @da
toolkit definition: Korporation, som indlemmede en anden korporation. @da
label: té com a entitat corporativa absorbent @ca
definition: Relaciona una entitat corporativa amb una entitat corporativa que va absorbir una altra entitat corporativa. @ca
toolkit label: entitat corporativa absorbent @ca
toolkit definition: Entitat corporativa que va absorbir una altra entitat corporativa. @ca
definition: Liittää yhteisön yhteisöön, johon toinen yhteisö on sulautunut.
toolkit label: sulautunut yhteisöön
toolkit definition: Yhteisö, johon toinen yhteisö on sulautunut.
toolkit label: innlemmende korporasjon @no
toolkit definition: En korporasjon som innlemmer en annen korporasjon. @no
label: hat übernehmende Körperschaft @de
label: a pour collectivité absorbante @fr
definition: Met une collectivité en relation avec une collectivité qui a absorbé une autre collectivité. @fr
toolkit label: collectivité absorbante @fr
toolkit definition: Collectivité qui a absorbé une autre collectivité. @fr
has element type: 2
sub property of: yhteisöön liittyvä yhteisö
label: magába olvasztó testülete a következő: @hu
definition: Hozzákapcsol egy testületet egy testülethez, amely egy másik testületet magába olvasztott. @hu
toolkit label: magába olvasztó testület: @hu
toolkit definition: Egy testület, amely egy másik testületet magába olvasztott. @hu
label: har innlemmende korporasjon @no
definition: Relaterer en korporasjon til en korporasjon som innlemmer en annen korporasjon. @no
label: heeft opnemende corporatie @nl
definition: Relateert een corporatie aan een corporatie die een andere corporatie opgenomen heeft. @nl
toolkit label: opnemende corporatie @nl
toolkit definition: Een corporatie die een andere corporatie opgenomen heeft. @nl
label: لها هيئة مستحوِذة @ar
definition: يربط هيئة بهيئة استحوذت على هيئة أخرى. @ar
toolkit label: هيئة مستحوذة @ar
toolkit definition: هيئة استحوذت على هيئة أخرى. @ar
label: sulandunud asutusse @et
definition: Seostab asutuse asutusega, mis sulandas teise asutuse. @et
toolkit label: sulandunud asutusse @et
toolkit definition: Asutus, mis sulandas teise asutuse. @et
label: ha come ente che assorbe @it
definition: Correla un ente a un ente che ha assorbito un altro ente. @it
toolkit label: ente che assorbe @it
toolkit definition: Ente che ha assorbito un altro ente. @it
label: iekļāvējinstitūcija @lv
definition: Sasaista institūciju ar institūciju, kas iekļauj sevī citu institūciju. @lv
toolkit label: iekļāvējinstitūcija @lv
toolkit definition: Institūcija, kas iekļauj sevī citu institūciju. @lv
label: 有吸收团体 @zh-hans
definition: 将一个团体与吸收另一个团体的一个团体关联起来。 @zh-hans
toolkit label: 吸收团体 @zh-hans
toolkit definition: 吸收另一个团体的一个团体 @zh-hans
label: kapsayan tüzel kişi ile ilişkilidir @tr
definition: Bir tüzel kişiyi, başka bir tüzel kişiyi bünyesine katan bir tüzel kişi ile ilişkilendirir. @tr
toolkit label: kapsayan tüzel kişi @tr
toolkit definition: Başka bir tüzel kişiliği bünyesine katan bir tüzel kişilik. @tr
has subproperty: P50302

sulautunut yhteisö
status: Published
type: Property
label: has absorbed corporate body @en
lexical alias: absorbedCorporateBody.en
definition: Relates a corporate body to a corporate body who was absorbed by another corporate body. @en
domain: C10005
toolkit label: absorbed corporate body @en
toolkit definition: A corporate body who was absorbed by another corporate body. @en
instruction number: 29.5
label: έχει απορροφούμενο συλλογικό όργανο @el
definition: Συνδέει ένα συλλογικό όργανο με ένα συλλογικό όργανο, το οποίο απορροφήθηκε από/συγχωνεύθηκε με κάποιο άλλο συλλογικό όργανο. @el
toolkit label: απορροφούμενο συλλογικό όργανο @el
toolkit definition: Ένα συλλογικό όργανο το οποίο απορροφήθηκε από/συγχωνεύθηκε με κάποιο άλλο συλλογικό όργανο. @el
definition: Setzt eine Körperschaft in Beziehung zu einer Körperschaft, die von einer anderen Körperschaft übernommen wird. @de
toolkit label: Übernommene Körperschaft @de
toolkit definition: Eine Körperschaft, die von einer anderen Körperschaft übernommen wird. @de
label: har indlemmet korporation @da
definition: Relaterer en korporation til en korporation, som blev indlemmet af en anden korporation. @da
toolkit label: indlemmet korporation @da
toolkit definition: Korporation, som blev indlemmet af en anden korporation. @da
label: té com a entitat corporativa absorbida @ca
definition: Relaciona una entitat corporativa amb una entitat corporativa que va ser absorbida per una altra entitat corporativa. @ca
toolkit label: entitat corporativa absorbida @ca
toolkit definition: Entitat corporativa que va ser absorbida per una altra entitat corporativa. @ca
definition: Liittää yhteisön yhteisöön, joka on sulautunut toiseen yhteisöön.
toolkit label: sulautunut yhteisö
toolkit definition: Yhteisö, joka on sulautunut toiseen yhteisöön.
toolkit label: innlemmet korporasjon @no
toolkit definition: En korporasjon som er innlemmet i en annen korporasjon. @no
label: hat übernommene Körperschaft @de
label: a pour collectivité absorbée @fr
definition: Met une collectivité en relation avec une collectivité qui a été absorbée par une autre collectivité. @fr
toolkit label: collectivité absorbée @fr
toolkit definition: Collectivité qui a été absorbée par une autre collectivité. @fr
has element type: 2
sub property of: yhteisöön liittyvä yhteisö
label: magába olvasztott testülete a következő: @hu
definition: Hozzákapcsol egy testületet egy testülethez, amelyet egy másik testület magába olvasztott. @hu
toolkit label: magába olvasztott testülete: @hu
toolkit definition: Egy testület, amelyet egy másik testület magába olvasztott. @hu
label: har innlemmet korporasjon @no
definition: Relaterer en korporasjon til en korporasjon som er innlemmet i en annen korporasjon. @no
label: heeft opgenomen corporatie @nl
definition: Relateert een corporatie aan een corporatie die opgenomen werd door een andere corporatie. @nl
toolkit label: opgenomen corporatie @nl
toolkit definition: Een corporatie die opgenomen werd door een andere corporatie. @nl
label: لها هيئة مستحوذ عليها @ar
definition: يربط هيئة بهيئة استحوذت عليها هيئة أخرى. @ar
toolkit label: هيئة مُستحوذ عليها @ar
toolkit definition: هيئة استحوذت عليها هيئة أخرى. @ar
label: sulandunud asutus @et
definition: Seostab asutuse asutusega, mis on sulandunud teise asutusse. @et
toolkit label: sulandunud asutus @et
toolkit definition: Asutus, mis on sulandunud teise asutusse. @et
label: ha come ente assorbito @it
definition: Correla un ente a un ente che è stato assorbito da un altro ente. @it
toolkit label: ente assorbito @it
toolkit definition: Ente che è stato assorbito da un altro ente. @it
label: iekļautā institūcija @lv
definition: Sasaista institūciju ar institūciju, kas iekļauta citā institūcijā. @lv
toolkit label: iekļautā institūcija @lv
toolkit definition: Institūcija, kas iekļauta citā institūcijā. @lv
label: 有被吸收的团体 @zh-hans
definition: 将一个团体与被另一个团体吸收的一个团体关联起来。 @zh-hans
toolkit label: 被吸收的团体 @zh-hans
toolkit definition: 被另一个团体吸收的一个团体 @zh-hans
label: kapsanmış tüzel kişi ile ilişkilidir @tr
definition: Bir tüzel kişiyi, başka bir tüzel kişilik tarafından bünyesine katılan bir tüzel kişilikle ilişkilendirir. @tr
toolkit label: kapsanan tüzel kişi @tr
toolkit definition: Başka bir tüzel kişi tarafından bünyesine alınan bir tüzel kişi. @tr
has subproperty: P50301

maskeeraaja (toimija) ekspresiossa
status: Published
type: Property
label: is makeup artist agent of @en
lexical alias: makeupArtistAgentOf.en
definition: Relates an agent to an expression that includes a contribution by an agent of applying makeup and prosthetics for a moving image production or for a musical or dramatic presentation or entertainment. @en
domain: C10002
toolkit label: makeup artist agent of @en
toolkit definition: An expression that includes a contribution by an agent of applying makeup and prosthetics for a moving image production or for a musical or dramatic presentation or entertainment. @en
instruction number: 18.5
sub property of: esitykseen osallinen toimija ekspressiossa
label: είναι ψιμυθιολόγος φορέας του @el
definition: Συνδέει έναν φορέα, ο οποίος συνεισφέρει σε μια έκφραση ενός έργου μέσω της εφαρμογής μακιγιάζ και προσθετικών για την παραγωγή μιας κινητής εικόνας ή μιας μουσικής ή δραματικής παρουσίασης ή ψυχαγωγίας, με μια έκφραση. @el
toolkit label: ψιμυθιολόγος φορέας του @el
toolkit definition: Μια έκφραση ενός έργου που ενσωματώνει τη συνεισφορά της εφαρμογής μακιγιάζ και προσθετικών για την παραγωγή μιας κινητής εικόνας ή μιας μουσικής ή δραματικής παρουσίασης ή ψυχαγωγίας. @el
definition: Setzt einen Akteur in Beziehung zu einer Expression, zu der ein Akteur beiträgt, indem er Schminke und Prothetik für eine Bewegtbildproduktion oder eine musikalische oder dramatische Darbietung oder Aufführung aufträgt. @de
toolkit label: Akteur als Maskenbildnerin/Maskenbildner von @de
toolkit definition: Eine Expression, zu der ein Akteur beiträgt, indem er Schminke und Prothetik für eine Bewegtbildproduktion oder eine musikalische oder dramatische Darbietung oder Aufführung aufträgt. @de
label: er agent, som er sminkør af @da
definition: Relaterer en agent til et udtryk, som omfatter en agents bidrag ved at lægge makeup og påsætte proteser til en levende billedproduktion eller til en musikalsk eller dramatisk præsentation eller til underholdning. @da
toolkit label: agent, som er sminkør af @da
toolkit definition: Udtryk, som omfatter en agents bidrag ved at lægge makeup og påsætte proteser til en levende billedproduktion eller til en musikalsk eller dramatisk præsentation eller til underholdning. @da
label: és agent maquillador de @ca
definition: Relaciona un agent amb una expressió que inclou una contribució d’un agent aplicant maquillatge i pròtesis en el cas d’una producció d’imatge en moviment o una representació o un espectacle musical o dramàtic. @ca
toolkit label: agent maquillador de @ca
toolkit definition: Expressió que inclou una contribució d’un agent aplicant maquillatge i pròtesis en el cas d’una producció d’imatge en moviment o una representació o un espectacle musical o dramàtic. @ca
definition: Liittää toimijan ekspressioon, jonka tekemiseen toimija osallistuu vastaamalla elokuvan, musikaalin tai näyttämöteoksen maskeerauksesta.
toolkit label: maskeeraaja (toimija) ekspresiossa
toolkit definition: Ekspressio, jonka tekemiseen toimija osallistuu vastaamalla elokuvan, musikaalin tai näyttämöteoksen maskeerauksesta.
toolkit label: sminkør for (agent) @no
toolkit definition: Et uttrykk som inkluderer et bidrag fra en agent i form av å bruke sminke og proteser for en produksjon med levende bilder eller en musikalsk eller dramatisk forestilling eller underholdning. @no
label: ist Akteur als Maskenbildnerin/Maskenbildner von @de
label: est un agent maquilleur de @fr
definition: Met un agent en relation avec une expression qui intègre une contribution de la part d’un agent consistant à appliquer du maquillage et des prothèses pour une production d’images animées ou bien pour une présentation ou un spectacle musical ou dramatique. @fr
toolkit label: agent maquilleur de @fr
toolkit definition: Expression qui intègre une contribution de la part d’un agent consistant à appliquer du maquillage et des prothèses pour une production d’images animées ou bien pour une présentation ou un spectacle musical ou dramatique. @fr
has element type: 2
label: sminkmester ágense a következőnek: @hu
definition: Hozzákapcsol egy ágenst egy kifejezési formához, amely magában foglalja egy ágens közreműködését makeup és protézisek alkalmazásában egy mozgókép-produkcióhoz, zenei vagy drámai bemutatóhoz, vagy szórakoztató műsorhoz. @hu
toolkit label: sminkmester ágense: @hu
toolkit definition: Egy kifejezési forma, amely magában foglalja egy ágens közreműködését makeup és protézisek alkalmazásában egy mozgókép-produkcióhoz, zenei vagy drámai bemutatóhoz, vagy szórakoztató műsorhoz. @hu
alternative label: make-up artist of @en
alternative label: meikkitaiteilijana ekspressiossa
label: er sminkør for (agent) @no
definition: Relaterer en agent til et uttrykk som inkluderer et bidrag fra en agent i form av å bruke sminke og proteser for en produksjon med levende bilder eller en musikalsk eller dramatisk forestilling eller underholdning. @no
alternative label: sminkør for @no
label: is make-upartiest-actor van @nl
definition: Relateert een actor aan een expressie die omvat een bijdrage door een actor door aanbrengen van make-up en protheses voor een bewegend beeld-productie of voor een muzikale of dramatische presentatie of vermaak. @nl
toolkit label: make-upartiest-actor van @nl
toolkit definition: Een expressie die omvat een bijdrage door een actor door aanbrengen van make-up en protheses voor een bewegend beeld-productie of voor een muzikale of dramatische presentatie of vermaak. @nl
label: هو وكيل فنان مكياج لـ @ar
definition: يربط وكيلا بتعبيرة تتضمن إسهام وكيل بوضع مكياج أو أطراف صناعية في إنتاج صور متحركة أو في عرض موسيقي أو درامي أو ترفيهي. @ar
alternative label: فنان مكياج @ar
toolkit label: وكيل فنان مكياج @ar
toolkit definition: تعبيرة تتضمن إسهام وكيل بوضع مكياج أو أطراف صناعية في إنتاج صور متحركة أو في عرض موسيقي أو درامي أو ترفيهي. @ar
alternative label: maquillador de @ca
alternative label: sminkør af @da
label: grimmikunstnik (tegija) väljenduses @et
definition: Seostab tegija väljendusega, millesse tegija on andnud panuse, tehes grimmi ja proteesgrimmi filmi tootmise, muusika- või draamaetenduse või meelelahutusürituse jaoks. @et
alternative label: grimmikunstnik väljenduses @et
toolkit label: grimmikunstnik (tegija) väljenduses @et
toolkit definition: Väljendus, millesse tegija on andnud panuse, tehes grimmi ja proteesgrimmi filmi tootmise, muusika- või draamaetenduse või meelelahutusürituse jaoks. @et
alternative label: sminkmestere: @hu
label: è truccatore agente di @it
definition: Correla un agente a un'espressione che comprende un contributo da parte di un agente nell'applicare trucchi e protesi per una produzione cinematografica o per uno spettacolo o un intrattenimento musicale o teatrale. @it
alternative label: truccatore di @it
toolkit label: truccatore agente di @it
toolkit definition: Espressione che comprende un contributo da parte di un agente nell'applicare trucchi e protesi per una produzione cinematografica o per uno spettacolo o un intrattenimento musicale o teatrale. @it
alternative label: ψιμυθιολόγος του @el
alternative label: μακιγιέρ του @el
alternative label: maquilleur de @fr
label: ir grima mākslinieks (aģents) @lv
definition: Sasaista aģentu ar izteiksmi, kas ietver aģenta ieguldījumu, pielietojot dekoratīvo kosmētiku un protezēšanu filmu veidošanā, mūzikas vai dramatiskā uzvedumā vai izklaides pasākumā. @lv
toolkit label: ir grima mākslinieks (aģents) @lv
toolkit definition: Izteiksme, kas ietver aģenta ieguldījumu, pielietojot dekoratīvo kosmētiku un protezēšanu filmu veidošanā, mūzikas vai dramatiskā uzvedumā vai izklaides pasākumā. @lv
alternative label: Maskenbildner von @de
toolkit label: ……的化妆艺术家行为者 @zh-hans
toolkit definition: 包括为动态图像制作或者为音乐或戏剧呈现或娱乐施加化妆品或假体的一个行为者的贡献的一种内容表达 @zh-hans
toolkit label: makyaj sanatçısı temsilcisi @tr
toolkit definition: Hareketli bir görüntü üretimi veya müzikal veya dramatik bir sunum veya eğlence için bir temsilcinin makyaj ve protez uygulama katkısını içeren bir anlatım. @tr
has subproperty: maskeeraaja (yhteistoimija) ekspressiossa

maskeeraaja (yhteistoimija) ekspressiossa
status: Published
label: is makeup artist collective agent of @en
lexical alias: makeupArtistCollectiveAgentOf.en
definition: Relates a collective agent to an expression that includes a contribution by a collective agent of applying makeup and prosthetics for a moving image production or for a musical or dramatic presentation or entertainment. @en
toolkit label: makeup artist collective agent of @en
toolkit definition: An expression that includes a contribution by a collective agent of applying makeup and prosthetics for a moving image production or for a musical or dramatic presentation or entertainment. @en
type: Property
domain: C10011
has element type: 2
sub property of: esitykseen osallinen yhteistoimija ekspressiossa
sub property of: maskeeraaja (toimija) ekspresiossa
definition: Liittää yhteistoimijan ekspressioon, jossa yhteistoimija on osallisena vastaamalla elokuvan, musikaalin tai näyttämöteoksen maskeerauksesta.
toolkit label: maskeeraaja (yhteistoimija) ekspressiossa
toolkit definition: Ekspressio, jossa yhteistoimija on osallisena vastaamalla elokuvan, musikaalin tai näyttämöteoksen maskeerauksesta.
label: er sminkør for (kollektiv agent) @no
definition: Relaterer en kollektiv agent til et uttrykk som inkluderer et bidrag fra en kollektiv agent i form av å bruke sminke og proteser for en produksjon med levende bilder eller en musikalsk eller dramatisk forestilling eller form for underholdning. @no
toolkit label: sminkør for (kollektiv agent) @no
toolkit definition: Et uttrykk som inkluderer et bidrag fra en kollektiv agent i form av å bruke sminke og proteser for en produksjon med levende bilder eller en musikalsk eller dramatisk forestilling eller form for underholdning. @no
label: is make-upartiest-collectieve actor van @nl
definition: Relateert een collectieve actor aan een expressie die omvat een bijdrage door een collectieve actor door aanbrengen van make-up en protheses voor een bewegend beeld-productie of voor een muzikale of dramatische presentatie of vermaak. @nl
toolkit label: make-upartiest-collectieve actor van @nl
toolkit definition: Een expressie die omvat een bijdrage door een collectieve actor door aanbrengen van make-up en protheses voor een bewegend beeld-productie of voor een muzikale of dramatische presentatie of vermaak. @nl
label: هو وكيل جماعي فنان مكياج لـ @ar
definition: يربط وكيلا جماعيا بتعبيرة تتضمن إسهام وكيل جماعي بوضع مكياج أو أطراف صناعية في إنتاج صور متحركة أو في عرض موسيقي أو درامي أو ترفيهي. @ar
toolkit label: وكيل جماعي فنان مكياج @ar
toolkit definition: تعبيرة تتضمن إسهام وكيل جماعي في وضع مكياج أو أطراف صناعية في إنتاج صور متحركة أو في عرض موسيقي أو درامي أو ترفيهي. @ar
label: és agent col·lectiu maquillador de @ca
definition: Relaciona un agent col·lectiu amb una expressió que inclou una contribució d’un agent col·lectiu aplicant maquillatge i pròtesis en el cas d’una producció d’imatge en moviment o una representació o un espectacle musical o dramàtic. @ca
toolkit label: agent col·lectiu maquillador de @ca
toolkit definition: Expressió que inclou una contribució d’un agent col·lectiu aplicant maquillatge i pròtesis en el cas d’una producció d’imatge en moviment o una representació o un espectacle musical o dramàtic. @ca
label: er kollektiv agent, som er sminkør af @da
definition: Relaterer en kollektiv agent til et udtryk, som omfatter en kollektiv agents bidrag ved at lægge makeup og påsætte proteser til en levende billedproduktion eller til en musikalsk eller dramatisk præsentation eller til underholdning. @da
toolkit label: kollektiv agent, som er sminkør af @da
toolkit definition: Udtryk, som omfatter en kollektiv agents bidrag ved at lægge makeup og påsætte proteser til en levende billedproduktion eller til en musikalsk eller dramatisk præsentation eller til underholdning. @da
label: grimmikunstnik (kollektiiv) väljenduses @et
definition: Seostab kollektiivi väljendusega, millesse kollektiiv on andnud panuse, tehes grimmi ja proteesgrimmi filmi tootmise, muusika- või draamaetenduse või meelelahutusürituse jaoks. @et
toolkit label: grimmikunstnik (kollektiiv) väljenduses @et
toolkit definition: Väljendus, millesse kollektiiv on andnud panuse, tehes grimmi ja proteesgrimmi filmi tootmise, muusika- või draamaetenduse või meelelahutusürituse jaoks. @et
label: ist gemeinschaftlicher Akteur als Maskenbildnerin/Maskenbildner von @de
definition: Setzt einen gemeinschaftlichen Akteur in Beziehung zu einer Expression, zu der ein gemeinschaftlicher Akteur beiträgt, indem er Schminke und Prothetik für eine Bewegtbildproduktion oder eine musikalische oder dramatische Darbietung oder Aufführung aufträgt. @de
toolkit label: Gemeinschaftlicher Akteur als Maskenbildnerin/Maskenbildner von @de
toolkit definition: Eine Expression, zu der ein gemeinschaftlicher Akteur beiträgt, indem er Schminke und Prothetik für eine Bewegtbildproduktion oder eine musikalische oder dramatische Darbietung oder Aufführung aufträgt. @de
label: sminkmester kollektív ágense a következőnek: @hu
definition: Hozzákapcsol egy kollektív ágenst egy kifejezési formához, amely magában foglalja egy kollektív ágens közreműködését makeup és protézisek alkalmazásában mozgókép-produkcióhoz, zenei vagy drámai előadáshoz vagy szórakoztató műsorhoz. @hu
toolkit label: sminkmester kollektív ágense: @hu
toolkit definition: Egy kifejezési forma, amely magában foglalja egy kollektív ágens közreműködését makeup és protézisek alkalmazásában mozgókép-produkcióhoz, zenei vagy drámai előadáshoz vagy szórakoztató műsorhoz. @hu
label: è truccatore agente collettivo di @it
definition: Correla un agente collettivo a un'espressione che comprende un contributo di un agente collettivo nell'applicazione di trucco e protesi per una produzione di immagini in movimento o per una presentazione o spettacolo musicale o drammatico. @it
toolkit label: truccatore agente collettivo di @it
toolkit definition: Espressione che comprende un contributo di un agente collettivo nell'applicazione di trucco e protesi per una produzione di immagini in movimento o per una presentazione o spettacolo musicale o drammatico. @it
label: είναι ψιμυθιολόγος συλλογικός φορέας του @el
toolkit label: ψιμυθιολόγος συλλογικός φορέας του @el
label: est un agent collectif maquilleur de @fr
definition: Met un agent collectif en relation avec une expression qui intègre une contribution de la part d’un agent collectif consistant à appliquer du maquillage et des prothèses pour une production d’images animées ou bien pour une présentation ou un spectacle musical ou dramatique. @fr
toolkit label: agent collectif maquilleur de @fr
toolkit definition: Expression qui intègre une contribution de la part d’un agent collectif consistant à appliquer du maquillage et des prothèses pour une production d’images animées ou bien pour une présentation ou un spectacle musical ou dramatique. @fr
label: ir grima mākslinieks (grupa) @lv
definition: Sasaista grupu ar izteiksmi, kas ietver grupas ieguldījumu, pielietojot dekoratīvo kosmētiku un protezēšanu filmu veidošanā, mūzikas vai dramatiskā uzvedumā vai izklaides pasākumā. @lv
toolkit label: ir grima mākslinieks (grupa) @lv
toolkit definition: Izteiksme, kas ietver grupas ieguldījumu, pielietojot dekoratīvo kosmētiku un protezēšanu filmu veidošanā, mūzikas vai dramatiskā uzvedumā vai izklaides pasākumā. @lv
label: 是……的化妆艺术家集体行为者 @zh-hans
definition: 将一个集体行为者与包括为动态图像制作或者为音乐或戏剧呈现或娱乐施加化妆品或假体的一个集体行为者的贡献的一种内容表达关联起来。 @zh-hans
toolkit label: ……的化妆艺术家集体行为者 @zh-hans
toolkit definition: 包括为动态图像制作或者为音乐或戏剧呈现或娱乐施加化妆品或假体的一个集体行为者的贡献的一种内容表达 @zh-hans
label: makyaj sanatçısı kolektif temsilcisidir @tr
definition: Kolektif bir temsilciyi, hareketli bir görüntü üretimi veya müzikal veya dramatik bir sunum veya eğlence için kolektif bir temsilcinin makyaj ve protez uygulama katkısını içeren bir anlatımla ilişkilendirir. @tr
toolkit label: makyaj sanatçısı kolektif temsilcisi @tr
toolkit definition: Hareketli bir görüntü üretimi veya müzikal ya da dramatik bir sunum ya da eğlence için kolektif bir temsilcinin makyaj ve protez uygulama katkısını içeren bir anlatım. @tr
has subproperty: maskeeraaja (yhteisö) ekspressiossa
has subproperty: maskeeraaja (suku) ekspressiossa
has subproperty: P50723

maskeeraaja (yhteisö) ekspressiossa
status: Published
label: is makeup artist corporate body of @en
lexical alias: makeupArtistCorporateBodyOf.en
definition: Relates a corporate body to an expression that includes a contribution by a corporate body of applying makeup and prosthetics for a moving image production or for a musical or dramatic presentation or entertainment. @en
toolkit label: makeup artist corporate body of @en
toolkit definition: An expression that includes a contribution by a corporate body of applying makeup and prosthetics for a moving image production or for a musical or dramatic presentation or entertainment. @en
type: Property
domain: C10005
has element type: 2
sub property of: esitykseen osallinen yhteisö ekspressiossa
sub property of: maskeeraaja (yhteistoimija) ekspressiossa
definition: Liittää yhteisön ekspressioon, jossa yhteisö on osallisena vastaamalla elokuvan, musikaalin tai näyttämöteoksen maskeerauksesta.
toolkit label: maskeeraaja (yhteisö) ekspressiossa
toolkit definition: Ekspressio, jossa yhteisö on osallisena vastaamalla elokuvan, musikaalin tai näyttämöteoksen maskeerauksesta.
label: er sminkør for (korporasjon) @no
definition: Relaterer en korporasjon til et uttrykk som inkluderer et bidrag fra en korporasjon i form av å bruke sminke og proteser for en produksjon med levende bilder eller en musikalsk eller dramatisk forestilling eller form for underholdning. @no
toolkit label: sminkør for (korporasjon) @no
toolkit definition: Et uttrykk som inkluderer et bidrag fra en korporasjon i form av å bruke sminke og proteser for en produksjon med levende bilder eller en musikalsk eller dramatisk forestilling eller form for underholdning. @no
label: is make-upartiest-corporatie van @nl
definition: Relateert een corporatie aan een expressie die omvat een bijdrage door een corporatie door aanbrengen van make-up en protheses voor een bewegend beeld-productie of voor een muzikale of dramatische presentatie of vermaak. @nl
toolkit label: make-upartiest-corporatie van @nl
toolkit definition: Een expressie die omvat een bijdrage door een corporatie door aanbrengen van make-up en protheses voor een bewegend beeld-productie of voor een muzikale of dramatische presentatie of vermaak. @nl
label: هي هيئة فنانة مكياج لـ @ar
definition: يربط هيئة بتعبيرة تتضمن إسهام هيئة في وضع مكياج أو أطراف صناعية في إنتاج صور متحركة أو في عرض موسيقي أو درامي أو ترفيهي. @ar
toolkit label: هيئة فنانة مكياج @ar
toolkit definition: تعبيرة تتضمن إسهام هيئة في وضع مكياج أو أطراف صناعية في إنتاج صور متحركة أو في عرض موسيقي أو درامي أو ترفيهي. @ar
label: és entitat corporativa maquilladora de @ca
definition: Relaciona una entitat corporativa amb una expressió que inclou una contribució d’una entitat corporativa aplicant maquillatge i pròtesis en el cas d’una producció d’imatge en moviment o una representació o un espectacle musical o dramàtic. @ca
toolkit label: entitat corporativa maquilladora de @ca
toolkit definition: Expressió que inclou una contribució d’una entitat corporativa aplicant maquillatge i pròtesis en el cas d’una producció d’imatge en moviment o una representació o un espectacle musical o dramàtic. @ca
label: er korporation, som er sminkør af @da
definition: Relaterer en korporation til et udtryk, som omfatter en korporations bidrag ved at lægge makeup og påsætte proteser til en levende billedproduktion eller til en musikalsk eller dramatisk præsentation eller til underholdning. @da
toolkit label: korporation, som er sminkør af @da
toolkit definition: Udtryk, som omfatter en korporations bidrag ved at lægge makeup og påsætte proteser til en levende billedproduktion eller til en musikalsk eller dramatisk præsentation eller til underholdning. @da
label: grimmikunstnik (asutus) väljenduses @et
definition: Seostab asutuse väljendusega, millesse asutus on andnud panuse, tehes grimmi ja proteesgrimmi filmi tootmise, muusika- või draamaetenduse või meelelahutusürituse jaoks. @et
toolkit label: grimmikunstnik (asutus) väljenduses @et
toolkit definition: Väljendus, millesse asutus on andnud panuse, tehes grimmi ja proteesgrimmi filmi tootmise, muusika- või draamaetenduse või meelelahutusürituse jaoks. @et
label: ist Körperschaft als Maskenbildnerin/Maskenbildner von @de
definition: Setzt eine Körperschaft in Beziehung zu einer Expression, zu der eine Körperschaft beiträgt, indem sie Schminke und Prothetik, für eine Bewegtbildproduktion oder eine musikalische oder dramatische Darbietung oder Aufführung aufträgt. @de
toolkit label: Körperschaft als Maskenbildnerin/Maskenbildner von @de
toolkit definition: Eine Expression, zu der eine Körperschaft beiträgt, indem sie Schminke und Prothetik, für eine Bewegtbildproduktion oder eine musikalische oder dramatische Darbietung oder Aufführung aufträgt. @de
label: sminkmester testülete a következőnek: @hu
definition: Hozzákapcsol egy testületet egy kifejezési formához, amely magában foglalja egy testület közreműködését makeup és protézisek alkalmazásában mozgókép-produkcióhoz, zenei vagy drámai előadáshoz vagy szórakoztató műsorhoz. @hu
toolkit label: sminkmester testülete: @hu
toolkit definition: Egy kifejezési forma, amely magában foglalja egy testület közreműködését makeup és protézisek alkalmazásában mozgókép-produkcióhoz, zenei vagy drámai előadáshoz vagy szórakoztató műsorhoz. @hu
label: è truccatore ente di @it
definition: Correla un ente a un'espressione che comprende un contributo di un ente nell'applicazione di trucco e protesi per una produzione di immagini in movimento o per una presentazione o spettacolo musicale o drammatico. @it
toolkit label: truccatore ente di @it
toolkit definition: Espressione che comprende un contributo di un ente nell'applicazione di trucco e protesi per una produzione di immagini in movimento o per una presentazione o spettacolo musicale o drammatico. @it
label: είναι ψιμυθιολόγος συλλογικό όργανο του @el
toolkit label: ψιμυθιολόγος συλλογικό όργανο του @el
label: est une collectivité maquilleuse de @fr
definition: Met une collectivité en relation avec une expression qui intègre une contribution de la part d’une collectivité consistant à appliquer du maquillage et des prothèses pour une production d’images animées ou bien pour une présentation ou un spectacle musical ou dramatique. @fr
toolkit label: collectivité maquilleuse de @fr
toolkit definition: Expression qui intègre une contribution de la part d’une collectivité consistant à appliquer du maquillage et des prothèses pour une production d’images animées ou bien pour une présentation ou un spectacle musical ou dramatique. @fr
label: ir grima mākslinieks (institūcija) @lv
definition: Sasaista institūciju ar izteiksmi, kas ietver institūcijas ieguldījumu, pielietojot dekoratīvo kosmētiku un protezēšanu filmu veidošanā, mūzikas vai dramatiskā uzvedumā vai izklaides pasākumā. @lv
toolkit label: ir grima mākslinieks (institūcija) @lv
toolkit definition: Izteiksme, kas ietver institūcijas ieguldījumu, pielietojot dekoratīvo kosmētiku un protezēšanu filmu veidošanā, mūzikas vai dramatiskā uzvedumā vai izklaides pasākumā. @lv
label: 是……的化妆艺术家团体 @zh-hans
definition: 将一个团体与包括为动态图像制作或者为音乐或戏剧呈现或娱乐施加化妆品或假体的一个团体的贡献的一种内容表达关联起来。 @zh-hans
toolkit label: ……的化妆艺术家团体 @zh-hans
toolkit definition: 包括为动态图像制作或者为音乐或戏剧呈现或娱乐施加化妆品或假体的一个团体的贡献的一种内容表达 @zh-hans
label: makyaj sanatçısı tüzel kişisidir @tr
definition: Bir tüzel kişiyi, hareketli bir görüntü üretimi veya müzikal veya dramatik bir sunum veya eğlence için bir tüzel kişinin makyaj ve protez uygulama katkısını içeren bir anlatımla ilişkilendirir. @tr
toolkit label: makyaj sanatçısı tüzel kişisi @tr
toolkit definition: Hareketli bir görüntü üretimi veya müzikal veya dramatik bir sunum veya eğlence için tüzel bir kişinin makyaj ve protez uygulama katkısını içeren bir anlatım. @tr
has subproperty: P50874

maskeeraaja (suku) ekspressiossa
status: Published
label: is makeup artist family of @en
lexical alias: makeupArtistFamilyOf.en
definition: Relates a family to an expression that includes a contribution by a family of applying makeup and prosthetics for a moving image production or for a musical or dramatic presentation or entertainment. @en
toolkit label: makeup artist family of @en
toolkit definition: An expression that includes a contribution by a family of applying makeup and prosthetics for a moving image production or for a musical or dramatic presentation or entertainment. @en
type: Property
domain: C10008
has element type: 2
sub property of: esitykseen osallinen suku ekspressiossa
sub property of: maskeeraaja (yhteistoimija) ekspressiossa
definition: Liittää suvun ekspressioon, jossa suku on osallisena vastaamalla elokuvan, musikaalin tai näyttämöteoksen maskeerauksesta.
toolkit label: maskeeraaja (suku) ekspressiossa
toolkit definition: Ekspressio, jossa suku on osallisena vastaamalla elokuvan, musikaalin tai näyttämöteoksen maskeerauksesta.
label: er sminkør for (familie) @no
definition: Relaterer en familie til et uttrykk som inkluderer et bidrag fra en familie i form av å bruke sminke og proteser for en produksjon med levende bilder eller en musikalsk eller dramatisk forestilling eller form for underholdning. @no
toolkit label: sminkør for (familie) @no
toolkit definition: Et uttrykk som inkluderer et bidrag fra en familie i form av å bruke sminke og proteser for en produksjon med levende bilder eller en musikalsk eller dramatisk forestilling eller form for underholdning. @no
label: is make-upartiest-familie van @nl
definition: Relateert een familie aan een expressie die omvat een bijdrage door een familie door aanbrengen van make-up en protheses voor een bewegend beeld-productie of voor een muzikale of dramatische presentatie of vermaak. @nl
toolkit label: make-upartiest-familie van @nl
toolkit definition: Een expressie die omvat een bijdrage door een familie door aanbrengen van make-up en protheses voor een bewegend beeld-productie of voor een muzikale of dramatische presentatie of vermaak. @nl
label: هي عائلة فنانة مكياج لـ @ar
definition: يربط عائلة بتعبيرة تتضمن إسهام عائلة في وضع مكياج أو أطراف صناعية في إنتاج صور متحركة أو في عرض موسيقي أو درامي أو ترفيهي. @ar
toolkit label: عائلة فنانة مكياج @ar
toolkit definition: تعبيرة تتضمن إسهام عائلة في وضع مكياج أو أطراف صناعية في إنتاج صور متحركة أو في عرض موسيقي أو درامي أو ترفيهي. @ar
label: és família maquilladora de @ca
definition: Relaciona una família amb una expressió que inclou una contribució d’una família aplicant maquillatge i pròtesis en el cas d’una producció d’imatge en moviment o una representació o un espectacle musical o dramàtic. @ca
toolkit label: família maquilladora de @ca
toolkit definition: Expressió que inclou una contribució d’una família aplicant maquillatge i pròtesis en el cas d’una producció d’imatge en moviment o una representació o un espectacle musical o dramàtic. @ca
label: er familie, som er sminkør af @da
definition: Relaterer en familie til et udtryk, som omfatter en families bidrag ved at lægge makeup og påsætte proteser til en levende billedproduktion eller til en musikalsk eller dramatisk præsentation eller til underholdning. @da
toolkit label: familie, som er sminkør af @da
toolkit definition: Udtryk, som omfatter en families bidrag ved at lægge makeup og påsætte proteser til en levende billedproduktion eller til en musikalsk eller dramatisk præsentation eller til underholdning. @da
label: grimmikunstnik (perekond) väljenduses @et
definition: Seostab perekonna väljendusega, millesse perekond on andnud panuse, tehes grimmi ja proteesgrimmi filmi tootmise, muusika- või draamaetenduse või meelelahutusürituse jaoks. @et
toolkit label: grimmikunstnik (perekond) väljenduses @et
toolkit definition: Väljendus, millesse perekond on andnud panuse, tehes grimmi ja proteesgrimmi filmi tootmise, muusika- või draamaetenduse või meelelahutusürituse jaoks. @et
label: ist Familie als Maskenbildnerin/Maskenbildner von @de
definition: Setzt eine Familie in Beziehung zu einer Expression, zu der eine Familie beiträgt, indem sie Schminke und Prothetik für eine Bewegtbildproduktion oder eine musikalische oder dramatische Darbietung oder Aufführung aufträgt. @de
toolkit label: Familie als Maskenbildnerin/Maskenbildner von @de
toolkit definition: Eine Expression, zu der eine Familie beiträgt, indem sie Schminke und Prothetik für eine Bewegtbildproduktion oder eine musikalische oder dramatische Darbietung oder Aufführung aufträgt. @de
label: sminkmester családja a következőnek: @hu
definition: Hozzákapcsol egy családot egy kifejezési formához, amely magában foglalja egy család közreműködését makeup és protézisek alkalmazásában mozgókép-produkcióhoz, zenei vagy drámai előadáshoz vagy szórakoztató műsorhoz. @hu
toolkit label: sminkmester családja: @hu
toolkit definition: Egy kifejezési forma, amely magában foglalja egy család közreműködését makeup és protézisek alkalmazásában mozgókép-produkcióhoz, zenei vagy drámai előadáshoz vagy szórakoztató műsorhoz. @hu
label: è truccatore famiglia di @it
definition: Correla una famiglia a un'espressione che comprende un contributo di una famiglia nell'applicazione di trucco e protesi per una produzione di immagini in movimento o per una presentazione o spettacolo musicale o drammatico. @it
toolkit label: truccatore famiglia di @it
toolkit definition: Espressione che comprende un contributo di una famiglia nell'applicazione di trucco e protesi per una produzione di immagini in movimento o per una presentazione o spettacolo musicale o drammatico. @it
label: είναι ψιμυθιολόγος οικογένεια του @el
toolkit label: ψιμυθιολόγος οικογένεια του @el
label: est une famille maquilleuse de @fr
definition: Met une famille en relation avec une expression qui intègre une contribution de la part d’une famille consistant à appliquer du maquillage et des prothèses pour une production d’images animées ou bien pour une présentation ou un spectacle musical ou dramatique. @fr
toolkit label: famille maquilleuse de @fr
toolkit definition: Expression qui intègre une contribution de la part d’une famille consistant à appliquer du maquillage et des prothèses pour une production d’images animées ou bien pour une présentation ou un spectacle musical ou dramatique. @fr
label: ir grima mākslinieks (dzimta/ģimene) @lv
definition: Sasaista dzimtu/ģimeni ar izteiksmi, kas ietver dzimtas/ģimenes ieguldījumu, pielietojot dekoratīvo kosmētiku un protezēšanu filmu veidošanā, mūzikas vai dramatiskā uzvedumā vai izklaides pasākumā. @lv
toolkit label: ir grima mākslinieks (dzimta/ģimene) @lv
toolkit definition: Izteiksme, kas ietver dzimtas/ģimenes ieguldījumu, pielietojot dekoratīvo kosmētiku un protezēšanu filmu veidošanā, mūzikas vai dramatiskā uzvedumā vai izklaides pasākumā. @lv
label: 是……的化妆艺术家家族 @zh-hans
definition: 将一个家族与包括为动态图像制作或者为音乐或戏剧呈现或娱乐施加化妆品或假体的一个家族的贡献的一种内容表达关联起来。 @zh-hans
toolkit label: ……的化妆艺术家家族 @zh-hans
toolkit definition: 包括为动态图像制作或者为音乐或戏剧呈现或娱乐施加化妆品或假体的一个家族的贡献的一种内容表达 @zh-hans
label: makyaj sanatçısı ailesidir @tr
definition: Bir aileyi, hareketli bir görüntü prodüksiyonu veya müzikal ya da dramatik bir sunum veya eğlence için makyaj ve protez uygulama katkısını içeren bir anlayımla ilişkilendirir. @tr
toolkit label: makyaj sanatçısı ailesi @tr
toolkit definition: Hareketli bir görüntü üretimi veya müzikal veya dramatik bir sunum veya eğlence için bir ailenin makyaj ve protez uygulama katkısını içeren bir anlatım. @tr
has subproperty: P51025

maskeeraaja (henkilö) ekspressiossa
status: Published
label: is makeup artist person of @en
lexical alias: makeupArtistPersonOf.en
definition: Relates a person to an expression that includes a contribution by a person of applying makeup and prosthetics for a moving image production or for a musical or dramatic presentation or entertainment. @en
toolkit label: makeup artist person of @en
toolkit definition: An expression that includes a contribution by a person of applying makeup and prosthetics for a moving image production or for a musical or dramatic presentation or entertainment. @en
type: Property
domain: C10004
has element type: 2
sub property of: esitykseen osallinen henkilö ekspressiossa
sub property of: maskeeraaja (toimija) ekspresiossa
definition: Liittää henkilön ekspressioon, jossa henkilö on osallisena vastaamalla elokuvan, musikaalin tai näyttämöteoksen maskeerauksesta.
toolkit label: maskeeraaja (henkilö) ekspressiossa
toolkit definition: Ekspressio, jossa henkilö on osallisena vastaamalla elokuvan, musikaalin tai näyttämöteoksen maskeerauksesta.
label: er sminkør for (person) @no
definition: Relaterer en person til et uttrykk som inkluderer et bidrag fra en person i form av å bruke sminke og proteser for en produksjon med levende bilder eller en musikalsk eller dramatisk forestilling eller form for underholdning. @no
toolkit label: sminkør for (person) @no
toolkit definition: Et uttrykk som inkluderer et bidrag fra en person i form av å bruke sminke og proteser for en produksjon med levende bilder eller en musikalsk eller dramatisk forestilling eller form for underholdning. @no
label: is make-upartiest-persoon van @nl
definition: Relateert een persoon aan een expressie die omvat een bijdrage door een persoon door aanbrengen van make-up en protheses voor een bewegend beeld-productie of voor een muzikale of dramatische presentatie of vermaak. @nl
toolkit label: make-upartiest-persoon van @nl
toolkit definition: Een expressie die omvat een bijdrage door een persoon door aanbrengen van make-up en protheses voor een bewegend beeld-productie of voor een muzikale of dramatische presentatie of vermaak. @nl
label: هو شخص فنان مكياج لـ @ar
definition: يربط شخصا بتعبيرة تتضمن إسهام شخص بوضع مكياج أو أطراف صناعية في إنتاج صور متحركة أو في عرض موسيقي أو درامي أو ترفيهي. @ar
toolkit label: شخص فنان مكياج @ar
toolkit definition: تعبيرة تتضمن إسهام شخص بوضع مكياج أو أطراف صناعية في إنتاج صور متحركة أو في عرض موسيقي أو درامي أو ترفيهي. @ar
label: és persona maquilladora de @ca
definition: Relaciona una persona amb una expressió que inclou una contribució d’una persona aplicant maquillatge i pròtesis en el cas d’una producció d’imatge en moviment o una representació o un espectacle musical o dramàtic. @ca
toolkit label: persona maquilladora de @ca
toolkit definition: Expressió que inclou una contribució d’una persona aplicant maquillatge i pròtesis en el cas d’una producció d’imatge en moviment o una representació o un espectacle musical o dramàtic. @ca
label: er person, som er sminkør af @da
definition: Relaterer en person til et udtryk, som omfatter en persons bidrag ved at lægge makeup og påsætte proteser til en levende billedproduktion eller til en musikalsk eller dramatisk præsentation eller til underholdning. @da
toolkit label: person, som er sminkør af @da
toolkit definition: Udtryk, som omfatter en persons bidrag ved at lægge makeup og påsætte proteser til en levende billedproduktion eller til en musikalsk eller dramatisk præsentation eller til underholdning. @da
label: grimmikunstnik (isik) väljenduses @et
definition: Seostab isiku väljendusega, millesse isik on andnud panuse, tehes grimmi ja proteesgrimmi filmi tootmise, muusika- või draamaetenduse või meelelahutusürituse jaoks. @et
toolkit label: grimmikunstnik (isik) väljenduses @et
toolkit definition: Väljendus, millesse isik on andnud panuse, tehes grimmi ja proteesgrimmi filmi tootmise, muusika- või draamaetenduse või meelelahutusürituse jaoks. @et
label: ist Person als Maskenbildnerin/Maskenbildner von @de
definition: Setzt eine Person in Beziehung zu einer Expression, zu der eine Person beiträgt, indem sie Schminke und Prothetik für eine Bewegtbildproduktion oder eine musikalische oder dramatische Darbietung oder Aufführung aufträgt. @de
toolkit label: Person als Maskenbildnerin/Maskenbildner von @de
toolkit definition: Eine Expression zu der eine Person beiträgt, indem sie Schminke und Prothetik für eine Bewegtbildproduktion oder eine musikalische oder dramatische Darbietung oder Aufführung aufträgt. @de
label: sminkmester személye a következőnek: @hu
definition: Hozzákapcsol egy személyt egy kifejezési formához, amely magában foglalja egy személy közreműködését makeup és protézisek alkalmazásában egy mozgókép-produkcióhoz, zenei vagy drámai előadáshoz, vagy szórakoztató műsorhoz. @hu
toolkit label: sminkmester személye: @hu
toolkit definition: Egy kifejezési forma, amely magában foglalja egy személy közreműködését makeup és protézisek alkalmazásában egy mozgókép-produkcióhoz, zenei vagy drámai előadáshoz, vagy szórakoztató műsorhoz. @hu
label: è truccatore persona di @it
definition: Correla una persona a un'espressione che comprende un contributo di una persona nell'applicazione di trucco e protesi per una produzione di immagini in movimento o per una presentazione o spettacolo musicale o drammatico. @it
toolkit label: truccatore persona di @it
toolkit definition: Espressione che comprende un contributo di una persona nell'applicazione di trucco e protesi per una produzione di immagini in movimento o per una presentazione o spettacolo musicale o drammatico. @it
label: είναι ψιμυθιολόγος φυσικό πρόσωπο του @el
toolkit label: ψιμυθιολόγος φυσικό πρόσωπο του @el
label: est une personne maquilleuse de @fr
definition: Met une personne en relation avec une expression qui intègre une contribution de la part d’une personne consistant à appliquer du maquillage et des prothèses pour une production d’images animées ou bien pour une présentation ou un spectacle musical ou dramatique. @fr
toolkit label: personne maquilleuse de @fr
toolkit definition: Expression qui intègre une contribution de la part d’une personne consistant à appliquer du maquillage et des prothèses pour une production d’images animées ou bien pour une présentation ou un spectacle musical ou dramatique. @fr
label: ir grima mākslinieks (persona) @lv
definition: Sasaista personu ar izteiksmi, kas ietver personas ieguldījumu, pielietojot dekoratīvo kosmētiku un protezēšanu filmu veidošanā, mūzikas vai dramatiskā uzvedumā vai izklaides pasākumā. @lv
toolkit label: ir grima mākslinieks (persona) @lv
toolkit definition: Izteiksme, kas ietver personas ieguldījumu, pielietojot dekoratīvo kosmētiku un protezēšanu filmu veidošanā, mūzikas vai dramatiskā uzvedumā vai izklaides pasākumā. @lv
label: 是……的化妆艺术家个人 @zh-hans
definition: 将一个个人与包括为动态图像制作或者为音乐或戏剧呈现或娱乐施加化妆品或假体的一个个人的贡献的一种内容表达关联起来。 @zh-hans
toolkit label: ……的化妆艺术家个人 @zh-hans
toolkit definition: 包括为动态图像制作或者为音乐或戏剧呈现或娱乐施加化妆品或假体的一个个人的贡献的一种内容表达 @zh-hans
label: makyaj sanatçısı kişisidir @tr
definition: Bir kişiyi, hareketli bir görüntü prodüksiyonu veya müzikal ya da dramatik bir sunum veya gösteri için makyaj ve sahne estetiği uygulayan bir kişinin katkısını içeren bir anlatımla ilişkilendirir. @tr
toolkit label: Makyaj sanatçısı @tr
toolkit definition: Hareketli bir görüntü üretimi veya müzikal veya dramatik bir sunum veya eğlence için bir kişinin makyaj ve protez uygulama katkısını içeren bir anlatım. @tr
has subproperty: P50572

valmistaja (toimija) manifestaatiossa
status: Published
label: is manufacturer agent of @en
definition: Relates an agent to a manifestation by an agent that involves a responsibility for printing, duplicating, casting, etc. @en
type: Property
domain: C10002
lexical alias: manufacturerAgentOf.en
label: est un agent fabricant de @fr
definition: Met un agent en relation avec une manifestation qui comporte une responsabilité de la part d’un agent en ce qui concerne l’impression, la reproduction, le moulage, etc. @fr
toolkit label: agent fabricant de @fr
toolkit definition: Manifestation qui comporte une responsabilité de la part d’un agent en ce qui concerne l’impression, la reproduction, le moulage, etc. @fr
toolkit label: manufacturer agent of @en
toolkit definition: A manifestation that involves a responsibility of an agent for printing, duplicating, casting, etc. @en
sub property of: toimijaan liittyvä manifestaatio
label: είναι κατασκευαστής φορέας του @el
definition: Συνδέει έναν φορέα υπεύθυνο για την εκτύπωση, την αντιγραφή, τη χύτευση κ.λπ., με μια εκδήλωση. @el
toolkit label: κατασκευαστής φορέας του @el
toolkit definition: Μια εκδήλωση η οποία εκτυπώνεται, αντιγράφεται, χυτεύεται κ.λπ. @el
definition: Setzt einen Akteur in Beziehung zu einer Manifestation, bei der ein Akteur für den Druck, die Vervielfältigung, den Guss und so weiter verantwortlich ist. @de
toolkit label: Akteur als Herstellerin/Hersteller von @de
toolkit definition: Eine Manifestation, bei der ein Akteur für den Druck, die Vervielfältigung, den Guss und so weiter verantwortlich ist. @de
label: er agent, som er producent af @da
definition: Relaterer en agent til en manifestation, som involverer en agents ansvar for trykning, duplikering, støbning etc. @da
toolkit label: agent, som er producent af @da
toolkit definition: Manifestation, som involverer en agents ansvar for trykning, duplikering, støbning etc. @da
label: és agent fabricant de @ca
definition: Relaciona un agent amb una manifestació que implica una responsabilitat d’un agent en la impressió, la reproducció, el modelat, etc. @ca
toolkit definition: Manifestació que implica una responsabilitat d’un agent en la impressió, la reproducció, el modelat, etc. @ca
definition: Liittää toimijan manifestaatioon, jonka painamisesta, monistamisesta, kirjasinten valamisesta tms. toimija on vastuussa.
toolkit label: valmistaja (toimija) manifestaatiossa
toolkit definition: Manifestaatio, jonka painamisesta, monistamisesta, kirjasinten valamisesta tms. toimija on vastuussa.
toolkit label: tilvirker av (agent) @no
toolkit definition: En manifestasjon som involverer ansvar for en agent i form av trykking, mangfoldiggjøring, støping, etc. @no
label: ist Akteur als Herstellerin/Hersteller von @de
has element type: 2
label: gyártó ágense a következőnek: @hu
definition: Hozzákapcsol egy ágenst egy megjelenési formához, amelyhez hozzátartozik egy ágens felelőssége a nyomtatásért, sokszorosításért, öntésért, stb. @hu
toolkit label: gyártó ágense: @hu
toolkit definition: Egy megjelenési forma, amelyhez hozzátartozik egy ágens felelőssége a nyomtatásért, sokszorosításért, öntésért, stb. @hu
alternative label: manufacturer of @en
alternative label: valmistajana aineistossa
label: er tilvirker av (agent) @no
definition: Relaterer en agent til en manifestasjon som involverer ansvar for en agent i form av trykking, mangfoldiggjøring, støping, etc. @no
alternative label: tilvirker av @no
label: is vervaardiger-actor van @nl
definition: Relateert een actor aan een manifestatie die met zich meebrengt een verantwoordelijkheid van een actor voor drukken, vermenigvuldigen, gieten etc. @nl
toolkit label: vervaardiger-actor van @nl
toolkit definition: Een manifestatie die met zich meebrengt een verantwoordelijkheid van een actor voor drukken, vermenigvuldigen, gieten etc. @nl
label: هو وكيل مُصّنع لـ @ar
definition: يربط وكيلا بتجسيدة من خلال وكيل مما يترتب عليه مسئوليته عن الطباعة أو النسخ أو الصب، الخ. @ar
alternative label: مُصنِّع @ar
toolkit label: وكيل مُصنع @ar
toolkit definition: تجسيدة من جانب وكيل تنطوي على مسئولية عن الطباعة أو النسخ أو الصب أو ما إلى ذلك. @ar
alternative label: fabricant de @ca
alternative label: producent af @da
label: valmistaja (tegija) kehastuses @et
definition: Seostab tegija kehastusega, mis sisaldab tegija vastutust trükkimise, paljundamise, valamise vms eest. @et
alternative label: valmistaja kehastuses @et
toolkit label: valmistaja (tegija) kehastuses @et
toolkit definition: Kehastus, mis sisaldab tegija vastutust trükkimise, paljundamise, valamise vms eest. @et
alternative label: gyártója: @hu
label: è costruttore agente di @it
definition: Correla un agente a una manifestazione che implica la responsabilità di un agente per la stampa, duplicazione, fusione, etc. @it
alternative label: costruttore di @it
toolkit label: costruttore agente di @it
toolkit definition: Manifestazione che implica la responsabilità di un agente per la stampa, duplicazione, fusione, etc. @it
alternative label: κατασκευαστής του @el
label: ir ražotājs (aģents) @lv
definition: Sasaista aģentu ar manifestāciju, kas ietver aģenta atbildību par iespiešanu, pavairošanu u.tml. @lv
toolkit label: ir ražotājs (aģents) @lv
toolkit definition: Manifestācija, kas ietver aģenta atbildību par iespiešanu, pavairošanu u.tml. @lv
alternative label: Hersteller von @de
alternative label: ……的生产者 @zh-hans
label: 是……的生产者行为者 @zh-hans
toolkit label: ……的生产者行为者 @zh-hans
toolkit definition: 涉及印刷、复制、铸造等的一个行为者的责任的一种载体表现 @zh-hans
toolkit label: üretici temsilcisi @tr
toolkit definition: Basım, çoğaltma, rol dağıtımı vb. için bir temsilcinin sorumluluğunu içeren bir gösterim. @tr
has subproperty: pistekirjoituksen tekijä (toimija) manifestaatiossa
has subproperty: valmistaja (yhteistoimija) manifestaatiossa
has subproperty: valmistaja (henkilö) manifestaatiossa